##TITLE=abcd
##JCAMPDX= 6.0         $$ Bruker NMR JCAMP-DX V2.0
##DATA TYPE= NMR SPECTRUM
##DATA CLASS= NTUPLES
##ORIGIN= UXNMR, Bruker Analytische Messtechnik GmbH
##OWNER= root
$$ XWIN-NMR		Version 3.5
$$ Thu Feb 23 11:52:42 2023 Russian Standard Time (UT+4h)  servis@DPX200
##.OBSERVE FREQUENCY= 200.131235884673
##.OBSERVE NUCLEUS= ^1H
##.ACQUISITION MODE= SIMULTANEOUS
##.ACQUISITION SCHEME= undefined
##.AVERAGES= 16
##.DIGITISER RES= 18
##SPECTROMETER/DATA SYSTEM= spect
##.PULSE SEQUENCE= zg
##.SOLVENT NAME= DMSO
##.SHIFT REFERENCE= (INTERNAL, DMSO, 0, 16.4885)
##AUDIT TRAIL= $$ (NUMBER, WHEN, WHO, WHERE, WHAT)
$$ ##TITLE= Audit trail, XWIN-NMR		Version 3.5
$$ ##JCAMPDX= 5.01
$$ ##ORIGIN= Bruker BioSpin GmbH
$$ ##OWNER= servis
$$ F:\spectra/data/av/nmr/H1/1/pdata/1/auditp.txt
$$ ##AUDIT TRAIL=  $$ (NUMBER, WHEN, WHO, WHERE, WHAT)
(   1,<2023-02-23 11:51:38.75 +0400>,<servis>,<DPX200>,
      <created by zg, POWCHK disabled, PULCHK disabled
       terminated by command 'halt'
       configuration hash MD5:
       00 E9 B6 7A A2 85 ED C7 34 08 36 98 17 FE 4E 26
       data hash MD5: 32K
       B6 47 19 E2 13 A4 45 28 83 5F 50 33 B0 2C D7 EF>)
(   2,<2023-02-23 11:52:15.07 +0400>,<servis>,<DPX200>,
      <Start of raw data processing
       efp BC_mod = 2 LB = 0.05 FT_mod = 6 PKNL = 1 PHC0 = -182.4208 PHC1 = -2.89851 SI = 16K 
       data hash MD5: 16K
       87 4E 56 26 0A 96 70 CB 79 CB F5 C6 34 4F 6E D4>)
$$ ##END=
$$ 
$$ hash MD5
$$ 26 05 C7 1B 37 21 0F 97 08 EF BE AC AD E1 56 FC
##$RELAX= 
##$RELAX= 
##$RELAX= 
##$RELAX= 
##$RELAX= 
##$RELAX= 
##$RELAX= 
##$RELAX= 
$$ Bruker specific parameters
$$ --------------------------
##$DU= <F:\spectra>
##$EXPNO= 1
##$NAME= <H1>
##$PROCNO= 1
##$TYPE= <nmr>
##$USER= <av>
##$AMP= (0..31)
100 100 100 100 100 100 100 100 100 100 100 100 100 100 100 100 100 100 
100 100 100 100 100 100 100 100 100 100 100 100 100 100 
##$AQSEQ= 0
##$AQ_mod= 1
##$AUNM= <au_zg>
##$AUTOPOS= <>
##$BF1= 200.13
##$BF2= 200.13
##$BF3= 200.13
##$BF4= 200.13
##$BF5= 500.13
##$BF6= 500.13
##$BF7= 500.13
##$BF8= 500.13
##$BYTORDA= 1
##$CFDGTYP= 0
##$CFRGTYP= 5
##$CHEMSTR= <none>
##$CNST= (0..31)
1 1 145 1 1 1 1 1 1 1 1 1 1 1 1 1 1 1 1 1 1 1 1 1 1 1 1 1 1 1 1 1 
##$CPDPRG= <>
##$CPDPRG1= <>
##$CPDPRG2= <>
##$CPDPRG3= <>
##$CPDPRG4= <mlev>
##$CPDPRG5= <mlev>
##$CPDPRG6= <mlev>
##$CPDPRG7= <mlev>
##$CPDPRG8= <mlev>
##$CPDPRGB= <>
##$CPDPRGT= <>
##$D= (0..31)
0 2 0 0 0 0 0 0 0 0.06 0 0 0 0 0 0 0.0002 0 0 0 0 0 0 0 0 0 0 0 0 0 0 
0 
##$DATE= 1677138698
##$DBL= (0..7)
120 120 120 120 120 120 120 120 
##$DBP= (0..7)
150 150 150 150 150 150 150 150 
##$DBP07= 0
##$DBPNAM0= <>
##$DBPNAM1= <>
##$DBPNAM2= <>
##$DBPNAM3= <>
##$DBPNAM4= <>
##$DBPNAM5= <>
##$DBPNAM6= <>
##$DBPNAM7= <>
##$DBPOAL= (0..7)
0.5 0.5 0.5 0.5 0.5 0.5 0.5 0.5 
##$DBPOFFS= (0..7)
0 0 0 0 0 0 0 0 
##$DE= 6
##$DECBNUC= <off>
##$DECIM= 32
##$DECNUC= <off>
##$DECSTAT= 4
##$DIGMOD= 1
##$DIGTYP= 9
##$DL= (0..7)
0 120 120 120 120 120 120 120 
##$DP= (0..7)
$$ [...]
##$SUBNAM4= <"">
##$SUBNAM5= <"">
##$SUBNAM6= <"">
##$SUBNAM7= <"">
##$SUBNAM8= <"">
##$SUBNAM9= <"">
##$SW= 20.6817932712277
##$SWIBOX= (0..15)
0 0 3 0 0 0 0 0 0 0 0 0 0 0 0 0 
##$SW_h= 4139.07284768212
##$TD= 32768
##$TD0= 1
##$TE= 0
##$TE2= 300
##$TE3= 300
##$TEG= 300
##$TL= (0..7)
0 120 120 120 120 120 120 120 
##$TP= (0..7)
150 150 150 150 150 150 150 150 
##$TP07= 0
##$TPNAME0= <>
##$TPNAME1= <>
##$TPNAME2= <>
##$TPNAME3= <>
##$TPNAME4= <>
##$TPNAME5= <>
##$TPNAME6= <>
##$TPNAME7= <>
##$TPOAL= (0..7)
0.5 0.5 0.5 0.5 0.5 0.5 0.5 0.5 
##$TPOFFS= (0..7)
0 0 0 0 0 0 0 0 
##$TUNHIN= 0
##$TUNHOUT= 0
##$TUNXOUT= 0
##$USERA1= <user>
##$USERA2= <user>
##$USERA3= <user>
##$USERA4= <user>
##$USERA5= <user>
##$V9= 5
##$VALIST= <valist>
##$VCLIST= <CCCCCCCCCCCCCCC>
##$VD= 0
##$VDLIST= <DDDDDDDDDDDDDDD>
##$VPLIST= <PPPPPPPPPPPPPPP>
##$VTLIST= <TTTTTTTTTTTTTTT>
##$WBST= 1024
##$WBSW= 30
##$XGAIN= (0..3)
0 0 0 0 
##$XL= 0
##$YL= 0
##$YMAX_a= 161611
##$YMIN_a= -262845
##$ZGOPTNS= <>
##$ZL1= 120
##$ZL2= 120
##$ZL3= 120
##$ZL4= 120
##$ABSF1= 0
##$ABSF2= 0
##$ABSG= 0
##$ABSL= 0
##$ALPHA= 0
##$AQORDER= 0
##$ASSFAC= 0
##$ASSFACI= 0
##$ASSFACX= 0
##$ASSWID= 0
##$AUNMP= <proc_1d>
##$AZFE= 0.1
##$AZFW= 0.1
##$BCFW= 0
##$BC_mod= 2
##$BYTORDP= 0
##$COROFFS= 0
##$CY= 18.4799938201904
##$DATMOD= 1
##$DC= 0
##$DFILT= <>
##$DTYPP= 0
##$F1P= 9.9274215381318
##$F2P= -0.165520771350173
##$FCOR= 1
##$FTSIZE= 16384
##$FT_mod= 6
##$GAMMA= 0
##$GB= 0
##$INTBC= 1
##$INTSCL= 4.127829e-11
##$ISEN= 128
##$LB= 0.05
##$LEV0= 0
##$LPBIN= 0
##$MAXI= 10000
##$MC2= 0
##$MEAN= 0
##$ME_mod= 0
##$MI= 50
##$NCOEF= 0
##$NC_proc= -8
##$NLEV= 6
##$NOISF1= 3.799351
##$NOISF2= 2.8
##$NSP= 0
##$NTH_PI= 0
##$NZP= 0
##$OFFSET= 16.48848
##$PC= 4
##$PHC0= -182.4208
##$PHC1= -2.89851
##$PH_mod= 1
##$PKNL= yes
##$PPARMOD= 0
##$PSCAL= 4
##$PSIGN= 0
##$REVERSE= no
##$SF= 200.130005582386
##$SI= 16384
##$SIGF1= 3
##$SIGF2= 2
##$SINO= 400
##$SIOLD= 16384
##$SREGLST= <1H.CDCl3>
##$SSB= 0
##$STSI= 16384
##$STSR= 0
##$SW_p= 4139.07284768211
##$SYMM= 0
##$S_DEV= 0
##$TDeff= 32768
##$TDoff= 0
##$TI= <>
##$TILT= no
##$TM1= 0
##$TM2= 0
##$TOPLEV= 0
##$USERP1= <user>
##$USERP2= <user>
##$USERP3= <user>
##$USERP4= <user>
##$USERP5= <user>
##$WDW= 1
##$XDIM= 16384
##$YMAX_p= 519590794
##$YMIN_p= -2409919
$$ End of Bruker specific parameters
$$ ---------------------------------
##NTUPLES= NMR SPECTRUM
##VAR_NAME=  FREQUENCY,     SPECTRUM/REAL,   SPECTRUM/IMAG
##SYMBOL=    X,             R,               I
##VAR_TYPE=  INDEPENDENT,   DEPENDENT,       DEPENDENT
##VAR_FORM=  AFFN,          ASDF,            ASDF
##VAR_DIM=   16384,         16384,           16384
##UNITS=     HZ,            ARBITRARY UNITS, ARBITRARY UNITS
##FACTOR=    0.252644378177508, 1,           1
##FIRST=     3299.83951724647, 0,            0
##LAST=      -839.233330435636, 0,           0
##MIN=       -839.233330435636, -2409919,    0
##MAX=       3299.83951724647, 519590794,    0
$$ Real data points
##PAGE= N=1
##DATA TABLE= (X++(R..R)), XYDATA
$$ [...]
12005a367507K59729J51833M96513p0808n23468K03613n43093O79633n52342J54118
$$ -1367507 -1107778 -955945 -459432 -530240 -1053708 -850095 -1393188 -713555 -1265897 -1111779
11995a111779K89707K33414o85731L44629n32261L37249N97196l83142k19661
$$ -1111779 -822072 -588658 -1274389 -929760 -1462021 -1124772 -527576 -910718 -1130379
11986a130379K04168K65598l92764N35342K34099p95806M7231j20045Q3113K23772
$$ -1130379 -926211 -660613 -1053377 -518035 -283936 -1079742 -1032511 -1152556 -1069443 -845671
11976h45671n86439M98704M21679n9679j01462n07837N49348l95941k60663J03867
$$ -845671 -1432110 -933406 -511727 -571406 -672868 -1180705 -631357 -1027298 -1287961 -1184094
11966a184094M61814k65242m52563N37810q0187k64270P09473J4735M5177n71957
$$ -1184094 -722280 -987522 -1440085 -902275 -982462 -1246732 -537259 -522524 -477347 -1049304
11956a049304j46281o4693j35804O97238l32283J69457P9723l58939K62853j80628
$$ -1049304 -1195585 -1260278 -1396082 -698844 -1031127 -861670 -781947 -1140886 -878033 -1058661
11946a058661k91226K97989K96760n2155k71611J15457M2082O40120m26018J88749
$$ -1058661 -1349887 -1051898 -755138 -807293 -1078904 -963447 -921365 -281245 -707263 -518514
11936e18514l68741R0617J61074n19740L10406k28241J16469M26549l55048L78153
$$ -518514 -887255 -796638 -635564 -1155304 -844898 -1073139 -956670 -530121 -885169 -507016
11926e07016p95607O46194j84510L61667Q0081l08072L30508j62243j60106J30236
$$ -507016 -1302623 -656429 -840939 -479272 -399191 -707263 -376755 -538998 -699104 -568868
11916e68868q7745J6995J7296p2082j40643L36869p9401l27753j01113L54477
$$ -568868 -656613 -639618 -622322 -694404 -835047 -498178 -577579 -905332 -1006445 -651968
11906f51968j9298j93575k11525m61616J278679k26679K34208J15780m73398K8419
$$ -651968 -671266 -864841 -1076366 -1537982 -259303 -485982 -251774 -135994 -609392 -580973
11896e80973j6481J5647j51350R6108o8885j3850J51531J99522p7256n60686R40650
$$ -580973 -597454 -581807 -733157 -637049 -705934 -719784 -568253 -368731 -445987 -1006673 -66023
11885f6023n06820m71416N43238k52977J01618M08323k70653J27607j1756l735
$$ -66023 -572843 -1044259 -501021 -753998 -652380 -244057 -514710 -387103 -398859 -402594
11875d02594j18509m8408L93477l85697j78451j43983L56598j03468n63128K45994
$$ -402594 -521103 -569511 -176034 -561731 -740182 -884165 -527567 -631035 -1194163 -948169
11865i48169q4479K56312M14436L14771o08625n975K46304K32688o48169J78415
$$ -948169 -1032648 -776336 -361900 -47129 -655754 -661729 -415425 -182737 -830906 -652491
11855f52491k5677N8283L45267k36949J40405k04439k40411K6909O1726j30479
$$ -652491 -678168 -619885 -274618 -511567 -371162 -575601 -816012 -789103 -727377 -857856
11845h57856R27811r83755N65142o59948Q00877j70251J87506j69199k68464K68657
$$ -857856 69955 -913800 -348658 -1008606 -207729 -377980 -190474 -359673 -628137 -359480
11835c59480J700k19443M9478M67070n33895O00786o29838Q75927n41192R8187
$$ -359480 -357780 -577223 -527745 -60675 -594570 6216 -623622 252305 -288887 -190700
11825a90700K31198p27216L62418m08041M97840P9984m29602m57172R04823K6116
$$ -190700 40498 -686718 -324300 -732341 -234501 -154517 -584119 -1041291 -136468 -110352
11815a10352m84417O24903m22603l57915O93888m37577J28247j22715N54658r4291
$$ -110352 -594769 30134 -392469 -750384 -56496 -494073 -365826 -488541 66117 -28174
11805b8174o7456M01998m51529L9586J01427j13628N58959n08951o875Q1623L68349
$$ -28174 -95630 306368 -145161 -105575 -4148 -117776 441183 -67768 -74643 6980 375329
11794C75329N3311j3224J94276m48874L25968J23677n42569M31670n4843j43143
$$ 375329 428640 415416 609692 160818 486786 610463 67894 499564 444721 301578
11784C01578p6132j78970P71153m00572N98344k08195m51806J64378P5699J26242
$$ 301578 225446 46476 817629 417057 1015401 807206 355400 519778 595477 721719
11774G21719L57801n69783L88187M1919q1107N6177j08874K28777R0246l81077
$$ 721719 1079520 509737 897924 939843 858736 914913 806039 1034816 1125062 743985
11764G43985L75142j49925N98931n66244L85407K33470j62068N97085m67161J77929
$$ 743985 1119127 969202 1568133 1001889 1387296 1620766 1458698 2055783 1588622 1766551
11754A766551j24340J4567M25515k23245N48652l81497k10266M13593k2546J48429
$$ 1766551 1642211 1656778 2082293 1859048 2407700 2026203 1815937 2229530 2206984 2355413
11744B355413j62656J72288K2173m076j73779J01786j75541K984K47797K21433
$$ 2355413 2192757 2365045 2387218 2383142 2209363 2311149 2135608 2138592 2386389 2607822
11734B607822p3762m19701K68881K45097N2693L5491l00665J99582N27098m04691
$$ 2607822 2534060 2114359 2383240 2628337 2681030 2716521 2415856 2615438 3142536 2737845
11724B737845M52689o09013J06691Q71037n97410K80748m72504Q12384j37080
$$ 2737845 3190534 2581521 2688212 3559249 2961839 3242587 2770083 3582467 3445387
11715C445387j49087K91114k24605K3655N0738N8317L73619n03664O36718J89376
$$ 3445387 3296300 3587414 3362809 3386464 3437202 3495519 3869138 3365474 4002192 4191568
11705D191568j40286k02546P337K90763P4194K9156K45165l67125M67638Q4819
$$ 4191568 4051282 3848736 3856073 4146836 4221030 4250186 4495351 4128226 4595864 4680683
11695D680683o34095R48657j03965O3312K33249K81067m53815K84777j37434N89391
$$ 4680683 4046588 4995245 4891280 4954592 5187841 5468908 5015093 5299870 5162436 5751827
11685E751827J68701n0786r4976M93025l96525N61171k29806j49964R66095q31627
$$ 5751827 5920528 5869742 5774766 6267791 5871266 6432437 6202631 6052667 7018762 6187135
11675F187135R60849j61631L41780l87585l06974K28690L58100M62559M48708
$$ 6187135 7147984 6986353 7328133 6940548 6633574 6862264 7220364 7682923 8131631
11666H131631j07682L26492J72839J24472K12219o6198L32650O71894N4383L4777
$$ 8131631 8023949 8350441 8523280 8647752 8859971 8793773 9126423 9798317 9852700 9887477
11656I887477j85887J024752j99507l88279K92479N38627P25294j76556M83992
$$ 9887477 9701590 10726342 10526835 10138556 10431035 10969662 11694956 11518400 12002392
11647A2002392O18714N07973L05614j02553m67934R62261K26875R75999Q1943
$$ 12002392 12621106 13129079 13434693 13332140 12864206 13826467 14053342 15029341 15111284
11638A5111284P13807K25028M4940J056791k3251M65377M68749L46060N95862
$$ 15111284 15825091 16050119 16095059 17151850 17128599 17593976 18062725 18408785 19004647
11629A9004647N60075K81757O39096L89712N19640Q62348K88172P00674R32809
$$ 19004647 19564722 19846479 20485575 20875287 21394927 22257275 22545447 23246121 24178930
11620B4178930O19869P06676R84812J66772N65532O69057R54930R67499Q57615
$$ 24178930 24798799 25505475 26490287 26657059 27222591 27891648 28846578 29814077 30671692
11611C0671692N59551J536438m057J400120J205309M90779J238509J093294J345665
$$ 30671692 31231243 32767681 32763624 34163744 35369053 35859832 37098341 38191635 39537300
11602C9537300M21058J716895J182963J719063J019268J550859J628410J639778
$$ 39537300 39958358 41675253 42858216 44577279 45596547 47147406 48775816 50415594
11594E0415594J993184J165298J947116J921289J707556J905835K952192J460309
$$ 50415594 52408778 53574076 55521192 57442481 59150037 61055872 64008064 65468373
11586F5468373K808214K563241K788811K679473K551281K472386L332871K906446
$$ 65468373 68276587 70839828 73628639 76308112 78859393 81331779 84664650 87571096
11578H7571096L668130L151409L324765M012773L733934L581405L619246M422722
$$ 87571096 91239226 94390635 97715400 101728173 105462107 109043512 112662758 117085480
11570A17085480M125117L619901M631392K943172M376153L559051L730361L403547
$$ 117085480 121210597 124830498 129461890 132405062 136781215 140340266 144070627 147474174
11562A47474174L160917K664521K314382K453877J560047J111943J044885J97538
$$ 147474174 150635091 153299612 155613994 158067871 159627918 160739861 161784746 161982284
11554A61982284l39935r37028j485754j907263j554709l025844k115794l660733
$$ 161982284 161642349 160705321 159219567 157312304 155757595 152731751 150615957 146955224
11546A46955224l569784k718154l989012l994098l526523m102219l876061l350140
$$ 146955224 143385440 140667286 136678274 132684176 129157653 125055434 121179373 117829233
11538A17829233l314443l914818m142030k979761l527068k974248k909872l140584
$$ 117829233 114514790 110599972 106457942 103478181 99951113 96976865 94066993 90926409
11530I0926409k966543k979094k619629k650342k561422k246598k390968k838800
$$ 90926409 87959866 84980772 82361143 79710801 77149379 74902781 72511813 69673013
11522F9673013j392823j917956k776685j575074j736266j888857j675800j748626
$$ 69673013 68280190 66362234 63585549 62010475 60274209 58385352 56709552 54960926
11514E4960926j318488k122849j408604r69608j032100j798421j159635r94121
$$ 54960926 53642438 51519589 50110985 49141377 48109277 46310856 45151221 44157100
11506D4157100j396132j162891r79452j413809p36466j047802j315836n22230
$$ 44157100 42760968 41598077 40618625 39204816 38468350 37420548 36104712 35582482
11498C5582482p34921o21920j341828r25028o30229o96387j044180p14035n83973
$$ 35582482 34847561 34225641 32883813 31958785 31328556 30632169 29587989 28873954 28289981
11489B8289981m32093q16472j5849j350636o26192j42199o27342o90010p18309
$$ 28289981 27857888 27041416 27025567 25674931 25048739 24906540 24279198 23589188 22870879
11480B2870879k6518j23428j259900l48104k17943j05518j083190k12115j71302
$$ 22870879 22844361 22720933 21461033 21112929 20894986 20789468 19706278 19494163 19322861
11471A9322861r50338k40180L19825j109135R5554o53914k98111m11161p65893
$$ 19322861 18372523 18132343 18452168 17343033 17438587 16784673 16486562 16075401 15309508
11462A5309508J3677l69931M20675m89093o25544M55338r33134j23584l60618
$$ 15309508 15323185 14953254 15373929 14884836 14259292 14714630 13781496 13657912 13297294
11453A3297294l11131j95589l35800K4494N4366k05545m33053j78698p84318j3372
$$ 13297294 12986163 12790574 12454774 12479268 12533634 12328089 11895036 11716338 10932020 10918648
11443A0918648J1200m4830m78793N6229j83749k16092k92511m07348l28640Q19517
$$ 10918648 10929848 10885018 10406225 10462454 10278705 10062613 9770102 9362754 9034114 9853631
11433I853631k17340p03809N91073r43971N8494n5330m4074k820n48331o8913
$$ 9853631 9636291 8932482 9523555 8579584 8638078 8582748 8538674 8535854 7987523 7918610
11423G918610J46004k14512j17324N3795l92063L82219o11268M03303o51896j58686
$$ 7918610 8064614 7850102 7732778 7786573 7394510 7776729 7165461 7568764 6916868 6758182
11413F758182L40496n23768N91406m33452m79265l68669m66831N17575k93273
$$ 6758182 7098678 6574910 7166316 6732864 6253599 5884930 5418099 5935674 5642401
11404E642401k5840K05482m31069p0506N20401l18660l60407k12572k81871N20635
$$ 5642401 5616561 5822043 5390974 5320468 5840869 5522209 5161802 4949230 4667359 5187994
11394E187994j67166m18106L87351k81805m17622J17043N56603m26218k31878
$$ 5187994 5020828 4602722 4990073 4708268 4290646 4407689 4964292 4538074 4306196
11385D306196M38080k48762o55858J75840O78236n29286j70851Q7994K50890o29900
$$ 4306196 4744276 4495514 3839656 4015496 4693732 4164446 3993595 4081589 4332479 3702579
11375C702579O19904k60844K14665n97437Q3719j03392K4018J33807j34674j62757
$$ 3702579 4322483 4061639 4276304 3678867 3762586 3659194 3683212 3817019 3682345 3519588
11365C519588M49784k64414m868k55530K7524J93260l14432L7593p9573J75483
$$ 3519588 3969372 3704958 3700090 3444560 3472084 3665344 3350912 3388505 3308932 3484415
11355C484415K4259o9292l25872k6507L0837r0485K03926l97239J04301j7253
$$ 3484415 3508674 3439382 3113510 3087003 3117840 3027355 3231281 2834042 2938343 2921090
11345B921090J68948k19542M59322k68388o13635N730M41677m00430j93128j6280
$$ 2921090 3090038 2870496 3329818 3061430 2447795 2453525 2895202 2494772 2301644 2285364
11335B285364P19338k86911k82340l46292J89407k31267L6726j92037K57782k66312
$$ 2285364 3004702 2717791 2435451 2089159 2278566 2047299 2084025 1891988 2149770 1883458
11325A883458o0605j29L7254O08931m46706M28474k45048p94388L27970j07775
$$ 1883458 1822853 1822724 1859978 2468909 2022203 2450677 2205629 1411241 1739211 1631436
11315A631436O71304o34707M89646k81413k0420o3923m58545J10643L81655k56252
$$ 1631436 2302740 1668033 2157679 1876266 1855846 1791923 1333378 1444021 1825676 1569424
11305A569424k03355K38444m77174L02187Q6302o37277O32864n32283L30857L17930
$$ 1569424 1366069 1604513 1127339 1429526 1515828 878551 1511415 979132 1309989 1627919
11295A627919l09130L97583k73153R2155n36610J99983M69157j093985P69557
$$ 1627919 1318789 1716372 1443219 1535374 998764 1198747 1667904 573919 1343476
11286A343476l13675L94016m89159N9587M40921j80090l279k03857l85339K33569
$$ 1343476 1029801 1423817 934658 994245 1435166 1255076 1251797 1047940 662601 896170
11276H96170p2833j10413r0544L67758o88133O71822j17158l73321k22157P98155
$$ 896170 823337 712924 622380 990138 302005 973827 856669 483348 261191 1059346
11266A059346n18897J9213M67927j10738Q9719k14112n69348O40023l43763j22296
$$ 1059346 540449 559662 1027589 916851 1006570 792458 223110 863133 519370 397074
11256C97074Q18869m18894l60775M48071j68645o33906J66237p8925M35791m26462
$$ 397074 1215943 797049 436274 884345 715700 81794 248031 169106 604897 178435
11246A78435J27381L77890l96955J15067m9207K83233j28662J6432k44872M23404
$$ 178435 305816 683706 286751 401818 352611 635844 507182 523614 278742 702146
11236G02146o4883j07696m84000Q4623N10322j88920n78598k07722J20106O62404
$$ 702146 637263 529567 45567 130190 640512 451592 -127006 -334728 -214622 447782
11226D47782o47543P9305Q6310P2809J27665j1111J06877P1884o29058P15802
$$ 447782 -199761 -120456 -34146 38663 166328 155217 262094 333978 -295080 420722
11216D20722k91744M34252l38767n18932M33439m90228R1504K39005K00964l87458
$$ 420722 128978 563230 224463 -294469 138970 -351258 -259754 -20749 180215 -207243
11206b07243l45281O15954k21369m957j88517L99913j67281j42702J23928J90231
$$ -207243 -552524 63430 -157939 -162896 -351413 48500 -118781 -261483 -137555 52676
11196E2676K11139k48540j76309k88769L09761N3032m83888L17561O27169l59365
$$ 52676 263815 15275 -161034 -449803 -140042 -87010 -570898 -253337 373832 14467
11186A4467n868N4266M25321p60753K55199n67581N07866n24148L71255R196j44746
$$ 14467 8599 62865 488186 -272567 -17368 -584949 -77083 -601231 -229976 -220780 -365526
11175c65526L07188J88351J19138o14927J72496r3206l37201M87183o0627J62667
$$ -365526 -58338 130013 249151 -365776 -193280 -286486 -623687 -136504 -197131 -34464
11165c4464r1518J00266j70716r6632k05613J10024Q32468l30765j46414J49171
$$ -34464 -125982 -25716 -196432 -293064 -498677 -388653 443815 113050 -33364 115807
11155A15807l28921k25822m52471K28074j93593N94509L79464q68773L87256o72019
$$ 115807 -213114 -438936 -891407 -663333 -856926 -262417 117047 -751726 -364470 -1036489
11145a036489N54627m7122J49506l55404K75798p9865k36047N10944j35398M18736
$$ -1036489 -481862 -528984 -379478 -734882 -459084 -538949 -774996 -264052 -399450 19286
11135A9286k98903l30408o719L38329j00232p5299L1547j39013j15660N24000
$$ 19286 -279617 -610025 -616744 -278415 -378647 -453946 -422399 -561412 -677072 -153072
11125a53072m69204M58069n10718k57819N19546m06605L37436J82373n78594J99302
$$ -153072 -622276 -164207 -674925 -932744 -413198 -819803 -482367 -299994 -878588 -679286
11115f79286L87276J44325K12746q32212J18020q4506J72809J37286J29715k81351
$$ -679286 -292010 -147685 65061 -767151 -649131 -733637 -560828 -423542 -293827 -575178
11105e75178k33352k36497N02067j04721R9914n7156J02520m5238l43854K11082
$$ -575178 -808530 -1045027 -542960 -647681 -547767 -604923 -502403 -547641 -891495 -680413
11095f80413K89112k81477M6069k8097K74254l65369J33149J31978l38512J84138
$$ -680413 -391301 -672778 -626709 -654806 -380552 -745921 -612772 -480794 -819306 -635168
11085f35168l113q1372O7985K19314k77171N5085K19939j53872J84180R1236j73528
$$ -635168 -638281 -719653 -651668 -432354 -709525 -654440 -434501 -588373 -404193 -312957 -486485
11074d86485K49212l50636j9646k71437J26996K26667p17355M30899P11407o6497
$$ -486485 -237273 -587909 -607555 -878992 -751996 -525329 -1242684 -811785 -100378 -166875
11064a66875n02867N41013n51704n7758M12819j808M4472J39677q44384M51974
$$ -166875 -669742 -128729 -680433 -738191 -325372 -327180 -282708 -143031 -987415 -535441
11054e35441l36291P5178j60755K24922J74045K49385k53996k5409M921Q817j95752
$$ -535441 -871732 -796554 -957309 -732387 -558342 -308957 -562953 -588362 -583441 -574624 -770376
11043g70376J24902K03354M86857j048731P59324k84200r5370N35057n76311p231
$$ -770376 -645474 -442120 44737 -1003994 -244670 -528870 -624240 -89183 -665494 -672725
11033f72725n83086M82225r7297K40280q1533K63461m18106L27566r286Q0363
$$ -672725 -1255811 -773586 -870883 -630603 -712136 -448675 -866781 -539215 -548501 -468138
11023d68138o20749J034539o12641K25499J69825m92097J77377J37343m61580
$$ -468138 -1088887 -54348 -666989 -441490 -271665 -763762 -586385 -449042 -910622
11014i10622J97408J57958m42519P86334l58347p2229l66573N74655k24398J9105
$$ -910622 -713214 -555256 -997775 -211441 -569788 -642017 -1008590 -433935 -658333 -639228
11004f39228M05422m62114k4219j26251j58214K07538K43557o0375k99803O0384
$$ -639228 -233806 -695920 -720139 -846390 -1004604 -797066 -553509 -613884 -913687 -853303
10994h53303L44844j62622M63499m10003k72257k0427L65816n87638J38054M46829
$$ -853303 -508459 -671081 -207582 -617585 -889842 -910269 -544453 -1132091 -994037 -547208
10984e47208o50367N12808J13973n3241k35735j32696L62583K22930m75451j80183
$$ -547208 -1197575 -684767 -570794 -624035 -859770 -992466 -629883 -406953 -882404 -1062587
10974a062587K86310j6669K41261k0193n16741K5637L36001j86029j11463O54953
$$ -1062587 -776277 -792946 -551685 -571878 -1088619 -1062982 -726981 -913010 -1024473 -369520
10964c69520m05720j53313K99751M77100p60256K59737k16335k87522L61295l25030
$$ -369520 -775240 -928553 -628802 -151702 -911958 -652221 -868556 -1156078 -794783 -1119813
10954a119813L59944L7773o5227j46602p3069N20322m73310k5703j68716M91006
$$ -1119813 -759869 -722096 -787323 -933925 -1006994 -486672 -959982 -985685 -1154401 -663395
10944f63395n61375L89522O8710k41221P3942p2983K24424O74239p47920K36665
$$ -663395 -1224770 -835248 -766538 -1007759 -933817 -1006800 -782376 -108137 -856057 -619392
10934f19392j77526o9902P9370P1169j77715l60973M77457K26103m11506K54109
$$ -619392 -796918 -866820 -787450 -716281 -893996 -1254969 -777512 -551409 -962915 -708806
10924g08806L55022r59934R37717m98233K37764q0624j7985r73j85135J58005
$$ -708806 -353784 -1313718 -376001 -874234 -636470 -717094 -735079 -736052 -921187 -763182
10914g63182j57770M04016m1159m0865n27939j42508j03723Q08318j76215j09570
$$ -763182 -920952 -516936 -558095 -598960 -1126899 -1269407 -1373130 -564812 -741027 -850597
10904h50597L98626l63393j18017L22081n04037N17167j65031l49953J24183L24972
$$ -850597 -451971 -815364 -933381 -611300 -1115337 -598170 -763201 -1113154 -988971 -663999
10894f63999l26825m03219O35869L720M25025j109951K88939M77405m7566l65195
$$ -663999 -990824 -1394043 -758174 -754454 -329429 -1439380 -1150441 -673036 -720602 -1085797
10884a085797k95888L03763j86457K85615M6413j66823O39922k70410k67637P00646
$$ -1085797 -1381685 -1077922 -1264379 -978764 -932351 -1099174 -459252 -729662 -997299 -296653
10874b96653k95274m59289L88541k92859j69052J79676M05854k58923K8501k5994
$$ -296653 -591927 -1051216 -662675 -955534 -1124586 -944910 -539056 -797979 -769478 -795472
10864g95472L78845n30750r0322O4753K9502K26508p3036n07544N59359k73664
$$ -795472 -416627 -947377 -1037699 -972946 -943444 -716936 -789972 -1297516 -738157 -1011821
10854a011821M40591j41010j35868J3800n58961L18995K39464L42823j38138n00907
$$ -1011821 -571230 -712240 -848108 -834308 -1393269 -1074274 -834810 -491987 -630125 -1131032
10844a131032J81350m3869j05780j89403Q31735Q6962l74939j78951j46699J49785
$$ -1131032 -949682 -993551 -1099331 -1288734 -456999 -370037 -744976 -923927 -1070626 -920841
10834i20841J00388J26712m5562J73467r2816p3436l51398K59407l51548L41044
$$ -920841 -820453 -693741 -739303 -565836 -658652 -732088 -1083486 -824079 -1175627 -834583
10824h34583M06664n67763K00839J87843l43654l95462k3638K20181J51701N03606
$$ -834583 -427919 -995682 -794843 -607000 -950654 -1346116 -1369754 -1149573 -997872 -494266
10814d94266m63338m74339N03541M26381q38071J088064n49531n56246L74106
$$ -494266 -957604 -1431943 -928402 -502021 -1340092 -252028 -801559 -1357805 -983699
10805i83699K00056m38195P59660l65237j63991K7739k84092K62955K65473j36915
$$ -983699 -783643 -1221838 -462178 -827415 -991406 -963667 -1247759 -984804 -719331 -856246
10795h56246j57471K51377P3437l18694Q11947p29744O4834N91778p36880R6767
$$ -856246 -1013717 -762340 -688903 -1007597 -195650 -925394 -860560 -268782 -1005662 -908895
10785i08895J10068q8870j31307l90590O29211q7813l69998J88947J34603M22479
$$ -908895 -798827 -887697 -1019004 -1409594 -780383 -868196 -1238194 -1049247 -914644 -492165
10775d92165n24890L01582o76877R53467r75692J149146q77893N77139q03300
$$ -492165 -1017055 -715473 -1392350 -438883 -1414575 -265429 -1143322 -566183 -1369483
10766a369483N61434m20038l19980Q25211j9455n138l51652j51090K04377L12360
$$ -1369483 -808049 -1228087 -1548067 -722856 -742311 -747449 -1099101 -1250191 -1045814 -733454
10756g33454J56166j058304J031949q68720J110985l07575k22155n4971J20399
$$ -733454 -577288 -1635592 -603643 -1472363 -361378 -668953 -891108 -946079 -825680
10747h25680l9209P2243M9710k76835l42078O70441l26268L67607k93704q969
$$ -825680 -864889 -792646 -742936 -1019771 -1361849 -691408 -1017676 -650069 -943773 -952742
10737i52742r400n25073L7306R5091L50908K3892n29904N79272L83321n19867
$$ -952742 -962142 -1487215 -1449909 -1354818 -1003910 -980018 -1509922 -930650 -547329 -1067196
10727a067196k6612j98150J31552R904N29863q18356L91136l86129L18288L344
$$ -1067196 -1093808 -1291958 -1160406 -1150502 -620639 -1438995 -1047859 -1433988 -1115700 -1112356
10717a112356l5167M067K7628J77245k95298m17358N62325l17743R34844k54526
$$ -1112356 -1147523 -1143456 -1115828 -938583 -1233881 -1651239 -1088914 -1406657 -471813 -726339
10707g26339j55261k10327o4695J25383M831M798j07816M68984q39626O77037
$$ -726339 -881600 -1091927 -1156622 -1031239 -1026408 -1021610 -1129426 -660442 -1500068 -823031
10697h23031m55190J92224k26142L52518k31259M30791r3445l99022k61294Q73665
$$ -823031 -1278221 -1085997 -1312139 -959621 -1190880 -760089 -853534 -1252556 -1513850 -640185
10687f40185n9313n69729J18449L26205j85282q2351r8687L2241K9027m1790O2413
$$ -640185 -699498 -1269227 -1150778 -824573 -1009855 -1092206 -1190893 -1158652 -1129625 -1171415 -1109002
10676a109002Q5377j13750J70688P9449k8077r6000l50678J99410L50662q5822
$$ -1109002 -1023625 -1137375 -966687 -887238 -915315 -1011315 -1361993 -1162583 -811921 -897743
10666h97743l85624J43347l10354K25832k19242O87851p00388N02671o5877L9711
$$ -897743 -1283367 -1140020 -1450374 -1224542 -1443784 -755933 -1456321 -953650 -1019527 -979816
10656i79816p4258p23472N17860M6693L76449j13483k92353K35838l49110M47449
$$ -979816 -1054074 -1777546 -1259686 -1212993 -836544 -950027 -1242380 -1006542 -1355652 -908203
10646i08203O79397q65774J27870k24848j0430M19177p44586L91146K0094l61092
$$ -908203 -228806 -1094580 -966710 -1191558 -1201988 -782811 -1527397 -1136251 -1116157 -1477249
10636a477249K85848L7664M45727m77745J19430L15050O4212p00742K12542L51527
$$ -1477249 -1191401 -1153737 -708010 -1185755 -1066325 -751275 -687063 -1387805 -1175263 -823736
10626h23736p21627K73128R4354l30304M58116J50442j82435M56007r2357o41096
$$ -823736 -1545363 -1272235 -1177881 -1508185 -1050069 -899627 -1082062 -626055 -718412 -1359508
10616a359508R7061l9636N26549l78015P40696q16572o0555j32683P90324N0915
$$ -1359508 -1262447 -1302083 -775534 -1153549 -412853 -1229425 -1289980 -1422663 -632339 -581424
10606e81424m08504j19529n4534M42383n34231O19795l34242m83444N98817o70734
$$ -581424 -989928 -1109457 -1163991 -721608 -1255839 -636044 -970286 -1453730 -854913 -1525647
10596a525647J11725M22800N2144j10304M38334n55625l1103N91131n34134J91683
$$ -1525647 -1413922 -991122 -938978 -1049282 -610948 -1166573 -1197676 -606545 -1140679 -948996
10586i48996j22741o72267M96793J84884L01305p64615O20078j6875k3800k27002
$$ -948996 -1071737 -1744004 -1247211 -1062327 -761022 -1525637 -905559 -922434 -946234 -1173236
10576a173236O00053l04436k55882K03592l21564L46430l30526m4632p8901O61657
$$ -1173236 -573183 -877619 -1133501 -929909 -1251473 -905043 -1235569 -1280201 -1359102 -697445
10566f97445l40657J49281K37404n02102J16848n32374J07159N60012l00197m05915
$$ -697445 -1038102 -888821 -651417 -1153519 -1036671 -1569045 -1461886 -901874 -1202071 -1607986
10556a607986P54764k06491R8377n31926P74249m9560l39709K1663l6819N1906
$$ -1607986 -853222 -1059713 -961336 -1493262 -719013 -768573 -1108282 -1086619 -1123438 -1071532
10546a071532l16491r458N31033r3118j54050m56464N47756j7081K12930r17933
$$ -1071532 -1388023 -1397481 -866448 -959566 -1113616 -1570080 -1022324 -1039405 -826475 -1744408
10536a744408Q57614m15218J08775O82789o14994j63128R3533l41852L61059k46029
$$ -1744408 -886794 -1302012 -1193237 -510448 -1125442 -1288570 -1195037 -1536889 -1175830 -1421859
10526a421859K67829K17402o43728L98019j53182n3385K72580J71981n6301l68377
$$ -1421859 -1154030 -936628 -1580356 -1182337 -1335519 -1388904 -1116324 -944343 -1000644 -1369021
10516a369021N7873P5488l86001O02072J31169J19652p90141M30453r957l38747
$$ -1369021 -1311148 -1235660 -1621661 -1019589 -888420 -768768 -1558909 -1128456 -1138413 -1477160
10506a477160Q36032r12021M42903J20836l8469k3955l94456O3165J26425K84336
$$ -1477160 -641128 -1553149 -1110246 -989410 -1027879 -1051834 -1446290 -1383125 -1256700 -972364
10496i72364k40781j76614L16596m90771R17489p5942l95886k48085N2862K90119
$$ -972364 -1213145 -1389759 -1073163 -1563934 -646445 -722387 -1118273 -1366358 -1313496 -1023377
10486a023377J74517m42488K77993k48586p3845N292O90222o21964K95846K79527
$$ -1023377 -848860 -1291348 -1013355 -1261941 -1335786 -1330494 -640272 -1262236 -966390 -686863
10476f86863l94511j03613N0245l59360L77411K20008k25326q8962K81776m06928
$$ -686863 -1081374 -1184987 -1134742 -1494102 -1116691 -896683 -1122009 -1210971 -929195 -1336123
10466a336123K62626j8698k92682L65609k45724k8855K62542j98162j46581j85262
$$ -1336123 -1073497 -1092195 -1384877 -1019268 -1264992 -1293847 -1031305 -1229467 -1376048 -1561310
10456a561310L63192Q0638l40383Q40523k47801J3918l02578k31236Q0709J96356
$$ -1561310 -1198118 -1117480 -1457863 -617340 -865141 -851223 -1153801 -1385037 -1304328 -1107972
10446a107972P1741m95665L04183K16993k7781L18295m44462L82002l37898N0658
$$ -1107972 -1036231 -1531896 -1227713 -1010720 -1038501 -720206 -1164668 -782666 -1120564 -1069906
10436a069906k95231l352L06599R903M76741n00281l3420J64093k23721n1505
$$ -1069906 -1365137 -1368489 -1061890 -1051987 -575246 -1075527 -1108947 -944854 -1168575 -1220080
10426a220080K83998L37094j075842J07913M0899L97332j83599Q9569J71537k83596
$$ -1220080 -936082 -598988 -1674830 -1566917 -1526018 -1128686 -1312285 -1222716 -1051179 -1334775
10416a334775K49975k40176M61447o47929M91191P5056m98041K34146p1178j47175
$$ -1334775 -1084800 -1324976 -863529 -1511458 -1020267 -945211 -1443252 -1209106 -1280284 -1427459
10406a427459J91195l78259J43895M8818J73609K36295j55811M053j38179J29313
$$ -1427459 -1236264 -1614523 -1470628 -1421810 -1248201 -1011906 -1167717 -1163664 -1301843 -1172530
10396a172530J85560J24721l64772k33764L63794K16509K62519l51923J68976
$$ -1172530 -986970 -862249 -1227021 -1460785 -1096991 -880482 -617963 -969886 -800910
10387h00910n81301j57218N90013o08189M38715J59942Q6087o45023n7903K53775
$$ -800910 -1382211 -1539429 -949416 -1557605 -1118890 -958948 -872861 -1517884 -1575787 -1322012
10377a322012J47614k66304K66939K74903k42671L29016o24978M01188j51479
$$ -1322012 -1174398 -1440702 -1173763 -898860 -1141531 -812515 -1437493 -1036305 -1187784
10368a187784l74527K31258J29364M988M05080j44743j03667j56433Q2643k57906
$$ -1187784 -1562311 -1331053 -1201689 -1196701 -791621 -936364 -1040031 -1196464 -1113821 -1371727
10358a371727j52881R1524J81039n9751J38557K64464M4786l52054L34688l9561
$$ -1371727 -1524608 -1433084 -1252045 -1311796 -1173239 -908775 -863989 -1216043 -881355 -920916
10348i20916m47120M11381J34300o08863L19206l19112N29257K80745l47584L20661
$$ -920916 -1368036 -956655 -822355 -1431218 -1112012 -1431124 -901867 -621122 -968706 -648045
10338f48045l90243M72101n32220l0395J89660K26443j97701j64555K04065k86405
$$ -648045 -1038288 -566187 -1098407 -1128802 -939142 -712699 -910400 -1074955 -870890 -1157295
10328a157295j66593N71109j78899m81713L14148k6023j78745N13373p63519R9026
$$ -1157295 -1323888 -752779 -931678 -1413391 -1099243 -1125266 -1304011 -790638 -1554157 -1455131
10318a455131L6800K13072j61148M99707l78537J01948k286m57594R20765o8578
$$ -1455131 -1418331 -1205259 -1366407 -866700 -1245237 -1143289 -1145575 -1603169 -682404 -750982
10308g50982K85718l32547L5367K9493R1359p54057L97522J23981L05586n62795
$$ -750982 -465264 -797811 -762444 -732951 -641592 -1395649 -998127 -874146 -568560 -1131355
10298a131355L3558l6166K30158P0609m02985J84155J2024m22058R9115J26192
$$ -1131355 -1097797 -1133963 -903805 -833196 -1236181 -1052026 -1040002 -1462060 -1362945 -1236753
10288a236753O05584l49847l86663M69840L02763J57496j030063K58289l05521
$$ -1236753 -631169 -981016 -1367679 -897839 -595076 -437580 -1467643 -1209354 -1514875
10279a514875R01260l61920K02013l00097k73965j23158P13574p67855M19017
$$ -1514875 -613615 -975535 -773522 -1073619 -1347584 -1470742 -757168 -1525023 -1106006
10270a106006K67307j13114k26978o6457J69258L38143j75504k46435J89530k27882
$$ -1106006 -838699 -951813 -1178791 -1245248 -1075990 -737847 -913351 -1159786 -970256 -1198138
10260a198138L25610m68146J49445L55113n15171N97779l25259Q0698J32490m79520
$$ -1198138 -872528 -1340674 -1191229 -836116 -1351287 -753508 -1078767 -998069 -865579 -1345099
10250a345099J73229j1314l39779j94630P37813K75497k44342l10151R3068L04950
$$ -1345099 -1171870 -1183184 -1522963 -1717593 -979780 -704283 -948625 -1258776 -1165708 -860758
10240h60758j42898k93646J47263L15422j81863J54944m48677P80165l92269m45831
$$ -860758 -1003656 -1297302 -1150039 -834617 -1016480 -861536 -1310213 -530048 -922317 -1368148
10230a368148o4606J93662K17170J96231m77386j91910L97610m78474Q10301j80744
$$ -1368148 -1432754 -1239092 -1021922 -825691 -1303077 -1494987 -1097377 -1575851 -765550 -946294
10220i46294o8773q0259N07781m23748j20799N47629J18182o49000P1642j04319
$$ -946294 -1015067 -1095326 -587545 -1011293 -1132092 -584463 -466281 -1115281 -1043639 -1147958
10210a147958r06o2967K31059K17214k21438r8959q4100q7169K34915M36627j26337
$$ -1147958 -1148864 -1211831 -980772 -763558 -984996 -1083955 -1168055 -1255224 -1020309 -583682 -710019
10199g10019l82014j7953p0208k91729J39705N00216q02490K62482P23270l95479
$$ -710019 -1092033 -1109986 -1180194 -1471923 -1332218 -832002 -1634492 -1372010 -648740 -1044219
10189a044219k37025P23581m04565L8142q1157k13726K75993k72788k77445O21069
$$ -1044219 -1281244 -557663 -962228 -924086 -1005243 -1218969 -942976 -1215764 -1493209 -872140
10179h72140l87614O08921o58603M26924r7563j52614K41493m67231L43776K60516
$$ -872140 -1259754 -650833 -1309436 -882512 -980075 -1132689 -891196 -1358427 -1014651 -754135
10169g54135k58798K77775l29731O5134J0602o6999o7122M54908m44888J02083
$$ -754135 -1012933 -735158 -1064889 -999755 -989153 -1056152 -1123274 -668366 -1113254 -1011171
10159a011171K13925j46537L03957l04355j19367K98873k90106L89035k7877l73628
$$ -1011171 -797246 -943783 -639826 -944181 -1063548 -764675 -1054781 -665746 -693623 -1067251
10149a067251n1566K6327K89108O3905j99229r1922k23824K84756J81315n86823
$$ -1067251 -1118817 -1092490 -803382 -739477 -938706 -1030628 -1254452 -969696 -788381 -1375204
10139a375204j4784N57277l91381K98245K61575m8692k51692j34235R3486N03988
$$ -1375204 -1389988 -832711 -1224092 -925847 -664272 -712964 -964656 -1098891 -1005405 -501417
10129e01417k93799K42193k94075K84053K47148o32707P18394p9744l45226L37480
$$ -501417 -795216 -553023 -847098 -563045 -315897 -948604 -230210 -309954 -655180 -317700
10119c17700n88761K16890l15011N72466l95998J41580n59093L06421L66116j76739
$$ -317700 -906461 -689571 -1004582 -432116 -828114 -686534 -1245627 -939206 -573090 -749829
10109g49829p63268P06144M69833k92804j98907J60132p28195J189340j45314
$$ -749829 -1513097 -806953 -337120 -629924 -828831 -668699 -1396894 -207554 -352868
10100c52868r3327k07918m66074K24052L44883l09419K92719m77957K03059Q6471
$$ -352868 -446195 -654113 -1120187 -896135 -551252 -860671 -567952 -1045909 -842850 -756379
10090g56379M05735k37644k13072q8950M48847l26767Q0825l16707L67644r665
$$ -756379 -350644 -588288 -801360 -890310 -441463 -768230 -687405 -1004112 -636468 -646133
10080f46133j69390O6481R1333j60780N61422m61245N59616p55988J79881p5899
$$ -646133 -815523 -749042 -657709 -818489 -257067 -718312 -158696 -914684 -734803 -810702
10070h10702l04596M86732P275J64753M49397r74072L23378J81513K46304r39424
$$ -810702 -1115298 -628566 -621291 -456538 -7141 -981213 -657835 -476322 -230018 -1169442
10060a169442O88969M5047m9448n07605O55971J72315l9026N31668r18383M33233
$$ -1169442 -480473 -435426 -484874 -992479 -336508 -164193 -203219 328449 -589934 -156701
10050a56701r5784j23690P51k27281R29181k19591J95113k02467J1953j60141
$$ -156701 -252485 -376175 -375424 -602705 326476 106885 301998 99531 111484 -48657
10040d8657l8894Q4813k54495j25145J21056j63702O04814l00599P7801r7998
$$ -48657 -87551 -2738 -257233 -382378 -261322 -425024 179790 -120809 -43008 -141006
10030a41006O22261o90437O5388k79245N05633J52046J77324m96174K93209k78762
$$ -141006 481255 -209182 -143794 -423039 82594 234640 411964 -84210 208999 -69763
10020f9763K32010N05425k95741N72980q23697M38182K14520j42885M40919k40460
$$ -69763 162247 667672 371931 944911 121214 559396 773916 631031 1071950 831490
10010H31490k36785k04683M11156J05571j35244l63342P73293j04696l66141J202362
$$ 831490 594705 390022 801178 906749 771505 408163 1181456 1076760 710619 1912981
10000A912981o75018P26813m87602J14571L61135o15481M87861r3171N29209m39897
$$ 1912981 1237963 1964776 1477174 1591745 1952880 1337399 1825260 1732089 2261298 1821401
9990A821401J12199P4512n53574K74323O33588J60020l88692j93919N1002n15656
$$ 1821401 1933600 2008112 1454538 1728861 2362449 2522469 2133777 1939858 1990860 1475204
9980A475204L78211l09565M13144L25545k50415O14570p90564O75051m41602K2172
$$ 1475204 1853415 1543850 1956994 2282539 2032124 2646694 1856130 2531181 2089579 2111751
9970B111751J018930p2720J27865r6382K08586J96037L53089l55541O53409k74166
$$ 2111751 3130681 3057961 3185826 3089444 3298030 3494067 3847156 3491615 4145024 3870858
9960C870858j08609K20316q64058J0682j45626n75613J1799Q21751q98626K7238
$$ 3870858 3762249 3982565 3118507 3129189 2983563 2407950 2419749 3241500 2342874 2370112
9950B370112J67662q49101k3864m3844l52853n75233N41773l73912K41513o68589
$$ 2370112 2537774 1688673 1664809 1620965 1268112 692879 1234652 860740 1102253 433664
9940D33664M7213j20820L75555K18304N51333o22548l99557K98564K3484l50396
$$ 433664 480877 360057 735612 953916 1505249 882701 483144 781708 805192 454796
9930D54796l68375M42427k92334M31526k87605K34463n16125K11199L52772l316
$$ 454796 86421 528848 236514 668040 380435 614898 98773 309972 662744 659428
9920F59428O1308j07038M87150o01995l32526J4240K32877N75120n05576m29604
$$ 659428 720736 613698 1100848 498853 166327 180567 413444 988564 482988 53384
9910E3384M1498J48706M87180q05390N64487j53627j0799k49350O81663k52564
$$ 53384 94882 243588 730768 -74622 489865 336238 325439 76089 757752 505188
9900E05188J65469j67256j20621K84520k23384k20290O48818j48766P1795M06451
$$ 505188 670657 503401 382780 667300 443916 223626 872444 723678 795473 1201924
9890A201924J89887j11962m9394M7065K10110j59423J28117j12713K00847j92405
$$ 1201924 1391811 1279849 1230455 1277520 1487630 1328207 1456324 1343611 1544458 1352053
9880A352053M55788j98605o74403M16305k24682M78014j87962L23433l23843o240
$$ 1352053 1807841 1609236 934833 1351138 1126456 1604470 1416508 1739941 1416098 1409858
9870A409858K72628L37455l35057J31921l31774L25536O30037l61203J99561J53485
$$ 1409858 1682486 2019941 1684884 1816805 1485031 1810567 2440604 2079401 2278962 2432447
9860B432447J25280q9894L23392k30953n5928O61442l50880L49627J60662k70713
$$ 2432447 2557727 2467833 2791225 2560272 2504344 3165786 2814906 3164533 3325195 3054482
9850C054482l41203N44827J19319L39270m07731K17749j27288J14863m60203M69285
$$ 3054482 2713279 3258106 3377425 3716695 3308964 3526713 3399425 3514288 3054085 3523370
9840C523370k1929K61401M99499j27082J78031l10064q9668m4609Q79173p02887
$$ 3523370 3501441 3762842 4262341 4135259 4313290 4003226 3913558 3868949 4748122 4045235
9830D045235L38070M8247N47894n13369Q47950n02987k26080J70390L81853r1349
$$ 4045235 4383305 4431552 4979446 4466077 5314027 4811040 4584960 4755350 5137203 5045854
9820E045854k5304o998K25327L68296k18216n4900j22332K03598O61229P3964
$$ 5045854 5020550 5013552 5238879 5607175 5388959 5334059 5211727 5415325 6076554 6150518
9810F150518l15301K36908j47260J59467P46179L9793k49850q2488M49023K54494
$$ 6150518 5835217 6072125 5924865 6084332 6830511 6870304 6620454 6537966 6986989 7241483
9800G241483k63887N62256k25527K37255J22130o4729L25221j54047K31820M89809
$$ 7241483 6977596 7539852 7314325 7551580 7673710 7608981 7934202 7780155 8011975 8501784
9790H501784q9999L01703m79695M29225K57049j87074L55515M60331l2940J05047
$$ 8501784 8411785 8713488 8233793 8663018 8920067 8732993 9088508 9548839 9515899 9620946
9780I620946M9223m9129P01291K26925L45648O2993N38121M59395j31851N37704
$$ 9620946 9670169 9621040 10322331 10549256 10894904 10957897 11496018 11955413 11823562 12361266
9770A2361266O09655M59826M35481n52754J086223Q1807L83992O62639R8047P07966
$$ 12361266 12970921 13430747 13866228 13313474 14399697 14481504 14865496 15528135 15626182 16334148
9760A6334148l37566N74856J087068p7816R91331N72630L75570M19537m6942P74739
$$ 16334148 15996582 16571438 17658506 17580690 18572021 19144651 19520221 19939758 19892816 20667555
9750B0667555Q64891M32213N02987L99804J044793P12343J178732M51212K65736
$$ 20667555 21532446 21964659 22467646 22867450 23912243 24624586 25803318 26254530 26520266
9741B6520266R14611Q68219O51338Q86274M36933R20937Q79335R02364J341544
$$ 26520266 27434877 28303096 28954434 29840708 30277641 31198578 32077913 32980277 34321821
9732C4321821J139383P38010J515280Q00675J028328R85156J444336J898037R83929
$$ 34321821 35461204 36199214 37714494 38515169 39543497 40528653 41972989 43871026 44854955
9723D4854955J181787K080210J170336J780479J902924J832589K226471J720459
$$ 44854955 46036742 48116952 49287288 51067767 52970691 54803280 57029751 58750210
9715E8750210K264567K087977K582869K558291L477521L163077K292263M005324
$$ 58750210 61014777 63102754 65685623 68243914 71721435 74884512 77176775 81182099
9707H1182099L559115M074238L750759N120840M643760N480689N731209O386284
$$ 81182099 84741214 88815452 92566211 97687051 102330811 107811500 113542709 119928993
9699A19928993O663269P644111Q215395Q256012R292992J0120204J1567012J2160468
$$ 119928993 126592262 134236373 142451768 150707780 160000772 170120976 181687988 193848456
9691A93848456J2309191J3721458J4218939J4516811J5264136J4250545J2173261
$$ 193848456 206157647 219879105 234098044 248614855 263878991 278129536 290302797
9684B90302797J1784745R400210O609174L823330J407231j990455m568110o120371
$$ 290302797 302087542 311487752 318096926 321920256 323327487 321337032 316768922 310648551
9676C10648551p561427r234544q757714r306554p760712o765274n999218m742835
$$ 310648551 303087124 293852580 285094866 275788312 268027600 261262326 255263108 250520273
9668B50520273k645264j528243K12707J803290K939987M416056N918769P126437
$$ 250520273 247875009 246346766 246559473 248362763 251302750 255718806 261637575 268764012
9660B68764012Q800944R116742J0373116J1574143J1099693J0015285Q840347
$$ 268764012 277564956 286681698 297054814 308628957 319728650 329743935 338584282
9653C38584282O824306M688089K104714k288283m303771p480002j0134126j3098273
$$ 338584282 345408588 350096677 352201391 349913108 345609337 338129335 327995209 314896936
9645C14896936j4942523j5110958j6364590j5758296j5324342j4413877j4072211
$$ 314896936 299954413 284843455 268478865 252720569 237396227 222982350 208910139
9638B08910139j2249883j1975485r926478r425607q824639q369226o455797o239003
$$ 208910139 196660256 184684771 174758293 165332686 156508047 148138821 141683024 135444021
9630A35444021n850948n835398n213715m859877m862000m359219m301383l926472
$$ 135444021 129593073 123757675 118543960 113684083 108822083 104462864 100161481 96235009
9622I6235009l647315l376161k928237l335176k938855k701360k379329k764879
$$ 96235009 92587694 89211533 86283296 82948120 80009265 77307905 74928576 72163697
9614G2163697k151453j823147j891471k788546j477828j470308j770791j828758
$$ 72163697 70012244 68189097 66297626 63509080 62031252 60560944 58790153 56961395
9606E6961395j540616j874174r03164j733077j422828j363345j268688j268526
$$ 56961395 55420779 53546605 52643441 50910364 49487536 48124191 46855503 45586977
9598D5586977r85809j384633j322684j075504q71939j349397j295266m11208j169559
$$ 45586977 44601168 43216535 41893851 40818347 39946408 38597011 37301745 36890537 35720978
9589C5720978j013171o38566o71843n71364j017723k87736r11823p03736o03372
$$ 35720978 34707807 34069241 33397398 32826034 31808311 31520575 30608752 29905016 29301644
9580B9301644n1656n13668j019921j49155q08477p79834n13937l51427j035902
$$ 29301644 29249988 28736320 27716399 27567244 26758767 25978933 25464996 25113569 24077667
9571B4077667l36196m35430l13899m75411n76963k57206o59255l8660j28036p44923
$$ 24077667 23741471 23306041 22992142 22516731 21939768 21682562 21023307 20984647 20856611 20111688
9561B0111688J05128o55323R5239p89319o4233n7227J56383l38151k89802m6084
$$ 20111688 20216816 19561493 19656732 18867413 18803180 18745953 18902336 18564185 18274383 18228299
9551A8228299o9497j88541m70913l75569k58261J09388k1855j60585m50717p6507
$$ 18228299 18158802 17970261 17499348 17123779 16865518 16974906 16953051 16792466 16341749 16265242
9541A6265242m41912m32789N04604k69028p2901k79477k58658l28862n01729l18654
$$ 16265242 15823330 15390541 15895145 15626117 15553216 15273739 15015081 14686219 14184490 13865836
9531A3865836l47996j93934L88236p83919n3838m86704l92599N44060n93844J96808
$$ 13865836 13517840 13323906 13712142 12928223 12874385 12387681 11995082 12539142 11945298 12142106
9521A2142106M7547l40397j69821k3057j38116m0511j09113j41668K61033J0990
$$ 12142106 12189653 11849256 11679435 11656378 11518262 11477751 11368638 11226970 11488003 11498993
9511A1498993J84171k68274M8011J98100l41398R5701R5994k51647m61260q324
$$ 11498993 11683164 11414890 11462901 11661001 11319603 11415304 11511298 11259651 10798391 10790067
9501A0790067o63476N5284k03473m23823k72938q1117N08971k78191j11522j88420
$$ 10790067 10126591 10181875 9978402 9554579 9281641 9200524 9709495 9431304 9319782 9131362
9491I131362k07029p47L6854l98013l52024N20697K08614r14084K9136N83489
$$ 9131362 8924333 8923586 8960440 8562427 8210403 8731100 8939714 8025630 8054766 8638255
9481H638255J96770l93112O3658l27464L12042k40649P8259m02469m56654J099446
$$ 8638255 8835025 8441913 8505571 8178107 8490149 8249500 8327759 7925290 7468636 8568082
9471H568082o67606K89859j27866O15278m67482m52092O17627k17701R0809K35121
$$ 8568082 7900476 8190335 8062469 8677747 8210265 7758173 8375800 8158099 8248908 8484029
9461H484029p78525N47675P8941J32122K68503J1386m20996J8124K1775J72245
$$ 8484029 7705504 8253179 8332120 8464242 8732745 8744131 8323135 8341259 8363034 8535279
9451H535279J4598o58210R93277m58575k8030r3198m3085m51257q0490M61313
$$ 8535279 8549877 7891667 8884944 8426369 8398339 8305141 8262056 7810799 7730309 8191622
9441H191622n36581L96341R1992J99767k16684k42219L11453m42619j21419N33173
$$ 8191622 7655041 8051382 8143374 8343141 8126457 7884238 8195691 7753072 7631653 8164826
9431H164826l2198k09524M00358L62438q90615L90728j99735K14164j7625O5477
$$ 8164826 8132628 7923104 8323462 8685900 7795285 8186013 7986278 8200442 8182817 8248294
9421H248294n89665N75888m94125j82321N50386k10051M39599j65256n9369m35494
$$ 8248294 7658629 8234517 7740392 7558071 8108457 7898406 8338005 8172749 8113380 7677886
9411G677886J63216Q27273q56559L72383j00138L75004j55705m17825L09610J36513
$$ 7677886 7841102 8668375 7811816 8184199 8084061 8459065 8303360 7885535 8195145 8331658
9401H331658p9932L52722r0819o253m78933Q45733Q3382k47159m6307P00137o44425
$$ 8331658 8251726 8604448 8513629 8507376 8028443 8874176 8957558 8710399 8664092 9364229 8719804
9390H719804L54576M81952m20810J02314N43454J07509n00097P98170k05102N23693
$$ 8719804 9074380 9556332 9135522 9237836 9781290 9888799 9388702 10186872 9981770 10505463
9380A0505463M05353n4887o10667N22759L44429L01398j12470K28382Q43559q39304
$$ 10505463 10910816 10855929 10245262 10768021 11112450 11413848 11301378 11529760 12373319 11534015
9370A1534015M29696Q19072J2877R7284J28832l67965N45156n27495M69775N18530
$$ 11534015 11963711 12782783 12795660 12892944 13021776 12653811 13198967 12671472 13141247 13659777
9360A3659777k16461k5705p3754J57990P39542m30622M12631M04023J21761K62184
$$ 13659777 13443316 13417611 13343857 13501847 14241389 13810767 14223398 14627421 14749182 15011366
9350A5011366J32753K43600k41617N33595o34453J007858K81884J34276N01656
$$ 15011366 15144119 15387719 15146102 15679697 15045244 16053102 16334986 16469262 16970918
9341A6970918j51072O77088q5700J20887q4970P41110Q6959n11060R78375J03926
$$ 16970918 16819846 17496934 17411234 17532121 17447151 18188261 18275220 17764160 18742535 18846461
9331A8846461J73952N76623r5592R09685k25537j48713N44035L49676R165K75783
$$ 18846461 19020413 19597036 19501444 20411129 20185592 20036879 20580914 20930590 20939755 21215538
9321B1215538R70346r6073M54656N17594N12011J065818M71512K48125N71983
$$ 21215538 22185884 22089811 22544467 23062061 23574072 24639890 25111402 25359527 25931510
9312B5931510N57986N23449N84692Q89445N86409Q65834P95424J263899P36700
$$ 25931510 26489496 27012945 27597637 28487082 29073491 29939325 30734749 31998648 32735348
9303C2735348J275275P85830J361092J658828J557648J395511J745496J875939
$$ 32735348 34010623 34796453 36157545 37816373 39374021 40769532 42515028 44390967
9295D4390967J518952K041485J232710J448643P85038N82779O90784k55197q4842
$$ 44390967 45909919 47951404 49184114 50632757 51417795 52000574 52691358 52436161 52351319
9286E2351319p47809l22225n38155n72020j68417J82100n69301k04485M62277
$$ 52351319 51603510 51281285 50743130 50171110 50002693 50184793 49615492 49411007 49873284
9277D9873284l12323O59823J034856k0577M55625J075169O92080P50133J109035
$$ 49873284 49560961 50220784 51255640 51235063 51690688 52765857 53457937 54208070 55317105
9268E5317105J361873Q86801J005109J886530J793467R71299J837896J633942
$$ 55317105 56678978 57565779 58570888 60457418 62250885 63222184 65060080 66694022
9260F6694022J541958J643617K037639J979549K771520J620137K420627K773777
$$ 66694022 68235980 69879597 71917236 73896785 76668305 78288442 80709069 83482846
9252H3482846K812741K227738L067326L432214L049418L843042L895842M805281
$$ 83482846 86295587 88523325 91590651 95022865 98072283 101915325 105811167 110616448
9244A10616448M670743N238444N823691N823741O308448P601672P617765Q162537
$$ 110616448 115287191 120525635 126349326 132173067 138481515 146083187 153700952 161863489
9236A61863489Q759802R240310R748641R763250J0990447J0297674R325419Q678120
$$ 161863489 170623291 179863601 189612242 199375492 210365939 220663613 229989032 238667152
9228B38667152Q134551N980210N164544L892237J804134P29606k08548j908621
$$ 238667152 246801703 252781913 257946457 261838694 263642828 264372434 264163886 262255265
9220B62255265j500351j907190j754715q46221L83075R08301K511741L629899
$$ 262255265 260754914 258847724 257093009 256246788 256629863 257538164 260049905 263679804
9212B63679804M934486O557738P694552R583255J0441687J3200227J3959796J5827189
$$ 263679804 268614290 275172028 282866580 292449835 302891522 316091749 330051545 345878734
9204C45878734J7351134J8305456K0533875K0613553K0444790J9529830J8021521
$$ 345878734 363229868 381535324 402069199 422682752 443127542 462657372 480678893
9197D80678893J5827571J1319032Q724898L040400n77670l871502r429662j2021258
$$ 480678893 496506464 507825496 516550394 519590794 519013124 515141622 505711960 493690702
9189D93690702j4823829j6167065j6692525j6732530j5065830j4757589j1388951
$$ 493690702 478866873 462699808 446007283 429274753 414208923 399451334 388062383
9182C88062383j0126926q664751o017309l849826j824867k49305J347389L010740
$$ 388062383 377935457 369270706 363253397 359403571 357578704 357329399 358676788 361687528
9174C61687528M204568M192550M568199M922458K800692J299058J76421k031142
$$ 361687528 365892096 370084646 374652845 379575303 382375995 383675053 383851474 381820332
9166C81820332m146875n692625p460222p729924q576685q833895p410595p255459
$$ 381820332 377673457 371980832 364520610 356790686 348214001 339380106 331969511 324714052
9158C24714052m850536m555244l521221r25984j76301J944830L719778N310660
$$ 324714052 319863516 315308272 311787051 310861067 310684766 312629596 316349374 321660034
9150C21660034O452226P547534Q964518R518183J0323897J0271914Q809525Q392526
$$ 321660034 328112260 335659794 344624312 354142495 364466392 374738306 383547831 391940357
9142C91940357M594358K733811k8096l420985n895551q531325j0674509j2556257
$$ 391940357 396534715 399268526 399240430 395819445 389923894 381392569 370718060 358161803
9134C58161803j4373957j3765026j4176408j4279222j2758142j2103364j1135809
$$ 358161803 343787846 330022820 315846412 301567190 288809048 276705684 265569875
9127B65569875r527160q406444p735333o633440m337108m479219k975333k392154
$$ 265569875 256042715 247636271 239900938 233267498 228930390 224451171 221475838 219083684
9119B19083684j198613r27750L89006N98728J678760M53320J354493J747244J83535
$$ 219083684 217885071 216957321 217346327 217945055 219623815 220077135 221431628 223178872 223362407
9110B23362407j201733j922155k742780m348931n794711n856763p545232p794368
$$ 223362407 222160674 220238519 217495739 213146808 207352097 201495334 193950102 186155734
9102A86155734q011040p996044q045464o913893o086227o506750n564586n368715
$$ 186155734 178144694 170148650 162103186 155189293 149103066 142596316 137031730 131663015
9094A31663015m697141m699545l675595l703292l472306l305964l054396k915488
$$ 131663015 126965874 122266329 118590734 114887442 111415136 108109172 105054776 102139288
9086A02139288k133379k703367k654989k359841k061762j663682j758297j589405
$$ 102139288 100005909 97302542 94647553 92287712 90225950 88562268 86803971 85214566
9078H5214566j418095j566534r87900j271750j006446q54605r73357o38809p24864
$$ 85214566 83796471 82229937 81242037 79970287 78963841 78109236 77135879 76497070 75772206
9069G5772206p54507m17227k10051r15977k97077o19661L38414j101817L27565
$$ 75772206 75017699 74600472 74390421 73474444 73177367 72557706 72896120 71794303 72121868
9060G2121868q12789j35987K77764r6925n5932j26821K41586j31948j72975O75010
$$ 72121868 71309079 71173092 71450856 71353931 71297999 71171178 71412764 71280816 71107841 71782851
9050G1782851P07337J78618M76577M63167R23072P40219Q84271J095335J291923
$$ 71782851 72490188 72668806 73145383 73608550 74531622 75271841 76156112 77251447 78543370
9041G8543370P42866J288946J294648J267347J821840J539136J669806K271911
$$ 78543370 79286236 80575182 81869830 83137177 84959017 86498153 88167959 90439870
9033I0439870K167480J596200K704704K858179K614117L110169L404069L884742
$$ 90439870 92607350 94203550 96908254 99766433 102380550 105490719 108894788 112779530
9025A12779530M262864M785328M825972N585206N283750O278616P663167P579261
$$ 112779530 117042394 121827722 126653694 132238900 137522650 143801266 151464433 159043694
9017A59043694Q430676Q544171R327602J1308950J0006377J1348642J0269912
$$ 159043694 167474370 176018541 185346143 196655093 206661470 218010112 228280024
9010B28280024J0879031Q112075P210020O073352L913785J898532N47729k040637
$$ 228280024 239159055 247271130 254481150 260554502 264468287 266366819 266914548 264873911
9002B64873911l440562m009190m028644n123304m691556k919800k969440j214978
$$ 264873911 261433349 257424159 253395515 248272211 243580655 240660855 237691415 236476437
8994B36476437m47657R98151K424727L485129N636714O348632P747523Q261901
$$ 236476437 236028780 237026931 239451658 242936787 248573501 254922133 262669656 270931557
8986B70931557J0584406J1607190J1512109J1230873J2510528J0547378Q897756
$$ 270931557 281515963 293123153 304635262 315866135 328376663 338924041 347821797
8979C47821797P094757M237345K389232j972247m208121p448697q835903j1522133
$$ 347821797 354916554 359153899 361543131 359570884 355362763 347914066 339078163 327556030
8971C27556030j2532318j3645193j2971766j3486663j2188662j1238022r241044
$$ 327556030 315023712 301378519 288406753 274920090 262731428 251493406 242252362
8964B42252362q537968p734638o036532m208253l645229k548941j055366q55963
$$ 242252362 233714394 225979756 219943224 215734971 212089742 209540801 208485435 207629472
8956B07629472K15567J014195J478391J370549P00191O62414k00055j422715k676730
$$ 207629472 207845039 208859234 210337625 211708174 212408365 213070779 212870724 211448009 208771279
8947B08771279m016026n491981n355102q049995p868419p944574q950190q506307
$$ 208771279 204755253 199263272 193908170 185858175 177989756 170045182 161094992 152588685
8939A52588685q305298o762208p169799o471259n911322n985241m694283l898012
$$ 152588685 144283387 137521179 130351380 123880121 117968799 111983558 107289275 103391263
8931A03391263m347217l636911l597714l526792l073322k962451k478246l067579
$$ 103391263 99044046 95407135 91809421 88282629 85209307 82246856 79768610 76701031
8923G6701031k223219k389366k023278k082264k123665j499926k545840j893594
$$ 76701031 74477812 72088446 70065168 67982904 65859239 64359313 61813473 59919879
8915E9919879r51899j938168j722910j516976j156902q66915j012458j300901
$$ 59919879 58967980 57029812 55306902 53789926 52633024 51766109 50753651 49452750
8907D9452750j237503j148872q61509q92764j404578n15425r89436j063001o75782
$$ 49452750 48215247 47066375 46204866 45312102 43907524 43392099 42402663 41339662 40663880
8898D0663880q01338j377579j067009o48256p60025q80766q69673q25837q87967
$$ 40663880 39862542 38484963 37417954 36769698 36009673 35128907 34259234 33433397 32545430
8889C2545430k26701r34540n12572n62477M0860q50642j36282j064748J36171
$$ 32545430 32318729 31384189 30871617 30309140 30350000 29499358 29363076 28298328 28434499
8880B8434499o47422J81497j007712l16561k69035l07963n90577R6145p44234
$$ 28434499 27787077 27968574 26960862 26644301 26375266 26067303 25476726 25572871 24828637
8871B4828637q01823l84000M05589o94966m51509L4309q64194k67597m09581k44423
$$ 24828637 24026814 23642814 24048403 23353437 22901928 22936237 22072043 21804446 21394865 21150442
8861B1150442o41605k33666q02541K16913p19848l29097K4621q06505M68492r93797
$$ 21150442 20508837 20275171 19472630 19689543 18969695 18640598 18665219 17858714 18327206 17333409
8851A7333409N0794Q3533k24202n64544K45243o09168m21227N1937O047q18219
$$ 17333409 17384203 17467736 17243534 16678990 16924233 16315065 15893838 15945775 15951822 15133603
8841A5133603m25402j89689L68530n83145k39590j03813L28670j03241n70692
$$ 15133603 14708201 14518512 14887042 14303897 14064307 13960494 14289164 14185923 13615231
8832A3615231L70804m83003o74176L24856p0915k02189L0810n29672J85014n75367
$$ 13615231 13986035 13503032 12828856 13153712 13082797 12880608 12911418 12381746 12566760 11991393
8822A1991393k07041n1919r0904j5287j18221n09397k53910j20150o0225m03477
$$ 11991393 11784352 11732433 11641529 11626242 11508021 10998624 10744714 10624564 10564339 10160862
8812A0160862M4142k4716k63273j58222r15830P88786m15308R4823j82385K93300
$$ 10160862 10205004 10180288 9917015 9758793 8842963 9631749 9216441 9311264 9128879 9422179
8802I422179m47491N16946m34252l64381J15696l74106K18980m48763M45391m98625
$$ 9422179 8974688 9491634 9057382 8693001 8808697 8434591 8653571 8204808 8650199 8151574
8792H151574n63891O94982m14593j54468m7667m40413R63518r19884j34834l73773
$$ 8151574 7587683 8282665 7868072 7713604 7665937 7225524 8189042 7269158 7134324 6760551
8782F760551M70496J72790o90571K19118o56255J84161J11149K6457L97227l80962
$$ 6760551 7231047 7403837 6713266 6932384 6276129 6460290 6571439 6597896 6995123 6614161
8772F614161m53418L9752k50896Q83061n80929o8511m34369O4789O32870j63895
$$ 6614161 6160743 6200495 5949599 6832660 6251731 6183220 5748851 5813640 6446510 6282615
8762F282615M45759o36302K11686k11335K30716n97419m6452R2159J40397N1408
$$ 6282615 6728374 6092072 6303758 6092423 6323139 5725720 5679268 5771427 5911824 5963232
8752E963232J18668n67823L2859o47815O18694K97675o98856M61537l51310N59289
$$ 5963232 6081900 5514077 5546936 4899121 5517815 5815490 5116634 5578171 5226861 5786150
8742E786150r82137N53704q0066l64047k46966j3m02724P43900j38603L89172
$$ 5786150 4804013 5357717 5277651 4913604 4666638 4666625 4263901 5007801 4869198 5258370
8732E258370K75389m44097k22213k10644L04893J2275l35673J07660K7361l3649
$$ 5258370 5533759 5089662 4867449 4656805 4961698 4973973 4638300 4745960 4773321 4739672
8722D739672J47225K42441q80614P10031p88112M92657m32024j8903r4676R7902
$$ 4739672 4886897 5129338 4248724 4958755 4170643 4663300 4231276 4212373 4117697 4215599
8712D215599J12430K84807n52932K37665J33501J41402l40811l08835N21881m3510
$$ 4215599 4328029 4612836 4059904 4297569 4431070 4572472 4231661 3922826 4444707 4401197
8702D401197k51879P29003k55259j18128k37020L22074J29853k32477L8258K27478
$$ 4401197 4149318 4878321 4623062 4504934 4267914 4589988 4719841 4487364 4525622 4753100
8692D753100k69143L88378j75740J89827j90940o09835J32369N4733l24642J58123
$$ 4753100 4483957 4872335 4696595 4886422 4695482 4085647 4218016 4272749 3948107 4106230
8682D106230M36281k5831K0546K15888l15015j35608l00350N86644k82547k00080
$$ 4106230 4542511 4516680 4537226 4753114 4438099 4302491 4002141 4588785 4306238 4106158
8672D106158O37279l52465l86180K74234P6913J08252K61812M52551n36296p31187
$$ 4106158 4743437 4390972 4004792 4279026 4355939 4464191 4726003 5178554 4642258 3911071
8662C911071O96179m44062K42775j22841J63943q07381N83240q16889N47755K23498
$$ 3911071 4607250 4163188 4405963 4283122 4447065 3639684 4222924 3406035 3953790 4177288
8652D177288m79604m55574J51454M26702m15294M04439l59949o67612Q21569j57185
$$ 4177288 3697684 3242110 3393564 3820266 3404972 3809411 3449462 2781850 3603419 3446234
8642C446234J41171N8845J31707J01996n21238Q465J3216p4522J27174m49100
$$ 3446234 3587405 3646250 3777957 3879953 3358715 3367180 3380396 3305874 3433048 2983948
8632B983948M6091j37482k69452P09078q5562J09015n28923m55614Q4167M53843
$$ 2983948 3030039 2892557 2623105 3332183 3246621 3355636 2826713 2371099 2455266 2909109
8622B909109m16179J96083Q8553m7789k85874k19417J57629o060j40517l12650
$$ 2909109 2492930 2689013 2777566 2729777 2443903 2224486 2382115 2376055 2235538 1922888
8612A922888J05028K9771N1581N5190O4965p5550l53651q5297J98301j85062L8836
$$ 1922888 2027916 2057687 2109268 2164458 2229423 2153873 1800222 1714925 1913226 1728164 1767000
8601A767000l29090M36449L92409o99026L39335k40238J44687o21210P70559l71984
$$ 1767000 1437910 1874359 2266768 1567742 1907077 1666839 1811526 1190316 1960875 1588891
8591A588891K04979l15406J11030J79277m84377L48338j74971k73041M91109j80265
$$ 1588891 1793870 1478464 1589494 1768771 1284394 1632732 1457761 1184720 1675829 1495564
8581A495564J67644k09510K80410k12158k32728L97346k71015k24738O29349R344
$$ 1495564 1663208 1453698 1734108 1521950 1289222 1686568 1415553 1190815 1820164 1829508
8571A829508J25393k16895r7504m81451m67755P29954j49159K99259m84293R26729
$$ 1829508 1954901 1738006 1640502 1159051 691296 1421250 1272091 1571350 1087057 2013786
8561B013786j016614J23975P9211m42313J13140J29009O18386k77918l0880j22216
$$ 2013786 997172 1121147 1200358 758045 871185 1000194 1618580 1340662 1309782 1187566
8551A187566K87143l99559O4697L32317j81943K6132l96929M33110K99284o86821
$$ 1187566 1474709 1075150 1139847 1472164 1290221 1316353 919424 1352534 1651818 964997
8541I64997N08218L23391o74507k43903K16513m59309J166370m01913n16530q0939
$$ 964997 1473215 1796606 1122099 878196 1094709 635400 1801770 1399857 883327 802388
8531H02388j58429n14363k539515P236085k761173j49190n4918q10275j5258K90878
$$ 802388 643959 129596 -2409919 4826166 2064993 1915803 1860885 1050610 1035352 1326230
8521A326230j34038P9813J42693J04206m33523L39073M37077l67996J88684m00332
$$ 1326230 1192192 1272005 1414698 1518904 1085381 1424454 1861531 1493535 1682219 1281887
8511A281887j70403L25699J79428n65553J92915l16035L45371j86897K74065L87688
$$ 1281887 1111484 1437183 1616611 1051058 1243973 927938 1273309 1086412 1360477 1748165
8501A748165j54035p0446l21516k65584P64101o91552l0916j34840L1914R2944
$$ 1748165 1594130 1523684 1202168 936584 1700685 1009133 978217 843377 875291 968235
8491I68235J32533J26990n26200Q84283q84337J069464o33183k07764L16451j2365
$$ 968235 1100768 1227758 701558 1585841 701504 1770968 1137785 930021 1246472 1234107
8481A234107J34069m4814n89005L01242M01728l85107M04017Q430n65537M16091
$$ 1234107 1368176 1323362 734357 1035599 1437327 1052220 1456237 1464667 899130 1315221
8471A315221M6706j08117Q1060r5907L8981j42773P8046j13647l77101n980L28440
$$ 1315221 1361927 1253810 1334870 1238963 1277944 1135171 1213217 1099570 722469 716489 1044929
8460A044929l51472M7200O21031l93429L01857O3775k36129j46492L22850J679
$$ 1044929 693457 740657 1361688 968259 1270116 1333891 1097762 951270 1274120 1275799
8450A275799J51633o0600J48172n07005m64801K84249J32931p015L90632j55893
$$ 1275799 1427432 1366832 1515004 1007999 543198 827447 960378 953363 1343995 1188102
8440A188102J08910k88611l9275l9837j12019K02640j88780m4421R8194M17678
$$ 1188102 1297012 1008401 969126 929289 817270 1019910 831130 786709 884903 1302581
8430A302581o51424K34574R8275M68623n88571o8733K52166q6940K36849k43123
$$ 1302581 651157 885731 984006 1452629 864058 795325 1047491 960551 1197400 954277
8420I54277m99281J215421o55642n2780p58323Q87809K61757o12731N77990l27635
$$ 954277 454996 1670417 1014775 961995 203672 1091481 1353238 740507 1318497 990862
8410I90862l5503j03519L66499k06841k57205O2179o4504L0567m6214K43872r02804
$$ 990862 955359 851840 1218339 1011498 754293 816472 751968 782535 736321 980193 77389
8399G7389P35844J9899K79265j5192j145404N78060J39664J78077j03041J18212
$$ 77389 813233 833132 1112397 1097205 -48199 529861 669525 847602 744561 862773
8389H62773n283L18222r2838k29736O09645n59792q68154Q72722m07784m7070
$$ 862773 857490 1175712 1082874 853138 1462783 902991 34837 907559 499775 452705
8379D52705N34523p29049O28378j56928j05970p8151J11289J28463P7174l56184
$$ 452705 987228 258179 886557 729629 623659 545508 656797 785260 862434 506250
8369E06250L73848J76807j40300m61128J66070J47620L66090m38547k19659q9726
$$ 506250 880098 1056905 916605 455477 621547 769167 1135257 696710 477051 387325
8359C87325K05687L64573o95943O12873K8804k43619J76172Q124k07635M53066
$$ 387325 593012 957585 261642 874515 903319 659700 835872 843996 636361 1089427
8349A089427n91532L67049p3735J68583j82066N92519m94000L44536o91990J08925
$$ 1089427 497895 864944 791209 959792 777726 1370245 876245 1220781 528791 637716
8339F37716J04119N95652r66790L37940J91836n71039N27115l04534l23494K41929
$$ 637716 741835 1337487 370697 708637 900473 329434 856549 552015 228521 470450
8329D70450q955J61456j27306l01338M56105k46565K07752o026J7966J73604K70119
$$ 470450 461495 622951 495645 194307 650412 403847 611599 605573 623539 797143 1067262
8318A067262l79366k28739J99478P3371l67643J8373k32690l18577P15778R9637
$$ 1067262 687896 459157 658635 732006 364363 382736 150046 -168531 547247 646884
8308F46884K13834l46741P71545o16522J99054l90962K27390K72287m50656L18893
$$ 646884 860718 513977 1285522 669000 868054 477092 704482 976769 526113 845006
8298H45006k22111l64257P32022k23212m1903l3302L9649K74252p07362J40973
$$ 845006 622895 258638 990660 767448 725545 692243 731892 1006144 298782 439755
8288D39755K42094N0954L29678m57015k28581O06374L3710o55328L42499l31505
$$ 439755 681849 732803 1062481 605466 376885 983259 1016969 361641 704140 372635
8278C72635J8988O65646o31073l37754M43962K5199k47930k8297J4746P96281
$$ 372635 391623 1057269 426196 88442 532404 557603 309673 281376 296122 1092403
8268A092403q97744K74530J91104O4591L90347n17862K09498k22378N18958o55008
$$ 1092403 194659 469189 660293 724884 1115231 597369 806867 584489 1103447 448439
8258D48439p1788K30908l25162j9007M86055k15434K15795Q096p8799N3028l15536
$$ 448439 376651 607559 282397 263390 749445 534011 749806 757902 679103 732131 416595
8247D16595R6350n68226P03727k52564p2387L80377j16570K20458n81332L09709
$$ 416595 512945 -55281 648446 395882 323495 703872 587302 807760 226428 536137
8237E36137O54798n98129J39074o64504L80562K88212m88457L18688m88652N75739
$$ 536137 1190935 592806 731880 67376 447938 736150 247693 566381 77729 653468
8227F53468o48662M68255j90055J25654N03695k65141M64172n26593Q9494L18174
$$ 653468 4806 473061 283006 408660 912355 647214 1111386 584793 674287 992461
8217I92461j12741j13910q81269L98780k65949L38489p19829R64871k55781l55895
$$ 992461 879720 765810 -115459 283321 17372 355861 -363968 600903 345122 -10773
8207a0773L76869j58343m37514P1550j73114R26181k90086R3350l15039K30549
$$ -10773 366096 207753 -229761 -158211 -331325 594856 304770 398120 83081 313630
8197C13630k73827K66160n50732l90143j7522K972242l62858k020416K70028J69851
$$ 313630 39803 305963 -244769 -634912 -652434 2319808 1956950 -63466 206562 376413
8187C76413j1242P8532L11659j62973k49413J85010M48979J53085p5244J80353
$$ 376413 365171 443703 755362 592389 342976 527986 976965 1130050 1054806 1235159
8177A235159l91730l88648O59835j62155n90071K17459J083L53147j8669q8019
$$ 1235159 843429 454781 1114616 952461 362390 579849 580932 934079 915410 827391
8167H27391n912o19362N15576J56862j50981l36172P6255O33914m45647m48887
$$ 827391 821479 202117 717693 874555 723574 387402 463657 1097571 651924 203037
8157B03037K74418L4346o22624J57735l4189L28157j0561j72827L93497k46309
$$ 203037 477455 511801 -110823 46912 12723 340880 330319 157492 550989 304680
8147C04680P9822l534K48177N189n12440J19503N87378j25408k08376n57315N87265
$$ 304680 384502 380968 629145 634334 121894 241397 828775 703367 494991 -62324 524941
8136E24941j28660K19217j58067k63559J30374j28207L39122K59617k75273J92805
$$ 524941 396281 615498 457431 193872 324246 196039 535161 794778 519505 712310
8126G12310o30183L7861J23216k8653J25960o0546L45961m34872M21289j65618
$$ 712310 82127 119988 243204 214551 340511 279965 625926 191054 612343 446725
8116D46725L27214k29621l9038R7522l69867O2058J65678J51602K72296n23471
$$ 446725 773939 544318 505280 602802 232935 294993 460671 612273 884569 361098
8106C61098l83961L57827k00026M00618J20379j92617Q2112N9691p2850k48284
$$ 361098 -22863 334964 134938 535556 655935 463318 545430 605121 532271 283987
8096B83987L86810R105o39124P07012p29618L79732j91610N37900n30389O75476
$$ 283987 670797 679902 40778 747790 18172 397904 206294 744194 213805 889281
8086H89281p49869k866N03214m43924O33205n10538L83889P0521m90311K08543
$$ 889281 139412 136546 639760 195836 829041 318503 702392 772913 282602 491145
8076D91145k77357Q1075K7574L61872l68300m3314J48336j62364L04051K6798
$$ 491145 213788 294863 322437 684309 316009 272695 421031 258667 562718 589516
8066E89516l05021K9392M8201k07651L29965j38867o59139K39466J59260k00744
$$ 589516 284495 313887 362088 154437 484402 345535 -313604 -74138 85122 -115622
8056a15622N34822J81671o90062P16510n63943k72747L15689k2288L26497k90755
$$ -115622 419200 600871 -89191 627319 63376 -209371 106318 84030 410527 119772
8046A19772L11794j67714L02157n83634N16989K85K3076J64586m85247l85421
$$ 119772 431566 263852 566009 -17625 499364 499649 522725 687311 202064 -183357
8036a83357Q2587j48722P1896N29827K82691j41472j88435L64047j54855l69491
$$ -183357 -100770 -249492 -177596 352231 634922 493450 305015 669062 514207 144716
8026A44716K90670o75545P43570q10015J103974n28020k34032J88362j01113K27104
$$ 144716 435386 -240159 503411 -306604 797370 269350 35318 223680 122567 349671
8016C49671l01188K50867p2361K80196k8242K15418n94601m6125J85655j01014
$$ 349671 48483 299350 226989 507185 478943 694361 99760 53635 239290 138276
8006A38276L46843j020643Q54412J74268m83454P37522o86796Q3527k02197K52080
$$ 138276 485119 -535524 318888 493156 9702 747224 60428 143955 -58242 193838
7996A93838L95267J42404r85985R94376j201378J99988K59888j27074K56392o6455
$$ 193838 589105 731509 -254476 739900 -461478 -261490 -1602 -128676 127716 61261
7986F1261P0805M44688n72589J22852J24763K13538k76153r0549L86437K86107
$$ 61261 132066 576754 4165 127017 251780 465318 189165 98616 485053 771160
7976G71160o03196K9284k96518N2087K65734J9266m86599M50788k25640K20007
$$ 771160 167964 197248 -99270 -47183 218551 237817 -248782 202006 -23634 196373
7966A96373K55589n86138J35739k65721J45222O01147j20670m72137N44683r61651
$$ 196373 451962 -134176 1563 -264158 -118936 482211 361541 -110596 434087 -527564
7956e27564Q74589n18138N28312o15936O88996k29061M8177k16133J40692m455
$$ -527564 347025 -171113 357199 -258737 430259 201198 249375 33242 173934 169479
7946A69479L97954n45678l82287M87184M22291k55448n52758N33223j93168j37707
$$ 169479 567433 21755 -360532 126652 548943 293495 -259263 273960 80792 -56915
7936e6915M90251l75483M28687p55492p339j67155R3392Q50759q39516K47129
$$ -56915 433336 57853 486540 -268952 -276291 -443446 -350054 500705 -338811 -91682
7926i1682k18008M7457K64065r1059J55652r1085M70243j61763O1705l7179n10072
$$ -91682 -309690 -262233 1832 -89227 66425 -24660 445583 283820 345525 308346 -201726
7915b01726N23522j44203L10486k11040k65022L03299j619k21387m31679M79401
$$ -201726 321796 177593 488079 277039 12017 315316 313697 92310 -339369 140032
7905A40032j69688O74963p28717M51817n5078m95343k85428L92219M91255m16443
$$ 140032 -29656 645307 -83410 368407 313329 -182014 -467442 -75223 416032 -411
7895d11K73411K18991o84718L27267J088299j067893L552J31966K73019l25179
$$ -411 273000 491991 -192727 134540 1222839 154946 158498 290464 563483 238304
7885B38304k53979K48801l85136l79693Q27004k45698N3569K44523m64412j32189
$$ 238304 -15675 233126 -152010 -531703 295301 49603 103172 347695 -116717 -248906
7875b48906N12517m40724n4293J44196k72653J16930P4688j09649N95428r75669
$$ -248906 263611 -177113 -231406 -87210 -359863 -242933 -168245 -277894 317534 -658135
7865f58135Q05230k82192K76066o7804K3053l47173m309L02886j47395j345394
$$ -658135 147095 -135097 140969 73165 96218 -250955 -255264 47622 -99773 -1445167
7855a445167K700067o73990J38625l53939L1488k86625J38018p5237P1544k2164
$$ -1445167 1254900 580910 719535 365596 397084 110459 248477 173240 244784 222620
7845B22620M18927n01896n4678K41672j38553j3392m33441M55044j55092l26616
$$ 222620 641547 139651 84973 326645 188092 174700 -258741 196303 41211 -285405
7835b85405K82266j55033J58499L71962m71713k83381N21118k37584M033K15284
$$ -285405 -3139 -158172 327 372289 -99424 -382805 138313 -99271 -95238 120046
7825A20046L28069p92234L24149j5998M46966p30087M85815l136p03892k34896
$$ 120046 448115 -344119 -19970 -35968 410998 -319089 166726 163590 -540302 -775198
7815g75198Q70982j94537R776J14601j39947L93635k11121L93847l65012j72113
$$ -775198 95784 -98753 -88977 25624 -114323 279312 68191 462038 97026 -75087
7805g5087k2441K14636j84720M42729m22754R1085K63297P9782o61649N95107
$$ -75087 -97528 117108 -67612 375117 -47637 43448 306745 386527 -275122 319985
7795C19985m0516n16804N59353k23460Q9232k83950r9986P12442k28016j23872
$$ 319985 279469 -237335 322018 98558 187790 -96160 -196146 516296 288280 164408
7785A64408k37137j35762K60303n84110P65160j56533k5876M47760o65197L19043
$$ 164408 -72729 -208491 51812 -532298 232862 76329 50453 498213 -166984 152059
7775A52059j7154j53576o7849O15835p92736L50650j54283j97270Q06008n52417
$$ 152059 134905 -18671 -86520 529315 -263421 87229 -67054 -264324 541684 -10733
7765a0733J20774m69326J85468M22707k17574j98402L4854j72665k9202J87688
$$ -10733 110041 -359285 -173817 248890 31316 -167086 -132232 -304897 -334099 -146411
7755a46411r2504j41385L27717Q9296Q0644k89316j93426R39462p43790N45057
$$ -146411 -238915 -380300 -52583 36713 117357 -171959 -365385 574077 -169713 375344
7745C75344p38619P70827J61650n32665m52353P84674m14299n74524Q90213m72193
$$ 375344 -363275 407552 569202 36537 -415816 368858 -45441 -619965 270248 -201945
7735b01945O95395l82116o34305M68155M89116m88272K66531o6952k1704K2484
$$ -201945 493450 111334 -522971 -54816 434300 -53972 212559 145607 123903 146387
7725A46387J6721k53203M1900K43531j13623K36421k18599J77511O8288l74839
$$ 146387 163108 -90095 -48195 195336 81713 318134 99535 277046 345334 -29505
7715b9505L68129K38519m83162Q5212r9518N18737k63778l42043k1302k27301
$$ -29505 338624 577143 93981 179193 79675 598412 334634 -7409 -28711 -256012
7705b56012K72529o5397j46076M7879L34844p92859O69454n62400J108974n64159
$$ -256012 16517 -48880 -194956 -147077 187767 -605092 64362 -498038 610936 46777
7695D6777j13576j27525l3867K65279K36283k45585k18265O57514l86103j95595
$$ 46777 -66799 -194324 -228191 37088 273371 27786 -190479 467035 80932 -114663
7685a14663J89547K15079j93351n6520p32327N76449N0106K16259r92211O21814
$$ -114663 74884 289963 96612 40092 -692235 -115786 -65680 150579 -841632 -219818
7675b19818R59283q75927K78165k20992M60095m78908Q6367p361K35071m8213
$$ -219818 739465 -136462 141703 -79289 380806 -98102 -11735 -19096 215975 167762
7665A67762K17291k4063n39803K58965L4745q05471J367433o03903P15789p32125
$$ 167762 385053 360990 -178813 80152 114897 -690574 676859 72956 788745 56620
7655E6620K21705L748K67996k93351j26524l96246J0907K57496K98739k29477
$$ 56620 278325 282073 550069 256718 130194 -266052 -255145 2351 301090 71613
7645G1613j78642J99368m1303m40861l3859J010213m73435N90379p66196J27464
$$ 71613 -107029 92339 51036 -389825 -423684 586529 113094 703473 -62723 64741
7635F4741N46673n01667J84007o0950O9297j04120m53032P27149k67510k10947
$$ 64741 611414 109747 293754 232804 302101 197981 -255051 472098 204588 -6359
7625f359K0140K65673P4112j95675J50412q1740k8512o9717p0972M8462K94128
$$ -6359 13781 279454 353566 157891 308303 226563 198051 128334 57362 105824 399952
7614C99952r2647P2443J98956m77628N16323l0970k2400l78755O2536M7059M6778
$$ 399952 307305 379748 578704 101076 617399 586429 564029 185274 247810 294869 341647
7603C41647j31082J00728m8953K19039K12204j004997Q84198r49972J073326m44908
$$ 341647 210565 311293 262340 481379 693583 -311414 572784 -377188 696138 251230
7593B51230L75224n02915Q33893l58818l73494O83873L39946m38524R5869m90046
$$ 251230 626454 123539 957432 598614 225120 908993 1248939 810415 906284 416238
7583D16238l6535K70784N99709l00682j36442k8919l66916M22627K51958k88134
$$ 416238 379703 650487 1250196 949514 813072 784153 417237 839864 1091822 803688
7573H03688n6057p8512l7122K66815J07137l14680J94359k08644Q28738j66336
$$ 803688 747631 669119 631997 898812 1005949 691269 885628 676984 1505722 1339386
7563A339386k93164p301J048429l49497m9098m330M55096k53113N08273J59775
$$ 1339386 1046222 1038921 2087350 1737853 1688755 1684425 2139521 1886408 2394681 2554456
7553B554456k62206k25267P63388J14962N11722J77829N7473k6275L37215K00541
$$ 2554456 2292250 2066983 2830371 2945333 3457055 3634884 3692357 3666082 4003297 4203838
7543D203838P51828N86750L5549R00813L74102R67220k48722P58028P83059K73418
$$ 4203838 4955666 5542416 5577965 6478778 6852880 7820100 7571378 8329406 9112465 9385883
7533I385883p09836K74002l76970m07541l23977k90312q39295p33596m05020o44817
$$ 9385883 8676047 8950049 8573079 8165538 7841561 7551249 6711954 5978358 5573338 4928521
7523D928521n03310m66169J29265j5843n56971q9902j06287J12690o63350K3569
$$ 4928521 4425211 3959042 4088307 4072464 3515493 3425591 3319304 3431994 2768644 2792213
7513B792213J49965l58291K73241o65306K432k5083l80012J80178p94532L56672
$$ 2792213 2942178 2583887 2857128 2191822 2194254 2169171 1789159 1969337 1174805 1531477
7503A531477M22442j30761J88514o91096j19088k53787M0892j4687K08008J59670
$$ 1531477 1953919 1823158 2011672 1320576 1201488 947701 988593 973906 1181914 1341584
7493A341584l55192j47185n28904P14976L39884k36051M3566j61169l87375M26461
$$ 1341584 986392 839207 310303 1025279 1365163 1129112 1172678 1011509 624134 1050595
7483A050595n3389r0082j7857k65397M02706l71599J68862j08222o7168r0428
$$ 1050595 997206 907124 889267 623870 1026576 654977 823839 715617 648449 558021
7473E58021M46135l83488N5355M19013j071623N43544Q2801n75619J47653R8971
$$ 558021 1004156 620668 676023 1095036 23413 566957 649758 74139 221792 320763
7463C20763P6723o3527l11814O0037M41787M10387q74120J062739q90928L26653
$$ 320763 397486 333959 22145 82182 523969 934356 60236 1122975 232047 558700
7453E58700N27520o83511L85948q57945N62397m25103L49300n24643K13260K65829
$$ 558700 1086220 402709 788657 -69288 493109 68006 417306 -107337 105923 371752
7443C71752j91475l2627P9828j3642K07542N92061m71221J25121q85829M95275
$$ 371752 180277 147650 227478 213836 421378 1013439 542218 667339 -218490 276785
7433B76785q4847k5906j92713O40791m3501k49914k45910L52833k68355o5950
$$ 276785 191938 166032 -26681 614110 570609 320695 74785 427618 159263 93313
7423I3313L39525p1211n5805l89214l73123M60091p7881K80261O23052q52993
$$ 93313 432838 361627 305822 -83392 -456515 3576 -74305 205956 829008 -23985
7413b3985J82881m65385L62931L01506j25858l77854R20210m57193R1268l96844
$$ -23985 158896 -306489 56442 357948 232090 -145764 774446 317253 408521 11677
7403A1677M00213j53061K57941j49350j61537n00035M91329M9492L34054o70366
$$ 11677 411890 258829 516770 367420 205883 -294152 197177 246669 580723 -89643
7393h9643N29991j82591l19661M08311k80563K1484R9225m34913Q7228J61710
$$ -89643 440348 257757 -61904 346407 65844 87328 186553 -248360 -161132 578
7383E78L09593n85291N54263o49751M98205j40327K47219m29380K68098L16882
$$ 578 310171 -275120 279143 -370608 127597 -12730 234489 -194891 73207 390089
7373C90089p62261L69249j41697L70799L91840o53752k21453P37967m64681J63320
$$ 390089 -372172 -2923 -144620 226179 618019 -35733 -257186 480781 16100 179420
7363A79420k90990m18046O47541r4164J55736o12790M84766j21813k51429K1901
$$ 179420 -111570 -529616 117925 23761 179497 -433293 51473 -70340 -321769 -299868
7353b99868K27155N03558r8293m24924M276k44379O4532M172l18593O37994J27203
$$ -299868 -72713 430845 332552 -92372 -88096 -332475 -267943 -263771 -582364 55630 182833
7342A82833k62072j94529J79194k58565K12800J72507K20014k04612K32274k67974
$$ 182833 -79239 -273768 -94574 -353139 -140339 32168 252182 47570 279844 11870
7332A1870k69730O54982R1572m49632o3696l27042N38084j89463R0339R1265k29173
$$ 11870 -257860 397122 488694 39062 -24634 -351676 186408 -3055 87284 178549 -50624
7321e0624L36946j30804j87059M36553j84011l97197J92021O030k8157k117Q2118
$$ -50624 286322 155518 -31541 405012 221001 -176196 15825 21855 -6302 -8419 73699
7310G3699p5603p25535Q88317J83652n41528R7380l71866L18452O4360K83356
$$ 73699 -1904 -727439 160878 344530 -196998 -99618 -471484 -153032 -88672 194684
7300A94684o32058J26274P6202J90316J04388j77400M96193o45697L32001j84364
$$ 194684 -437374 -311100 -234898 -44582 59806 -117594 378599 -267098 64903 -119461
7290a19461K30195n79307O67611J59162j97625o40327J77116N02107K88480n27830
$$ -119461 110734 -468573 199038 358200 160575 -479752 -302636 199471 487951 -39879
7280c9879K64379m77787R8614j2026K43381l3156J46696p1006m24060j94842J98245
$$ -39879 224500 -253287 -154673 -166699 76682 43526 190222 119216 -304844 -499686 -301441
7269c01441M22775l36840R0216M10905k78508j15152K74901m13821J056415q90501
$$ -301441 121334 -215506 -125290 285615 7107 -108045 166856 -246965 809450 -81051
7259h1051L08886K73740o07865L89973n4853o96572L52685L57542l6872n63732
$$ -81051 227835 501575 -106290 283683 228830 -467742 -115057 242485 205613 -358119
7249c58119M64673J59029j73556m0759Q5381j03769m92988L71270j28388J68476
$$ -358119 106554 265583 92027 51268 136649 32880 -460108 -88838 -217226 -48750
7239d8750k5447m9394J80427J97925n69499p6381O03441J87958k98692J83494
$$ -48750 -74197 -123591 56836 254761 -314738 -391119 212322 400280 101588 285082
7229B85082o16287j82930N51754p94727O30952j36004M24002j21380K62481J66427
$$ 285082 -331205 -514135 37619 -757108 -126156 -262160 161842 40462 302943 469370
7219D69370l10381J00104K2054o9684k39124r9685l89179M13946l60376N66595
$$ 469370 158989 259093 281147 211463 -27661 -127346 -516525 -102579 -462955 103640
7209A03640l54483J53527k32583N69018j50321m1083l36909K55157Q3741L65558
$$ 103640 -250843 -97316 -329899 239119 88798 47715 -289194 -34037 49704 415262
7199D15262m72231j00094L24719l81844N71158p07042M22563J48413n9976P9996
$$ 415262 -56969 -157063 167656 -214188 356970 -350072 72491 220904 160928 240924
7189B40924J8234P0976r8234l3074m02982J83682Q7027J6072k55463J07709J79551
$$ 240924 259158 330134 231900 198826 -204156 -20474 66553 82625 -172838 -65129 114422
7178A14422o2243J99420n45300N27788k57514L42685m43943p6766L07309J03553
$$ 114422 52179 251599 -293701 234087 -23427 319258 -124685 -201451 105858 209411
7168B09411j93492l56561L76631J64171K86715p17993K65049J5515K59120L65182
$$ 209411 15919 -340642 35989 200160 486875 -231118 33931 49446 308566 673748
7158F73748k2181q21181L43129j29842L08028n65133M56131n65440K27874K87869
$$ 673748 651567 -169614 173515 43673 351701 -213432 242699 -322741 -94867 193002
7148A93002m67504j25351K69503J11296p0957J49031j54071J66894j75245K99915
$$ 193002 -274502 -399853 -130350 -19054 -90011 59020 -95051 71843 -103402 196513
7138A96513j25881M23565n85154j25876M6658M34391l36400K37970K2969N8758
$$ 196513 70632 494197 -90957 -216833 -170175 264216 -72184 165786 188755 247513
7128B47513n38274O38905L30980n81578l93778L23190L7293l48904M82783O6686
$$ 247513 -290761 348144 679124 97546 -296232 26958 64251 -284653 198130 264816
7118B64816j19601l31832L59429K65853j48152l49558Q13670k07042m6097Q001
$$ 264816 145215 -186617 172812 438665 290513 -59045 754625 547583 501486 509487
7108E09487l55743K41672L7404l70650M00605J4103k65417l67747l4908K23214
$$ 509487 153744 395416 432820 62170 462775 476878 211461 -156286 -191194 32020
7098C2020L73402l80665j51760R70002r40136K96247k40970N4324L3344J62244
$$ 32020 405422 24757 -127003 842999 -97137 199110 -41860 12464 45808 208052
7088B08052j35303O66788n8804p06907J01697M92M19594r35796l43788O50334
$$ 208052 72749 739537 680733 -26174 75523 76015 495609 -440187 -783975 -133641
7078a33641L15002N39174o72652r5396k4278Q47705n12431l7191p2667R1577j95020
$$ -133641 181361 720535 47883 -47513 -71791 775914 263483 226292 153625 245202 50182
7067E0182K3004l18131N26415j077117N95980Q5429L56077o16417M8143R4117
$$ 50182 73186 -244945 281470 -795647 -199667 -114238 241839 -374578 -326435 -232318
7057b32318L30565J50253J18545m69873M63293o79355k79476Q52056j76484k38642
$$ -232318 98247 248500 367045 -102828 360465 -318890 -598366 253690 77206 -161436
7047a61436N62756k21320m49577K84897Q597o23367P69826j06077N83332p83929
$$ -161436 401320 180000 -269577 15320 23917 -599450 170376 64299 647631 -136298
7037a36298J88178K15800k31050j529M75808l44824O11991p40827M44680k55044
$$ -136298 51880 267680 36630 35101 510909 166085 778076 37249 481929 226885
7027B26885n26178O08340O63963j72508l60646O6958j10188L09143K50788o24083
$$ 226885 -299293 309047 973010 800502 439856 506814 396626 705769 956557 332474
7017C32474j2340L69029o91241N34634q283l52164R1911j11183L08141J28215
$$ 332474 320134 689163 -2078 532556 524273 172109 264020 152837 460978 589193
7007E89193o14715K75965l04892K42317k14144o1129J02633L0227L22666j36144
$$ 589193 -25522 250443 -54449 187868 -26276 -87405 15228 45455 368121 231977
6997B31977N8732k49613l35655R51170p00935M03193k7311l2052k45086J75015
$$ 231977 290709 41096 -294559 656611 -44324 358869 331558 299506 54420 229435
6987B29435l9885l34980O74198k66477K7334R6776r2827J0363J24075p42141M58974
$$ 229435 189550 -145430 528768 262291 289625 386401 293574 303937 428012 -314129 144845
6976A44845K08794K71887l42503J97348p22475L92715L51984o20976M22192M2853
$$ 144845 353639 625526 283023 480371 -242104 150611 502595 -118381 303811 346664
6966C46664K7017j01111O02883o72174J75343L73146l09187l36408K03374l33785
$$ 346664 373681 272570 875453 203279 378622 751768 442581 106173 309547 -24238
6956b4238J87520j25962l47859M84391N56885m41412N01187m76102L66576m53760
$$ -24238 163282 37320 -310539 173852 730737 289325 790512 314410 680986 227226
6946B27226L36375J13076M9082n82449P72287o62609K28374r48874Q78501m60236
$$ 227226 563601 676677 725759 143310 915597 252988 481362 -467512 410989 -49247
6936d9247k00966J40869P19887m63828l46855L14726Q12383n63774J17832K49838
$$ -49247 -250213 -109344 610543 146715 -200140 114586 926969 363195 481027 730865
6926G30865m86315R1095R8538k9680J44974j53896J01128j65123m02919N29062
$$ 730865 244550 335645 434183 404503 549477 395581 496709 331586 -71333 457729
6916D57729k90572J7523K29138l492J07753m9356k66208L54644l37131M06868
$$ 457729 167157 184680 413818 410326 518079 468723 202515 557159 220028 626896
6906F26896J10908o15888L1308j05757M74343r6698j52428M16884m43858M09449
$$ 626896 737804 121916 153224 47467 521810 425112 272684 689568 245710 655159
6896F55159L19224l39419k65454N04289p2644n61801O21808j46411m93842K74830
$$ 655159 974383 634964 369510 873799 801155 239354 861162 714751 220909 495739
6886D95739J64310L0948L91892p38389k64406P77089n40546O91125l19350Q780
$$ 495739 660049 690997 1082889 344500 80094 857183 316637 1007762 688412 697192
6876F97192k12842J36900M30687k73711K03042k34123k39915L81674m89134J94224
$$ 697192 484350 621250 1051937 778226 981268 747145 507230 888904 399770 593994
6866E93994k42243Q56033n04102k24587O91036l92152j30550N9289j34969R7785
$$ 593994 351751 1207784 703682 479095 1170131 777979 647429 706718 571749 669534
6856F69534j24194j81264J22409K6449L04870j08360j91532k3001m36375K61451
$$ 669534 545340 364076 486485 512934 817804 709444 517912 494911 58536 319987
6846C19987M83769o6446l3411J95218r0806p59363L82464M91971o33125K63471
$$ 319987 803756 737310 703899 899117 808311 48948 431412 923383 290258 553729
6836E53729j55364L06149n9310L83690k83284j1146q8360J16598l36140k84842
$$ 553729 398365 704514 645204 1028894 745610 734464 646104 762702 426562 141720
6826A41720L90616l88258K01057k25108L95059j56117J17236q2119m31684L14214
$$ 141720 532336 144078 345135 120027 515086 358969 476205 394086 -37598 276616
6816B76616K37332O2459n67728R0509K5575J8379K85569L87300p36307k8861L43547
$$ 276616 513948 576407 8679 99188 124763 143142 428711 816011 79704 50843 394390
6805C94390j88036L10773j16297K91825l68859r3979M38071k66354K36654l03782
$$ 394390 206354 517127 400830 692655 323796 229817 667888 401534 638188 334406
6795C34406k28714O37140o51643R11778m50192l46890M2664J14362l99996K12316
$$ 334406 105692 742832 91189 1002967 552775 205885 248549 362911 -37085 175231
6785A75231k56361J54083L10498K48281o99828N47315k52616o4184J26225N27430
$$ 175231 -81130 72953 383451 631732 -68096 479219 226603 162419 288644 816074
6775H16074o69153L93350j01459m10168R4386k10671j17382j81016J293067p98234
$$ 816074 146921 540271 438812 28644 123030 -87641 -205023 -386039 907028 108794
6765A08794L6528n2741l60146M29542N53615o05152o0079k08492M35817m04555
$$ 108794 145322 92581 -267565 161977 715592 110440 50361 -158131 277686 -126869
6755a26869N68362j03296q4298L20864m70786J49408O0274j65000K43364j79200
$$ -126869 441493 338197 253899 574763 103977 253385 313659 148659 392023 212823
6745B12823Q0499p2125P21755q89585N95474j88329n48137O00144k6145m20697
$$ 212823 293322 221197 942952 53367 648841 460512 -87625 512519 486374 65677
6735F5677N28554j89510K38504m19408O21653q02851J55111P5609j72870P3377
$$ 65677 594231 404721 643225 223817 845470 42619 197730 273339 100469 173846
6725A73846n7205K57990j1164k51507Q2850J28078K67819m58707R9029j22337
$$ 173846 116641 374631 363467 111960 194810 322888 590707 132000 231029 108692
6715A08692L34643k12618M83412o02485L03691P9257n19755P06261m49219J5345
$$ 108692 443335 230717 714129 111644 415335 494592 -25163 681098 231879 247224
6705B47224K2262M40022q8969n04271K97089k48223K48921j3978K2177K80072
$$ 247224 269486 709508 620539 116268 413357 165134 414055 400077 422254 702326
6695G02326k57730M2625k904N36715n00903p8820L79922m38899q0805R2696r2378
$$ 702326 444596 487221 484317 1021032 520129 441309 821231 382332 301527 394223 301845
6684C01845N51000n01162M6948L57144n36516N21559k24934k9495k30082L30982
$$ 301845 852845 351683 398631 755775 219259 740818 515884 486389 256307 587289
6674E87289q3756L16685j14872o57690j08797K73060L58133p93295Q45402J26591
$$ 587289 503533 820218 705346 47656 -61141 211919 570052 -223243 622159 748750
6664G48750L4313q05977Q99110m29693M98523p08403m05692L06291J98057K44966
$$ 748750 783063 -22914 876196 446503 945026 236623 -169069 137222 335279 580245
6654E80245r6806Q91n03907K99900L92735l42321N30647l40394m5257J52978J02034
$$ 580245 483439 484330 -19577 280323 673058 330737 861384 520990 475733 628711 730745
6643G30745j70592l13334K97648j92583m78798O60948J67291l08962N9527J60011
$$ 730745 560153 246819 544467 351884 -126914 534034 701325 392363 451890 611901
6633F11901l70798M19502k36036m63540O0444O23010m1125j36865K93828N66579
$$ 611901 241103 660605 424569 -38971 21473 644483 603358 466493 760321 1326900
6623A326900n22646K69888m52661j85753L21861j60943j53452O29483o12176K57267
$$ 1326900 804254 1074142 621481 435728 757589 596646 443194 1072677 460501 717768
6613G17768k44606K10154k71287M08664n67458M38261L12403m56613o1610j09985
$$ 717768 473162 683316 412029 820693 253235 691496 1003899 547286 485676 375691
6603C75691K81876j29953J95871n05644j8839M88301J01950l26036L16654K51252
$$ 375691 657567 527614 723485 217841 199002 687303 789253 463217 779871 1031123
6593A031123l6087L56989q09889K95222l03125K33582M02777m40790O7321l62531
$$ 1031123 995036 1352025 542136 837358 534233 767815 1170592 729802 797123 434592
6583D34592o14897O08299q2320K65782K49741l86153k445k8741M2210m1103o741
$$ 434592 -180305 427994 345674 611456 861197 475044 472599 443858 486068 444965 438224
6572D38224M01761Q6277l77068M0938n09023M71259K55733m38954M5130K49366
$$ 438224 839985 926262 549194 590132 81109 552368 808101 369147 414277 663643
6562F63643L8623l71291K55344j48185M96413l39133N9166j37272m57291Q48209
$$ 663643 702266 330975 586319 438134 934547 595414 654580 517308 60017 908226
6552I08226O6956p31924L55074Q6715m44566k05603K38284L23641r0296j35170
$$ 908226 975182 243258 598332 685047 240481 34878 273162 596803 506507 371337
6542C71337R0448J0451j40452O27727n41054M25113q00262M73163L59957n84842
$$ 371337 461785 472236 331784 959511 418457 843570 43308 516471 876428 291586
6532B91586O97660n37247J8697K46587j45082l45571k34415q2769N80124N9299
$$ 291586 989246 451999 470696 717283 572201 226630 -7785 -90554 489570 548869
6522E48869J2656L4985l17420K53083M6929k48326J97749N4676J1513m13140L35050
$$ 548869 561525 596510 279090 532173 579102 330776 528525 583201 594714 181574 516624
6511E16624K49812m3817r9539M7884k66583m17501M91023k16016N86466o98423
$$ 516624 766436 722619 623080 670964 404381 -13120 477903 261887 848353 149930
6501A49930L93827m92388K94222m97218K84824L54079q6084k02068L645M08191
$$ 149930 543757 51369 345591 -151627 133197 487276 401192 199124 202769 610960
6491F10960J26704m01188M83500p57147L75103k4971L6776j37758Q7092N5345
$$ 610960 737664 336476 819976 62829 437932 412961 449737 311979 399071 454416
6481D54416l1940L0139J81433J33347j00483L38802m55558L8764l62196M32325
$$ 454416 422476 452615 634048 767395 666912 1005714 550156 588920 226724 659049
6471F59049k50322M8363K17603O7297K19878o94262J66850l05559O17805l55205
$$ 659049 408727 457090 674693 741990 961868 267606 434456 128897 746702 391497
6461C91497k56873N70506l02441L78014k87545j13012L4270l23350N81640J9744
$$ 391497 134624 705130 402689 780703 493158 380146 414416 91066 672706 692450
6451F92450l57733J48517N31057m44488M16904m74377J47968l65688R38587r64561
$$ 692450 334717 483234 1014291 569803 986707 512330 660298 294610 1233197 268636
6441B68636M00455p4642N5229k69303j93739M15948o00056N42061L54158j75046
$$ 268636 669091 594449 649678 380375 186636 602584 2528 544589 898747 723701
6431G23701R0243l16269k93136k0380l09036M11644J95734J94957n51913L89728
$$ 723701 813944 497675 204539 184159 -124877 286767 482501 677458 125545 515273
6421E15273L62037o58415N35084m02331M3202P8402J66448k10455K46044j68536
$$ 515273 877310 218895 753979 351648 394850 473252 639700 429245 675289 506753
6411E06753J81490K52432q6301m76560R6002p8244J67058K48785m52269L08016
$$ 506753 688243 940675 854374 377814 473816 395572 562630 811415 359146 667162
6401F67162k80355L49706m22080N15236P5584l18478M07920k57538J63478n04804
$$ 667162 386807 736513 314433 829669 905253 586775 994695 737157 900635 395831
6391C95831K28265Q46q5696M8906O3889M14176o05128K50537j2638K13909j2161
$$ 395831 624096 624942 539246 588152 652041 1066217 461089 711626 698988 912897 900736
6380I00736m38943L65822J68793p0823m66721P10463m50164Q65342j155636J63301
$$ 900736 461793 827615 996408 925585 458864 1169327 719163 1584505 428869 592170
6370E92170K70900J11121J1123m45806K58049L64143p24955K04781j5980L95688
$$ 592170 863070 974191 985314 539508 797557 1161700 436745 641526 625546 1021234
6360A021234l81486N74582p93281k42625R79965o74277O4230M54729J49333O4080
$$ 1021234 639748 1214330 421049 178424 1158389 484112 548342 1003071 1152404 1216484
6350A216484m67177J20653l57926M61153o83982M07046J68913j60844m69024N25522
$$ 1216484 749307 869960 512034 973187 289205 696251 865164 704320 235296 760818
6340G60818J51131o26358M32726J88374k20198K2331j13894k60510K05262P7624
$$ 760818 911949 285591 718317 906691 686493 708824 594930 334420 539682 617306
6330F17306M10158j11419j31147N044M8417n21706L15571K56056j35797P8970
$$ 617306 1027464 916045 784898 789942 838359 316653 632224 888280 752483 831453
6320H31453Q3998p6763J95281q1654K15756m74476L06539p6080j99112J3782L1241
$$ 831453 915451 838688 1033969 952315 1168071 693595 1000134 924054 724942 738724 769965
6309G69965L61763Q9209n75549J58753J34177k08901r9002J87191n3929j77729
$$ 769965 1131728 1220937 645388 804141 938318 729417 630415 817606 763677 585948
$$ [...]
##END NTUPLES=NMR SPECTRUM
##END=
