##TITLE=abcd
##JCAMPDX= 6.0         $$ Bruker NMR JCAMP-DX V2.0
##DATA TYPE= NMR SPECTRUM
##DATA CLASS= NTUPLES
##ORIGIN= UXNMR, Bruker Analytische Messtechnik GmbH
##OWNER= root
$$ XWIN-NMR		Version 3.5
$$ Sat Feb 18 12:10:08 2023 Russian Standard Time (UT+4h)  servis@DPX200
##.OBSERVE FREQUENCY= 200.131235884673
##.OBSERVE NUCLEUS= ^1H
##.ACQUISITION MODE= SIMULTANEOUS
##.ACQUISITION SCHEME= undefined
##.AVERAGES= 16
##.DIGITISER RES= 18
##SPECTROMETER/DATA SYSTEM= spect
##.PULSE SEQUENCE= zg
##.SOLVENT NAME= CDCl3
##.SHIFT REFERENCE= (INTERNAL, CDCl3, 0, 16.4885)
##AUDIT TRAIL= $$ (NUMBER, WHEN, WHO, WHERE, WHAT)
$$ ##TITLE= Audit trail, XWIN-NMR		Version 3.5
$$ ##JCAMPDX= 5.01
$$ ##ORIGIN= Bruker BioSpin GmbH
$$ ##OWNER= servis
$$ F:\spectra/data/av/nmr/H1/1/pdata/1/auditp.txt
$$ ##AUDIT TRAIL=  $$ (NUMBER, WHEN, WHO, WHERE, WHAT)
(   1,<2023-02-18 12:09:18.14 +0400>,<servis>,<DPX200>,
      <created by zg, POWCHK disabled, PULCHK disabled
       terminated by command 'halt'
       configuration hash MD5:
       00 E9 B6 7A A2 85 ED C7 34 08 36 98 17 FE 4E 26
       data hash MD5: 32K
       F7 53 9D 95 73 65 7B 34 D7 F2 34 92 F2 85 D0 D4>)
(   2,<2023-02-18 12:09:27.40 +0400>,<servis>,<DPX200>,
      <Start of raw data processing
       efp BC_mod = 2 LB = 0.05 FT_mod = 6 PKNL = 1 PHC0 = -105.2258 PHC1 = -2.89851 SI = 16K 
       data hash MD5: 16K
       39 9A A4 F0 CF B9 E5 9E 45 CF 04 6C 48 38 6D 18>)
(   3,<2023-02-18 12:09:31.21 +0400>,<servis>,<DPX200>,
      <abs ABSG = 5 
       data hash MD5: 16K
       4A 92 5A 22 27 77 D8 65 51 D2 03 10 28 94 0E AB>)
(   4,<2023-02-18 12:09:50.06 +0400>,<servis>,<DPX200>,
      <pk PHC0 = 5.2 PHC1 = 0 
       data hash MD5: 16K
       DE 22 17 C3 D7 7E 03 6E 30 88 4B 21 FC 9C 8C 5D>)
$$ ##END=
$$ 
$$ hash MD5
$$ EE 72 21 F2 8E B9 3F 5C 65 84 7C C7 DC 15 54 85
##$RELAX= 
##$RELAX= 
##$RELAX= 
##$RELAX= 
##$RELAX= 
##$RELAX= 
##$RELAX= 
##$RELAX= 
$$ Bruker specific parameters
$$ --------------------------
##$DU= <F:\spectra>
##$EXPNO= 1
##$NAME= <H1>
##$PROCNO= 1
##$TYPE= <nmr>
##$USER= <av>
##$AMP= (0..31)
100 100 100 100 100 100 100 100 100 100 100 100 100 100 100 100 100 100 
100 100 100 100 100 100 100 100 100 100 100 100 100 100 
##$AQSEQ= 0
##$AQ_mod= 1
##$AUNM= <au_zg>
##$AUTOPOS= <>
##$BF1= 200.13
##$BF2= 200.13
##$BF3= 200.13
##$BF4= 200.13
##$BF5= 500.13
##$BF6= 500.13
##$BF7= 500.13
##$BF8= 500.13
##$BYTORDA= 1
##$CFDGTYP= 0
##$CFRGTYP= 5
##$CHEMSTR= <none>
##$CNST= (0..31)
1 1 145 1 1 1 1 1 1 1 1 1 1 1 1 1 1 1 1 1 1 1 1 1 1 1 1 1 1 1 1 1 
##$CPDPRG= <>
##$CPDPRG1= <>
##$CPDPRG2= <>
##$CPDPRG3= <>
##$CPDPRG4= <mlev>
##$CPDPRG5= <mlev>
##$CPDPRG6= <mlev>
##$CPDPRG7= <mlev>
##$CPDPRG8= <mlev>
##$CPDPRGB= <>
##$CPDPRGT= <>
##$D= (0..31)
0 2 0 0 0 0 0 0 0 0.06 0 0 0 0 0 0 0.0002 0 0 0 0 0 0 0 0 0 0 0 0 0 0 
0 
##$DATE= 1676707757
##$DBL= (0..7)
120 120 120 120 120 120 120 120 
##$DBP= (0..7)
150 150 150 150 150 150 150 150 
##$DBP07= 0
##$DBPNAM0= <>
##$DBPNAM1= <>
##$DBPNAM2= <>
$$ [...]
##$SUBNAM5= <"">
##$SUBNAM6= <"">
##$SUBNAM7= <"">
##$SUBNAM8= <"">
##$SUBNAM9= <"">
##$SW= 20.6817932712277
##$SWIBOX= (0..15)
0 0 3 0 0 0 0 0 0 0 0 0 0 0 0 0 
##$SW_h= 4139.07284768212
##$TD= 32768
##$TD0= 1
##$TE= 0
##$TE2= 300
##$TE3= 300
##$TEG= 300
##$TL= (0..7)
0 120 120 120 120 120 120 120 
##$TP= (0..7)
150 150 150 150 150 150 150 150 
##$TP07= 0
##$TPNAME0= <>
##$TPNAME1= <>
##$TPNAME2= <>
##$TPNAME3= <>
##$TPNAME4= <>
##$TPNAME5= <>
##$TPNAME6= <>
##$TPNAME7= <>
##$TPOAL= (0..7)
0.5 0.5 0.5 0.5 0.5 0.5 0.5 0.5 
##$TPOFFS= (0..7)
0 0 0 0 0 0 0 0 
##$TUNHIN= 0
##$TUNHOUT= 0
##$TUNXOUT= 0
##$USERA1= <user>
##$USERA2= <user>
##$USERA3= <user>
##$USERA4= <user>
##$USERA5= <user>
##$V9= 5
##$VALIST= <valist>
##$VCLIST= <CCCCCCCCCCCCCCC>
##$VD= 0
##$VDLIST= <DDDDDDDDDDDDDDD>
##$VPLIST= <PPPPPPPPPPPPPPP>
##$VTLIST= <TTTTTTTTTTTTTTT>
##$WBST= 1024
##$WBSW= 30
##$XGAIN= (0..3)
0 0 0 0 
##$XL= 0
##$YL= 0
##$YMAX_a= 128921
##$YMIN_a= -161538
##$ZGOPTNS= <>
##$ZL1= 120
##$ZL2= 120
##$ZL3= 120
##$ZL4= 120
##$ABSF1= 16.48848
##$ABSF2= -4.193441
##$ABSG= 5
##$ABSL= 3
##$ALPHA= 0
##$AQORDER= 0
##$ASSFAC= 0
##$ASSFACI= 0
##$ASSFACX= 0
##$ASSWID= 0
##$AUNMP= <proc_1d>
##$AZFE= 0.1
##$AZFW= 0.1
##$BCFW= 0
##$BC_mod= 2
##$BYTORDP= 0
##$COROFFS= 0
##$CY= 18.4799938201904
##$DATMOD= 1
##$DC= 0
##$DFILT= <>
##$DTYPP= 0
##$F1P= 9.9274215381318
##$F2P= -0.165520771350173
##$FCOR= 1
##$FTSIZE= 16384
##$FT_mod= 6
##$GAMMA= 0
##$GB= 0
##$INTBC= 1
##$INTSCL= 4.127829e-11
##$ISEN= 128
##$LB= 0.05
##$LEV0= 0
##$LPBIN= 0
##$MAXI= 10000
##$MC2= 0
##$MEAN= 0
##$ME_mod= 0
##$MI= 50
##$NCOEF= 0
##$NC_proc= -8
##$NLEV= 6
##$NOISF1= 3.799351
##$NOISF2= 2.8
##$NSP= 0
##$NTH_PI= 0
##$NZP= 0
##$OFFSET= 16.48848
##$PC= 4
##$PHC0= -100.0258
##$PHC1= -2.89851
##$PH_mod= 1
##$PKNL= yes
##$PPARMOD= 0
##$PSCAL= 4
##$PSIGN= 0
##$REVERSE= no
##$SF= 200.130005582386
##$SI= 16384
##$SIGF1= 3
##$SIGF2= 2
##$SINO= 400
##$SIOLD= 16384
##$SREGLST= <1H.CDCl3>
##$SSB= 0
##$STSI= 16384
##$STSR= 0
##$SW_p= 4139.07284768211
##$SYMM= 0
##$S_DEV= 0
##$TDeff= 32768
##$TDoff= 0
##$TI= <>
##$TILT= no
##$TM1= 0
##$TM2= 0
##$TOPLEV= 0
##$USERP1= <user>
##$USERP2= <user>
##$USERP3= <user>
##$USERP4= <user>
##$USERP5= <user>
##$WDW= 1
##$XDIM= 16384
##$YMAX_p= 389540945
##$YMIN_p= -1628564
$$ End of Bruker specific parameters
$$ ---------------------------------
##NTUPLES= NMR SPECTRUM
##VAR_NAME=  FREQUENCY,     SPECTRUM/REAL,   SPECTRUM/IMAG
##SYMBOL=    X,             R,               I
##VAR_TYPE=  INDEPENDENT,   DEPENDENT,       DEPENDENT
##VAR_FORM=  AFFN,          ASDF,            ASDF
##VAR_DIM=   16384,         16384,           16384
##UNITS=     HZ,            ARBITRARY UNITS, ARBITRARY UNITS
##FACTOR=    0.252644378177508, 1,           1
##FIRST=     3299.83951724647, 0,            0
##LAST=      -839.233330435636, 0,           0
##MIN=       -839.233330435636, -1628564,    0
##MAX=       3299.83951724647, 389540945,    0
$$ Real data points
##PAGE= N=1
##DATA TABLE= (X++(R..R)), XYDATA
$$ [...]
8649g61726N4969O3886p0366P779j9592m3726J13645m1044o1191L7722k5260l157
8637g48061J17477n6621l3690N6761p1718k4661M0300J4809k6353k8314j2868
8626g72939k3238J10850l9625j26807J26375Q96p5796j876Q8720q2746p44J16491
8614f80439r3584O6346j94091P5168M487L8570J9474J01053J699j04282j52716
8603i18315K10690o9592J7626n4817Q8181m6899P0103J5921Q2826j28520K1930
8592g10866L4969J2733j55498K3785L56683l16958K1154l7445J01608o3258J1438
8581g21655j792m475P3664r4342j3499j0280J34385j26291J3868K4253K8521l6413
8569g34056j8587r131l9476J4109j0117j0932Q2135n7896m1323r2360J81957M7955
$$ y = [-761726, -706757, -642871, -713237, -705458, -725050, -768776, -655131, -696175, -757366, -719644, -744904, -748061, -630584, -687205, -720895, -664134, -735852, -760513, -720213, -705404, -731757, -760071, -772939, -796177, -685327, -724952, -851759, -725384, -724488, -800284, -802160, -713440, -796186, -796930, -680439, -774023, -707677, -901768, -826600, -822113, -783543, -764069, -663016, -661317, -765599, -918315, -707625, -777217, -759591, -814408, -726227, -773126, -703023, -687102, -604276, -732796, -710866, -675897, -663164, -818662, -794877, -438194, -755152, -733998, -771443, -669835, -733093, -721655, -723447, -727922, -654258, -748600, -762099, -772379, -637994, -764285, -750417, -726164, -697643, -734056, -752643, -761774, -801250, -787141, -797258, -808190, -726055, -783951, -825274, -917634, -735677, -687722]
8557f87722q2706q5l837j3033n5545N6449N6208k6054J2145l7858J00694j03445
8545g84789R8255m2889l7620J6026L6375n5777q617P2624j10033Q2590M79J8358
8533g15018P401k8791N3483r5453k9758J10069R2192N636O33621L017600l409035
8522c58053l79153q7519N2140J2503R0063r9910M5957j21801L1666J31739j58614
8511h40982O4788Q1486j15412J7903q429R0269J2437N3377j50053K9625k1446
8500g86437Q7008o9012j1424K6903j49636K53986j48556P8321p9173l448K0218
8489g81250k8009K3033K9584k1875R343Q168j0211q2531n7153J70973o216j41574
8477h87718M6170M6684k9315K4194n7194R6980o317K6837q782o6857o010n7800
$$ y = [-687722, -770428, -770513, -774350, -787383, -842928, -786479, -730271, -756325, -744180, -782038, -681344, -784789, -686534, -729423, -767043, -751017, -714642, -770419, -779036, -706412, -816445, -733855, -733376, -715018, -707617, -736408, -682925, -778378, -808136, -698067, -605875, -600239, 33382, 3050982, -358053, -737206, -824725, -772585, -760082, -670019, -769929, -723972, -845773, -814107, -682368, -840982, -776194, -694708, -810120, -792217, -800646, -710377, -697940, -644563, -794616, -764991, -786437, -699429, -768441, -779865, -752962, -902598, -648612, -797168, -718847, -798020, -801468, -781250, -809259, -786226, -756642, -778517, -769174, -761006, -771217, -853748, -910901, -739928, -746144, -887718, -841548, -794864, -824179, -799985, -857179, -760199, -766516, -739679, -748461, -815318, -821328, -879128]
8465h79128J28376o5319p1887o7840J88752j37855K08133j05369N2214o0982k3064
8454h33969N2789N5202j14737M0211n797O7483r8442O6128J4418j2963q4474k0785
8442h74936R5906J9265M2711p7617K4792j1915O9126m8268N9777j37587j5515
8431h54261N167J8753Q9700j935P303p0023n1920k9664M2036J96924j32849L7303
8419g43466J8287l13218L00850r67m4490l3428J38708j33693M4705k2573N4464
8408g34821j33812R0366L703M1899J02479j96257L2972J04249p3430p9777O1662
8397g80767l6717J46221o8929O6362q4750M7231K2043Q37820q66096o8417q7681
8386h73680P5750p2349J47860k0558r5218P0460j03000K6601L739K875N1050J8260
$$ y = [-879128, -750752, -816071, -887958, -955798, -767046, -904901, -696768, -802137, -749923, -810905, -833969, -781180, -725978, -840715, -800504, -806301, -738818, -837260, -771132, -756714, -769677, -854151, -874936, -779030, -759765, -717054, -794671, -769879, -781794, -712668, -760936, -701159, -838746, -854261, -849094, -830341, -740641, -742576, -735273, -805296, -857216, -886880, -844844, -647920, -780769, -743466, -725179, -1038397, -737547, -738514, -783004, -816432, -677724, -811417, -766712, -789285, -734821, -868633, -778267, -774564, -732665, -630186, -826443, -793471, -689222, -762652, -842429, -780767, -817484, -671263, -740192, -673830, -758580, -711349, -689306, 148514, -717582, -785999, -873680, -797930, -870279, -722419, -742977, -838195, -767735, -870735, -844134, -840395, -837520, -786470, -768210]
8374g68210k4041o3333J18115j24503l975J37721j4923j47224Q1227k4713j5081
8363h48940J51439p7174l8836j37761J59463m9810j29650K86865r9952p9944O7887
8352g96413j12191J11131j3728j1445Q5835p0097P3030k5560j41360N0348K5504
8341h24946N4708K3057J6001q0713J10670j22811j40335J43806L7153n5871K2361
8330h16920j4103J8599j0391R2240K4057q7017l7005Q1348m0531R2027j36023
8319h33719J06028r0829o1346O0877R2908r4335O6811N5200J986Q0366r0592j40054
8307h46699n5843J09012j04375J09927j29607J72821p7529l707j43631K19386
8297g50245r1821K181k963m5531J15616P8905j21506o9260k5712Q7356J80768
$$ y = [-768210, -792251, -855584, -737469, -861972, -865947, -728226, -743149, -890373, -809146, -833859, -848940, -697501, -774675, -813511, -951272, -791809, -841619, -971269, -684404, -784356, -864300, -796413, -908604, -797473, -811201, -822646, -736811, -806908, -733878, -759438, -900798, -850450, -824946, -770238, -747181, -731180, -811893, -701223, -824034, -964369, -820563, -783410, -839281, -816920, -831023, -812424, -822815, -730575, -706518, -793535, -830540, -749192, -789723, -697696, -833719, -727691, -818520, -879866, -818989, -726081, -820416, -753605, -698405, -696419, -616053, -706645, -846699, -902542, -793530, -897905, -787978, -917585, -744764, -822293, -826000, -969631, -750245, -842066, -839885, -842848, -888379, -772763, -693858, -815364, -884624, -910336, -822980, -642212]
8286f42212j18798K9555N505q0306K28272k42250M6635L2444j34893N1826J25503
8275f98719k59164K61008j48173l8450N4904p5947J16996o3480K8140K5361j31286
8264i28810J56315l3611j5123p1185M297R4143R0180k90542J96285R4863j44446
8253h47634Q7291m1236J64590j09613j61241J20118j12233J80448q0191P8314
8243g21387n5903l5667O5665k14594R4767k2460J07057p9033j94025L03458j57881
8232i10003l219J88006k9270J73241j53335J2319j57613J73282k34623K06626
8222g34589k35088k2110P2125K40993j72025J54263P8261j08025K9923k9201l02994
8211a028467N4347J56644p2977R0391J27218l8512l819J38473l2517l86906M59810
$$ y = [-642212, -761010, -731455, -725950, -806256, -577984, -820234, -773599, -741155, -876048, -824222, -698719, -957883, -696875, -845048, -883498, -828594, -904541, -787545, -851025, -822885, -797524, -928810, -772495, -806106, -821229, -892414, -888117, -793974, -703794, -994336, -798051, -703188, -847634, -760343, -801579, -636989, -746602, -907843, -787725, -899958, -719510, -799701, -721387, -777290, -812957, -747292, -961886, -867119, -889579, -782522, -861555, -1055580, -752122, -910003, -913222, -725216, -754486, -581245, -734580, -722261, -879874, -706592, -941215, -734589, -969677, -991787, -919662, -678669, -850694, -696431, -618170, -726195, -696272, -725473, -1028467, -974120, -817476, -890453, -800062, -672844, -711356, -715175, -576702, -609219, -996125, -536315]
8200e36315n87663L23993J11513n06870K90352j36276J46168j54519n78947K048262
8190D19698j101641l7726J61554l2721m63484P25965K15835o8840o56473L96059
8180d41774m22868K25980L09837n19162K53537R1392j54319J28367k10063K5448
8170g13625l0008J36042j15575M4249M6373Q5192n657j53545J88215k32533K02599
8159e48273r5339k22919K72804j11659l7843J07033n8495q756J73165k60930K35853
8148e55359J38417j49329n8827Q0792k7719k46391K74501Q0955j77611J15675
8138e24896L4839j30809L235K5800M771q1419O8830L1525M5515j56275K14924
8127d63960j24127L2013j3950j5450K01033p8038J27385K1565k68562R1759j66008
$$ y = [-536315, -1123978, -799985, -688472, -1195342, -904990, -1041266, -895098, -1049617, -1628564, 419698, -681943, -719669, -558115, -590836, -1054320, -328355, -112520, -181360, -837833, -441774, -864642, -638662, -328825, -847987, -594450, -503058, -657377, -529010, -739073, -713625, -743633, -607591, -723166, -678917, -632544, -547352, -553009, -706554, -518339, -750872, -548273, -643612, -866531, -593727, -705386, -743229, -636196, -694691, -703447, -530282, -791212, -555359, -416942, -566271, -625098, -544306, -572025, -818416, -543915, -462960, -640571, -524896, -490057, -620866, -617631, -591831, -587060, -668479, -599649, -568124, -522609, -678884, -463960, -588087, -556074, -570024, -585474, -384441, -462479, -335094, -313529, -582091, -490332, -656340]
8116f56340Q7845K4195J89251r6314P5528q7986P5167o452O3026J95032k57069
8105c94117l9918J40107L6982o701n7286r0925N6021J26162j88420K51165j47654
8094c14584q283K39865o4532l2692J2609L6648j01904M5355p2320J28856J5541
8083a15441K0726j25047J9790M8592m0786J0892J15939n2292r455Q2254K1107
8072b3721j21915J87464j09462K8315R3296J1939k31335J58833k52651J76765
8062h2472n2160M555M0451r4968J6476K45391o8519j62416J25710o5379M5972
8051d7359O1439j06365J5370j84510Q7664N4155j24104O0830o666l309O2359j6468
8039a46964j6457j26580p4987R2905J6229p2913o1371P6211o5294L2644J56696
$$ y = [-656340, -568495, -544300, -355049, -451363, -375835, -463821, -388654, -395106, -332080, -137048, -394117, -434035, -293928, -256946, -263647, -320933, -411858, -355837, -229675, -418095, -166930, -314584, -322867, -83002, -147534, -180226, -167617, -130969, -232873, -187518, -259838, -130982, -115441, -94715, -219762, -199972, -151380, -192166, -181274, -65335, -117627, -127082, -44828, -23721, -145636, 41828, -67634, -39319, 53977, 65916, -165419, -6586, -259237, -82472, -134632, -130077, -89626, -184594, -168118, 77273, 8754, -153662, -27952, -93331, -47359, 14080, -92285, -76915, -261425, -173761, -119606, -243710, -182880, -189546, -192855, -130496, -146964, -163421, -290001, -364988, -272083, -255854, -328767, -390138, -313927, -379221, -346577, -189881]
8028a89881j65579J9236k3831L6740p1590L5999J5342m9046q8315Q6702o0425
8017d54648n499P4129r8581l0970n4542J15477M3319j629q2964j6023L430p6475
8005e84976J9776J19852q020q8636L134J04438N563J735N4814j20160j00602R5937
7993d97145O198j5011P8838m5536n7231j33435J73757J20255l9635o5500O0725
7982d13720k2983P8846j34283j0298K11225q2344j31129P7527J9158M725p3667
7971d76943L2206O6996q2200l8486J6409J53033j52491Q2931L8269L4931r1188
7960d16533Q742P7459j9145k8967n9109J31257K0812o8008K7593k5477J03931
7949b47445l8644m7568O222K8529j35798P2743P3006p8858k2028n9460Q5474K6323
$$ y = [-189881, -355460, -336224, -360055, -323315, -394905, -358906, -343564, -392610, -480925, -394223, -454648, -460147, -386018, -484599, -515569, -570111, -454634, -411315, -412944, -495908, -511931, -508501, -584976, -565200, -445348, -453368, -542004, -538870, -434432, -428869, -427134, -372320, -492480, -593082, -497145, -490947, -505958, -427120, -472656, -529887, -663322, -489565, -369310, -408945, -474445, -413720, -436703, -357857, -492140, -502438, -291213, -373557, -504686, -427159, -408001, -403276, -476943, -444737, -377741, -459941, -498427, -482018, -328985, -481476, -398545, -360276, -325345, -416533, -407791, -330332, -349477, -378444, -437553, -306296, -285484, -353492, -325899, -351376, -247445, -286089, -333657, -327435, -298906, -434704, -361961, -288955, -367813, -389841, -449301, -363827, -337504]
7937c37504K7709L9227l9421j5123l8175N2422J37641q1696R303o1824l8257N486
7925c40212J34012j8657r9797K398P3746j74490J78573j60016J16379o5934J31941
7914b22057J31118j21135n986O7284m4515l0535K2793N6301m6676j5438N486O2700
7902a40660J15975j0803K0468j16264J85915p0253R7456r668j5824J27619n9264
7891A24697K8922J18394j08642N5437q2628O1566n348P5626O0740L0404j9154
7880C40014M8408O1439L8947R0579o417J06214O5276m2664J23534j06036M4938
7869G64232L4811J34596P49R9102K5223L5025J08051l9922K64776k386259R32200
7858b7416Q44789O7531Q6865O5551L7497n1511K41829p5947M2129P9760K3879
$$ y = [-337504, -309795, -270568, -309989, -325112, -363287, -310865, -173224, -254920, -245617, -307441, -345698, -340212, -206200, -224857, -324654, -322256, -248510, -423000, -244427, -404443, -288064, -353998, -222057, -90939, -212074, -218060, -150776, -195291, -225826, -203033, -146732, -193408, -208846, -203360, -140660, -24685, -35488, -15020, -131284, 54631, -15622, 81834, 72166, 56342, 183961, 124697, 153619, 272013, 163371, 218808, 136180, 197746, 192398, 268024, 328764, 359168, 340014, 388422, 449861, 488808, 579387, 572970, 679184, 744460, 701796, 825330, 719294, 764232, 799043, 933639, 934388, 1033490, 1058713, 1093738, 1201789, 1161867, 1426643, -959616, -27416, 817373, 884904, 971769, 1037320, 1074817, 1023306, 1265135, 1189188, 1231317, 1311077, 1334956]
7847A334956J62454j6009J4942j13811J39680k63187R1492p7074O8209m9611m3345
7836A248696P3067j31315l2868N8125P2238n4568N700O030n1314J9194J1744l4003
7824A190726O2102j3567j43256M9551q7184j5317J5926K4313l9296j38959P1118
7813I76157k18594n8617J45967o4909r614j07023J1248k7237j18785j02053M8653
7802D75193J43079m2429r950n0445r2708K51J03231k07781J18178q9455m0378
7791C06786m277m4852j7032l5380P9748O1569j88627R8773j83150J13558n6907
7780A30209k4962N2872J81514k63000N1828m9545P0640N9294p7084J1831N4032
7769A97629m7214R0815r5098J7887p0009M1901o3278j782K2551K4100N7996p5858
$$ y = [1334956, 1497410, 1481401, 1496343, 1382532, 1522212, 1259025, 1350517, 1273443, 1341652, 1292041, 1248696, 1321763, 1190448, 1157580, 1215705, 1287943, 1233375, 1239075, 1245105, 1193791, 1212985, 1224729, 1190726, 1252828, 1239261, 1096005, 1145556, 1058372, 1043055, 1058981, 1083294, 1043998, 905039, 976157, 757563, 698946, 844913, 780004, 770390, 663367, 674615, 647378, 528593, 426540, 475193, 618272, 575843, 565893, 515448, 422740, 422991, 526222, 318441, 436619, 347164, 306786, 302509, 257657, 240625, 205245, 284993, 346562, 157935, 256708, 73558, 187116, 130209, 105247, 158119, 339633, 76633, 128461, 78916, 149556, 208850, 131766, 143597, 197629, 150415, 241230, 146132, 164019, 94010, 135911, 72633, 70851, 93402, 117502, 175498, 99640]
7757I9640J14378k1004j14948P9900N6809L1400m0974p4895k910O4835M9391q0834
7745A60788P8676l137o4306l5349K5097p35O0523J06170j03965m0729J29048j76666
7733A35415J57613o7048M4708o4919L8127o505k132O7862k4494o0747J7249J29668
7721C64797j36287J8141R6450j45550J44998m9364Q7288r2794j4865M1339p352
7710C06801j00612Q5376O3619j1310j03321J03212j25562J51851p3927J645R1906
7699C89678m871J4165K5925j09917P2192p3543k9993J07981m3011L8606K1165
7688D08377J3411k6483J49154j50270q7820J01626l0136Q3254k8013j27611L8121
7677C43610Q5074j36800Q2256K2835J06038l9249r8601J66501k00871J45501o253
$$ y = [99640, 214018, 193014, 78066, 157966, 214775, 246175, 205201, 130306, 127396, 192231, 241622, 160788, 239464, 236327, 172021, 136672, 161769, 161034, 221557, 327727, 223762, 183033, 312081, 135415, 293028, 225980, 270688, 205769, 243896, 237391, 235259, 303121, 278627, 217880, 235129, 364797, 228510, 246651, 343101, 197551, 342549, 293185, 380473, 287679, 272814, 314153, 306801, 206189, 291565, 355184, 343874, 240553, 343765, 218203, 370054, 296127, 297772, 389678, 384807, 398972, 424897, 314980, 387172, 313629, 283636, 391617, 348606, 387212, 408377, 421788, 395305, 544459, 394189, 306369, 407995, 377859, 461113, 433100, 305489, 343610, 428684, 291884, 374140, 396975, 503013, 463764, 365163, 531664, 330793, 476294, 470041]
7666D70041j38741R5157O2972l7592m1725O0049M0844n2635r9314J35349o6349
7655D28056K8881L1013l4847L6171O3734O3720m6394r7202M1824q1511n451N8096
7643D86090O1428P1362j2195j7458R985J7469k114l3997L3419O526J17410k4101
7631G13824R3097n7393j17444P0277K0003q4210m2690P4659k8197P3351m09p7326
7619F37542n2407L6450O6747p9763R8572L1066l3430k2886O3300N5798L6222r33
7607H36278L449J13039j81916R7045j17609O632o8573J6263K1693m64335M25394
7596F87360J68268r0148m5152J05222L9112j53853N5859R3518K6998p7142O3990
7585H74032l2200J2974p0830J1123R3471J086k2004j03129L8253m5772L3706k8257
$$ y = [470041, 331300, 426457, 489429, 451837, 410112, 470161, 511005, 458370, 359056, 494405, 428056, 456937, 487950, 453103, 489274, 553008, 616728, 570334, 473132, 514956, 433445, 427994, 486090, 547518, 618880, 606685, 589227, 599212, 616681, 614567, 580570, 613989, 620515, 737925, 713824, 806921, 749528, 632084, 702361, 722364, 638154, 595464, 670123, 641926, 715277, 714868, 637542, 585135, 621585, 688332, 608569, 707141, 738207, 704777, 681891, 745191, 800989, 837211, 836278, 839727, 952766, 770850, 867895, 750286, 756918, 688345, 704608, 726301, 261966, 687360, 855628, 765480, 720328, 825550, 864662, 710809, 766668, 860186, 887184, 810042, 874032, 841832, 854806, 783976, 795099, 888570, 889656, 867652, 764523, 802776, 757004, 790710, 762453]
7573G62453M709R0169Q407J3322k2845q8431J9115j4718O1705p2886N8548L9892
7561H59440k2152L0215K0467J1752m6105l8847K2987K4592M3303j00263J972L6589
7549H43950N4708L8000o7838O373N6459l6017m8143L5465P1485j16674J19931
7538I57699K3691L8292k9164J00524N942J587P7681q7028J22105o6613J4866l8990
7526A120592O471R5941l415P4157J13089j8787J25261M7320k1804P8679R6566
7515A714070P6903j3359K45112J00708J01017J47475P7344J27558J63437J18296
7505B858561K05123j09023J69595l1025N7226N4957j90649o0738n1832J40003
7495C042198n8002N5751P81Q3196p0672k52347j31091n5247m5414p716J8469O4687
$$ y = [762453, 767162, 857331, 865738, 879060, 856215, 767784, 786899, 772181, 833886, 761000, 819548, 859440, 837288, 867503, 887970, 899722, 853617, 814770, 837757, 862349, 905652, 805389, 807361, 843950, 898658, 936658, 868820, 875193, 931652, 895635, 847492, 882957, 954442, 837768, 957699, 981390, 1019682, 990518, 1091042, 1096984, 1098571, 1176252, 1089224, 1211329, 1144716, 1159582, 1120592, 1127063, 1223004, 1219589, 1293746, 1406835, 1388048, 1513309, 1560629, 1538825, 1617504, 1714070, 1790973, 1777614, 2022726, 2123434, 2224451, 2371926, 2449270, 2576828, 2740265, 2858561, 3063684, 2954661, 3124256, 3093231, 3150457, 3205414, 3014765, 2954027, 2902195, 3042198, 2984196, 3039947, 3040728, 3123924, 3053252, 2800905, 2669814, 2614567, 2569153, 2561437, 2579906, 2644593]
7483B644593J0654J40438k4534J10364J07433L6374J67956P6255M6115J95595
7473C511243j21243p0250j11216M2711p4710p0925o6025N0540p2988J10414q5951
7462C041600N1325k4446N4616J08163J8816J32712M9531J20491J70825J37253
7452C860886k9214J15533p164L1134k6733j90404n9586k04143j69484n8764j61960
7441C100101j6264k42467p8224p8931P8475n3909L3870M8264k2452L4585Q1285
7430B884333N2504O3270N1546P9916O6608j4913J11296L1341M9685P6325K4741
7419C476652m4098j38992k07425n1606j01019j00861q5822j18096p7032j29148
7409B422553P5725k6363j29939R8168j42788J48981j62586R6315J5333k31355
$$ y = [2644593, 2655247, 2795685, 2771151, 2881515, 2988948, 3025322, 3193278, 3269533, 3315648, 3511243, 3390000, 3319750, 3208534, 3251245, 3176535, 3105610, 3039585, 3090125, 3017137, 3127551, 3041600, 3092925, 3068479, 3123095, 3231258, 3250074, 3382786, 3432317, 3552808, 3723633, 3860886, 3831672, 3947205, 3940041, 3971175, 3944442, 3754038, 3694452, 3490309, 3320825, 3262061, 3100101, 3083837, 2841370, 2763146, 2684215, 2762690, 2708781, 2742651, 2790915, 2768463, 2803048, 2884333, 2936837, 3000107, 3051653, 3131569, 3198177, 3183264, 3294560, 3325901, 3375586, 3451911, 3476652, 3432554, 3293562, 3086137, 3034531, 2933512, 2832651, 2746829, 2628733, 2551701, 2422553, 2498278, 2471915, 2341976, 2440144, 2297356, 2446337, 2283751, 2380066, 2395399, 2164044]
7399B164044N3004n142m5009r4276L5041m8756N4190p3167p1001M9212P900j748
7387B024292M9968l8418Q232k5206J32877j08879J1973P6877M6053Q6271n4439
7376B209601R3009N368Q8253L3101Q9582M0158J9036M2443R8580O970m495K5187
7364B746793N6199Q2559J15174o7967J73332P5342j2478M0112J65178M7020J41491
7353C562755Q5403J31513Q5548J24818K22205J07731R8803K10311R6448J17851
7343D843386K14164L30795L00334K70630N65414O09146Q61463Q92702O21337L48490
7333I857861p7961k23412n38941l58174l98289m9236q9883j29970K86654L54762
7323H633411L36774L88115P60824O78496R57632J266893J518270J889299K599636
$$ y = [2164044, 2217048, 2211906, 2166897, 2072621, 2107662, 2058906, 2113096, 2039929, 1968928, 2018140, 2026040, 2024292, 2074260, 2035842, 2044074, 2018868, 2151745, 2042866, 2054839, 2131716, 2177769, 2264040, 2209601, 2302610, 2307978, 2396231, 2429332, 2518914, 2559072, 2578108, 2620551, 2719131, 2726101, 2721606, 2746793, 2802992, 2885551, 3000725, 2932758, 3106090, 3181432, 3168954, 3209066, 3374244, 3421264, 3562755, 3648158, 3779671, 3865219, 3990037, 4212242, 4319973, 4418776, 4629087, 4725535, 4843386, 5057550, 5388345, 5688679, 5959309, 6524723, 7133869, 7995332, 8888034, 9509371, 9857861, 9779900, 9556488, 9017547, 8659373, 8261084, 8211848, 8121965, 7991995, 8278649, 8633411, 8970185, 9358300, 10119124, 10797620, 11755252, 13022145, 14540415, 16429714, 19029350]
7314A9029350K871432K913270K272184J082265p20869j675842k427523k360583
7306B0983684k053460j692420j202287p95783m52743j38884J58696M18347L78650
7297A5603800Q73058J097250J609354K094631K675419L630070M236559M393625
7289C6213766L510261J585497q74974k698174l917614m154718l718189k963154
7281B2982701k257918j725141j131514q71639l87970j81828j74429K95866M12921
7272A6961049N90830J062591J474576K175991K554020K837557K439604J114023
7264C1210241m90845j986157k936513l124497k872874k441970j823095j514875
7256A4019415r86571q38974n68206n52009k50375k35321l15626n6121o3326l3011
$$ y = [19029350, 21900782, 24814052, 27086236, 28168501, 27447632, 25771790, 23344267, 20983684, 18930224, 17237804, 16035517, 15239734, 14786991, 14648107, 14806803, 15225150, 15603800, 16476858, 17574108, 19183462, 21278093, 23953512, 27583582, 31820141, 36213766, 39724027, 41309524, 40434550, 37736376, 33818762, 29664044, 25945855, 22982701, 20724783, 18999642, 17868128, 16996489, 16608519, 16426691, 16252262, 16548128, 16961049, 17551879, 18614470, 20089046, 22265037, 24819057, 27656614, 30096218, 31210241, 30719396, 28733239, 25796726, 22672229, 19799355, 17357385, 15534290, 14019415, 13032844, 12193870, 11625664, 11073655, 10823280, 10587959, 10272333, 10216212, 10152886, 10119875]
7246A0119875L36965L94932N73693N63564K42146k87156q38477q65420r39002
7237I301120r12991q16228o19824m44148m58920k35904k27144k21167j71153k49870
7227D943771j14898k00778k49675j31678j19320j53567k44379j682m0508k34128
7217C453158r2318k8436p0037j09009q5874j77712J7275r4915J0065j31587k2280
7206B668330j7992j4951p9683M2148J38895l98562n5885L4184q5302L9716j59453
7195B111445k5795j44586M4857r1351N5299o5236l2949q257K5156q4641m6540
7184A737402L4124o7554M894p1573j27165N365O4678j22343P7679k5027m1950
7173A468530o1867m0949K7759N3353m9539m987l3484j49813l4489l4387Q5392
$$ y = [10119875, 10456840, 10851772, 11425465, 11989029, 12231175, 11944019, 11105542, 10240122, 9301120, 8388129, 7571901, 6952077, 6507929, 6049009, 5813105, 5585961, 5364794, 5193641, 4943771, 4828873, 4628095, 4378420, 4246742, 4127422, 3973855, 3729476, 3727794, 3687286, 3453158, 3360840, 3332404, 3262367, 3153358, 3067484, 2889772, 2907047, 2812132, 2822197, 2690610, 2668330, 2650338, 2635387, 2555704, 2597852, 2736747, 2338185, 2282300, 2316484, 2231182, 2270898, 2111445, 2085650, 1941064, 1985921, 1894570, 1949869, 1884633, 1851684, 1843427, 1868583, 1783942, 1737402, 1771526, 1703972, 1708866, 1637293, 1510128, 1515493, 1580171, 1457828, 1535507, 1510480, 1468530, 1406663, 1365714, 1393473, 1446826, 1397287, 1392300, 1358816, 1209003, 1174514, 1140127, 1225519]
7162A225519O5233m3959n0378q6426J07258q5157j6281J48465n2132Q546r0789
7151A129899L674l7337J1007M1929j0292J4001k8070K0312j1536K7503m6175L2230
7139A147145j9420k1570j44942O2578L2473j7273l6758J6267p8280R0354j7197
7128A013377L1253K9206j02264l403R2631j19177J30364L2900j83034O9885J5854
7117A007592j229M0943k0981K8395j7706q5624M2732Q8L4158k6391j5638l0667
7105I55672J9078l1385J6022M8039K7863j36361R6063j1834p1156L5483P5931
7094A023415p2093J2242j6987L001K648N3549r8119m5458K7850K9380J21420q3710
7082I57138P5547m8743P0016n1295J86991n1514n5037J90273l3790n5944J96474
$$ y = [1225519, 1290752, 1246793, 1196415, 1109989, 1217247, 1132090, 1115809, 1264274, 1212142, 1220688, 1129899, 1133573, 1096236, 1107243, 1149172, 1138880, 1152881, 1124811, 1145123, 1133587, 1161090, 1114915, 1147145, 1127725, 1106155, 961213, 1023791, 1056264, 1038991, 1002233, 1018500, 940220, 1030574, 1013377, 1044630, 1073836, 971572, 968169, 1060800, 941623, 1071987, 1104887, 921853, 991738, 1007592, 1006363, 1047306, 1026325, 1054720, 1037014, 951390, 994122, 994210, 1028368, 1001977, 986339, 955672, 974750, 943365, 959387, 1007426, 1035289, 898928, 994991, 983157, 912001, 947484, 1023415, 951322, 963564, 946577, 949578, 952226, 1005775, 907656, 862198, 890048, 919428, 1040848, 957138, 1032685, 983942, 1053958, 1002663, 1189654, 1138140, 1083103, 1273376, 1239586, 1183642, 1380116]
7071A380116k5785J35627P7905R46J14752Q3302Q4436L4728q9247N3342k0238
7060A829884j3280m1947m276L5236m0261K5227j7763J08650J177j8383J61299
7049B025563q0444J77329j29459N3519J2737l7336N3360o7181j19110J06541j37337
7038A858182k316M882M8860j17417M9494n3524J13562j39782M7426K7824K0854
7027A858045R703q7404l4080O7469N3118j552K153q4987J3364P3319L6069q6145
7015A819072J83750l7283O5709j2782j1620J28947q9805O2529j0347J6116l3101
7004B081185P0915M5971L7928J03570n6132R3962Q8353M677K21436r9072j0166
6993B582627J52237r0363o2904J5372J3687j907k6947M2020j47864m5026j23519
$$ y = [1380116, 1354331, 1489958, 1567863, 1568809, 1683561, 1766863, 1851299, 1886027, 1796780, 1850122, 1829884, 1816604, 1774657, 1770381, 1805617, 1765356, 1790583, 1772820, 1881470, 1882647, 1864264, 2025563, 1945119, 2122448, 1992989, 2046508, 2059245, 2021909, 2075269, 2008088, 1888978, 1995519, 1858182, 1855866, 1860748, 1909608, 1792191, 1841685, 1788161, 1901723, 1761941, 1809367, 1837191, 1858045, 1867748, 1780344, 1746264, 1813733, 1866851, 1865299, 1867452, 1782465, 1795829, 1869148, 1905217, 1819072, 2002822, 1965539, 2031248, 2018466, 2006846, 2135793, 2045988, 2108517, 2098170, 2114286, 2081185, 2152100, 2198071, 2235999, 2339569, 2283437, 2377399, 2465752, 2470429, 2691865, 2592793, 2582627, 2734864, 2644501, 2581597, 2596969, 2610656, 2608749, 2581802, 2623822, 2475958, 2430932, 2307413]
6982B307413L6613K3783J0491O4370r4853J0002O4433K7677K02368q9188J55744
6971B718853J13158J5425J85694J83559O8631K93930J93329J72041K30736Q7955
6961D263311K25494J06892n0799J43893L4499q0890R7829Q598j26774J2041J67433
6950D801527j26608R128J76424M8859J60260N9205M0286P2499R9864p1660m186
6939E265598k0742k4780m3259k50642j43665o2436p6132n4463o9170j36122k8502
6928D355685j54377Q3692l9799n6824K5430p7722Q0P8976J30445J42231Q3839
6917D571656J27856J92051J21679L35348J03681K30109O3034J02690m0120j2223
6907E795761j5171r8824j05770k24040l2166j76271K1109r8032j17987j9885P0365
$$ y = [2307413, 2344026, 2367809, 2378300, 2442670, 2347817, 2357819, 2422252, 2449929, 2652297, 2563109, 2718853, 2832011, 2847436, 3033130, 3216689, 3285320, 3579250, 3772579, 3944620, 4175356, 4263311, 4488805, 4595697, 4544898, 4688791, 4723290, 4642400, 4740229, 4748827, 4622053, 4634094, 4801527, 4674919, 4684047, 4860471, 4909330, 5069590, 5128795, 5169081, 5241580, 5341444, 5269784, 5265598, 5244856, 5220076, 5176817, 4926175, 4782510, 4720074, 4643942, 4589479, 4520309, 4384187, 4355685, 4201308, 4285000, 4245201, 4188377, 4213807, 4136085, 4136165, 4215141, 4345586, 4487817, 4571656, 4699512, 4891563, 5013242, 5348590, 5452271, 5682380, 5745414, 5848104, 5807984, 5795761, 5780590, 5681766, 5575996, 5351956, 5319790, 5143519, 5164628, 5066596, 4948609, 4928724, 4999089]
6896D999089J32665K0952J01958J29735K05608K70215K42346K00529K91114Q4671
6886F678882o7878j89575l10586m12225k82711m78108l95812k92593l06646k23957
6876C718791j84616r0255j97874M5034k05763K201q1049J22761n0519P3632J02845
6865C255188J11103Q9610J30366k9607m6162J9662l24217k58715j37665k52799
6855B556764j94028j53703j05465j07080k81675P0002j14455j01694l021o5727
6845A499918l1530j00733R2136l1590L274L6467j19751Q8899n85j82459N2799
6834A306845j13287j29940M5279o1450j32016q9758N2601o6559l0122j8822j75362
6823E87409O632P5459o2502j66628L7561J23120j58948O4607q7446O6752k7979
$$ y = [4999089, 5131754, 5152706, 5254664, 5384399, 5590007, 5860222, 6102568, 6303097, 6594211, 6678882, 6611004, 6421429, 6110843, 5698618, 5415907, 4937799, 4541987, 4249394, 3942748, 3718791, 3534175, 3443920, 3246046, 3291080, 3085317, 3087518, 3006469, 3129230, 3078711, 3152343, 3255188, 3366291, 3455901, 3586267, 3556660, 3510498, 3530160, 3205943, 2947228, 2809563, 2556764, 2362736, 2209033, 2103568, 1996488, 1714813, 1784815, 1670360, 1568666, 1565645, 1499918, 1468388, 1367655, 1459791, 1428201, 1431475, 1467942, 1348191, 1437090, 1436505, 1254046, 1306845, 1193558, 1063618, 1108897, 1047447, 915431, 825673, 878274, 811715, 781593, 762771, 587409, 594041, 669500, 606998, 440370, 477931, 601051, 442103, 506710, 419264, 486016, 458037]
6812D58037m7892K7157k2779k565N475j66253J66454j37454k4044Q9377n3849
6801B91664J8463j1895o5845N2681l3458m0182J9260k4494R0012k4174M373k1535
6789B54870K9642M8436j7612K4564k7830l3892P646O2230j23477Q8576q2315K5803
6777B56641M6119L5623N01N4156M1568j49364J77543l8057o8355R2896j3165r405
6765D26701L8593l9540P6459L5170N9414q2676K8196p3359M774n9546K9357n0267
6753C93276O0210P5453K6873P3907M7213k1120N0149P3642Q263J25770p5440n5312
6741G82884J38812N1869o9903R983Q5487J63531M2472R3064p3729R9527j050J19757
6729A442704j1733J32687l4929J34186J15432J21433n470J05293k5211J03449
$$ y = [458037, 410145, 437302, 414523, 411958, 417433, 251180, 417634, 280180, 256136, 345513, 291664, 310127, 298232, 232387, 285068, 251610, 211428, 230688, 206194, 296206, 272032, 276405, 254870, 284512, 332948, 315336, 339900, 312070, 278178, 285824, 348054, 224577, 313153, 230838, 256641, 302760, 338383, 338884, 393040, 434608, 285244, 462787, 424730, 356375, 449271, 436106, 426701, 465294, 425754, 502213, 537383, 596797, 514121, 542317, 468958, 473732, 414186, 443543, 393276, 453486, 528939, 555812, 629719, 676932, 655812, 705961, 779603, 787866, 913636, 838196, 782884, 921696, 973565, 903662, 913645, 999132, 1162663, 1205135, 1298199, 1224470, 1323997, 1322947, 1442704, 1430971, 1563658, 1528729, 1662915, 1778347, 1899780, 1894310, 1999603, 1974392, 2077841]
6719B077841J24126o185Q3766o9678K2838m392l6259m3240m1205J11534m3389
6708B175757J61863J70759j76933n4958R607j23296k7557p5257J8593k8413M7620
6697B097785Q6166o2244J06520q0533O4355n9768L4931O9937Q421J0567j27979
6686B148158M7623n3727M6099m2201J98515R8563N5668P3469M6338j84191p7157
6675B357157j45872j15347N2484l0701l6892k3909O9465j0973o0268k7973q886
6664B018285R915j08799R3223o5739p9060k3828p8643l4390O6113l6257R725N807
6652A776352o6536N0487j5300j02438l3082m5972q5096l7402j0034j1732j38573
6641A280674P0583m3321k51697O6258N9326l3535j53673P156N1995p819L622k4093
$$ y = [2077841, 2201967, 2195782, 2279548, 2209870, 2232708, 2228316, 2192057, 2148817, 2107612, 2219146, 2175757, 2337620, 2508379, 2331446, 2276488, 2286095, 2162799, 2135242, 2059985, 2078578, 2050165, 2097785, 2183951, 2121707, 2228227, 2147694, 2212049, 2152281, 2187212, 2257149, 2265570, 2276137, 2148158, 2195781, 2142054, 2188153, 2145952, 2344467, 2443030, 2498698, 2572167, 2618505, 2434314, 2357157, 2211285, 2095938, 2148422, 2117721, 2080829, 2056920, 2126385, 2115412, 2055144, 2027171, 2018285, 2028200, 1919401, 2012624, 1946885, 1867825, 1843997, 1765354, 1730964, 1797077, 1760820, 1770545, 1776352, 1709816, 1760303, 1745003, 1642565, 1609483, 1563511, 1478415, 1441013, 1430979, 1419247, 1280674, 1351257, 1307936, 1056239, 1122497, 1181823, 1148288, 994615, 1001771, 1053766, 1045947, 1049569, 1025476]
6629A025476j6453J543j00838J09199p0950Q4564K9467j08305N7830r3963j1114
6618I06456k9333P2646m633N8987R321j09005Q3454o1754J52289j13387q121O0772
6606A017692n5249J4586n6056Q795k2458j2422j5697l8762j02401k1728n9998
6595F56302j3979Q0777j19301M1309j19529L4595J7826j10366N7466l7432k5626
6584D62042m2896k2056J22870j4439P5924q1957o1231P4106O9280K5815j3770
6573E93688j07280L7553J15043k1148N720j6614J4180l87O4331r4628K6952P4758
6561F92168K1413o5831N637n6518N1987K8625k1417R8939j18507J81885q7856
6550G30525q5368R8682N201O8097q5454J29400q2425M1795J5614r5492M7549P8873
$$ y = [1025476, 1009023, 1010566, 909728, 1018927, 947977, 1032541, 1062008, 953703, 1011533, 917570, 906456, 877123, 949769, 945136, 1004123, 1013444, 904439, 987893, 926139, 1078428, 965041, 956920, 1017692, 962443, 977029, 920973, 929768, 907310, 894888, 879191, 840429, 738028, 716300, 656302, 642323, 723100, 603799, 645108, 525579, 560174, 578000, 467634, 525100, 487668, 462042, 419146, 397090, 519960, 505521, 581445, 499488, 438257, 512363, 581643, 607458, 593688, 486408, 523961, 639004, 617856, 623576, 606962, 621142, 620755, 685086, 590458, 617410, 692168, 713581, 647750, 653387, 596869, 648856, 677481, 656064, 755003, 636496, 818381, 730525, 645157, 743839, 749040, 817137, 731683, 861083, 778658, 820453, 836067, 740575, 788124, 866997]
6538H66997K146o3696j44196O4889n2307P0425l9440O8468j03149O3876j37777
6527E96236L1257J0609J5168m396K7116J5204R6753J1213m8351O0025o8091M5901
6515G88644J34839j23344N0328k6233K9968m139j0436J01040k34688L8989N6829
6504H01797M5466R5688j35266L8327j9625K1919l5992J38878j45229M9816j0091
6493H45688Q8487k007j4840J16221k4500j19219N0756j7883J8856k7444M1965
6482I56080P7545j15190m4093m4320N87N4755r0858M1786Q5848q9696L947N3880
6470H90271n6472L0504N9497J9411j6564K3958J28303m651J05381J5414m447N9100
6458A249705M6004r996R2811n249J49285J16552J72904K8419J83384K16926J09595
$$ y = [866997, 869143, 805447, 661251, 726140, 673833, 744258, 704818, 773286, 670137, 734013, 596236, 627493, 638102, 653270, 648874, 675990, 691194, 787947, 799160, 750809, 810834, 742743, 788644, 923483, 800139, 850467, 824234, 854202, 850063, 839627, 940667, 705979, 744968, 801797, 847263, 942951, 807685, 846012, 826387, 848306, 812314, 951192, 805963, 855779, 845688, 934175, 932168, 917328, 1033549, 1009049, 889830, 940586, 922703, 941559, 914115, 956080, 1033625, 918435, 874342, 830022, 830609, 885364, 794506, 836292, 922140, 832444, 836391, 890271, 833799, 864303, 923800, 943211, 926647, 950605, 1078908, 1074257, 1179638, 1195052, 1190605, 1249705, 1295709, 1285713, 1378524, 1373275, 1522560, 1639112, 1812016, 1840435, 2023819, 2240745, 2350340]
6447B350340K14434R7869j7606j1772k3593N2800L2298J90341J56605J96621L12141
6436C550478K11915L81866M03702M03487J41577K49889R4322j56806j25171n0331
6426E104928k43957j29011j04339n1460j08384k090j99712k778m9613N368k8349
6415D190603J24377K7760K80715J86344N75737k09083L80080M15094L60335L27025
6405F658987L39132J70374K73457J20354J79269J70940L10724K75134K34965L9195
6395H772531j77221j57488l97146l46467m03524l08444m40159k58348k34392o9257
6385E980085o6653l9000R8161J27135K3094J16177r9265L875j82202j0344r6621
6374E854442j07027m0879N3803J6375Q3594r6046n6105j92407k69245k22843k75591
$$ y = [2350340, 2564774, 2662643, 2645037, 2633265, 2609672, 2662472, 2694770, 2885111, 3041716, 3238337, 3550478, 3762393, 4144259, 4547961, 4951448, 5093025, 5342914, 5437236, 5280430, 5155259, 5104928, 4860971, 4731960, 4627621, 4576161, 4467777, 4465687, 4265975, 4263197, 4213584, 4218952, 4190603, 4314980, 4342740, 4623455, 4809799, 5385536, 5176453, 5556533, 5971627, 6331962, 6658987, 6998119, 7168493, 7441950, 7562304, 7741573, 7912513, 8223237, 8498371, 8733336, 8772531, 8595310, 8437822, 8040676, 7694209, 7290685, 6982241, 6542082, 6283734, 6049342, 5980085, 5913432, 5874432, 5972593, 6099728, 6122822, 6238999, 6139734, 6143609, 5961407, 5951063, 5854442, 5747415, 5706536, 5760339, 5776714, 5860308, 5764262, 5708157, 5515750, 5246505, 5023662, 4748071]
6363D748071k83578l08673k04601j53347j29784n3741j70989q7793m7022j18897
6353C189646J2064q9849m39Q11j40371K8176R698N7963L5845M8622J01209K8430
6341C281805P4009M5066M2514j36058O9364l1638J3208J6131L4368O2955q119
6330C463605P4916J10929L8997l1448Q5665k955P0635P3331O5013o6217J05985
6319C988456L9696j437J30898R3673m670J3348J38235K3354J15416J28582P7672
6308D743223J46299p0265K37827P8678k7365J62894R9561N0885Q4535J09981m7668
6297E568585J94651J61116J17438J13192K1500J83383J51018J81967J06768Q4424
6287F884042J41702N9536K79070J87283J47052K97680M9028J80061K57873K40661
$$ y = [4748071, 4464493, 4155820, 3951219, 3797872, 3668088, 3614347, 3443358, 3355565, 3308543, 3189646, 3201710, 3111861, 3111422, 3112233, 2971862, 3000038, 3009736, 3067699, 3103544, 3152166, 3253375, 3281805, 3355814, 3400880, 3443394, 3307336, 3376700, 3345062, 3358270, 3374401, 3408769, 3471724, 3463605, 3538521, 3649450, 3688447, 3656999, 3742664, 3739709, 3810344, 3883675, 3948688, 3882471, 3988456, 4028152, 4026715, 4157613, 4251286, 4246616, 4259964, 4398199, 4421553, 4536969, 4665551, 4743223, 4889522, 4819257, 5057084, 5135762, 5108397, 5271291, 5370852, 5421737, 5506272, 5616253, 5568585, 5763236, 5924352, 6041790, 6154982, 6176482, 6359865, 6510883, 6692850, 6799618, 6884042, 7025744, 7085280, 7364350, 7551633, 7698685, 7996365, 8045393, 8225454, 8483327, 8723988]
6277H723988L34182L22836L31232L76441L82090M07385L95566M91897M24483O07084
6267A2797184N69661N36590M94973O08636N34850O42762O97704Q50659J003383
6258A8736402J382105J548717K076779K580942L623720M643381N906461O419137
6250D6917644N169378P58293k203352l170147k593684j664924j70339R00990P94364
6241D4738223m47272j914188k486520k279569j629069j132668k65115J24293R74112
6232C5682227J577361K142377L250391M717371O075667P323689P040110L579034
6224G1388227O75131K82039N69701J06493o49799P303O16292J405283J114086
6215G5514756K262691K425669O34407m300954p056333p444510o536791n397217
$$ y = [8723988, 9058170, 9381006, 9712238, 10088679, 10470769, 10878154, 11273720, 11765617, 12190100, 12797184, 13366845, 13903435, 14398408, 15007044, 15541894, 16184656, 16882360, 17733019, 18736402, 20118507, 21667224, 23744003, 26324945, 29948665, 34592046, 40498507, 46917644, 52087022, 52845315, 50641963, 47471816, 44878132, 43213208, 43042869, 43943859, 44738223, 44290951, 42376763, 39890243, 37610674, 35981605, 34848937, 34583822, 34708115, 35682227, 37259588, 39401965, 42652356, 47369727, 53445394, 60769083, 67809193, 71388227, 72063358, 72345397, 72915098, 73021591, 72371792, 72379095, 72995387, 74400670, 75514756, 77777447, 80203116, 80837523, 76536569, 69480236, 62035726, 55498935, 50101718]
6207E0101718l998778k805415j795938r26099l42878L81116J406617K061300K990477
6198D7072120K977539K018237J64240n06095l07412R28856K158408L734592M444019
6189F2684504K666071j769002n332438o432717n960859n217127m261201l129152
6181C3248079k458617j961925j488121j277886r68148p53476o65860m51574l13864
6172B2908608l82461k85360j84748j37989j69340o6889p3493k04645r7607j06056
6162B1200020j31823l54351k15933j93556m24655k87193k85870k75502m68456
6153A8562681l33472l91756k72161l55775j95861j54674k44597q490J0453n9632
6143A6556716M4804R1902l3879N0471K0133P2621K7153J35903N0113J67814J15428
$$ y = [50101718, 46102940, 43297525, 41501587, 40575488, 40232610, 40613726, 42020343, 44081643, 47072120, 50049659, 52067896, 52232136, 51726041, 51418629, 52347485, 54505893, 58240485, 62684504, 65350575, 63581573, 58249135, 51816418, 45855559, 40638432, 36377231, 33248079, 30789462, 28827537, 27339416, 26061530, 25093382, 24339906, 23674046, 23222472, 22908608, 22526147, 22240787, 22056039, 21918050, 21748710, 21681821, 21608328, 21403683, 21306076, 21200020, 21068197, 20713846, 20497913, 20304357, 19879702, 19592509, 19306639, 19031137, 18562681, 18229209, 17837453, 17565292, 17209517, 17013656, 16858982, 16614385, 16605895, 16616348, 16556716, 16601520, 16693422, 16659543, 16710014, 16730147, 16802768, 16829921, 16965824, 17015937, 17183751, 17299179]
6132A7299179R1260N6881J77195L6144q5077K4667j5328J0519l5273M5819l3449
6121A7572537q990j94938q6497j26173j0964p9036q7699q5393m2167j78968l7729
6110A6633983q328m8835r918p144J41538j4904M6789j42563n5290j81328k24811
6099A6129189l10366j42426k81097k04110k75102p1145k00722q7327k02785k7723
6089A4326386O4180L8395k4649P2802N3015j7459o5354k47005k94125k30832l11830
6078A3363524k54614k11260j75433l40979M3124k82767p3597j32156o9407j48262
6068A1718173j87932k3171P697n956J99725J49554M1311L45992J44720O1452K39768
6057A2691333J50105K421j02329J04641k68802m9384q1699k78412j83912k18819
$$ y = [17299179, 17390439, 17447320, 17624515, 17660659, 17575582, 17600249, 17584921, 17595440, 17560167, 17605986, 17572537, 17563547, 17368609, 17282112, 17155939, 17144975, 17065939, 16978240, 16892847, 16850680, 16671712, 16633983, 16625655, 16576820, 16566902, 16559758, 16701296, 16686392, 16733181, 16590618, 16535328, 16354000, 16129189, 15818823, 15676397, 15395300, 15191190, 14916088, 14844943, 14644221, 14556894, 14354109, 14326386, 14390566, 14428961, 14404312, 14477114, 14530129, 14512670, 14447316, 14200311, 13906186, 13675354, 13363524, 13108910, 12897650, 12722217, 12381238, 12424362, 12141595, 12067998, 11935842, 11866435, 11718173, 11530241, 11507070, 11514767, 11508811, 11708536, 11858090, 11899401, 12245393, 12390113, 12451565, 12691333, 12841438, 12843859, 12741530, 12846171, 12577369, 12527985, 12446286, 12167874, 11983962, 11765143]
6047A1765143m8921j46119n1071M9588N4468J67347K92033M05417N94597L12000
6037A3394482K41491k7250m93528m20830n89667n00495m49078n61366m36643j67162
6027I989954k97373k89340j85735j52972p4052J15428r1660o4633R6260J58997
6017I204874J62713J60003M89157m6223L63849K06703j25477l81738o30473n50134
6007H853254m90758n17883l79347k35837k51544j32818j96146j00085j5730j40913
5997F392193o8462j85555j18442j10510k00495j43361j97900n7807k24071j17992
5987D967598m4095j05851j30912k0772j92073l468r8378l8746K7128j99310j448
5976D159673R9311j80337R6074L0303N087j94234M9539J12227M2040n1375N9700
$$ y = [11765143, 11716222, 11570103, 11519032, 11568620, 11623088, 11790435, 12082468, 12487885, 13082482, 13394482, 13635973, 13608723, 13115195, 12694365, 12104698, 11604203, 11155125, 10593759, 10157116, 9989954, 9692581, 9403241, 9217506, 9064534, 8990482, 9105910, 9014250, 8949617, 9045877, 9204874, 9367587, 9527590, 10016747, 9970524, 10334373, 10541076, 10415599, 10033861, 9403388, 8853254, 8362496, 7844613, 7465266, 7229429, 6977885, 6845067, 6648921, 6548836, 6533106, 6392193, 6323731, 6138176, 6019734, 5909224, 5708729, 5565368, 5367468, 5309661, 5085590, 4967598, 4923503, 4817652, 4686740, 4665968, 4473895, 4470427, 4372049, 4333303, 4360431, 4161121, 4159673, 4258984, 4078647, 4174721, 4205024, 4210111, 4015877, 4065416, 4177643, 4219683, 4168308, 4228008]
5965D228008J84844P1608J29646J78255M7485O2548J36057K01770J45003L07009
5955E692233K56403M18276M35173L44289J56158J23231n3633o748j24485L35549
5945G576446J99237L32529N35421O97397P23974Q91229J112346J577838K069142
5936A5715559K392895L032320K832533J529034n72048j998765k387986k604023
5928A7939519k242397j705601j238340r88376o40647n32110m39293k00656j24461
5919I827638j87833j85616j57492k80431k18762j37235j42125k20472q8995K544
5909H211221k46788J4431p761p8859O6813m275J24285K15078R1564L39093L76764
5898I101566L31390L53561M61914O34604P32195N03019O91339O20420J09554J05947
$$ y = [4228008, 4412852, 4484460, 4614106, 4792361, 4839846, 4902394, 5038451, 5240221, 5385224, 5692233, 5948636, 6366912, 6802085, 7146374, 7302532, 7425763, 7372130, 7365382, 7240897, 7576446, 7775683, 8108212, 8643633, 9341030, 10065004, 10956233, 12068579, 13646417, 15715559, 18108454, 21140774, 23973307, 25502341, 24930293, 22931528, 20543542, 17939519, 15697122, 13991521, 12753181, 11764805, 11124158, 10592048, 10152755, 9952099, 9827638, 9639805, 9454189, 9296697, 9016266, 8797504, 8660269, 8518144, 8297672, 8208677, 8211221, 7964433, 7978864, 7971103, 7892244, 7959057, 7954782, 8079067, 8294145, 8385709, 8724802, 9101566, 9432956, 9786517, 10248431, 10883035, 11615230, 12118249, 12809588, 13430008, 13539562, 13645509]
5888A3645509K5488n5906L6689l5551O760l704q0913o0083J04105J67188L51148
5877A4100730N92974P93601R83522J149122J166207P62916O6543k82646n58164
5868A8774805m10780k69865j45553m6752L42941J6354q941k20357k74924k63516
5858A7493412j61063m35773l37436k58612k79822l89457k56446k40959k46477
5849A4887367k66476j57659k12319p2394R5583O3483K7911K26711K44082J00568
5839A4936857K86085K67531L82712M63435L08963M65898L66876L37244M10904
5830A8226505L32638L40362J73408K53552J62782N12099N89918O18828Q12462
5821B2022554Q97488J374727J180737J548034J704507K273293K990617L878732
$$ y = [13645509, 13670997, 13615091, 13651780, 13616229, 13622989, 13619285, 13538372, 13478289, 13582394, 13749582, 14100730, 14693704, 15487305, 16470827, 17619949, 18786156, 19549072, 19615615, 19332969, 18774805, 18364025, 18094160, 17948607, 17901855, 18244796, 18261150, 18252209, 18031852, 17756928, 17493412, 17332349, 16896576, 16559140, 16300528, 16020706, 15631249, 15374803, 15133844, 14887367, 14620891, 14463232, 14250913, 14178519, 14274102, 14337585, 14365496, 14592207, 14836289, 14936857, 15222942, 15490473, 15873185, 16336620, 16645583, 17111481, 17478357, 17815601, 18226505, 18559143, 18899505, 19072913, 19326465, 19489247, 20001346, 20591264, 21210092, 22022554, 22920042, 24294769, 25475506, 27023540, 28728047, 31001340, 33991957, 37870689]
5813C7870689N317482O798479P219665N571073Q43292k708812l916438l276287
5805E3719143k269455n89824O95191J353280K58248j157314j709356j502636p87189
5796D8010088J74598J275608K425916L443232M187818L766938N242831O441319
5788G4968348N928636K447170p14140j505666m83503J336883L009619L484929
5780H8472276L030805N16173k956753l678348k782431q73395N01347r7591l270199
5771G8861884n486208n782569n237382m287518l154135k137475j461945q59397
5763E0455255j27010P68410J322722J834590J105949n3203j003943j023763J55722
5754E3434729J276797K771484L685316K358427j785356m691061n787685n261572
$$ y = [37870689, 43188171, 49986650, 57206315, 62777388, 63620680, 60911868, 56995430, 53719143, 51449688, 50859864, 51555055, 52908335, 53166583, 52009269, 50299913, 48797277, 48010088, 48184686, 49460294, 51886210, 55329442, 59517260, 63284198, 68527029, 74968348, 80896984, 83344154, 82630014, 81124348, 80640845, 81977728, 84987347, 88472276, 91503081, 92019254, 89062501, 85384153, 82601722, 81728327, 82229674, 82132083, 78861884, 73375676, 67593107, 62355725, 58068207, 54914072, 52776597, 51314652, 50455255, 50328245, 51096655, 52419377, 54253967, 55359916, 55306713, 54302770, 53279007, 53434729, 54711526, 57483010, 61168326, 63526753, 61741397, 57050336, 51262651, 46001079]
5746D6001079m760341l887990k631797k157481j567704j425423j347655j047354
5738B7175334q48886p34068o45771m89801n16990m06460k44321k44157k55390
5729B2789490j3569l10242p2654j40466j04078k88923k33067j33791k18618k12129
5719B1061953M8185J9164J6928r7237O3531J75814J29139M46308M81424M83137
5709B2828346N40470M61580M06709M76968O96415R38629J199871J448476J567944
5700C0565408J728773J723969J485558J596046J809800J874587K327450K477336
5692D5588927L285051L843779M782224O271625P231841Q342238J0406149J2725795
5684A02477629J5279198K0330613K9635627M1628695N6107048O6429629N7652506
$$ y = [46001079, 41240738, 37352748, 34720951, 32563470, 30995766, 29570343, 28222688, 27175334, 26326448, 25592380, 24946609, 24456808, 23939818, 23533358, 23289037, 23044880, 22789490, 22775921, 22465679, 22393025, 22252559, 22148481, 21859558, 21626491, 21492700, 21274082, 21061953, 21110138, 21129302, 21146230, 21048993, 21112524, 21288338, 21417477, 21863785, 22345209, 22828346, 23368816, 23830396, 24237105, 24714073, 25410488, 26349117, 27548988, 28997464, 30565408, 32294181, 34018150, 35503708, 37099754, 38909554, 40784141, 43111591, 45588927, 48873978, 52717757, 57499981, 63771606, 71003447, 79345685, 89751834, 102477629, 117756827, 138087440, 167723067, 209351762, 265458810, 331888439, 389540945]
5677C89540945q981286m4621935n7944100n0121218m4117139l3321856k3138023
5670A27295388j7052062j3187164j0387262q598235o880030n548344m689334m136092
5662E6816865l753992l331707k945903k725279k270769k016327j622990j470012
5654C6679886j298652p90698j049223j073575j228591j398455j337591j167391
5646B7335710r93564r55567q47390n10361p07680n67640n89878o54724n37553
5637B0971353m71833m30590l98443l04346m45160l80208k00345l35206k60017
5628A7745205k24415j80504k06923j22228k32031j74261j16655j48739J4269j88880
5618A6164838n4990J40218q143n5357L8377J3540J36937J97801J43909K61996
$$ y = [389540945, 380559659, 335937724, 277993624, 227872406, 183755267, 150433411, 127295388, 110243326, 97056162, 86668900, 78070665, 71190635, 65642291, 60952957, 56816865, 53062873, 49731166, 46785263, 44059984, 41789215, 39772888, 38149898, 36679886, 35381234, 34590536, 33541313, 32467738, 31239147, 29840692, 28503101, 27335710, 26342146, 25386579, 24539189, 24028828, 23321148, 22753508, 22163630, 21508906, 20971353, 20499520, 20068930, 19670487, 19366141, 18920981, 18540773, 18340428, 18005222, 17745205, 17520790, 17340286, 17133363, 17011135, 16779104, 16604843, 16488188, 16339449, 16353718, 16164838, 16109848, 16250066, 16241923, 16186566, 16224943, 16238483, 16375420, 16573221, 16717130, 16979126]
5608A6979126K51814O13647N32046Q27892R12198R27474J110727J540121J897033
5599B5592078J809380M77158j166942k070362k188221j909743j743740j363731
5591A7435877j026222q87433o28713n19806n12925k65545l26658j10991l15308
5582A2842276k05435k57243k88034k21846k34193r9382j37938o6858l24437q8804
5572A0918106j61822k57121N6842m4911r4993j55375q4636n8599L0386m8860k2225
5561A0076792r0854p579j21358p6826j53509O7912q8311M3306N8947p9795J13949
5550I742674j01506J58341J49052L0228J47968K28638N8871K02981J86813K27851
5540A1031911J33108Q9022M0717J68769K08617K86977M31970K94083L72060M07088
$$ y = [16979126, 17230940, 17844587, 18376633, 19204525, 20116723, 21044197, 22154924, 23695045, 25592078, 27401458, 27878616, 26711674, 24641312, 22453091, 20543348, 18799608, 17435877, 16409655, 15522222, 14893509, 14373703, 13860778, 13595233, 13268575, 13157584, 12842276, 12636841, 12379598, 12091564, 11869718, 11635525, 11536143, 11398205, 11331347, 11006910, 10918106, 10756284, 10499163, 10556005, 10511094, 10416101, 10260726, 10176090, 10117491, 10147877, 10099017, 10076792, 9985938, 9978359, 9857001, 9780175, 9626666, 9694578, 9606267, 9649573, 9708520, 9628725, 9742674, 9641168, 9799509, 9948561, 9978789, 10126757, 10355395, 10414266, 10617247, 10804060, 11031911, 11165019, 11254041, 11294758, 11463527, 11672144, 11959121, 12391091, 12685174, 13057234, 13464322]
5530A3464322M38121N42573P07272J082053J283679J486465Q42094K51264J00525
5521B0198368o7440o89358p94878p93954n59055k97447o0633M46201M37351P44308
5511A8563463N78129J91410l27288n91734p29537n09074n01056l04673m36408
5502A5933232q0760j41798N2780k7473K03988K45166K43110L29114L93165N61436
5492A7711960O01529P86553R10333J181647J397067J729826K013211K453048K944782
5483C1729956K895812K223156P23503p07630j310912j365999r25167k67946L84098
5474C3378871J010257J643118K405398L031927M091047N904060Q215311J0518509
5466G0198498J2714493J1306431L293250n868722r835087j0252961q862291p151850
$$ y = [13464322, 13902443, 14445016, 15152288, 16234341, 17518020, 19004485, 19846579, 20097843, 20198368, 20130928, 19441570, 18646692, 17852738, 17293683, 16996236, 16935603, 17381804, 17819155, 18563463, 19141592, 19333002, 19005714, 18413980, 17684443, 17175369, 16674313, 16369640, 15933232, 15852472, 15710674, 15763454, 15735981, 15939969, 16185135, 16428245, 16757359, 17150524, 17711960, 18313489, 19100042, 20010375, 21192022, 22589089, 24318915, 26332126, 28785174, 31729956, 34625768, 36848924, 37572427, 36864797, 35553885, 34187886, 33262719, 32994773, 33378871, 34389128, 36032246, 38437644, 41469571, 45560618, 51464678, 59679989, 70198498, 82912991, 94219422, 97512672, 91643950, 81808863, 71555902, 62693611, 55541761]
5458E5541761m807264k443520j284294m5194J55507o16331k006341l332673l587769
5449C7573882l490255k931627k628239j961395j652964j430130j102773r04149
5441B1472350q40459o49701m94704m68398m95934n55025m10591k35960k53078
5432A7068500q3414K61165K9991K54611N41820N13835O97031L64394j4787p21166
5422A8911980j015588j002561q37471r35815p47299l55172m80449m63891k68133
5413A2805601l53434k80714j27973j89943j6379j48705M418M732l0708R7551J98938
5402A1963384J47641K32470k65967k46410m28284l08122k44987l99191r0850j54736
5392A0204948o2687L0326j24770p0405k6432n6393l5169J3930J49831m6113R3847
$$ y = [55541761, 50734497, 48290977, 47006683, 46961489, 47116996, 46500665, 44494324, 41161651, 37573882, 34083627, 31152000, 28523761, 26562366, 24909402, 23479272, 22376499, 21472350, 20631891, 19982190, 19487486, 19019088, 18523154, 17968129, 17557538, 17321578, 17068500, 16985086, 17246251, 17276242, 17530853, 18072673, 18586508, 19283539, 19647933, 19633146, 18911980, 17896392, 16893831, 16056360, 15120545, 14373246, 14018074, 13537625, 13073734, 12805601, 12452167, 12171453, 12043480, 11853537, 11837158, 11688453, 11692871, 11697603, 11666895, 11764446, 11963384, 12111025, 12343495, 12077528, 11831118, 11402834, 11094712, 10849725, 10450534, 10359684, 10204948, 10142261, 10172587, 10047817, 9977412, 9950980, 9894587, 9859418, 9873348, 10023179, 9977066, 10070913]
5381A0070913J11841l1658n0528k19368P0890K0491o3345p8057q3917R4058j354
5370I839966Q871m8180l1532K3432L6471M391J1885k5159J66740K6991L9035K6902
5358A0079813p082J12771l7544O8297K4941R9048m4183K5358R0033k3633P1447
5347A0459266m7454k3382J00826R9686O4599K6020K3804k691R7092l6420J13230
5336A0874576J3558j3719K56731p8765K04661p5232K15744k6400N5143K06451
5326A1632748L1872m2081N4870K185O0843p627P3560k1691N2156r1845P1202q232
5314A1807960K292L9790j39817L9755J25744r5146L7708L8387r3365J10366r4272
5303A1779402k2850M1248r0324O7212m598J1303q2365L8143L815L6611p6020P5478
$$ y = [10070913, 10182754, 10151096, 10100568, 9881200, 9952090, 9972581, 9909236, 9831179, 9747262, 9841320, 9839966, 9848837, 9800657, 9769125, 9792557, 9829028, 9833419, 9845304, 9820145, 9986885, 10013876, 10052911, 10079813, 10072731, 10185502, 10147958, 10216255, 10241196, 10340244, 10296061, 10321419, 10411452, 10387819, 10459266, 10411812, 10388430, 10489256, 10588942, 10653541, 10679561, 10703365, 10700674, 10797766, 10761346, 10874576, 10888134, 10874415, 11131146, 11052381, 11257042, 11181810, 11397554, 11371154, 11426297, 11632748, 11664620, 11622539, 11677409, 11679594, 11740437, 11732810, 11806370, 11784679, 11836835, 11744990, 11816192, 11807960, 11810252, 11850042, 11710225, 11749980, 11875724, 11780578, 11818286, 11856673, 11763308, 11873674, 11779402, 11756552, 11797800, 11707476, 11774688, 11770090, 11781393, 11699028, 11737171, 11740986, 11777597, 11701577, 11777055]
5291A1777055j22270P6684M193j32554J6959n9186O0930m6385q680r891j02324
5280A1454531Q5828j27843j5430k9201N8932J5978K7488j79307R6531j25620q292
5269A1253595K9358j45651O1844q1971J2859j27084N9954j61352N4662l9762O8044
5258A0984496q7211M7882p2839k955L0993p7137m0627L7222P8989j7868Q989Q823
5246A0898757n5290n1737M3175J47249l5500j08228Q9663J08230j01000R1975
5236A1027294o9839J01793M6028l629j23840N5285R1954l1067l0613M6898r8132
5225A1012132J55651k6536o9284Q1408M2594L10o0603J15277J8904l5584R4547
5214A1328816J12170r9504P7737K5529m2138N6398o1780O9289J0367J2281n0705
$$ y = [11777055, 11654785, 11731469, 11735662, 11603108, 11620067, 11560881, 11621811, 11575426, 11566746, 11556855, 11454531, 11540359, 11412516, 11397086, 11367885, 11426817, 11442795, 11470283, 11290976, 11387507, 11261887, 11253595, 11282953, 11137302, 11199146, 11117175, 11130034, 11002950, 11062904, 10901552, 10956214, 10916452, 10984496, 10897285, 10945167, 10872328, 10869373, 10900366, 10823229, 10782602, 10819824, 10898813, 10880945, 10889934, 10898757, 10843467, 10791730, 10834905, 10982154, 10946654, 10838426, 10928089, 11036319, 10935319, 11027294, 10957455, 11059248, 11105276, 11101647, 10977807, 11033092, 11125046, 11093979, 11063366, 11110264, 11012132, 11167783, 11141247, 11071963, 11153371, 11195965, 11196275, 11135672, 11250949, 11269853, 11234269, 11328816, 11440986, 11341482, 11419219, 11444748, 11402610, 11459008, 11397228, 11466517, 11476884, 11489165, 11438460]
5203A1438460r519P1400N7717K9315k2407P8872n2705Q5893j41390p6110r1404
5192A1368122o1339j19037j0730j7004o6479j00310O5682j57121M5162k2476o1449
5181A0863021p202m4411j05259K217j0755j09259k7303m8296M826j20955l1241
5170A0365383n2917j7421o948m817o0147k09218O9928j99884P3367l0113n2838
5159I874375O367j00175r1235M2656n4610j35169m2517k7713r5209k54385j37530
5148H984855n4084j80615j28232l8067j09082j22444p9812k07623k8802j32864
5138G903230k0853j42801k3623j17138q4060m3127j71977L0302j55459J00934
5128G275428j16272r3229K2130j78363k3633j593r1824q2909j81407q507r3913
$$ y = [11438460, 11428941, 11500341, 11558058, 11587373, 11564966, 11643838, 11591133, 11677026, 11535636, 11459526, 11368122, 11306783, 11187746, 11177016, 11160012, 11093533, 10993223, 11058905, 10901784, 10946946, 10924470, 10863021, 10855819, 10811408, 10706149, 10708366, 10697611, 10588352, 10561049, 10512753, 10517579, 10396624, 10365383, 10312466, 10295045, 10288097, 10283280, 10223133, 10013915, 10083843, 9883959, 9957326, 9927213, 9874375, 9880742, 9780567, 9689332, 9731988, 9677378, 9542209, 9499692, 9471979, 9376770, 9122385, 8984855, 8930771, 8750156, 8621924, 8583857, 8474775, 8352331, 8272519, 8064896, 8036094, 7903230, 7882377, 7739576, 7715953, 7598815, 7514755, 7471628, 7299651, 7329953, 7174494, 7275428, 7159156, 7065927, 7088057, 6909694, 6886061, 6884468, 6792644, 6709735, 6528328, 6519821, 6425908]
5117F425908j3195j10955j27020q8291m2405r8422r0968j03293j04945n3923N3129
5106E645620j64188j52752J16248j28912j06948L0718r4738j06570J73097j71249
5096E040326j3151j70910J3922n2738q2015k4944Q2785k0789K6316j89351p7377
5085D532074J21431j21027M699M8512k0170K0918j14231R591o4515L5757O4466
5074D517505Q9407j45969J64794n8074l5287j35488K3637j02265o8458N3258p1906
5063D231154K8051l9290J48246L5596q915o8269J59115j09153M7124k663J34620
5052D555616j600J6634R9081J1710L7157P1396r409l0412J51267p5608Q8687J11501
5040E026020j94736R3937k1682l56p2688n694k9678K3554q6043J37384l4794j283
$$ y = [6425908, 6412713, 6301758, 6174738, 6086447, 6044042, 5945620, 5854652, 5751359, 5646414, 5592491, 5645620, 5481432, 5328680, 5444928, 5316016, 5209068, 5239786, 5145048, 5038478, 5211575, 5040326, 5027175, 4856265, 4870187, 4817449, 4735434, 4710490, 4793275, 4772486, 4798802, 4609451, 4532074, 4653505, 4532478, 4537177, 4585689, 4565519, 4586437, 4472206, 4481797, 4417282, 4453039, 4517505, 4606912, 4460943, 4625737, 4567663, 4532376, 4396888, 4420525, 4318260, 4249802, 4303060, 4231154, 4259205, 4219915, 4368161, 4403757, 4394842, 4326573, 4485688, 4376535, 4423659, 4420996, 4555616, 4554016, 4570650, 4669731, 4681441, 4718598, 4789994, 4780585, 4750173, 4901440, 4825832, 4914519, 5026020, 4831284, 4925221, 4903539, 4903183, 4830495, 4824801, 4795123, 4818677, 4732634, 4870018, 4835224, 4833941]
5028D833941r2404J52610P5968k4432n7815N9768J83222m2837M9263J24094J7514
5017E278892N6629J76925N8023k2965J50932J12971O8060P9104J07212J97397
5007F263180Q0121J37025J43878J05211N7621K59473J2176J95175O0528J0R0876
4996G405274Q8369J36787L2650J51390n3290J42827L620j7733n3157O9238J2244
4985G918219P5083r6200P1704k0211n9351K3718q789k6877j9428o0759J20897
4974G918006k13029K11916J2051R3223m933R4017J5578J16299J99467M7243P8980
4963H568818O1421K82414N9699K69953O0883L27576O1269K94194J38656K93436
4953A0418319K06221K71449K98582K75121K35383L78012L81820M36250L78955
$$ y = [4833941, 4741537, 4894147, 4970115, 4945683, 4887868, 4947636, 5130858, 5088021, 5137284, 5261378, 5278892, 5335521, 5512446, 5570469, 5547504, 5698436, 5811407, 5879467, 5958571, 6065783, 6263180, 6343301, 6480326, 6624204, 6729415, 6787036, 7046509, 7058685, 7253860, 7314388, 7314398, 7405274, 7493643, 7630430, 7663080, 7814470, 7761180, 7904007, 7907627, 7889894, 7836737, 7905975, 7918219, 7993302, 7897102, 7968806, 7948595, 7889244, 7912962, 7904173, 7877296, 7857868, 7797109, 7918006, 7704977, 7916893, 7928944, 8022167, 8017234, 8111251, 8126829, 8243128, 8442595, 8489838, 8568818, 8630239, 8912653, 8972352, 9242305, 9303188, 9630764, 9692033, 9986227, 10124883, 10418319, 10624540, 10895989, 11194571, 11469692, 11705075, 12083087, 12464907, 12901157, 13280112]
4944A3280112N02167O58161N70754N11585N04082K58580L89886K71066J93653
4935A7140046K90075L82203L49931O33737O66802Q54905Q84143P88819M51040
4926B2441701J34313j96681l81756m66204n45393m14697n21144k78510j27705
4917A9643924M0947J19058K13006L82068R1746K34834J03041j34163o312r0809
4907B0597340N7856K75336L70744P09889P69814R39427J054007Q35723P94156
4898B6404292N42383M31843K87060N29928K27894O73041P72482J022865J207089
4889C2098877J380447J343882R18641M70805k35064o56578j091833j196636j076475
4880C1956066r55411n50172m23193m6191L0317J62162j54046l46219o27775r16812
$$ y = [13280112, 13782279, 14440440, 15011194, 15522779, 16026861, 16285441, 16675327, 16946393, 17140046, 17430121, 17812324, 18162255, 18795992, 19462794, 20317699, 21201842, 21990661, 22441701, 22576014, 22379333, 21997577, 21531373, 20985980, 20571283, 20050139, 19771629, 19643924, 19684871, 19803929, 20016935, 20399003, 20490749, 20725583, 20828624, 20694461, 20688149, 20597340, 20655196, 20930532, 21301276, 22011165, 22780979, 23720406, 24774413, 25610136, 26404292, 26946675, 27378518, 27665578, 28195506, 28423400, 29096441, 29868923, 30891788, 32098877, 33479324, 34823206, 35741847, 36212652, 35977588, 35321010, 34229177, 33032541, 31956066, 31000655, 30450483, 30027290, 29981099, 30011416, 30173578, 30019532, 29673313, 29045538, 28128726]
4870B8128726j098930j292687j066223q65810n89950n17875k98419M0573N7784
4861B2497189K18346K38173K68595L127k37906j16311j02309N9747Q1919L06129
4851B3216699L77698O02567P98122P13900O14811L12325O1576k68360m77534m17009
4841B5534795m11778m45463l12449l29013l72035k24053l01546l02724l56522
4832B2479212p21460o30144q98140p52909p43554p12370o22428n49293n32637
4823A6316277l54743m00839m32031k72830l60414k70956k98389k51638k05914
4814A3468523j79153j56699p8097k35730p5530j1372j44624o2142j9599n8322
4804A2447255J59656n6695L6049J56242P9020J8974J87040P7969J91780J07992
$$ y = [28128726, 27029796, 25737109, 24670886, 23805076, 23215126, 22697251, 22398832, 22439405, 22497189, 22715535, 22953708, 23222303, 23225430, 22987524, 22871213, 22768904, 22828651, 22910570, 23216699, 23594397, 24196964, 24995086, 25708986, 26323797, 26636122, 26697698, 26429338, 25951804, 25534795, 25123017, 24677554, 24365105, 24036092, 23664057, 23440004, 23138458, 22835734, 22479212, 21757752, 21127608, 20229468, 19476559, 18733005, 18020635, 17398207, 16848914, 16316277, 15961534, 15560695, 15128664, 14855834, 14495420, 14224464, 13926075, 13674437, 13468523, 13289370, 13132671, 13054574, 12818844, 12743314, 12731942, 12587318, 12525176, 12505577, 12447255, 12606911, 12550216, 12586265, 12742507, 12821527, 12840501, 13027541, 13105510, 13297290, 13405282]
4794A3405282K51768K77731J45347K08439J90497K43450K15664K41347L67636
4785A5547161J00832M53443K00376K92638J66511L50004K59963K52808L23136
4776A7946872J82637K82138K42238K76234K09981L37336J83528L37512K18466
4767B0216942L25277L30671L25359K10131N14763M17997L68751L82051M63180
4758B3555122M05018M27816M64384N13375N26424M63302M59718M46012N41634
4749B7802805L84029M52161N25925N81433M00408M38259N33747M11567M51411
4740C1981745L86549N57937M46055L78412M26714N34076M21830N11542M20159
4731C6065019M78261N50029M31450M59196O25621M28631O14263N11442N82323
$$ y = [13405282, 13657050, 13934781, 14080128, 14288567, 14479064, 14722514, 14938178, 15179525, 15547161, 15647993, 16101436, 16301812, 16594450, 16760961, 17110965, 17370928, 17623736, 17946872, 18129509, 18411647, 18653885, 18930119, 19140100, 19477436, 19660964, 19998476, 20216942, 20542219, 20872890, 21198249, 21408380, 21923143, 22341140, 22709891, 23091942, 23555122, 23960140, 24387956, 24852340, 25365715, 25892139, 26355441, 26815159, 27261171, 27802805, 28186834, 28638995, 29164920, 29746353, 30146761, 30585020, 31118767, 31530334, 31981745, 32368294, 32926231, 33372286, 33750698, 34177412, 34711488, 35133318, 35644860, 36065019, 36543280, 37093309, 37524759, 37983955, 38609576, 39038207, 39652470, 40163912, 40746235]
4722D0746235N66991O81306N40322O91392Q65483N75701P68019P82024N97491
4713D6814964P54366O99677O68919O64801Q80078O07658P04387P32560P73042
4704E3300452O73732P98783Q18799R03599Q90352R44635P99881Q13993P37115
4695F0681341Q35999P79424P47270P85214R13554Q80871J099699J083596J259877
4686F9066845J507788J364604J564808J637735J663075J730034J704142J671668
4678H1910699J579907J549757J714599J716059J876638K094548K335811K516124
4670I7294142K636164K780984K761983K677481K569423K057108K033166J592424
4662A16402875J294823R22236O74617M34710M86157K48477M31086Q3619O8934
$$ y = [40746235, 41313226, 41994532, 42534854, 43226246, 44091729, 44667430, 45435449, 46217473, 46814964, 47569330, 48269007, 48937926, 49602727, 50482805, 51090463, 51794850, 52527410, 53300452, 53974184, 54772967, 55591766, 56495365, 57385717, 58330352, 59130233, 59944226, 60681341, 61517340, 62296764, 63044034, 63829248, 64742802, 65623673, 66723372, 67806968, 69066845, 70574633, 71939237, 73504045, 75141780, 76804855, 78534889, 80239031, 81910699, 83490606, 85040363, 86754962, 88471021, 90347659, 92442207, 94778018, 97294142, 99930306, 102711290, 105473273, 108150754, 110720177, 112777285, 114810451, 116402875, 117697698, 118619934, 119294551, 119729261, 120215418, 120463895, 120894981, 120978600, 121047534]
4653A21047534o5287k69073l49849n04082q34177r36258j192737j281649j323462
4644A14290960j586223j546244j612965j349507j135503n84978k07297M48687
4636A06716930Q42895J551873J917064K112649K187671K196720K136525K269427
4628A21931754K286860K507229K622579K481079K375798J924913J389872J050379
4620A38570463K15365n15299j025485j810344k070008k187482k454232k362082
4612A26360896k043158k012684k001619j777219j798888j747691j604364j745657
4604A11629616j890606k104284k323776k442466k445601k493358k553123k428910
4596I2947492k422854k122329k016808j787328j523393j395501j161467j240779
$$ y = [121047534, 120982247, 120713174, 120363325, 119859243, 119025066, 118088808, 116896071, 115614422, 114290960, 112704737, 111158493, 109545528, 108196021, 107060518, 106475540, 106268243, 106716930, 107559825, 109111698, 111028762, 113141411, 115329082, 117525802, 119662327, 121931754, 124218614, 126725843, 129348422, 131829501, 134205299, 136130212, 137520084, 138570463, 138785828, 138270529, 137245044, 135434700, 133364692, 131177210, 128722978, 126360896, 124317738, 122305054, 120303435, 118526216, 116727328, 114979637, 113375273, 111629616, 109739010, 107634726, 105310950, 102868484, 100422883, 97929525, 95376402, 92947492, 90524638, 88402309, 86385501, 84598173, 83074780, 81679279, 80517812, 79277033]
4588G9277033j160152j167950j046389j245532j101793j030484r84582q41940
4580G0698211q38986o75297n28483m38659n28972l30249l68714k26162k93988
4571F6468701k46645j47010P497N3312P4094P6681l9186o6903l50611n19890m22547
4560F4887493o69812n72979o81748m52273o45779o01593o46227n27361o75583
4551E9414138n28097n21196n87525m57178m87845m96344l60442l85674l16622
4542E5273215l74454m91474m75324o11545m14070o96433m88282o35888o41520
4533E0444225p28767p41997p61695p68237q73498q46117p12526q43945p84969
4524D3382474n56893n79011o50610o38728n38237o12424m92631m75869m28064
$$ y = [79277033, 78116881, 76948931, 75902542, 74657010, 73555217, 72524733, 71540151, 70698211, 69859225, 69183928, 68655445, 68216786, 67687814, 67357565, 66988851, 66762689, 66468701, 66222056, 66075046, 66082543, 66135855, 66209949, 66286630, 66247444, 66180541, 65829930, 65310040, 64887493, 64217681, 63644702, 62962954, 62510681, 61864902, 61263309, 60617082, 60089721, 59414138, 58886041, 58364845, 57777320, 57320142, 56832297, 56335953, 55975511, 55589837, 55273215, 54898761, 54407287, 53931963, 53320418, 52906348, 52209915, 51721633, 51085745, 50444225, 49715458, 48973461, 48211766, 47443529, 46570031, 45723914, 45011388, 44167443, 43382474, 42825581, 42246570, 41595960, 40957232, 40418995, 39806571, 39313940, 38838071, 38410007]
4515C8410007o21383o31950n33832o53684n63826q04713o58395o80370o55851
4506C2606003p67363p49722n68113o68397m23715n88656l87187k59981l76758
4497B7816111l05331l64412n36463n23865m53644m08186n82788m62497n45750
4488B3633175n20891l35399m15615l59163l91820l07126l46178k92336k73735
4479B0390912l66648k67041j74299k90114k87194k09456j31654q2892l05647L683
4469A8279650k84403q7750j89309k9799j03546K9395o1230r4844j29302j8213
4459A7310649Q138p1615l8989p5034k0324K0192J36878o4902p0860P645j8814
4448A7122964j15164N2746o5660j23233j3725l2676l2276o213j32852Q358Q0030
$$ y = [38410007, 37788624, 37156674, 36622842, 35969158, 35405332, 34600619, 33942224, 33261854, 32606003, 31838640, 31088918, 30520805, 29852408, 29428693, 28840037, 28452850, 28192869, 27816111, 27510780, 27146368, 26609905, 26086040, 25632396, 25224210, 24641422, 24178925, 23633175, 23112284, 22776885, 22361270, 22002107, 21610287, 21303161, 20956983, 20664647, 20390912, 20024264, 19757223, 19582924, 19292810, 19005616, 18796160, 18664506, 18581614, 18275967, 18279650, 17995247, 17907497, 17718188, 17688389, 17584843, 17614238, 17553008, 17458164, 17328862, 17310649, 17318787, 17247172, 17208183, 17133149, 17112825, 17133017, 17269895, 17204993, 17134133, 17141778, 17122964, 17007800, 17060546, 16994886, 16871653, 16857928, 16825252, 16792976, 16786763, 16653911, 16662269, 16742299]
4437A6742299K7664N2943L986j2651k71139j8026j53034J11465j42375j337N1449
4426A6391244J14325K5381R9668K10204K32526K9989M46185K45408L88939J47198
4416A8331067J88818K20930R0418Q7852K12486L41591L38869P23603P19034N06883
4406B1761551j09499m95902o88262m65594m62024k42472k47426O0818r7334m5345
4396A8968511J37212J94817J66484K68090K48859K44213L57041J15222K23013
4387B0923462o0873j21865k67096j06223l18015l2937q1403J6248m7193j12658
4377A9791447j80039M3051k05971J2129L5029o467O7552j6892J51612P4916K26820
4366A9993187K22951J95966K76183P3908M14280K53892K24696J75880J17710Q7437
$$ y = [16742299, 16769963, 16822906, 16826892, 16814241, 16543102, 16525076, 16372042, 16483507, 16341132, 16339795, 16391244, 16505569, 16530950, 16630618, 16840822, 17073348, 17103337, 17549522, 17794930, 18183869, 18331067, 18519885, 18740815, 18831233, 18919085, 19131571, 19473162, 19812031, 20535634, 21254668, 21761551, 21652052, 21156150, 20467888, 20002294, 19540270, 19297798, 19050372, 19111190, 19013856, 18968511, 19105723, 19300540, 19467024, 19735114, 19983973, 20228186, 20585227, 20700449, 20923462, 20862589, 20740724, 20473628, 20367405, 20049390, 20016453, 19935050, 19951298, 19904105, 19791447, 19611408, 19654459, 19448488, 19460617, 19495646, 19489179, 19556731, 19539839, 19691451, 19766367, 19993187, 20216138, 20412104, 20688287, 20762195, 21176475, 21430367, 21655063, 21830943, 21948653, 22036090]
4356B2036090O226J31960N3925K13830K9486J63640J47787L22720K09911J56381
4346B3471956K83404K07328L10765K08770K69557L79427J65709L44887K75103
4337B5916906L84108K78937M40314L82123M49909M42232N18788N40207O00241
4328B9953765O44217N16049M29306M82955L92637M32689M88694L84245M98053
4319C4222610M59395M82168M08100L91258L09028K41348J61739L35284L13770
4310C7324700K81100M23352K91927K72817M30887M06583N86978P25490O05258
4301D1349092P57570P10667O41451R85841Q57406Q90735J001637J086732J030970
4292D9312101J260166J245752J149938J247280J326097J425490J293938J425130
$$ y = [22036090, 22042316, 22174276, 22228201, 22442031, 22471517, 22635157, 22782944, 23105664, 23315575, 23471956, 23755360, 23962688, 24273453, 24482223, 24751780, 25131207, 25296916, 25641803, 25916906, 26301014, 26579951, 27020265, 27402388, 27852297, 28294529, 28813317, 29353524, 29953765, 30597982, 31114031, 31543337, 32026292, 32418929, 32851618, 33340312, 33724557, 34222610, 34682005, 35164173, 35572273, 35963531, 36272559, 36513907, 36675646, 37010930, 37324700, 37605800, 38029152, 38321079, 38593896, 39024783, 39431366, 40018344, 40743834, 41349092, 42106662, 42817329, 43458780, 44444621, 45302027, 46192762, 47194399, 48281131, 49312101, 50572267, 51818019, 52967957, 54215237, 55541334, 56966824, 58260762, 59685892]
4284E9685892J409678J408760J233052J355492J148918J079386J056594J076595
4276F9454367J115875J097979J064950J159011Q95916R21426N96645K92209j02466
4267G6495912k99453l37419k48253m68017l06654k14452l4909j47829J25655J27606
4257G4692187J83256J32051K63656N31187N20167O91857Q32959J075030J240890
4248H0163240J500110J588709J689072K019662K098741K356566K485465K320627
4240I6222192J926753J839284K027123K185409K098156K217811K481282K575696
4232A13573706K881798K833833K997685L132979L145774L470987M087190M273596
4224A40397548M475693L109082P16748j859537l153716l444918l483949l086534
$$ y = [59685892, 61095570, 62504330, 63737382, 65092874, 66241792, 67321178, 68377772, 69454367, 70570242, 71668221, 72733171, 73892182, 74788098, 75709524, 76306169, 76598378, 76495912, 76196459, 75859040, 75610787, 75142770, 74836116, 74621664, 74586755, 74438926, 74564581, 74692187, 74875443, 75007494, 75271150, 75802337, 76322504, 77014361, 77847320, 78922350, 80163240, 81663350, 83252059, 84941131, 86960793, 89059534, 91416100, 93901565, 96222192, 98148945, 99988229, 102015352, 104200761, 106298917, 108516728, 110998010, 113573706, 116455504, 119289337, 122287022, 125420001, 128565775, 132036762, 136123952, 140397548, 144873241, 147982323, 148699071, 146839534, 143685818, 140240900, 136756951, 133670417]
4216A33670417k705103k227550j937996j727293j744808j853468j663624j481646
4208A18328929j266648j178423q58742l76670o594M95763Q45380J517745K028345
4199A19529085L086547M227352N824998P082092P067829L795584j819866n142615
4191A43651006o168440n822083n166595m182954l281745k923013k711790k591727
4183A10802659k828526k834038k765901k779335k683743k552042k396092k004916
4175H9958066j670721j073811j033328r95950p05651m14779L81050J039602J489908
4166H6974386J212391o24486k634280l624694l835971l451868l118913k369346
4158F8527219j844012j575551j056759j050910q01157p76969m52072q72819q16354
$$ y = [133670417, 130965314, 128737764, 126799768, 125072475, 123327667, 121474199, 119810575, 118328929, 117062281, 115883858, 115025116, 114648446, 114641852, 115137615, 115982995, 117500740, 119529085, 122615632, 126842984, 132667982, 139750074, 146817903, 150613487, 148793621, 143651006, 137482566, 131660483, 126493888, 122310934, 119029189, 116106176, 113394386, 110802659, 107974133, 105140095, 102374194, 99594859, 96911116, 94359074, 91962982, 89958066, 88287345, 87213534, 86180206, 85184256, 84478605, 84063826, 84444876, 85484478, 86974386, 88186777, 87562291, 84928011, 81303317, 77467346, 74015478, 70896565, 68527219, 66683207, 65107656, 64050897, 62999987, 62198830, 61421861, 60969789, 60096970, 59280616]
4149E9280616j046439q74084r39701j063582r10500j004774r03388o02762q50348
4140E1085038n44105m22092l14075l75035l57842k23842k78735l68530k96310
4131D7904472j92951k35378k30000n6886j97648o1149j76133l032K3870J96038
4121D6971203p5489L08297K27236L95636N37857M69600L69920M01187N12303N53857
4111E0671607M55809N39263M26162L77056O0290n0518m23414l69006o36757p94088
4101E0256404p88704q77674q69233p91829o45839n82272l90720j10952l3011M7121
4091D5213291J46439K39513L87775N23543K14753M71736J73842L33004K49213
4082D7953109L81352M32174N13244O38613O96248R36457R29184J046996J205920
$$ y = [59280616, 58234177, 57360093, 56420392, 55356810, 54446310, 53441536, 52538148, 51935386, 51085038, 50540933, 50118841, 49804766, 49429731, 49071889, 48848047, 48569312, 48200782, 47904472, 47711521, 47476143, 47246143, 47189257, 46991609, 46930460, 46754327, 46751295, 46775165, 46971203, 46895714, 47204011, 47431247, 47826883, 48364740, 48834340, 49204260, 49605447, 50117750, 50671607, 51127416, 51666679, 52092841, 52469897, 52530187, 52479669, 52056255, 51687249, 51050492, 50256404, 49467700, 48590026, 47720793, 46928964, 46283125, 45700853, 45310133, 45199181, 45166170, 45213291, 45359730, 45599243, 45987018, 46510561, 46725314, 47197050, 47370892, 47703896, 47953109, 48334461, 48766635, 49279879, 49918492, 50614740, 51551197, 52480381, 53527377, 54733297]
4073E4733297J228795J175310J177225R75529P11597O62145M04203K49254J48606
4064F1465961j25943j23102n55823n43007p06822q90113r03644p73576j093590
4055E5750341j166792j061053j095982j016199r41411r15289q48429p11433o55519
4046D7338234n43102n43273l62859l02228j11379J65565n9776K82676N56668M12069
4036D6832595O59176O89448P38949P70472O66279P58620M79019L77086L04627
4027E2276271L01080J55598K2837k11318l55360m25980p94140n38138o20575m87549
4017D9322726l84370l72994l02359m28585l41866k67562J01376N06467P49677
4008D8582510O78222k26467j431789j718557j572331j452086j124692r04834o88665
$$ y = [54733297, 55962092, 57137402, 58314627, 59290156, 60001753, 60663898, 61068101, 61317355, 61465961, 61340018, 61216916, 60661093, 60118086, 59411264, 58521151, 57617507, 56843931, 55750341, 54583549, 53522496, 52426514, 51410315, 50468904, 49553615, 48705186, 47993753, 47338234, 46795132, 46251859, 45889000, 45586772, 45475393, 45640958, 45581182, 45863858, 46420526, 46832595, 47491771, 48181219, 48920168, 49690640, 50356919, 51115539, 51594558, 51971644, 52276271, 52577351, 52732949, 52755786, 52544468, 52189108, 51763128, 50968988, 50430850, 49810275, 49322726, 48938356, 48565362, 48263003, 47834418, 47492552, 47224990, 47326366, 47832833, 48582510, 49260732, 49034265, 47602476, 45883919, 44311588, 42859502, 41734810, 40829976, 40141311]
3999D0141311n61944l14996k83535r9630K51473L73765O82351J190998J577453
3990D2957246K128479K332633K390948K300506K625343L666791M665365M539407
3982F7606718Q73241k837628m402518m371678l579491k983573k151479j840250
3974D6313342j447375j418719j127158p69314m72674q1267L11802O62070J706696
3965D3677403K867820L855740M608506M028702Q35931l771389n177213n162059
3957D5763441m371978l583692k625197j744251j478111j094717r87446o95053
3949B9182996n71961o76785o34972m78768l64507J1284K25116P40521J521779
3940B8954703K236294K980929K643851o85464k313832l106537k560915k034805
$$ y = [40141311, 39579367, 39264371, 38980836, 38881206, 39132679, 39506444, 40188795, 41379793, 42957246, 45085725, 47418358, 49809306, 52109812, 54735155, 58401946, 63067311, 67606718, 68479959, 65642331, 61239813, 56868135, 53288644, 50305071, 48153592, 46313342, 44865967, 43447248, 42320090, 41550776, 41078102, 40996835, 41308637, 41970707, 43677403, 46545223, 50400963, 55009469, 59038171, 59874102, 56102713, 50925500, 45763441, 41391463, 37807771, 35182574, 33438323, 31960212, 30865495, 29878049, 29182996, 28611035, 27934250, 27299278, 26820510, 26456003, 26467287, 26692403, 27432924, 28954703, 31190997, 34171926, 36815777, 36130313, 33816481, 30709944, 28149029, 26114224]
3932B6114224j627909q59051m72314m52726o09896m24876m69884l59622k28518
3923B0609428J82153L38931J91754l46476j032612j183715j217430r62547p30139
3914A5849347o20743l47553l69686k73204j15728N4691O1942K99796L80574R3509
3904A5012945P8550R5376q4117l30486l12272j16492p9996J98938N54617N75558
3894A5592621K04353l48945r63597r72817r73564p03912n42042k62896l30939
3885A0698262j81056L3089J64042L00625J39669k37168l15290l85353k81374j15992
3875I819454J14728K09473L91330J96368j8072m38338o15068n72320o51087l79287
3865H057181l36490l67173k16930k16211k11013l5163o8142j30041j77117J3385
$$ y = [26114224, 24486315, 23627264, 23154950, 22702224, 22092328, 21667452, 21197568, 20837946, 20609428, 20791581, 21130512, 21322266, 20975790, 19943178, 18759463, 17542033, 16579486, 15849347, 15228604, 14881051, 14511365, 14238161, 14122433, 14177124, 14239066, 14538862, 14919436, 15012945, 15091495, 15186871, 15102754, 14772268, 14459996, 14343504, 14263508, 14462446, 15017063, 15592621, 15796974, 15448029, 14484432, 13511615, 12538051, 11834139, 11292097, 11029201, 10698262, 10517206, 10550295, 10714337, 11014962, 11154631, 10917463, 10602173, 10216820, 9935446, 9819454, 9934182, 10143655, 10534985, 10731353, 10713281, 10274943, 9659875, 9087555, 8436468, 8057181, 7720691, 7353518, 7136588, 6920377, 6709364, 6674201, 6606059, 6476018, 6298901, 6312286]
3855F312286p3133P259o1149m6151J14271K4384J63117J74806K35456K55079J93456
3844G299681j10015l32406j76193l19665m20946j94579k50719j66641j97770m8947
3834E081800j66730j23832K5912k18628J9952o4770k4646j02752l7304P70k1845
3823D367927j00839n8862l889q7472n1774k8327j2803j11191M7517m223l5511
3812C920553j73343N0340j06283n13P8829n1210q6531j9739o6349R4498r7104
3801C543148l9077k0671q9982J8422r105r0014l1561J1781m0867k8521j6439P3987
3789C281101n3592l492K442Q003p4820m7061P2032j7886k5981m9933J7744M3947
3777C152504k1988m5696n2063n323o720j856N9044j60386J18713n1096r9927Q1715
$$ y = [6312286, 6239153, 6246412, 6185263, 6139112, 6253383, 6277767, 6440884, 6615690, 6851146, 7106225, 7299681, 7189666, 6857260, 6681067, 6361402, 5940456, 5745877, 5495158, 5328517, 5130747, 5081800, 4915070, 4791238, 4817150, 4598522, 4618474, 4553704, 4529058, 4426306, 4389002, 4389772, 4367927, 4267088, 4208226, 4204337, 4116865, 4065091, 4036764, 4023961, 3912770, 3960287, 3956064, 3920553, 3747210, 3797550, 3691267, 3690754, 3769583, 3718373, 3631842, 3612103, 3545754, 3640252, 3543148, 3504071, 3483400, 3393418, 3411840, 3402735, 3312721, 3281160, 3292941, 3252074, 3223553, 3207114, 3281101, 3227509, 3224017, 3226459, 3234462, 3159642, 3112581, 3184613, 3166727, 3140746, 3090813, 3108557, 3152504, 3130516, 3084820, 3032757, 3027434, 3020714, 3018858, 3077902, 2917516, 3036229, 2985133, 2885206, 2966921]
3765B966921j12683Q5080j56353O8148k4228O8469n7651K6020q6721r167M8299
3754B816134j13387M7734p7023J03058j5384k0n773j25323O9553K7087L9218n1537
3742B714337j1209N9577p8289P3593N3643j1219j51808J61952j7178n9018m044
3731B730337l5243J09230o1438j9968K3865o7029o0414l0997k4566J23817j23852
3720B563742Q7505L0223K1462l4604L273O7072q518j45608r0758J07405j29080
3709B472114K4687j07370J30227j38839N6433K7702K2049j9803j4605M1740Q2571
3698B576906j15729K6100o2266J07300k9075q2352j7179K5698n2573m8418Q8403
3687B416815j16054j714l6528R957O246J7151p9927k6706k1437q37r842M8127
$$ y = [2966921, 2854238, 2939318, 2782965, 2851113, 2826885, 2895354, 2837703, 2863723, 2777002, 2767835, 2816134, 2702747, 2750481, 2673458, 2776516, 2761132, 2761112, 2755339, 2630016, 2699569, 2726656, 2765874, 2714337, 2703128, 2762705, 2684416, 2758009, 2811652, 2800433, 2648625, 2810577, 2793399, 2734381, 2730337, 2695094, 2804324, 2742886, 2722918, 2746783, 2679754, 2619340, 2588343, 2563777, 2687594, 2563742, 2651247, 2681470, 2702932, 2668328, 2671601, 2738673, 2730155, 2584547, 2493789, 2601194, 2472114, 2496801, 2389431, 2519658, 2380819, 2437252, 2464954, 2487003, 2467200, 2452595, 2494335, 2576906, 2461177, 2487277, 2425011, 2532311, 2503236, 2420884, 2403705, 2429403, 2376830, 2328412, 2416815, 2300761, 2299047, 2262519, 2272476, 2278722, 2295873, 2215946, 2189240, 2167803, 2166966, 2157124, 2205251]
3675B205251m8496l2040J6947K3989k3972K027N0249N0790n5407p3371m6249J6709
3663B086427J409l7408j4396k6833L279M0789q1996j2995j2904m0447K0521k6285
3651A899161m2948J05456L3589j31653n0737J41889P1424m3538q1082K7310p0015
3640A858856J2286n8608M2239J9412o6919N1894q2432L1413K9827o8815n0124
3629A719029O9287o7151K8508m3929P9185q1899N0929r2501M7962O3614j17791
3618A655243J14811n6147L85j8772j23101J2681J6777l2485R4078m0346m8586
3607A574538r48m714J2865N8769l0588J9616K559q1004O2997j07552J95018n6176
3595A645380p4297q559J8150k3101p5401M8344N8838l7322O525l97m7189L9578
$$ y = [2205251, 2156755, 2124715, 2141662, 2165651, 2141679, 2143706, 2193955, 2244745, 2189338, 2115967, 2069718, 2086427, 2087836, 2050428, 2036032, 2009199, 2012478, 2053267, 1971271, 1958276, 1945372, 1904925, 1925446, 1899161, 1856213, 1961669, 1995258, 1863605, 1812868, 1954757, 2026181, 1982643, 1901561, 1928871, 1858856, 1871142, 1812534, 1854773, 1874185, 1807266, 1859160, 1776728, 1808141, 1837968, 1769153, 1719029, 1788316, 1721165, 1749673, 1705744, 1784929, 1703030, 1753959, 1661458, 1709420, 1773034, 1655243, 1770054, 1713907, 1714292, 1695520, 1572419, 1585100, 1601877, 1569392, 1663470, 1623124, 1574538, 1573590, 1568876, 1581741, 1640510, 1609922, 1629538, 1632097, 1551093, 1614090, 1506538, 1701556, 1645380, 1571083, 1562524, 1580674, 1557573, 1482172, 1530516, 1589354, 1552032, 1558557, 1558160, 1510971, 1550549]
3583A550549P3865n3028k5470r7749J10286K3959j42615R1447K224J0835o5348
3572A478955P9700K5084r3852M5766l3730O7709q1751j1042O330O7401m8429K2109
3560A524250q8300P4335k9832k7389K9783p8917J18929j00929K3694O7602k0250
3549A492976J0020r6099R8703j08715L8041o5527O5520q3304m387Q0713q0669
3538A347272J02164o0267N3138l6588n8099P4503o3423J35568n0017M0005o8442
3527A415814M9612o4876m6540J09984n7219M9050m4961J44302j36116J27742o7844
3516A478948j9033K4617L3836J0648K0787L3573q2474N6504l0785q0859m7588
3505A398174o065l3891r7276n1099N0259K8586Q3574m2911R1158j18808J18672
$$ y = [1550549, 1624414, 1571386, 1545916, 1448167, 1558453, 1582412, 1439797, 1531244, 1533468, 1544303, 1478955, 1558655, 1583739, 1489887, 1535653, 1501923, 1569632, 1487881, 1476839, 1483169, 1550570, 1502141, 1524250, 1435950, 1510285, 1480453, 1453064, 1482847, 1403930, 1522859, 1421930, 1445624, 1513226, 1492976, 1502996, 1406897, 1505600, 1396885, 1434926, 1369399, 1434919, 1351615, 1347228, 1427941, 1347272, 1449436, 1389169, 1442307, 1405719, 1347620, 1422123, 1358700, 1494268, 1444251, 1484256, 1415814, 1465426, 1400550, 1354010, 1463994, 1406775, 1455825, 1410864, 1555166, 1419050, 1546792, 1478948, 1459915, 1484532, 1518368, 1529016, 1549803, 1583376, 1500902, 1557406, 1526621, 1445762, 1398174, 1392109, 1358218, 1260942, 1209843, 1260102, 1288688, 1372262, 1329351, 1420509, 1301701, 1420373]
3494A420373n1896k6606l8250O6723j9672l6203N0283k9092j0249N9718n6808
3483A328321M7231q9915N9383r453J1448J1653q8814N6716n5609K7702L2184l4089
3471A296758q3522O0856N1803j36740J51135K3095l9899k4838P3691o6084J7120
3460A323375j8904L7645n7563O2506o7960M369l732K823L2253p935m7926j5228
3448A243723m698K4408m0785O9180K3887k4718n330k5201n333k2158Q991R0198
3436A332164j3735L8923q3779K4239K992n6966N9373r729N216p5399j9180J09840
3424A313959k0200N131J1644p6844J06754q5921L3792P7865j55040Q5636q299
3413A288477o5744P9270J1440J9821m1912l6393N7384L3225n1265j7485M4471
$$ y = [1420373, 1368477, 1341871, 1303621, 1370344, 1350672, 1314469, 1364752, 1335660, 1325411, 1385129, 1328321, 1375552, 1285637, 1345020, 1335567, 1347015, 1358668, 1269854, 1326570, 1270961, 1298663, 1330847, 1296758, 1213236, 1274092, 1325895, 1189155, 1340290, 1363385, 1323486, 1298648, 1372339, 1306255, 1323375, 1304471, 1342116, 1284553, 1347059, 1279099, 1283468, 1279736, 1282559, 1314812, 1306877, 1258951, 1243723, 1239025, 1263433, 1222648, 1291828, 1315715, 1290997, 1285667, 1260466, 1255133, 1232975, 1241966, 1332164, 1318429, 1357352, 1273573, 1297812, 1300804, 1243838, 1303211, 1293482, 1298698, 1223299, 1204119, 1313959, 1293759, 1298890, 1310534, 1233690, 1340444, 1254523, 1288315, 1366180, 1211140, 1296776, 1288477, 1222733, 1302003, 1313443, 1333264, 1291352, 1254959, 1312343, 1345568, 1294303, 1276818, 1321289]
3402A321289o3770j3998L2087K5536j7189k4930M4651K2677p2593K316m4531O0285
3390A271830K3817o3528Q1850J1562l7006M0859J2860j12898P7338p4265O2308
3379A294727J0352M8099m5082j830p3472M3803K4085p5840J03767p495P7232r6526
3367A301820J07479o6476j3704j6959K1800K496L0465m9499R6773p7149R6991
3356A434037k9835l5740N7057P3741R274l4533L1980o707K2867m3164J10409K2806
3344A612192q941J7785L5581J8896k3873N0241k4323K1123n930r638J0854J23057
3332A817024p2253J48346o5741n284P2946L3432J0689m4326M5658M2899J4059
3321A997449q8072N1386R0471M0431K3867L8058K3735r8214J05643M1651J0703
$$ y = [1321289, 1257519, 1243521, 1275608, 1301144, 1283955, 1259025, 1303676, 1326353, 1253760, 1256076, 1211545, 1271830, 1295647, 1232119, 1313969, 1325531, 1288525, 1329384, 1342244, 1229346, 1306684, 1232419, 1294727, 1305079, 1353178, 1308096, 1306266, 1232794, 1276597, 1300682, 1224842, 1328609, 1321114, 1398346, 1301820, 1409299, 1342823, 1329119, 1312160, 1333960, 1336456, 1366921, 1317422, 1414195, 1337046, 1434037, 1404202, 1368462, 1425519, 1499260, 1508534, 1474001, 1505981, 1499274, 1522141, 1478977, 1589386, 1612192, 1603251, 1621036, 1656617, 1675513, 1651640, 1701881, 1677558, 1698681, 1692751, 1683113, 1693967, 1817024, 1744771, 1893117, 1827376, 1822092, 1895038, 1928470, 1939159, 1894833, 1940491, 1983390, 1997449, 1909377, 1960763, 2051234, 2091665, 2115532, 2153590, 2177325, 2079111, 2184754, 2226405, 2237108]
3310B237108O4241J78799o6907R4936R2499j5673J84938J33272L661J74330J82405
3299C263609O3576K38881J47327K39259J33844K78250L13323L37697M34548K74377
3289E724691M59792M26021O16575P13320R12859J310063J489015K499598L335575
3280A7487509M833837N300761M274907l174241l948824m711916l631342l271092
3272A3159599k137574j448954j218114o75699o96396m37035l07135j90068m38522
3263E610102l24100l65539k99314k59692k49973j73304j81329k11516o4168j07252
3253C373915r6161M3952j06320j12045j16367j45924o6201q8296j40387j8021
3243B528145m7668n9040l5466l5782j53021J64688k08814m4040j6463q4802K8280
$$ y = [2237108, 2301349, 2480148, 2413241, 2508177, 2600676, 2585003, 2769941, 2903213, 2906874, 3081204, 3263609, 3327185, 3566066, 3713393, 3952652, 4086496, 4364746, 4678069, 5015766, 5450314, 5724691, 6184483, 6610504, 7227079, 7940399, 8853258, 10163321, 11652336, 14151934, 17487509, 22321346, 27622107, 31897014, 28722773, 24773949, 20062033, 16430691, 13159599, 11022025, 9573071, 8354957, 7679258, 6982862, 6545827, 6238692, 6048624, 5610102, 5286002, 4920463, 4621149, 4361457, 4111484, 3938180, 3756851, 3545335, 3481167, 3373915, 3277754, 3321706, 3215386, 3103341, 2986974, 2841050, 2774849, 2686553, 2546166, 2528145, 2480477, 2421437, 2385971, 2350189, 2197168, 2361856, 2153042, 2109002, 2092539, 2007737, 2036017]
3232B036017N2698j72633o2685O581M3202j99L4557j74014J25931k05197J68537
3221A852795q2969j22240J39307r4182n8148j1435N725O958r0568N5994K8737
3210A629974m2181o0888K0382p7854J3456K073j07347J5352j7311O1107M942j33191
3198A308514l7882M0335n9062R8638N9129j09859J03330L4111j52124P4636j04826
3187A254940Q7045n6937L5684L1590m4414m9776j2611N0408k9503l6153q2442
3176A147831M429J04205m9684K7238n305l3769K3116P1693l7471K2139p782N9857
3164A326497m8622j08873J9098M0447m465L6225o9609J80526j29902o2217M0709
3153A219814L8820j627k2898k8899k1152L6260p8453M2497k2551N0638n9360J3729
$$ y = [2036017, 2088715, 1916082, 1853397, 1859978, 1903180, 1902981, 1937538, 1763524, 1889455, 1684258, 1852795, 1769826, 1647586, 1786893, 1692711, 1634563, 1623128, 1628853, 1635811, 1545243, 1601237, 1629974, 1587793, 1526905, 1547287, 1469433, 1482889, 1484962, 1377615, 1392967, 1375656, 1436763, 1441705, 1308514, 1270632, 1310967, 1251905, 1350543, 1409672, 1299813, 1403143, 1437254, 1285130, 1359766, 1254940, 1341985, 1285048, 1320732, 1352322, 1307908, 1258132, 1245521, 1295929, 1266426, 1230273, 1147831, 1152260, 1256465, 1206781, 1234019, 1228714, 1194945, 1218061, 1289754, 1252283, 1274422, 1266640, 1326497, 1277875, 1169002, 1188100, 1228547, 1224082, 1260307, 1190698, 1371224, 1241322, 1179105, 1219814, 1258634, 1257007, 1234109, 1205210, 1184058, 1220318, 1141865, 1184362, 1161811, 1212449, 1153089, 1166818]
3141A166818K7137m2295M849Q7588r8367J25836j37875l2445M1838J06248o2506
3130A186826j51793O8592Q4041p7600m412J6129Q7532j23411L2893l8809O2037
3119A142025l4468L0107L2928j2121j9761k7158P2878q4400K9848n200o1652N5856
3107A118882K0520j2794n658n1872J703k1461M1132K8317j1924j9893J26325r5831
3095A117446k2912p728o2269O9001L1170r928j9651q8591Q1285L3541J2033k3326
3083A110071j40120J03212Q815j9175M700K7202k3478j1348L579j09464J28929
3072A082923j17618J22417n57p1855j4471k17K5875j8397m8267R2256J8845K7986
3060A098920r7752J00153p3412q474l128N3484K9708q7762J18359K0813M840j13090
$$ y = [1166818, 1193955, 1151660, 1156509, 1244097, 1145730, 1271566, 1133691, 1101246, 1143084, 1249332, 1186826, 1035033, 1103625, 1187666, 1110066, 1105654, 1121783, 1209315, 1085904, 1118797, 1079988, 1142025, 1107557, 1137664, 1170592, 1158471, 1138710, 1111552, 1184430, 1100030, 1129878, 1124678, 1063026, 1118882, 1139402, 1126608, 1120950, 1069078, 1070781, 1049320, 1090452, 1118769, 1106845, 1086952, 1213277, 1117446, 1094534, 1086806, 1024537, 1093538, 1124708, 1114780, 1095129, 1006538, 1087823, 1121364, 1133397, 1110071, 969951, 1073163, 1081978, 1062803, 1067503, 1094705, 1071227, 1059879, 1063458, 953994, 1082923, 965305, 1087722, 1087165, 1015310, 1000839, 1000622, 1026497, 1008100, 959833, 1052089, 1070934, 1098920, 1001168, 1101321, 1027909, 1019435, 1016307, 1069791, 1099499, 1011737, 1130096, 1150909, 1155749, 1042659]
3048A042659j4782P9490K3511M1614j8390J08638j6454j20953n7507M1841J1815
3037A121482J7634q8200n0365L8705k360j9371J2149L8187n7175P6014m5458j7053
3025A024189l8221L8329l4165Q5973n780K0383j50554R7385m2584N3221k299k08930
3013H36947Q9682O3955j25062Q7309r9649J09809O2692q6069J03556j36094J89009
3002A096085j49287J5458q1226J12284j8863p9992j6177R2412o296p6666L779
2991H91511L9502P1649j8559L548n7479N9182j16110J7073J4440j1195J04452
2980I98014J9748j12025R1240J509j56011L9089K4096J1487m6366O6413o1152
2969H76042O1243J3132r0238M8233N1694O1361j78851J36672r756J9369o1722
$$ y = [1042659, 1027877, 1107367, 1130878, 1172492, 1154102, 1262740, 1246286, 1125333, 1067826, 1109667, 1121482, 1139116, 1050916, 1000551, 1039256, 1036896, 1017525, 1029674, 1067861, 1010686, 1086700, 1041242, 1024189, 985968, 1024297, 990132, 1076105, 1070325, 1090708, 940154, 1037539, 994955, 1048176, 1045877, 836947, 926629, 990584, 865522, 952831, 853182, 962991, 1025683, 939614, 1043170, 907076, 1096085, 946798, 962256, 881030, 993314, 974451, 894459, 878282, 970694, 964398, 887732, 891511, 931013, 1002662, 984103, 987651, 930172, 989354, 873244, 890317, 904757, 893562, 998014, 1017762, 905737, 996977, 998486, 842475, 881564, 905660, 917147, 870781, 937194, 876042, 937285, 950417, 860179, 908412, 960106, 1021467, 842616, 979288, 969532, 988901, 927179]
2958I27179p3278J21704k9793m1131P4721l7560O3675k8401r6191M3158Q8630
2947A012713r1092M2801n7248J38427j66054L784m31N5135M774o2260m8858Q1825
2935I13516L7600l1841l240j9846K0268L8500l4728J5113p1947L4140m290J03919
2923I97164o0145L264k6548j5203K9149N653K5599r0466N414o3558P6301o9629
2911H16995J16304k7677k6129m9712j123O9523L3928L5737q7222j8854q841P3931
2899I26860j4354M3268j05223Q6083k386J6049o9899M2855M6156j10307O4733
2888I23835k5523J0374j13799K1186R6180k464J3277J6230r8334Q8195l1480K4825
2876I22502P080n0894K0869q3961K5699J6481O9042K1042p0000j3849l2191N5140
$$ y = [927179, 853901, 975605, 945812, 904681, 979402, 941842, 1005517, 977116, 880925, 924083, 1012713, 921621, 964422, 907174, 1045601, 879547, 883331, 882900, 938035, 942809, 880549, 831691, 913516, 951116, 919275, 916035, 896189, 916457, 954957, 920229, 935342, 863395, 897535, 893245, 997164, 937019, 940283, 913735, 898532, 927681, 933334, 958933, 868467, 873881, 810323, 886624, 816995, 933299, 905622, 879493, 829781, 828658, 898181, 932109, 967846, 880624, 861770, 852929, 926860, 912506, 955774, 850551, 936634, 934248, 950297, 880398, 923253, 969409, 859102, 923835, 898312, 908686, 794887, 816073, 912253, 909789, 923066, 939296, 840962, 929157, 897677, 922502, 929582, 878688, 899557, 815596, 841295, 857776, 926818, 947860, 877860, 864011, 831820, 886960]
2864H86960L7679j31757L6913Q9903l7011O9818K0643n6326j71905J57035r407
$$ y = [886960, 924639, 792882, 829795, 919698, 882687, 952505, 973148, 916822, 744917, 901952, 892545]
$$ [...]
##END NTUPLES=NMR SPECTRUM
##END=
