##TITLE=C13cpd
##JCAMPDX= 6.0         $$ Bruker NMR JCAMP-DX V2.0
##DATA TYPE= NMR SPECTRUM
##DATA CLASS= NTUPLES
##ORIGIN= UXNMR, Bruker Analytische Messtechnik GmbH
##OWNER= root
$$ XWIN-NMR		Version 3.5
$$ Sat Feb 15 14:29:45 2025 Russian Standard Time (UT+4h)  servis@DPX200
##.OBSERVE FREQUENCY= 50.3277607988526
##.OBSERVE NUCLEUS= ^13C
##.ACQUISITION MODE= SIMULTANEOUS
##.ACQUISITION SCHEME= undefined
##.AVERAGES= 1452
##.DIGITISER RES= 17
##SPECTROMETER/DATA SYSTEM= spect
##.PULSE SEQUENCE= zgpg30
##.SOLVENT NAME= CDCl3
##.SHIFT REFERENCE= (INTERNAL, CDCl3, 0, 219.126)
##AUDIT TRAIL= $$ (NUMBER, WHEN, WHO, WHERE, WHAT)
$$ ##TITLE= Audit trail, XWIN-NMR		Version 3.5
$$ ##JCAMPDX= 5.01
$$ ##ORIGIN= Bruker BioSpin GmbH
$$ ##OWNER= servis
$$ F:\spectra/data/av/nmr/C13cpd/1/pdata/1/auditp.txt
$$ ##AUDIT TRAIL=  $$ (NUMBER, WHEN, WHO, WHERE, WHAT)
(   1,<2025-02-15 14:29:13.57 +0400>,<servis>,<DPX200>,
      <created by zg, POWCHK disabled, PULCHK disabled
       terminated by command 'halt'
       configuration hash MD5:
       00 E9 B6 7A A2 85 ED C7 34 08 36 98 17 FE 4E 26
       data hash MD5: 32K
       46 07 97 B1 AC 8D B2 0E 37 DB B6 3B B3 87 A8 1E>)
(   2,<2025-02-15 14:29:15.23 +0400>,<servis>,<DPX200>,
      <Start of raw data processing
       efp BC_mod = 2 LB = 2 FT_mod = 6 PKNL = 1 PHC0 = -340.063 PHC1 = 25.66493 SI = 32K 
       data hash MD5: 32K
       16 4E FE 03 30 F2 C1 1F 4B E0 70 F8 A9 FF 2B 53>)
$$ ##END=
$$ 
$$ hash MD5
$$ 7C 36 27 18 7D 7F B9 24 58 DD 83 3F A9 56 CE 34
##$RELAX= 
##$RELAX= 
##$RELAX= 
##$RELAX= 
##$RELAX= 
##$RELAX= 
##$RELAX= 
##$RELAX= 
$$ Bruker specific parameters
$$ --------------------------
##$DU= <F:\spectra>
##$EXPNO= 1
##$NAME= <C13cpd>
##$PROCNO= 1
##$TYPE= <nmr>
##$USER= <av>
##$AMP= (0..31)
100 100 100 100 100 100 100 100 100 100 100 100 100 100 100 100 100 100 
100 100 100 100 100 100 100 100 100 100 100 100 100 100 
##$AQSEQ= 0
##$AQ_mod= 1
##$AUNM= <au_zg>
##$AUTOPOS= <>
##$BF1= 50.322729
##$BF2= 200.13
##$BF3= 50.322729
##$BF4= 50.322729
##$BF5= 500.13
##$BF6= 500.13
##$BF7= 500.13
##$BF8= 500.13
##$BYTORDA= 1
##$CFDGTYP= 0
##$CFRGTYP= 5
##$CHEMSTR= <none>
##$CNST= (0..31)
1 1 145 1 1 1 1 1 1 1 1 1 1 1 1 1 1 1 1 1 1 1 1 1 1 1 1 1 1 1 1 1 
##$CPDPRG= <waltz16>
##$CPDPRG1= <>
##$CPDPRG2= <waltz16>
##$CPDPRG3= <>
##$CPDPRG4= <mlev>
##$CPDPRG5= <mlev>
##$CPDPRG6= <mlev>
##$CPDPRG7= <mlev>
##$CPDPRG8= <mlev>
##$CPDPRGB= <>
##$CPDPRGT= <>
##$D= (0..31)
0 2 0.00345 0 0 0 0 0 0 0.06 0 0.03 2e-05 3e-06 0 0 0.0002 0 0 0 0 0 0 
0 0 0 0 0 0 0 0 0 
##$DATE= 1739615353
##$DBL= (0..7)
120 120 120 120 120 120 120 120 
##$DBP= (0..7)
150 150 150 150 150 150 150 150 
##$DBP07= 0
##$DBPNAM0= <>
##$DBPNAM1= <>
##$DBPNAM2= <>
##$DBPNAM3= <>
##$DBPNAM4= <>
##$DBPNAM5= <>
##$DBPNAM6= <>
##$DBPNAM7= <>
##$DBPOAL= (0..7)
0.5 0.5 0.5 0.5 0.5 0.5 0.5 0.5 
##$DBPOFFS= (0..7)
0 0 0 0 0 0 0 0 
##$DE= 6
##$DECBNUC= <off>
##$DECIM= 12
##$DECNUC= <off>
##$DECSTAT= 4
##$DIGMOD= 1
##$DIGTYP= 9
##$DL= (0..7)
$$ [...]
##$SUBNAM2= <"">
##$SUBNAM3= <"">
##$SUBNAM4= <"">
##$SUBNAM5= <"">
##$SUBNAM6= <"">
##$SUBNAM7= <"">
##$SUBNAM8= <"">
##$SUBNAM9= <"">
##$SW= 238.246396889851
##$SWIBOX= (0..15)
0 1 3 0 0 0 0 0 0 0 0 0 0 0 0 0 
##$SW_h= 11990.4076738609
##$TD= 32768
##$TD0= 1
##$TE= 0
##$TE2= 300
##$TE3= 300
##$TEG= 300
##$TL= (0..7)
0 120 120 120 120 120 120 120 
##$TP= (0..7)
150 150 150 150 150 150 150 150 
##$TP07= 0
##$TPNAME0= <>
##$TPNAME1= <>
##$TPNAME2= <>
##$TPNAME3= <>
##$TPNAME4= <>
##$TPNAME5= <>
##$TPNAME6= <>
##$TPNAME7= <>
##$TPOAL= (0..7)
0.5 0.5 0.5 0.5 0.5 0.5 0.5 0.5 
##$TPOFFS= (0..7)
0 0 0 0 0 0 0 0 
##$TUNHIN= 0
##$TUNHOUT= 0
##$TUNXOUT= 0
##$USERA1= <user>
##$USERA2= <user>
##$USERA3= <user>
##$USERA4= <user>
##$USERA5= <user>
##$V9= 5
##$VALIST= <valist>
##$VCLIST= <CCCCCCCCCCCCCCC>
##$VD= 0
##$VDLIST= <DDDDDDDDDDDDDDD>
##$VPLIST= <PPPPPPPPPPPPPPP>
##$VTLIST= <TTTTTTTTTTTTTTT>
##$WBST= 1024
##$WBSW= 20
##$XGAIN= (0..3)
0 0 0 0 
##$XL= 0
##$YL= 0
##$YMAX_a= 23996177
##$YMIN_a= -17926083
##$ZGOPTNS= <>
##$ZL1= 120
##$ZL2= 120
##$ZL3= 120
##$ZL4= 120
##$ABSF1= 0
##$ABSF2= 0
##$ABSG= 0
##$ABSL= 0
##$ALPHA= 0
##$AQORDER= 0
##$ASSFAC= 0
##$ASSFACI= 0
##$ASSFACX= 0
##$ASSWID= 0
##$AUNMP= <proc_1d>
##$AZFE= 0.1
##$AZFW= 0.5
##$BCFW= 0
##$BC_mod= 2
##$BYTORDP= 0
##$COROFFS= 0
##$CY= 12.5
##$DATMOD= 1
##$DC= 0
##$DFILT= <>
##$DTYPP= 0
##$F1P= 99.9999945759776
##$F2P= -179.999992907048
##$FCOR= 0.5
##$FTSIZE= 32768
##$FT_mod= 6
##$GAMMA= 0
##$GB= 0
##$INTBC= 1
##$INTSCL= 0
##$ISEN= 30
##$LB= 2
##$LEV0= 0
##$LPBIN= 0
##$MAXI= 10000
##$MC2= 0
##$MEAN= 0
##$ME_mod= 0
##$MI= 0
##$NCOEF= 0
##$NC_proc= 2
##$NLEV= 6
##$NOISF1= 0
##$NOISF2= 0
##$NSP= 0
##$NTH_PI= 0
##$NZP= 0
##$OFFSET= 219.1257
##$PC= 1.4
##$PHC0= -340.063
##$PHC1= 25.66493
##$PH_mod= 1
##$PKNL= yes
##$PPARMOD= 0
##$PSCAL= 4
##$PSIGN= 0
##$REVERSE= no
##$SF= 50.322729
##$SI= 32768
##$SIGF1= 0
##$SIGF2= 0
##$SINO= 80
##$SIOLD= 32768
##$SREGLST= <13C.CDCl3>
##$SSB= 0
##$STSI= 32768
##$STSR= 0
##$SW_p= 11990.4076738609
##$SYMM= 0
##$S_DEV= 0
##$TDeff= 32768
##$TDoff= 0
##$TI= <>
##$TILT= no
##$TM1= 0
##$TM2= 0
##$TOPLEV= 0
##$USERP1= <user>
##$USERP2= <user>
##$USERP3= <user>
##$USERP4= <user>
##$USERP5= <user>
##$WDW= 1
##$XDIM= 32768
##$YMAX_p= 365991106
##$YMIN_p= -2307627
$$ End of Bruker specific parameters
$$ ---------------------------------
##NTUPLES= NMR SPECTRUM
##VAR_NAME=  FREQUENCY,     SPECTRUM/REAL,   SPECTRUM/IMAG
##SYMBOL=    X,             R,               I
##VAR_TYPE=  INDEPENDENT,   DEPENDENT,       DEPENDENT
##VAR_FORM=  AFFN,          ASDF,            ASDF
##VAR_DIM=   32768,         32768,           32768
##UNITS=     HZ,            ARBITRARY UNITS, ARBITRARY UNITS
##FACTOR=    0.365929370215793, 1,           1
##FIRST=     11027.0033138647, 0,            0
##LAST=      -963.404359996184, 0,           0
##MIN=       -963.404359996184, -2307627,    0
##MAX=       11027.0033138647, 365991106,    0
$$ Real data points
##PAGE= N=1
##DATA TABLE= (X++(R..R)), XYDATA
$$ [...]
11059c16309j39772j9679J07751J10709R928J1169J77408L43627L98858L21510
11049A005200J80656J13805P7685O2920Q1941N5917J0419n3826j25033j14440
11039A295244l5337M4264P0314K934j68929l02603k87721j94193m9664N8046J52839
11028E85194K57201L03016K47567J14079J0607k2726k6777m5081O409J52057K71805
11017A853351K25757J32438J47570J67877O6985n2617j01750j21912j41560j63750
11007B012389j59168r8334q3936j48402j93172j88171j14373k9552L2637J7568
10997A047486j23074k31356j56344j4539m9148j37108n8959Q7397J73134J62927
10987G00416J42373J87404K53271K36488J12364q6085k93500l15220p2182K27720
$$ y = [-316309, -456081, -475760, -368009, -257300, -247372, -236203, -58795, 284832, 683690, 1005200, 1185856, 1299661, 1377346, 1440266, 1522207, 1578124, 1588543, 1534717, 1409684, 1295244, 1259907, 1304171, 1374485, 1377419, 1208490, 905887, 618166, 423973, 374309, 432355, 585194, 842395, 1145411, 1392978, 1507057, 1517664, 1494938, 1468161, 1423080, 1429489, 1581546, 1853351, 2079108, 2211546, 2359116, 2526993, 2593978, 2541361, 2439611, 2317699, 2176139, 2012389, 1853221, 1754887, 1670951, 1522549, 1329377, 1141206, 1026833, 997281, 1029918, 1047486, 924412, 693056, 536712, 522173, 473025, 335917, 276958, 364355, 537489, 700416, 842789, 1030193, 1283464, 1519952, 1632316, 1546231, 1252731, 937511, 865329, 1093049]
10977A093049L44451K83339J00528j08437j56491r8241k2375J06705K09380K10014
10967A961922J91109K40713K75631J74551m96j83896l10436l95090l77324k25605
10957A351079q5299m1331p2412j06170r5424j6187M1214K9246K8188Q5496R3579
10946A211979J8904j69988l60727m01324k71337m7956J14446J88658J51816M0236
10936D74707j1095P5950K38385L38987K94585J43800K3435m0746q3301p3473l8094
10925A343140m3297o6418j02887j91942j27666O0745J13540R6160J19787J39479
10915A340641J32672P5271n2255j69349j27215N543O4171J63m1317J4514J05022
10904A347861J02249j1591j05224j32607j50880j73746k33646k26776o3624J59945
$$ y = [1093049, 1437500, 1720839, 1821367, 1712930, 1556439, 1458198, 1435823, 1542528, 1751908, 1961922, 2153031, 2393744, 2669375, 2843926, 2843430, 2659534, 2349098, 1954008, 1576684, 1351079, 1265780, 1224449, 1152037, 1045867, 950443, 934256, 975470, 1004716, 1032904, 1118400, 1211979, 1230883, 1060895, 700168, 298844, 27507, -20449, 93997, 282655, 434471, 474707, 463612, 539562, 777947, 1116934, 1411519, 1555319, 1578754, 1538008, 1454707, 1381234, 1343140, 1299843, 1233425, 1130538, 938596, 810930, 871675, 985215, 1081375, 1201162, 1340641, 1473313, 1548584, 1496329, 1326980, 1199765, 1205308, 1269479, 1269642, 1228325, 1242839, 1347861, 1450110, 1438519, 1333295, 1200688, 1049808, 876062, 642416, 415640, 352016, 511961]
10894E11961L46862M56420M33758K93519J58980P6905J3576q4838j94650k71314
10884A741179l30297k87224j27251j1894P1589J22004O0824j3942m1531j06932
10874A076525k17740k47742j35933Q649J39398K43909J71799o7509k31949j69502
10864E69905R8928L53318L92755K59205J26093k4382k74748m78707m68576k77748
10854B76043q0122K7678O5899P2707L6023r4401k30734j74041k896O9064k2452
10843e7232j34309r6346M3379J93044K54010J79359M5575J1536Q0521J49759J60246
10832H29542L8579j62815k36291r0435J29660K52329K95038K98626K80279J83643
10822A818155l8183k84636l94539l51262j69260R4985K84476L09976P9794k23978
$$ y = [511961, 858823, 1315243, 1749001, 2042520, 2201500, 2278405, 2291981, 2207143, 2012493, 1741179, 1410882, 1123658, 996407, 984513, 1056102, 1178106, 1238930, 1224988, 1183457, 1076525, 858785, 611043, 475110, 483759, 623157, 867066, 1038865, 971356, 739407, 569905, 668833, 1022151, 1414906, 1674111, 1800204, 1775822, 1501074, 1022367, 553791, 276043, 195921, 223599, 289498, 362205, 398228, 303827, 73093, -100948, -103844, -34780, -57232, -191541, -287887, -244508, -51464, 202546, 381905, 427480, 439016, 519537, 669296, 829542, 868121, 705306, 469015, 378580, 508240, 760569, 1055607, 1354233, 1634512, 1818155, 1779972, 1495336, 1100797, 749535, 580275, 675260, 959736, 1269712, 1349506, 1125528]
10812A125528l28114j90008O1280J98692J47390L0309p4884j58955j52494j8083
10802F40661Q8774n354k00143l30021l81375l24885j06298J38089K61396L08455
10792H9299L61411L89476L81482K76597N2504j71746k36615j36632o1303J7296
10782I61769J02730Q9104o7173k80512l97891l66811j84560J12552L65286L68831
10772G03325J32339m7268m6817L3613Q5327J41632K59407K79917J53866m3047
10762A652294j79295j95106j23951m3469j9960n8334j31538j75803j83921j85975
10752C54942j15261k6047m3163p3981M0504K29558L14349K64613J51269M4411
10742A141194j0472O2122J92774K29881K54586K59057J61795O4211J1112m6886
$$ y = [1125528, 797414, 607406, 668686, 867378, 1014768, 1045077, 970193, 811238, 658744, 640661, 729435, 724081, 523938, 193917, -187458, -512343, -618641, -480552, -219156, 89299, 450710, 840186, 1221668, 1498265, 1550769, 1379023, 1142408, 1005776, 944473, 961769, 1064499, 1153603, 1086430, 805918, 408027, 41216, -143344, -30792, 334494, 703325, 835664, 788396, 741579, 775192, 860519, 1002151, 1261558, 1541475, 1695341, 1652294, 1472999, 1277893, 1153942, 1110473, 1090513, 1032179, 900641, 724838, 540917, 354942, 239681, 213634, 170471, 96490, 136994, 366552, 680901, 945514, 1096783, 1141194, 1130722, 1192844, 1385618, 1615499, 1870085, 2129142, 2290937, 2355148, 2366260, 2319374]
10732B319374j52131k43091k63885k47375j60796n2361l4358r6643j58488j54768
10722G55478m2220P8271J32160J27547O1874n3236j50874j62805r1744J8006J86024
10711H58481K94538J97872K7641o8549p0991o9614j54620j85583j65416k03288
10701D60471k48361k06321r4007n2286p4835p1998o5443m9591M5874J97213K71615
10690A12331K37705J91706J91903J77056N9546o6308m0262O0695J30825J55858
10680A211055J20382M024j83425k14141m8414M4265k4243j13992o9574O2128J25264
10669I13329Q2709K9179R3352J95508J41093M7354N6334O6282M0968K3005N4552
10658A743665J21941J32118R5492R0550J12328J79917K60428K07766L3258j63657
$$ y = [2319374, 2167243, 1924152, 1660267, 1412892, 1252096, 1199735, 1165377, 1068734, 910246, 755478, 713258, 791529, 923689, 1051236, 1113110, 1059874, 909000, 746195, 654451, 672457, 858481, 1153019, 1350891, 1378532, 1309983, 1238992, 1169378, 1014758, 829175, 663759, 460471, 212110, 5789, -88218, -140504, -215339, -287337, -352780, -402371, -356497, -159284, 112331, 350036, 541742, 733645, 910701, 970247, 903939, 863677, 924372, 1055197, 1211055, 1331437, 1335461, 1152036, 937895, 889481, 933746, 909503, 795511, 725937, 788065, 913329, 996038, 1025217, 1118569, 1314077, 1455170, 1502524, 1558858, 1625140, 1666108, 1689113, 1743665, 1865606, 1997724, 2093216, 2183766, 2296094, 2476011, 2736439, 2944205, 2977463, 2813806]
10648B813806l27672l97654l43493k56327j93180l8139J99302L63012M22974M80683
10638B723312N40554N16576M03741M21483O78085R76079J169227J323354J560991
10629A0313402J932386K331387K747503L172603L323775K832217J482582l48626
10621B7787229j930741k891835l264515l121743k637242k072335j597455j314615
10613H956748j164127j061221j036258j056211j013637p62598k79993J50859K18371
10604B951933J8240j21207j16470j01528j15043n7093N2305P2507J0653j5102
10594B579195k3389o5563j81607l17339l28806j87313K355J05353J2253j39971
10584A455168j81768j27117n1223K928R694m1767r2073k4913P9296J25417J85791
$$ y = [2813806, 2486134, 2088480, 1744987, 1488660, 1295480, 1257341, 1456643, 1819655, 2242629, 2723312, 3263866, 3780442, 4184183, 4605666, 5283751, 6259830, 7429057, 8752411, 10313402, 12245788, 14577175, 17324678, 20497281, 23821056, 26653273, 28135855, 27787229, 25856488, 22964653, 19700138, 16578395, 13941153, 11868818, 10271363, 8956748, 7792621, 6731400, 5695142, 4638931, 3625294, 2862696, 2582703, 2733562, 2951933, 2970173, 2848966, 2732496, 2630968, 2515925, 2458832, 2511137, 2583644, 2594297, 2579195, 2555806, 2490243, 2308636, 1991297, 1662491, 1475178, 1477533, 1582886, 1595139, 1455168, 1273400, 1146283, 1095060, 1097988, 1107682, 1065915, 973842, 948929, 1028225, 1153642, 1339433]
10573A339433K48918K03444J18666J01358J32785J59423P2043p6770j66426j91391
10563A941483j96115k21204l35210m11914l22363j46934l0672k576p579m6518
10553B20398l9782O5008J17282N0404l7528m1384j4514l6537l6840j572L1797
10542B76732m3657j07919n0969J4555Q1551J93958K69517K37213Q2250j21293
10532H31938k05005j55818o9844p405K6246P0847M6349j5063J5164J22037J69034
10521H28480J55015J67678J08287p2604k38544k17112K5104K61284K80255J12291
10511A410134n4191q0104M2430J61806J86181J53487n929k38229l94949m57977
10501G22659m77031m17116k51479o5346M827K3796P7445J50730J52956J15305
$$ y = [1339433, 1588351, 1791795, 1910461, 2011819, 2144604, 2304027, 2376070, 2299300, 2132874, 1941483, 1745368, 1524164, 1188954, 777040, 454677, 307743, 277071, 274495, 266916, 220398, 180616, 245624, 362906, 413310, 375782, 334398, 319884, 283347, 246507, 244935, 276732, 233075, 125156, 74187, 88742, 170293, 364251, 633768, 870981, 953231, 831938, 626933, 471115, 401271, 393866, 420112, 490959, 537308, 522245, 537409, 659446, 828480, 983495, 1151173, 1259460, 1186856, 948312, 731200, 756304, 1017588, 1297843, 1410134, 1355943, 1275839, 1318269, 1480075, 1666256, 1819743, 1813814, 1575585, 1180636, 722659, 245628, -171488, -422967, -488313, -483486, -459690, -382245, -231515, -78559, 36746]
10491C6746J65634J89948J00432M47j8393j1641j4412n3970l4601R1267J77401
10480F28858J99053K31056L16496L58177K94713J82047K7840r2979j60920k28202
10470A756139k42143j56349q2464o9570r9698j50268j76878j34469p6835m5672
10460E21793l2534K5444J45590K70938L66433L78590K81461Q8420j27010k91236
10450A627889l19571k49781k03600j61248j31563j52205j98404j87335j22451
10441i8269p8154N28O7574J9259n6320m9390M0510J32656L0593j28878j11005
10430b30896m5797j5631N8514K56336M30734M09472K97703K14622J02832o9184
10420A408705k35275l04558k36787j10342m2322l6168j9562J0660K2617J9578
$$ y = [36746, 202380, 392328, 492760, 493207, 474814, 463173, 448761, 394791, 360190, 451457, 628858, 827911, 1058967, 1375463, 1733640, 2028353, 2210400, 2238240, 2145261, 1984341, 1756139, 1513996, 1357647, 1275183, 1205613, 1105915, 955647, 778769, 644300, 567465, 521793, 489259, 514703, 660293, 931231, 1297664, 1676254, 1957715, 2046135, 1919125, 1627889, 1308318, 1058537, 854937, 693689, 562126, 409921, 211517, 24182, -98269, -176423, -175895, -108321, -89062, -145382, -194772, -154262, -21606, 8987, -119891, -230896, -276693, -292324, -233810, 22526, 453260, 862732, 1160435, 1375057, 1477889, 1408705, 1173430, 868872, 632085, 521743, 479421, 443253, 423691, 434351, 456968, 476546]
10410D76546O9532J64521J64525P286k01817k71401j76306o189J34684J25571
10400D86952N2253J3502j844l7281p1467j16995j47347j04139l110J18225K55177
10389D43926K77610J48872N0416M4911L2451R919k810l5251l2972k5147k3950
10378H87975m2723j72854k65324j18943R1470K29358K92330K73559K71545K52070
10368A698463R9868j19898k08581k26917k84724l40817k86126j28074m7660m316
10358A51218J02741J11095Q1068J20206J57702J34200P7040M5188k3375j80441
10348G76642k57783j55276J210Q8223Q3430Q5644R6109M3011K4554J17460J82284
10337A085508R0293n6152q0526j555P5670P1005m7034j04829k2883N6245N9642
$$ y = [476546, 546078, 710599, 875124, 882410, 680593, 409192, 232886, 226697, 361381, 486952, 539205, 552707, 550863, 513582, 442115, 325120, 177773, 73634, 70524, 188749, 443926, 721536, 870408, 920824, 965735, 998186, 1008105, 1005295, 970044, 937072, 911925, 887975, 845252, 672398, 407074, 288131, 379601, 608959, 901289, 1174848, 1446393, 1698463, 1798331, 1678433, 1469852, 1242935, 958211, 617394, 331268, 203194, 155534, 151218, 253959, 365054, 446122, 566328, 724030, 858230, 935270, 980458, 957083, 776642, 518859, 363583, 364793, 453016, 536446, 622090, 718199, 761210, 785764, 903224, 1085508, 1175801, 1119649, 1039123, 1037568, 1113238, 1184243, 1137209, 1032380, 1009497, 1065742, 1125384]
10326A125384j7019j63835l29811l83912k05405R8102K78520K77164J84340J16928
10316I80456P728k06776m32610m30571j3885L23990J84695q9675j48528J913J72121
10305C48858K00838O4439j34766k26382j75997p8970L8963J70397K51932K31002
10295F90314J19076K6922l5408n6111J2211Q3196J54288J65979J40967J96588
10285A498022L29905M03998L14954J42286j0037j67193k44463k11459j39162q7010
10275A829841j93766l86817l73685j09705J19557K26229K63339J52827r4610l14532
10265A118678k96033n9434J07887J03339l9373k23943k48184r1468L1624L0139
10255D33232O2485J95376K02483K7977j82354l07773k46888j40892r4204k8535
$$ y = [1125384, 1108365, 944530, 614719, 230807, 25402, 123504, 402024, 679188, 863528, 980456, 988184, 781408, 348798, -81773, -95658, 228332, 413027, 323352, 174824, 176737, 348858, 549696, 614135, 479369, 252987, 76990, -1980, 36983, 207380, 459312, 690314, 809390, 836312, 800904, 744793, 757004, 840200, 994488, 1160467, 1301434, 1498022, 1827927, 2231925, 2546879, 2689165, 2679128, 2511935, 2267472, 2056013, 1916851, 1829841, 1636075, 1249258, 875573, 765868, 885425, 1111654, 1374993, 1527820, 1433210, 1118678, 822645, 763211, 871098, 974437, 935064, 711121, 462937, 371469, 403093, 433232, 495717, 691093, 893576, 921553, 739199, 431426, 184538, 43646, -50558, -79093]
10245g9093N6358N0805o5454k12073k52200j32277R268P4463J24797K20963L02436
10234I7993K90748J73074R5294J17487K17195K60136J47994K2069N143J1991o4090
10223A375034j85471l09190l72827k84446p4218J28147K14900J87844R3618n2698
10213G20693j21509o3688j6976r8973k18783k01825o9637J0488n9235q6933N9640
10202a46738K39921K73605K17321K40305L14137L13626K04277N0374j25663k51891
10192A329274k43003p5290J00351Q9548k3868j19127j97930k28504j64490n3039
10182D13922r232j7354l8573r0932j29525p0455J09712K65677K51239J75876R4166
10171I54521J0641l9607j7014Q9287J87626J96886J53273J06694M5673J4129K4759
$$ y = [-79093, -22735, 28070, -37384, -249457, -501657, -633934, -624666, -550203, -425406, -204443, 97993, 388741, 561815, 657109, 774596, 991791, 1251927, 1399921, 1421990, 1427133, 1439124, 1375034, 1189563, 880373, 507546, 223100, 148882, 277029, 491929, 679773, 773391, 720693, 599184, 535496, 518520, 419547, 200764, -1061, -70698, -60210, -119445, -206378, -146738, 93183, 366788, 584109, 824414, 1138551, 1452177, 1656454, 1706828, 1581165, 1329274, 1086271, 1010981, 1111332, 1200880, 1177012, 1057885, 859955, 631451, 466961, 413922, 404690, 387336, 348763, 257831, 128306, 57851, 167563, 433240, 684479, 860355, 954521, 965162, 925555, 908541, 997828, 1185454, 1382340, 1535613, 1642307, 1687980, 1702109, 1726868]
10160A726868M1008P1255Q4834M6108j5478m7923k8206m249j20891l13834l31449
10149A108043k36479k70313l44512l43393l14856k99075k52183j06090O7736Q8872
10139i02250m3054j38081j6509J88931L02700L54060L50143L12290K13207L1156
10129F52593j26942j02829Q7275K40312K02033J5974j58124k11454j85742j64762
10119B48334j73281j92399j40571j1119J09210J95590J02072j02154j16653K891
10109g8080K5959n163P767L0660N5398J11798J51426J40068Q5949M5252N6007
10098F27041J29716J59396J12384M1626m9926o2592O3259J48239J20770L8004
10088A327917m9147p4457l5511O6864M5690q3850r3775j27986k83746l71700k74318
$$ y = [1726868, 1767876, 1839131, 1923965, 1970073, 1954595, 1906672, 1878466, 1874217, 1753326, 1439492, 1108043, 871564, 601251, 256739, -86654, -401510, -700585, -952768, -1058858, -991122, -902250, -945304, -1083385, -1099894, -910963, -608263, -254203, 95940, 408230, 621437, 652593, 525651, 422822, 510097, 750409, 952442, 968416, 810292, 598838, 413096, 248334, 75053, -117346, -257917, -269036, -159826, 35764, 137836, 35682, -80971, -78080, -52121, -57284, -49517, -18857, 36541, 148339, 299765, 439833, 525782, 571034, 627041, 756757, 916153, 1028537, 1070163, 1020237, 957645, 1020904, 1169143, 1289913, 1327917, 1278770, 1204313, 1168802, 1235666, 1281356, 1197506, 1103731, 975745, 691999, 320299, 45981]
10077D5981j17842l598J12856J17722J8189q6917j73657j20521J04748L30787
10067B27748L75036K31277R038j09840K7568K36226J93469m3969j86576j46430
10057H13547k0479M4908N4652J13904K15913K18629P5169j32734l03057l57679
10047G22773k85378j63727p0969n384M4769N5582R4683J87053K32129K04831J17508
10036A133870k723j33306k57091l13163k57388j13900o656L2011L4865K3181N9163
10025A98863Q6680R931o1796L2429J73951K34657K47003K12149J43760M3245p2620
10014A248252j27032r5241o1758j06112j78644j31996j152Q2691Q1471J7214k9551
10003F98142p0660j34247j19391o746R6928J04640O8906P3112O0747M081j6252
$$ y = [45981, -71861, -75459, 37397, 155119, 173308, 86391, -87266, -207787, -103039, 227748, 602784, 834061, 843099, 733259, 760827, 997053, 1190522, 1146553, 959977, 813547, 793068, 837976, 892628, 1006532, 1222445, 1441074, 1516243, 1383509, 1080452, 722773, 437395, 273668, 202699, 197315, 242084, 297666, 392349, 579402, 811531, 1016362, 1133870, 1131147, 997841, 740750, 427587, 170199, 56299, 49643, 81654, 116519, 139700, 198863, 285543, 295474, 233678, 266107, 440058, 674715, 921718, 1133867, 1277627, 1320872, 1248252, 1121220, 1025979, 964221, 858109, 679465, 547469, 546317, 629008, 710479, 727693, 698142, 627482, 493235, 373844, 367098, 464026, 568666, 637572, 710684, 771431, 775512, 759260]
9992G59260j1793n3169l7375J4515R5227J98274K50038K83366K55543J41659R3634
9981A989179J72286K31651J58171l3229j84100k16406k69154l34257k85509j47942
9971A080690J6772J01661O1057R6072J78558Q9459l1603k594O1259P4251J61923
9960A887505K67063K42687J47760o028j24342o7711J5083K7299n084j71555m19852
9949A792825n21473l92251j67865n6726k6688J07880K48526K63790K38826K01840
9939A688684J06270L1349O4750Q3381j5900j62114k12763j25498m4748n5841r1989
9928A265581j01262j21706j38864j01663m7282j05180k55584k35723q0712j8878
9918E8727R313O7282L2842n936M5124J26050J23086K5110j5245J1580r544m0250
$$ y = [759260, 747467, 694298, 656923, 671438, 766665, 964939, 1214977, 1498343, 1753886, 1895545, 1989179, 2161465, 2393116, 2551287, 2518058, 2333958, 2117552, 1848398, 1514141, 1228632, 1080690, 1097462, 1199123, 1260180, 1356252, 1534810, 1624269, 1592666, 1590072, 1651331, 1725582, 1887505, 2154568, 2397255, 2545015, 2538987, 2414645, 2346934, 2362017, 2389316, 2384232, 2212677, 1792825, 1271352, 879101, 711236, 654510, 627822, 735702, 984228, 1248018, 1486844, 1688684, 1794954, 1826303, 1891053, 1974434, 1958534, 1796420, 1583657, 1458159, 1413411, 1357570, 1265581, 1164319, 1042613, 903749, 802086, 754804, 649624, 394040, 158317, 77605, 58727, 68040, 135322, 168164, 162228, 207352, 333402, 456488, 481598, 466353, 477933, 468389, 428139]
9906D28139j9940K1661J28729K07417J11967j5368J2802J53705K67278L09653
9896A606043L70473M90661N80682O01655N03905L03495J23788p6158k91150m47960
9886C765434o08313p44730o69367m53518l28580k28430m7116J19876J63008J55158
9876A123422J42199M8557r2140j88132j69769r196J89677K39165P3286r7223j44604
9865A115242o5490Q0203J71937K00125J18856N442j7712O3599J89814K16923R8237
9854B177176j04537k34061k50790k78834l36876l41138l16803l70036l12175k3607
9844c91681K74571L92151L27202K24428J85646J53698L7890l0724P3394J39743
9834A386318N0531j723L4170L9766L0487O5665P4324l1145k24588l29933k58406
$$ y = [428139, 408199, 429860, 558589, 766006, 877973, 862605, 875407, 1029112, 1296390, 1606043, 1976516, 2467177, 3047859, 3649514, 4153419, 4456914, 4580702, 4504544, 4213394, 3765434, 3157121, 2412391, 1743024, 1289506, 960926, 732496, 685380, 805256, 968264, 1123422, 1265621, 1314178, 1222038, 1033906, 864137, 854941, 1044618, 1283783, 1357069, 1259846, 1115242, 1049752, 1129955, 1301892, 1502017, 1620873, 1626315, 1608603, 1672202, 1862016, 2078939, 2177176, 2072639, 1838578, 1587788, 1308954, 972078, 630940, 314137, -55899, -368074, -391681, -117110, 275041, 602243, 826671, 1012317, 1166015, 1203905, 1173181, 1246575, 1386318, 1436849, 1435126, 1469296, 1509062, 1539549, 1605214, 1679538, 1648393, 1423805, 1093872, 835466]
9823H35466m0033K32151L62307K63414J13543O6931O7888P0916N1138K630r6531
9812A929820k30383k71083j92660m6686N0666k6945j85055k19098p9344O6360
9802G95592J18167Q5255M8171N6200L4777j4593M7886J88700K44629J34734m9593
9791A689925j56511j73075j36197l3307K9654M1264m586p5390l6096J20640K52088
9780A518409K34802Q9427m8882r5346j47187k44300k42255n4995J67706K37572
9770A414951K14782J96661R1529o5904j21850r0960k3052m7312j52252k57315
9760A159278l51861l55532k61574j25127J84M5797N3816J49099K60952K65958
9750H40990J59942n870j73520k43033j36552O8202J76248J45835J27404J37054
$$ y = [835466, 795433, 1027584, 1389891, 1653305, 1766848, 1833779, 1901667, 1972583, 2023721, 2026351, 1929820, 1699437, 1428354, 1235694, 1189008, 1239674, 1212729, 1027674, 808576, 729232, 795592, 913759, 999014, 1047185, 1103385, 1138162, 1123569, 1171455, 1360155, 1604784, 1739518, 1689925, 1533414, 1360339, 1224142, 1190835, 1220489, 1261753, 1257167, 1181777, 1145681, 1266321, 1518409, 1753211, 1842638, 1793756, 1698410, 1551223, 1306923, 1064668, 1009673, 1177379, 1414951, 1629733, 1826394, 1917923, 1852019, 1730169, 1639209, 1616157, 1568845, 1416593, 1159278, 807417, 451885, 190311, 65184, 65368, 111165, 164981, 314080, 575032, 840990, 1000932, 995062, 821542, 578509, 441957, 510159, 686407, 832242, 959646, 1096700]
9740A096700Q5985o1502j63812j18743j3730O8288P0230L934j6430N8738J23880
9729A133538O0994o7541j95026k64981k37011j80791j10105j4133L1465j0160
9719A46249o2293p3227L4002K52834M17362M13042L21278J24798j85284l72159
9709A016602l13610j18516J33819L11137L37760K88556K04325P3899l8774p7288
9699A817910j00733j10675j02266p7865M6148J46848L3660k57155m41767l21454
9689F32651j24572m0731J525J9315j1744n0397o2343j6618J52418L70181M49340
9678A319025L85858K61442J11138J9020L0199P337o8433r4531n9393R391O7667
9667A988720O8861j23884l86016m48489l43634j37309J21850L03304L30054J74597
$$ y = [1096700, 1182685, 1121183, 957371, 838628, 824898, 893186, 963416, 967350, 950920, 1009658, 1133538, 1194532, 1126991, 931965, 666984, 429973, 249182, 139077, 124944, 156409, 146249, 83956, 10729, 44731, 297565, 714927, 1127969, 1449247, 1574045, 1388761, 1016602, 702992, 584476, 718295, 1029432, 1367192, 1655748, 1860073, 1933972, 1895198, 1817910, 1717177, 1606502, 1504236, 1426371, 1472519, 1619367, 1653027, 1395872, 954105, 632651, 508079, 467348, 468873, 488188, 476444, 426047, 363704, 347086, 499504, 869685, 1319025, 1704883, 1966325, 2077463, 2096483, 2126682, 2134019, 2065586, 1971055, 1911662, 1921053, 1988720, 2057581, 1933697, 1547681, 1099192, 755558, 618249, 740099, 1043403, 1373457, 1548054]
9657A548054o0259j71219j20469M8677K37204K62063J15783j00431k04859j21303
9647A433241L6580O5390j4101n5106j29712k37823k27852j55148j25426o9931
9637E20112M9522J42264J70602J63342N5887j46898j92510j00838j8979J81062
9627H23566M47808M71163K32453J7669m2337j8969k5351j44313l29797l35627
9617A096265j30114R2273J33897m7246k46138k86127k24687j85974j08348O1068
9607A54869J81381J95871J29010j7333k03751k61486j67347m7546Q1086J87983
9597B32737K29785J47713O0103Q8322J89550L00702L10893J70762J5260n8399
9587A687428j48687k59648l60490l91642k92967j20361K0836J28855K49306L37265
$$ y = [1548054, 1487795, 1316576, 1196107, 1244784, 1481988, 1744051, 1859834, 1759403, 1554544, 1433241, 1469821, 1535211, 1521110, 1466004, 1336292, 1098469, 870617, 715469, 590043, 520112, 569634, 711898, 882500, 1045842, 1101729, 954831, 762321, 661483, 642504, 823566, 1271374, 1742537, 1974990, 1992659, 1950322, 1931353, 1906002, 1761689, 1431892, 1096265, 966151, 1058424, 1192321, 1145075, 898937, 612810, 388123, 202149, 93801, 154869, 336250, 532121, 661131, 643798, 440047, 178561, 11214, -36332, 44754, 232737, 462522, 610235, 670338, 758660, 948210, 1248912, 1559805, 1730567, 1745827, 1687428, 1538741, 1279093, 918603, 526961, 233994, 113633, 134469, 263324, 512630, 849895]
9577H49895K72440K6384k04742l04696k80296q0749K53064N10690N06793L08112
9567A856895J16684j4343j93079l73404m29197l82040k53288n1077L2406p1408
9557B38149j32775r2792J2732J52089J91065J19383J19644K13635K80575K31473
9547A333178J54721J16107K7634q5298j11317k6202J45340L40183M05468K71298
9537B571112J03880M8959P0691L6699m7834j05147j34020j40385q5075n0196o8164
9526B200520o7449r4447j65734j97426j02443O5668J91620L26513M37355M23567
9516C017744M12678M68334N38533N29268M68305M74553N44224N89568N78917O94783
9506H316907R98413J261313J373879J387981J434800J517597J476358J340528
$$ y = [849895, 1122335, 1148719, 943977, 639281, 358985, 278236, 531300, 1041990, 1548783, 1856895, 1973579, 1959236, 1766157, 1392753, 963556, 581516, 328228, 277151, 309557, 238149, 105374, 12582, 25314, 177403, 368468, 487851, 607495, 821130, 1101705, 1333178, 1487899, 1604006, 1631640, 1546342, 1435025, 1408823, 1554163, 1894346, 2299814, 2571112, 2674992, 2723951, 2794642, 2831341, 2783507, 2678360, 2544340, 2403955, 2318880, 2268684, 2200520, 2133071, 2038624, 1872890, 1675464, 1573021, 1638689, 1830309, 2156822, 2594177, 3017744, 3430422, 3898756, 4437289, 4966557, 5434862, 5909415, 6453639, 7043207, 7622124, 8316907, 9315320, 10576633, 11950512, 13338493, 14773293, 16290890, 17767248, 19107776]
9498A9107776J147484P51976K48794j57061m47811o74572q65416j038753j238144
9489A6834273j447490j551277j438155j162903q92605p66265p91403p82367o68557
9480G333251n30310n01295n95556o41401n66174m05838j80944m7102o7060j44209
9470C653362k30172k40169k28233k13061j52719j53254j55027r6470o6553r3436
9460B024268j59819k19537j91107j14417j17937j28637J483J74245J87492J29745
9450A585779Q8982M6867o259K8734J44057J94279K29525L11657L64680L61676
9440C349977K75421J56914J03192L7025j18376k51342l27885l45776l22664k68583
9430B287903j62470o6820m384L4658n225q2027j14994r4719n7395q0885q9355
$$ y = [19107776, 20255260, 21007236, 21256030, 21098969, 20651158, 19976586, 19111170, 18072417, 16834273, 15386783, 13835506, 12397351, 11234448, 10341843, 9575578, 8784175, 8001808, 7333251, 6802941, 6301646, 5706090, 5064689, 4498515, 4092677, 3911733, 3864631, 3797571, 3653362, 3423190, 3183021, 2954788, 2741727, 2589008, 2435754, 2280727, 2184257, 2117704, 2024268, 1864449, 1644912, 1453805, 1339388, 1221451, 1092814, 1094297, 1268542, 1456034, 1585779, 1674761, 1721628, 1715369, 1744103, 1888160, 2082439, 2311964, 2623621, 2988301, 3349977, 3625398, 3782312, 3885504, 3922529, 3804153, 3552811, 3224926, 2879150, 2556486, 2287903, 2125433, 2058613, 2054229, 2088887, 2083662, 2001635, 1886641, 1791922, 1734527, 1653642, 1564287]
9419A564287r183J21567R7612j80025m06763l68706j36565J07352K49744K72754
9409A312074K02574J42747J00390O9954Q4208R2592j8162k21722k92447j59311
9399A312897p684Q7132J00877O5837J07001J65806J21363L6459n189m1231j01428
9388A841840q4860l4459p9862j42950j05174L6429J93067L03144L62302M09687
9378B699164L53785J25908j21448k29129j55036o0739j02165k30523l58081l26927
9368A594809j45269R060O5925l5976j48015r5265N9283J57723P9468q1661j49172
9357A310910j36233n8046R3847K43878K83627K59509J76058N662k11299l24192
9347A643721l46727k75474q4411N6778J30234J77813J58310J50549J24490M4291
$$ y = [1564287, 1555104, 1676671, 1774283, 1594258, 1187495, 818789, 682224, 789576, 1039320, 1312074, 1514648, 1657395, 1757785, 1827739, 1911947, 2004539, 1986377, 1764655, 1472208, 1312897, 1305213, 1392345, 1493222, 1559059, 1666060, 1831866, 1953229, 1989688, 1984499, 1943268, 1841840, 1756980, 1722521, 1642659, 1499709, 1394535, 1430964, 1624031, 1927175, 2289477, 2699164, 3052949, 3178857, 3057409, 2828280, 2673244, 2612505, 2510340, 2279817, 1921736, 1594809, 1449540, 1458600, 1524525, 1488549, 1340534, 1245269, 1304552, 1462275, 1541743, 1460082, 1310910, 1174677, 1116631, 1210478, 1454356, 1737983, 1997492, 2173550, 2179212, 1967913, 1643721, 1296994, 1021520, 937109, 993887, 1124121, 1301934, 1460244, 1610793, 1735283, 1779574]
9337A779574M3975Q9064O6829J8507J6154J7534o2344j56024j48216o1709N8849
9326A662193J05531J25197J19369K1705p0985q3128n0490k3917R218J3167K0493
9315A848353P4102O2343m8110r2150j4865K6969n5323k09809k22279l5312J24195
9304A458114R1465j07429k90629k38924o4660l3495j55632k39554j44741k4536
9294B49979l8098r5221j26415k18000l31348k62910J19174N81397Q00754O59427
9284A338739K95528o888j22384j17962r1766m0124N1982k3218k04855k15169j0559
9273H53324K20220L06681K13401K0402j17350j48999j31416p9773r727L8282M9448
9262A214493J8841l7789q2829j28574j91059j96664p4801P9677J10914R3157M0856
$$ y = [1779574, 1823549, 1912613, 1979442, 1997949, 2014103, 2031637, 1969293, 1813269, 1665053, 1603344, 1662193, 1767724, 1892921, 2012290, 2033995, 1963010, 1879882, 1829392, 1805475, 1814693, 1827860, 1848353, 1922455, 1984798, 1936688, 1844538, 1829673, 1856642, 1801319, 1591510, 1369231, 1333919, 1458114, 1549579, 1442150, 1151521, 912597, 847937, 814442, 658810, 419256, 274515, 249979, 211881, 116660, -9755, -227755, -559103, -822013, -702839, -121442, 679312, 1338739, 1634267, 1627379, 1504995, 1387033, 1295267, 1255143, 1307125, 1283907, 1079052, 863883, 853324, 1073544, 1380225, 1593626, 1614028, 1496678, 1347679, 1216263, 1136490, 1126763, 1165045, 1214493, 1233334, 1195545, 1112716, 984142, 793083, 596419, 521618, 601295, 712209, 805366, 846222]
9251H46222l9575n6557j2126Q8948J93067K26851J67213O351j64817k24583j68059
9240H62935m3472k467k4845N7277J38923J45100J36122J92712K27883J39566k2346
9229A807388j39876j32387p6629l4866J6660M4344L3810J42931K64420J41749
9219B067544p2883j66156k38939l66335l94593l02642j54349n79N5223L5167M6543
9208E08001Q7730J28336J71881K32350K93369K70682O6478l27805o51695o46922
9198A32405m07057j07821J69742L04149K18583O9272L9822R9949Q9231K5835K3617
9187F57727P8751J62335K36483K31615J04965j10692k71637k36570j36370j24559
9177E92048q5471O2404J60894J43702J12025O5635j8825j01553k443K58462L27034
$$ y = [846222, 806647, 750090, 737964, 826912, 1019979, 1246830, 1414043, 1420394, 1255577, 1030994, 862935, 819463, 816996, 792151, 849428, 988351, 1133451, 1269573, 1462285, 1690168, 1829734, 1807388, 1667512, 1535125, 1458496, 1423630, 1440290, 1484634, 1518444, 1661375, 1925795, 2067544, 1994661, 1828505, 1589566, 1223231, 828638, 525996, 371647, 371068, 426291, 461458, 508001, 595731, 724067, 895948, 1128298, 1421667, 1692349, 1758827, 1431022, 779327, 132405, -274652, -382473, -212731, 91418, 310001, 379273, 419095, 519044, 608275, 634110, 657727, 736478, 898813, 1135296, 1366911, 1471876, 1361184, 1089547, 852977, 716607, 592048, 506577, 568981, 729875, 873577, 985602, 1051237, 1032412, 930859, 928416, 1186878, 1513912]
9166A513912J23484n2715r7475j57845j29045J05434L23904L73104K59191J16112
9156B378061J38350J80096J517k60787l44899k41507j73966j78114j70273r3917
9146A234561L499O9155P1117K1574l4340o3429k685J09222J89539K56097L01243
9135B155553K06193j6371k05166k69919k36758j23119o0346p7673r8951q4176
9125A189267r0379j49226k11707j77436N0632K75042L15148L15270L50046L07283
9115B173940J65776j3458j10146j12995j15446j87389k95550k95895j89060j43031
9105H76746j22675k5206N1571M5152K6923l0561j33702j09696J1872O0982Q4676
9094G36082R6987M0497o0750n7253K5262K6191j08116k61087l32431k44299k2751
$$ y = [1513912, 1637396, 1584681, 1487206, 1329361, 1200316, 1305750, 1629654, 2002758, 2261949, 2378061, 2516411, 2696507, 2698024, 2437237, 2092338, 1850831, 1676865, 1498751, 1328478, 1234561, 1238060, 1307215, 1378332, 1399906, 1365566, 1302137, 1299452, 1408674, 1598213, 1854310, 2155553, 2361746, 2345375, 2140209, 1870290, 1633532, 1510413, 1450067, 1372394, 1273443, 1189267, 1098888, 949662, 737955, 560519, 611151, 886193, 1201341, 1516611, 1866657, 2173940, 2339716, 2326258, 2216112, 2103117, 1987671, 1800282, 1504732, 1208837, 1019777, 876746, 754071, 728865, 780436, 825588, 852511, 821950, 688248, 578552, 590424, 651406, 736082, 833069, 873566, 812816, 755563, 780825, 807016, 698900, 437813, 105382, -138917, -161668]
9083a61668J64591J87391J20431N4523l5898r0730m2874N8180J84411K31311J16999
9072G86667n1708j07964m0303l5851j21432j11021k396J42996K78933K95255K16115
9061A249291J27813L862r0688p0675n0884k1242Q6744J82483J18828m3582j26387
9050A365563q5843n1990j04992j53829j64220j03861K5609J08596O2362n3533
9040H43862j8370J31477J84759J60839J12212Q0183R8330J00977J16091J18886
9030A929246P1246j3344q2571j25236j78736j68365p6533L0908J49824K35130
9020A771569K08782K5925k05758k68330j25513N6585K22738M16464N37406N67763
9010C207631N60003N04939M57204M86948N72837N84594M51796K67566R9714r5534
$$ y = [-161668, 2923, 190314, 310745, 365268, 329370, 238640, 195766, 253946, 438357, 669668, 786667, 734959, 626995, 586692, 550841, 429409, 318388, 315992, 458988, 737921, 1033176, 1249291, 1377104, 1380966, 1290278, 1219603, 1168719, 1147477, 1234221, 1416704, 1535532, 1491950, 1365563, 1279720, 1227730, 1122738, 968909, 804689, 700828, 726437, 835033, 897395, 843862, 825492, 956969, 1141728, 1302567, 1414779, 1494962, 1593292, 1694269, 1810360, 1929246, 2000492, 1987148, 1904577, 1779341, 1600605, 1432240, 1355707, 1386615, 1536439, 1771569, 1980351, 2006276, 1800518, 1532188, 1406675, 1463260, 1685998, 2102462, 2639868, 3207631, 3767634, 4272573, 4729777, 5216725, 5789562, 6374156, 6825952, 7093518, 7193232, 7097698]
9000G097698l58575o01250p18894p10935n52229m01027l68786l87200m17775l95165
8990B185862k75961j24375k5660O4747J46855J40895J07423J09931J21922J43356
8980B594995K64588M22869L10100k9932k62694k51099q6842k9071j39357j97263
8970B596294j26048R201Q2377l4721j38072r4947m7618o6997j60743k92479k93886
8959A432361j11046J24983K70615K08183l1592k38305l13690k53578j45575p9768
8949H62588l4189K6682R2988J88545K50719K08231N7342p9039p6623k0692k2289
8938A454263J1097J03125J61946J84658K06885J62317L0705n7292k2452L9947
8928B275199K9141J7881J9862k3180j63211k15545o9593N9858L0106n5774o6029
$$ y = [7097698, 6739123, 6137873, 5418979, 4708044, 4155815, 3754788, 3386002, 2998802, 2581027, 2185862, 1909901, 1785526, 1759866, 1824613, 1971468, 2112363, 2219786, 2329717, 2451639, 2594995, 2859583, 3282452, 3592552, 3562620, 3299926, 3048827, 2961985, 2932914, 2793557, 2596294, 2470246, 2479447, 2561824, 2527103, 2389031, 2294084, 2246466, 2179469, 2018726, 1726247, 1432361, 1321315, 1446298, 1716913, 1925096, 1893504, 1655199, 1341509, 1087931, 942356, 862588, 828399, 855081, 948069, 1136614, 1387333, 1595564, 1652906, 1573867, 1497244, 1476552, 1454263, 1465360, 1568485, 1730431, 1915089, 2121974, 2284291, 2314996, 2257704, 2235252, 2275199, 2304340, 2322221, 2342083, 2318903, 2155692, 1940147, 1870554, 1930412, 1960518, 1904744, 1838715]
8917A838715n3538r1373k09368l83837m13742j07860K16584K68371J81723J10463
8907A356138J8212j22264k02424j53680m9265K2296J16953K58860K74382J19659
8897A638867q6j810m1541j28227j12082j3428O0649N0978m2186j56303k33714
8886A021117k47574j72940n6216M0988J01141Q5159j976n1297r0663p5017J69
8875E52891J6842o1127j01695j0603J43753K86854L84849M21682M04770L01737
8865B339953K00094J51771M4738l4065r2320k24263l40483l68055k86513j41287
8855A249570L5295K49325M14712N36484N46660L50654Q5962r9818j72005k04273
8845B992566k63022k56595q4987J51413K14678Q7181r25L2888K7922j27134k28451
$$ y = [1838715, 1785177, 1693804, 1484436, 1100599, 686857, 578997, 795581, 1063952, 1245675, 1356138, 1374350, 1252086, 1049662, 895982, 846717, 869013, 985966, 1244826, 1519208, 1638867, 1638781, 1636971, 1595430, 1467203, 1355121, 1341693, 1402342, 1453320, 1411134, 1254831, 1021117, 773543, 600603, 544387, 585375, 686516, 771675, 769699, 718402, 627739, 552722, 552891, 569733, 508606, 406911, 396308, 540061, 826915, 1211764, 1633446, 2038216, 2339953, 2540047, 2691818, 2736556, 2702491, 2610171, 2385908, 2045425, 1677370, 1390857, 1249570, 1284865, 1534190, 1948902, 2485386, 3032046, 3382700, 3468662, 3368844, 3196839, 2992566, 2729544, 2472949, 2387962, 2539375, 2754053, 2841234, 2840309, 2873197, 2901119, 2773985, 2545534]
8834B545534j95235j62472j25220l2421P7775J55903J54873J24103J01986J0408
8824B655234j23633j84449j95431j09253N1609J50682J22310J124j05676j22188
8814B140329r3371o2821o2141j30076k22358k39419k01627k32229j89692J8791
8804G25386J64336J74446J18140O7162R8624R5567r129j68238k43107j65985K3425
8793H80627J91070K45191K07138J90674K17579Q9212j93598l11185j42611L8414
8783A412511L6786n844m9163j57801k61946l29391k68693k800K90737L90149L81160
8772A435705L60934K49538Q5613r4101k98176m17469l80247k41729k3337K09244
8762H85975K87189J79800N3170N805J462J2488K0284J37758M20904N72836L90814
$$ y = [2545534, 2350299, 2187827, 2062607, 2030186, 2107961, 2263864, 2418737, 2542840, 2644826, 2655234, 2531601, 2347152, 2151721, 2042468, 2094077, 2244759, 2367069, 2368193, 2262517, 2140329, 2046958, 1984137, 1921996, 1791920, 1569562, 1330143, 1128516, 896287, 706595, 725386, 889722, 1064168, 1182308, 1249470, 1348094, 1443661, 1434532, 1266294, 1023187, 857202, 880627, 1071697, 1316888, 1524026, 1714700, 1932279, 2021491, 1827893, 1516708, 1374097, 1412511, 1449297, 1443453, 1394290, 1236489, 974543, 645152, 376459, 373659, 664396, 1054545, 1435705, 1796639, 2046177, 2131790, 2037689, 1739513, 1322044, 941797, 700068, 676731, 885975, 1173164, 1352964, 1406134, 1411939, 1413401, 1425889, 1446173, 1583931, 2004835, 2577671, 2968485]
8751B968485J05490r2091j91561k28777j86108p5477k2579p2715j28370r6036
8741A980261l9886M407O7767Q9919q345j59142k25254j32994M6024J28008L9893
8730A790658j14043j90716m3917K08708L59111L47595K22503R8426L9114K6788
8720B744227K6971L0907N5079K2904r4884j80587k43772l17399l65178l12892
8710A365376k02920p9391R8212L05900L91064K23589p0844j89851j59484j71122
8700A510529m9320K40214L45627K01820J4478r4999o4875N4496J10118O4346r1632
8689B240802k64659k99583j76150l7665n625p8536j32556n2506R1335J37785M9856
8678A472498J9569O8952O8886O6308J13371J23071R7603J37234K68751L16191
$$ y = [2968485, 3073975, 2981884, 2790323, 2561546, 2375438, 2299961, 2277382, 2204667, 2076297, 1980261, 1940375, 1944782, 2012549, 2102468, 2094123, 1934981, 1709727, 1576733, 1622757, 1750765, 1790658, 1676615, 1485899, 1441982, 1650690, 2009801, 2357396, 2579899, 2678325, 2717439, 2744227, 2771198, 2802105, 2857184, 2880088, 2785204, 2604617, 2360845, 2043446, 1678268, 1365376, 1162456, 1083065, 1181277, 1487177, 1878241, 2101830, 2030986, 1841135, 1681651, 1510529, 1461209, 1701423, 2047050, 2248870, 2263348, 2168349, 2103474, 2157970, 2268088, 2332434, 2240802, 1976143, 1676560, 1500410, 1462745, 1457120, 1378584, 1246028, 1193522, 1284857, 1422642, 1472498, 1492067, 1561019, 1629905, 1696213, 1809584, 1932655, 2030258, 2167492, 2436243, 2752434]
8668B752434K05353M9409j1918O1914K16946L76490M40841L55342J43585o1801
8658D528595r5564O199M6275O4256J86760L15937K67940J18751J23652K15849
8648E778650J33283j6151m3385N2021K41123L93043M44819M62890M04269L33264
8638H183826K66731J57624J78203M08594N97100O87782Q05558R60492J159103
8629A3405013J303426J361674J465114J665640J960119K300864K590587K818270
8621B8870707L071411L362584L576882L596120L351265K844756K209570J421595
8613E2304890M33477o10614j599409k354914k839577l143950l239693l158452
8605C5791758l010858k895806k819382k707366k517941k153779j723715j524496
$$ y = [2752434, 2957787, 3007196, 2995278, 3057192, 3274138, 3650628, 4091469, 4446811, 4590396, 4528595, 4433031, 4439230, 4485505, 4549761, 4736521, 5052458, 5320398, 5439149, 5562801, 5778650, 5911933, 5895782, 5852397, 5904418, 6145541, 6538584, 6983403, 7446293, 7850562, 8183826, 8450557, 8608181, 8786384, 9194978, 9792078, 10479860, 11285418, 12245910, 13405013, 14708439, 16070113, 17535227, 19200867, 21160986, 23461850, 26052437, 28870707, 31942118, 35304702, 38881584, 42477704, 45828969, 48673725, 50883295, 52304890, 52738367, 52127753, 50528344, 48173430, 45333853, 42189903, 38950210, 35791758, 32780900, 29885094, 27065712, 24358346, 21840405, 19686626, 17962911, 16438415]
8597A6438415j463749j302445r84988o56142n34888n90275o20969n33731m45973
8588I305255m05893l46304l17880l63758l68614j97602j3514O2528J43991K21074
8578G719283J94623J107l33117o14670p38906o91460l73041P066J90267J67579
8568E528731J7117j11863r8772k2477M8157O5557j2115j59752l22133m41357m48559
8557D042534k89530r0464K4212Q2467O4367m3567n4563J9724J0242l609J00036
8546C861849K92096M23433M03401K52670K7805j88599l45821m36589l74291j58954
8536C757000k0023n0855j20731j45540q9060j9399m9724j58036j99993j45216
8526B758423q0255r0955j15887q3454m6986N5348K28425L17191L46423L89694
$$ y = [16438415, 14974666, 13672221, 12687233, 12031091, 11496203, 10905928, 10284959, 9751228, 9305255, 8899362, 8553058, 8235178, 7871420, 7502806, 7305204, 7291690, 7354218, 7498209, 7719283, 7913906, 7915013, 7581896, 6967226, 6228320, 5536860, 5163819, 5170885, 5361152, 5528731, 5545848, 5433985, 5335213, 5312736, 5360893, 5426450, 5414335, 5254583, 4932450, 4491093, 4042534, 3753004, 3662540, 3686752, 3769219, 3833586, 3790019, 3735456, 3755180, 3765422, 3761813, 3861849, 4153945, 4577378, 4980779, 5233449, 5261254, 5072655, 4726834, 4290245, 3915954, 3757000, 3736977, 3686122, 3565391, 3419851, 3330791, 3311392, 3261668, 3103632, 2903639, 2758423, 2678168, 2587213, 2471326, 2387872, 2340886, 2396234, 2624659, 2941850, 3288273, 3677967]
8516C677967M08449L75182K40403M8280l4996N7019J65293J10685k5325j08244
8506D914713j86480l14992l40813k65831k30499k28041k22108j51054j361J21577
8496C095111R4966K39L6564J51126J52483J00899J20927K28476M04624N14313
8486D899728L45444K0025k41474l63787k75632j19944n4818k0769N1929O7428
8476D308130O5682J72736K84800K78664K84619L41517K40491m209j48860j75021
8466E648549j96187k07939j96317o4508J87891M06449M66216L18914J18657k0008
8456F461717q0654o4933L9966J28219Q1927L7029N4048J15091J11592L6602m9937
8445F870667k15775l87656m02285k80498o9897K08839L88755L14532K27623K45734
$$ y = [3677967, 4086416, 4461598, 4702001, 4750281, 4715285, 4772304, 4937597, 5048282, 5022957, 4914713, 4728233, 4413241, 4072428, 3806597, 3576098, 3348057, 3125949, 2974895, 2973534, 3095111, 3190077, 3190316, 3226880, 3378006, 3530489, 3631388, 3752315, 3980791, 4385415, 4899728, 5245172, 5265197, 5023723, 4659936, 4384304, 4264360, 4209542, 4188773, 4240702, 4308130, 4373812, 4546548, 4831348, 5110012, 5394631, 5736148, 5976639, 5972430, 5823570, 5648549, 5452362, 5244423, 5048106, 4983598, 5171489, 5577938, 6044154, 6363068, 6481725, 6461717, 6381063, 6316130, 6356096, 6484315, 6566242, 6603271, 6657319, 6772410, 6884002, 6920604, 6870667, 6654892, 6267236, 5864951, 5584453, 5514556, 5723395, 6112150, 6426682, 6654305, 6900039]
8435F900039K25802K44015L65559M51465M47967L62520K35144J66830K47011M52563
8425A0098915O90834R66293J148099J122798J069681J109506J141878J029745
8417A8377749Q82670R74809J287455J632832J872662J942011J969478K099094
8409C1038760K247713K302330K215824J949834J556778J069128L00447o50617
8401D2030197j416383j863804k141168k356578k463292k414293k318463k228580
8393B4827636k055753j774425j484322j228697r82955q57057r49113j170310j250190
8384A3074814r86592o16257l88077l24850l46845l64139l44389k64892j65677
8375I273096q0568o0829j07387j22935r5617j11837q0418M9316J47339J29502
$$ y = [6900039, 7125841, 7369856, 7735415, 8186880, 8634847, 8997367, 9232511, 9399341, 9646352, 10098915, 10789749, 11756042, 12904141, 14026939, 15096620, 16206126, 17348004, 18377749, 19260419, 20235228, 21522683, 23155515, 25028177, 26970188, 28939666, 31038760, 33286473, 35588803, 37804627, 39754461, 41311239, 42380367, 42680814, 42030197, 40613814, 38750010, 36608842, 34252264, 31788972, 29374679, 27056216, 24827636, 22771883, 20997458, 19513136, 18284439, 17301484, 16444427, 15495314, 14325004, 13074814, 12088222, 11471965, 11083888, 10759038, 10412193, 10048054, 9703665, 9438773, 9273096, 9192528, 9131699, 9024312, 8901377, 8805760, 8693923, 8613505, 8662821, 8810160, 8939662]
8365H939662J8974q9934j10389n7161M4474J84179K19751N9136j94906k00377
8355H813409J24664M67915N59191M29232K78177J85459Q0223p7925k61563l78242
8345A0220540l30310k00510n6558L0103J3318j1711p87J41840M06362N88764O46355
8334A1447406O20076O08989O84351P05530O25534O53242Q74478J042083J050040
8325A8311729J047703J085834J127546J117238J092003J224691J532307J953808
8317B8492859K504444L100767L565683L801806L888149L759475L349878K761397
8309E5224458K067126J275413M54592m17324j300832k058442k605351k919456
8301D9720184l086190l089347k858251k538788k266401k047397j831678j625750
$$ y = [8939662, 8958636, 8868702, 8758313, 8701152, 8745626, 8929805, 9149556, 9208692, 9013786, 8813409, 8938073, 9405988, 9965179, 10394411, 10672588, 10858047, 10938270, 10860345, 10598782, 10220540, 9890230, 9689720, 9633162, 9663265, 9676583, 9664872, 9664085, 9805925, 10212287, 10801051, 11447406, 12067482, 12676471, 13360822, 14066352, 14691886, 15345128, 16219606, 17261689, 18311729, 19359432, 20445266, 21572812, 22690050, 23782053, 25006744, 26539051, 28492859, 30997303, 34098070, 37663753, 41465559, 45353708, 49113183, 52463061, 55224458, 57291584, 58566997, 59021589, 58604265, 57303433, 55244991, 52639640, 49720184, 46633994, 43544647, 40686396, 38147608, 35881207, 33833810, 32002132, 30376382]
8293C0376382j473510j273029r25631m94698j71183q4393n0764J01097K22796
8284B6227067K31080J84791M8082j31315j58887N3410M08042P01070Q62087J007140
8274B9432567J162784J288014J456843J702090J905606K136132K539384L115868
8266D4739288L734997M244742M725201N218479N831278O652857P586397Q593033
8258I1326272R597983J0411014J0836861J0744977J0034379Q733553O842502M439737
8250A62967278J781792j036540l839714o159239p709911q734343r434339r681932
8242A18153052r415207q850372q071482p013229n902876n004939m277078l667570
8234F5950299l196377k739197k153811j552479j125179r31647r77274j057309
$$ y = [30376382, 28902872, 27629843, 26704212, 26209514, 26038331, 25953938, 25903174, 26004271, 26227067, 26458147, 26642938, 26691020, 26559705, 26400818, 26454228, 26862270, 27563340, 28425427, 29432567, 30595351, 31883365, 33340208, 35042298, 36947904, 39084036, 41623420, 44739288, 48474285, 52719027, 57444228, 62662707, 68493985, 75146842, 82733239, 91326272, 100924255, 111335269, 122172130, 132917107, 142951486, 151685039, 158527541, 162967278, 164749070, 163712530, 159872816, 153713577, 146003666, 137269323, 127834984, 118153052, 108737845, 99887473, 91815991, 84802762, 78899886, 73894947, 69617869, 65950299, 62753922, 60014725, 57860914, 56308435, 55183256, 54251609, 53274335, 52217026]
8226E2217026r10821n47016p9025K99727M46861N04010O00920P85950J127511
8217E4445143J651818K273939K809545L166142L460190L857839M411117N115855
8209H1191588O047729P215604Q465260R685459J0966706J2480409J4252096J6179324
8201A66484175J8051141J9566402K0583893K0969492K0367154J8476642J5271449
8194B99770348J0810483N304690o14579o265000j1246168j5263612j8114059j9728537
8186B44653566k0102124j9447805j8062814j6306620j4588823j3034809j1531492
8179A31579079j0070432q679462p303667o051214n081612m388365l876072l446829
8171H2681426k953401k392720j944577j728058j570886j265214q95499m36471
$$ y = [52217026, 51306205, 50759189, 50680164, 50979891, 51426752, 51930762, 52531682, 53317632, 54445143, 56096961, 58370900, 61180445, 64346587, 67806777, 71664616, 76075733, 81191588, 87239317, 94454921, 102920181, 112605640, 123572346, 136052755, 150304851, 166484175, 184535316, 204101718, 224685611, 245655103, 266022257, 284498899, 299770348, 310580831, 315885521, 315270942, 309005942, 297759774, 282496162, 264382103, 244653566, 224551442, 205103637, 187040823, 170734203, 156145380, 143110571, 131579079, 121508647, 112829185, 105525518, 99474304, 94392692, 90004327, 86128255, 82681426, 79728025, 77335305, 75390728, 73662670, 72091784, 70826570, 69931071, 69494600]
8163F9494600J58518P42836J118298J289741J546148J989950K539243L231143
8155H2110477M087398M975010N827635O702938P722500Q961684J0325750J1798814
8147A42512206J3470568J5357408J7409035J9543632K1547824K3031520K3726867
8140B76599060K3503371K2051621J9043009J4496358Q595784J701903n438441
8133C60552665j1969127j7232690k0910807k3035413k3741926k3288614k2018393
8126B18355695k0264905j8369095j6492215j4522343j2513458j0745228r351127
8119A16097324q159302p041466n990344n084768m368795l838202l406577k923968
8111G5283902k546416k281374j919829j424013r32801n80471l08447K354L37639
$$ y = [69494600, 69653118, 70395954, 71514252, 72803993, 74350141, 76340091, 78879334, 82110477, 86197875, 91172885, 97000520, 103703458, 111425958, 120387642, 130713392, 142512206, 155982774, 171340182, 188749217, 208292849, 229840673, 252872193, 276599060, 300102431, 322154052, 341197061, 355693419, 364289203, 365991106, 360552665, 348583538, 331350848, 310440041, 287404628, 263662702, 240374088, 218355695, 198090790, 179721695, 163229480, 148707137, 136193679, 125448451, 116097324, 107938022, 100896556, 94906212, 89821444, 85452649, 81614447, 78207870, 75283902, 72737486, 70456112, 68536283, 67112270, 66179469, 65598998, 65290551, 65292905, 65630544]
8102F5630544P17002J237541J892319K547143L234089M019197M675652N223306
8094H9176793N913582O752081P815362R276943J0985009J2723948J4515494J6287022
8086A73446234J7836892J9059623J9827696J9908188J9016418J6883515J3381048
8079B99359614Q688594L252110k554492q247979j3262770j7143450j9587922k0598629
8071B29905076k0462363j9578618j8302096j6717573j4924395j3195053j1645490
8064A15079488j0242519r024683p992357o980754n987629n144320m426087l780992
8056F1500147l303347k954888k560043k128481j744492j467090j216677r22605
8048D5202524o62061l78531n5309K06416M45264O89518R04267J152991J537631
$$ y = [65630544, 66347546, 67585087, 69477406, 72024549, 75258638, 79277835, 83953487, 89176793, 95090375, 101842456, 109657818, 118934761, 129919770, 142643718, 157159212, 173446234, 191283126, 210342749, 230170445, 250078633, 269095051, 285978566, 299359614, 308048208, 311300318, 308745826, 300497847, 287235077, 270091627, 250503705, 229905076, 209442713, 189864095, 171561999, 154844426, 139920031, 126724978, 115079488, 104836969, 95812286, 87819929, 80839175, 74851546, 69707226, 65281139, 61500147, 58196800, 55241912, 52681869, 50553388, 48808896, 47341806, 46125129, 45202524, 44540463, 44161932, 44106623, 44313039, 44758303, 45447821, 46352088, 47505079, 49042710]
8039D9042710K002803K428843K864162L333893L887905M658063N554938O415561
8031H0188878P292926Q225349R143056R991702J0635849J0956165J0786527R939130
8023A57159582Q454498O315361L498825K42219l068448o065291q555109j0486342
8015A47495295j1613968j1887326j1606173j0972882j0166988r257922q172667
8008G3817369p109652o291379n639813m960886m274277l758685l350918k851164
8000C5580595k308249j875068j578731j387205j278663j141982r37398q14002
7992B4259297p20809n90767m39972l57025l76311l69592j82713N4911R6512r552
7982B1363979l9052J7576J72970M70096Q18915J213319J517258J645941J800382
$$ y = [49042710, 51045513, 53474356, 56338518, 59672411, 63560316, 68218379, 73773317, 80188878, 87481804, 95707153, 104850209, 114841911, 125477760, 136433925, 147220452, 157159582, 165614080, 171929441, 175428266, 175670485, 172602037, 166536746, 157981637, 147495295, 135881327, 123994001, 112387828, 101414946, 91247958, 81990036, 73817369, 66707717, 60416338, 54776525, 49815639, 45541362, 41782677, 38431759, 35580595, 33272346, 31397278, 29818547, 28431342, 27152679, 26010697, 25073299, 24259297, 23538488, 22947721, 22507749, 22150724, 21774413, 21404821, 21222108, 21277019, 21373531, 21363979, 21324927, 21342503, 21515473, 21985569, 22804484, 24017803, 25535061, 27181002, 28981384]
7973B8981384K005201K209364K547252K938195L127176L133473L006578K642200
7965E0590823J977671J051741Q2340p58380j533391k214036k763354l179430l422692
7956C9831292l526608l554169l506592l299221k857219k267345j819844j613302
7948A7386992j489576j284497j059655r27502r00453r12437r23713r26447r58361
7939H004351r35713p02631m06448k03178r2775j38430k28280k15296j57878j74099
7929D749623k68462l17922k62251j90163j00911j7901k314k844n5339k17392k99199
7918C014925p8546J73882J00260j91575l52976k95555k25733j99359q9275O1264
7908A917312J27562P7641j1660o5013m8852m1287j30963k70349k38267l7522J13393
$$ y = [28981384, 30986585, 33195949, 35743201, 38681396, 41808572, 44942045, 47948623, 50590823, 52568494, 53620235, 53702575, 52944195, 51410804, 49196768, 46433414, 43253984, 39831292, 36304684, 32750515, 29243923, 25944702, 23087483, 20820138, 19000294, 17386992, 15897416, 14612919, 13553264, 12625762, 11725309, 10812872, 9889159, 8962712, 8004351, 7068638, 6366007, 5959559, 5756381, 5663606, 5525176, 5296896, 5081600, 4923722, 4749623, 4481161, 4163239, 3900988, 3710825, 3609914, 3592013, 3589699, 3586855, 3531516, 3314124, 3014925, 2936379, 3110261, 3210521, 3018946, 2665970, 2370415, 2144682, 1945323, 1856048, 1917312, 2044874, 2122515, 2110855, 2045842, 1996990, 1955703, 1824740, 1554391, 1316124, 1278602, 1391995]
7897A391995J62602J80820R0881j01909k43188k24502j09281j4996m79j669M0128
7886A170402Q0963M6772j10836k27129j72221o5382R051O0096J08572J16651N2911
7875A069850J8256K7061L0138L7149P6991O3341n4054k05970k29287j40587j02954
7864E89934j18761j00035k8585K5471Q4101K60567M16596L18848O8925l5689M9107
7853A530479J95329L00441K27305n1127l26486m36440m16704l84487l58377k47851
7843C2082k7576J76619L21850L58816K42430J15385R2858J30483J41085M4289
7833A628321j14741k00177k32865k33869j84475j41395j57512k10334k31422j68125
7823b46594j7484J65317K46705K02122J36823J53494K62128K11490m4716k82706
$$ y = [1391995, 1554597, 1735417, 1826298, 1724389, 1481201, 1256699, 1147418, 1132422, 1131943, 1130274, 1170402, 1251365, 1298137, 1187301, 960172, 787951, 722569, 731620, 791716, 900288, 1016939, 1069850, 1088106, 1115167, 1145305, 1182454, 1259445, 1322786, 1268732, 1062762, 833475, 692888, 589934, 471173, 371138, 342553, 368024, 452125, 712692, 1129288, 1448136, 1517061, 1481372, 1530479, 1725808, 2026249, 2253554, 2202427, 1875941, 1439501, 1022797, 638310, 279933, 32082, 4506, 181125, 502975, 861791, 1104221, 1219606, 1312464, 1442947, 1584032, 1628321, 1513580, 1313403, 1080538, 846669, 662194, 520799, 363287, 152953, -78469, -246594, -264078, -98761, 147944, 350066, 486889, 640383, 902511, 1114001, 1069285, 786579]
7813G86579l25796j52857k7849l0744k5424n2045q4899N1183K35439K33795P1758
7802F79140l8464K3011Q1285n7725k11581k03122j15184l571N4526M0327q692
7791B39950r380L7864Q549j5417M0230Q4421J16919J83497K47924J39562j10195
7780I63924k80680k89955j30730N7706J24954K8323j53297k62632k29026r6456
7770b67869L1713J35388J62983J51617J67442J55242J63338J77151J27676Q0046
7760A084727k0453j69477j84864r4624q7644j72242k38324j19016R0218K20454
7750C08755K79284K97518K73896J53799P9530J55852K39214K40709J86054R9119
7740B313730R868j66092m28738n34010m44565l47454k50473j87415k42867k93684
$$ y = [786579, 460783, 307926, 280077, 249333, 223909, 171864, 86965, 138148, 373587, 607382, 679140, 640676, 663687, 744972, 687247, 475666, 272544, 157360, 153789, 208315, 248642, 239950, 230570, 268434, 276983, 261566, 301796, 386217, 503136, 686633, 934557, 1074119, 963924, 683244, 393289, 262559, 320265, 445219, 473542, 320245, 57613, -171413, -267869, -236156, -100768, 62215, 213832, 381274, 536516, 699854, 877005, 1004681, 1084727, 1064274, 894797, 709933, 615309, 527665, 355423, 117099, -1917, 88301, 308755, 588039, 885557, 1159453, 1313252, 1392782, 1548634, 1787848, 2028557, 2214611, 2313730, 2323598, 2157506, 1728768, 1194758, 750193, 402739, 152266, -35149, -278016, -571700]
7730e71700k22040j78959j66107m0179J39056K20015K13249J73299L4332j39258
7720e38292j51279q2710n9464l7621K7040J36386K75527L67423K83502K7729k28371
7709A9870k84492j96962j57227j54084j28621m2318R5553K21353L23570L56757
7699E3399K78842J57323R591j62391k55599k41214j73245k2063R9904J7396j14832
7688c52889j21432o636J66352K37678J51015l6090j58794q9220P8120J74253J28694
7677A71051J1497o8217p5694m919J07312J73714J32350J1473k3359L9697Q7079
7666E61984J83730L30188L82857L05968J50602J3675j04874k70534l73478l72838
7656H07280k70956p2622O3895Q6599O5140K6778j2797l5850n548J1286m6143m6542
$$ y = [-571700, -793740, -972699, -1138806, -1178985, -1039929, -819914, -606665, -433366, -399034, -538292, -689571, -772281, -831745, -869366, -842326, -705940, -430413, -62990, 220512, 248241, 19870, -264622, -461584, -618811, -772895, -901516, -943834, -848281, -626928, -303358, 53399, 332241, 489564, 499155, 336764, 81165, -160049, -333294, -355357, -255453, -238057, -352889, -474321, -480957, -314605, -76927, 74088, 37998, -120796, -210016, -131896, 42357, 171051, 182548, 114331, 38637, 33718, 141030, 314744, 447094, 458567, 435208, 474905, 561984, 745714, 1075902, 1458759, 1764727, 1915329, 1929004, 1824130, 1553596, 1180118, 807280, 536324, 463702, 527597, 614196, 679336, 706114, 693317, 657467, 651919, 663205, 617062, 570520]
7644E70520P5019K45398L70681M17489L89248L18444K27675J53615J20701L4066
7634B922856N039J82722M34632O63214Q67294R96363J030374J072352J136012
7625I310858J180573J266648J408800J487378J368401J091248P42165L60210p3432
7616A8142849n70333r38910j121027j219867j212100j176470j136083j060137
7608I707922r81137r02731q95182r69424r48001p41802m50239k14973j14439j10059
7598C379935k03497l00296k48547j51697j95365k91979k83169j64255j0286L9903
7588A570747o4477j30477j26622k59158n03144n84676m01001j92160j05560k2831
7578h19359J84760M13234M56627L35118J28849m8564p8471n9724r0155p5657o0497
$$ y = [570520, 645539, 890937, 1261618, 1679107, 2068355, 2386799, 2614474, 2768089, 2888790, 2922856, 2927895, 3110617, 3545249, 4208463, 5075757, 6072120, 7102494, 8174846, 9310858, 10491431, 11758079, 13166879, 14654257, 16022658, 17113906, 17856071, 18216281, 18142849, 17572516, 16633606, 15512579, 14292712, 13080612, 11904142, 10768059, 9707922, 8726785, 7824054, 6928872, 5959448, 5011447, 4269645, 3819406, 3604433, 3489994, 3379935, 3176438, 2876142, 2627595, 2475898, 2280533, 1988554, 1705385, 1541130, 1530844, 1570747, 1506270, 1375793, 1249171, 990013, 486869, -97807, -498808, -690968, -796528, -819359, -634599, -221365, 235262, 570380, 699229, 650665, 572194, 512470, 422315, 346658, 286161]
7567B86161j02008j00550k9764k110P054M5254O0268L5853Q2114J96613K73305
7556G52190K60162J58315l1710k06331k39066j02142N7953P2574m4561j55021
7546E22363j63156j11250j3147P2049L9144q1588j86829k14327j33822o2869n4152
7535c87584p5481r8696j8914J67237K31919N9099r1765o6615L0740O4836n732
7524a90956j48555k17176p8478J02881J33112O4187O8454J95455L14544L42890
7514E86358L33099K52637R8694m5298j01013n7239p6245j83901k20067j45266
7504D41759j10339j40585j51039j49001k15645k65573j52165L9078J80439J75672
7494c47399K1013p1473K6698J73575K37204K38868K48486K62505K52709J93195
$$ y = [286161, 184153, 83603, 53839, 51729, 58783, 104037, 164305, 200158, 282272, 478885, 752190, 1012352, 1170667, 1138957, 932626, 693560, 591418, 649371, 721945, 677384, 522363, 359207, 247957, 234810, 306859, 346003, 264415, 77586, -136741, -270563, -333432, -387584, -463065, -561761, -580675, -413438, -181519, -122420, -214185, -280800, -250060, -185224, -190956, -339511, -556687, -635165, -532284, -399172, -334985, -266531, -71076, 243468, 586358, 919457, 1172094, 1270788, 1225490, 1124477, 1067238, 990993, 807092, 587025, 441759, 331420, 190835, 39796, -109205, -324850, -590423, -742588, -703510, -523071, -347399, -326386, -397859, -371161, -197586, 39618, 278486, 526972, 789477, 1042186, 1235381]
7484A235381N7030j78855l80715m09790k81747p1587L314j03857j66760j65881
7474d63467j37490o7268P474R8528J39658Q8330N1831O4331J05296J80647J86802
7463B54672J35658J64217R5414j24107l38592l83517k63850q6032P0348J86651
7453b89138K99533K25271p656j31215j36939j78949k02299j44648o2393Q3254
7443e45179L05664M35888L42502P9116j46605j46190j4804L4847l9593p5846R494
7432B39294N4918j1122p9483j03522n0084N8268J57111J59166J4960j70926j98005
7421G0575q2199K7997P7267J36458J89495P4577j34081k12894j43500K231J58889
7410A64815K42213J96355M6558j24893j65462j1944J81168J85832o3358k63755
$$ y = [1235381, 1292411, 1113556, 732841, 323051, 41304, -30283, -26969, -130826, -297586, -463467, -600957, -668225, -660751, -562223, -422565, -334235, -282404, -218073, -112777, 67870, 254672, 390330, 554547, 649961, 525854, 187262, -196255, -460105, -546137, -475789, -289138, 10395, 235666, 228010, 96795, -40144, -219093, -421392, -566040, -628433, -545179, -239515, 196373, 538875, 617991, 471386, 325196, 310392, 345239, 305646, 229800, 239294, 294212, 283090, 203607, 100085, 50001, 108269, 265380, 424546, 439506, 268580, 70575, -11624, 16373, 93640, 230098, 419593, 494170, 360089, 147195, 3695, 5926, 164815, 407028, 603383, 649941, 525048, 359586, 347642, 528810, 714642, 651284, 387529]
7400C87529k00451K0891K11092K46115J02643j36775k69673k06574j09127n1705
7390f035J5124O5497J07283J36035J12389P1397j709n2397m248R0267J46896J49503
7378H30002J62059J64553P1675o2874j05162Q884J38573J49068Q5133n6956k08184
7367A176771k35344k26924k24261k55174l19060k82813p9274J19809J87814K73936
7357A35480L88511L73542J84221O633j8393K1427j3896j24206k09969k18883j61730
7346C62737q9953j0525O4664J16616J72201J70187J63615J58160M8483r3350j25585
7335I37250k5948M1992k828k9001K0645m560r7597j08551p1050j3122L0111m0291
7323F37050j03004j5046P5540K9561o0621r5693j11149j84984l35116l96875k31268
$$ y = [387529, 187078, 207969, 419061, 665176, 767819, 631044, 361371, 154797, 45670, -6035, 9089, 74586, 181869, 317904, 430293, 501690, 499981, 447584, 443336, 533603, 680499, 830002, 992061, 1156614, 1228289, 1165415, 1060253, 1069137, 1207710, 1356778, 1441911, 1384955, 1176771, 941427, 714503, 490242, 235068, -83992, -366805, -446079, -326270, -138456, 135480, 523991, 897533, 1081754, 1088387, 1069994, 1091421, 1077525, 953319, 743350, 524467, 362737, 272784, 262259, 326923, 443539, 615740, 785927, 949542, 1107702, 1156185, 1062835, 937250, 911302, 953294, 950466, 921465, 942110, 937550, 839953, 731402, 660352, 647230, 677341, 637050, 534046, 519000, 594540, 624101, 563480, 467787, 356638, 171654, -163462, -560337, -791605]
7312g91605N4954K76663L99230L68417K23740J15210J22378J65720J21315M1581
7302A097603K6482P6565O2831q4837k38747k82510k05396q8425m3724L955J73995
7291D97792K83152J41660O5088K26845L11704J87528k5004j71128j14737M4384
7281A447284O8859o4811j67461j42386r2171j03032j37318r6037P9640K08003
7271A000570J70268P9914P077L2473P7438L0870k9630J011R8746R5468m5503j93945
7259A324757l08971k91756j20975K9270M2391j3276o6067k20166l76210l16662
7249c17665j10428O2548J43574J78446J92075O6144q2962j21788j38831j64847
7239b93734j65892j09986l5877N4706J90210K85904K46616O8702p9128n6924k3602
$$ y = [-791605, -736651, -459988, -60758, 307659, 531399, 646609, 768987, 934707, 1056022, 1097603, 1124085, 1200650, 1263481, 1178644, 939897, 657387, 451991, 363566, 319842, 323797, 497792, 780944, 922604, 987692, 1214537, 1526241, 1713769, 1688765, 1517637, 1402900, 1447284, 1516143, 1451332, 1283871, 1141485, 1049314, 946282, 808964, 712927, 792567, 1000570, 1170838, 1250752, 1257829, 1290302, 1367740, 1398610, 1368980, 1369991, 1468737, 1564205, 1518702, 1324757, 1015786, 724030, 603055, 632325, 674716, 661440, 595373, 375207, -1003, -317665, -428093, -365545, -221971, -43525, 148550, 214694, 131732, 9944, -128887, -293734, -459626, -569612, -605489, -550783, -360573, -74669, 171947, 240649, 161521, 104597, 80995]
7228H0995m7545p6128j29511k08850k24656j52345l7990L3447q2287k79757k72345
7217a396972m1898J81037K53837K30248K18779K42374J91241Q0604m5695k43601
7207c30046l40385j87585K3890J70135L00358L43784K27919J08312Q8712Q2946
7197D88040J5818o3064k9199Q0381P7826J7907M3437J26412K69096L95440M03600
7186A825694K69628O6657j29788k69736k47290m3537K11180M09638L90930K11162
7176B694538J1443j75191k60668k81840l00534k31538m0940J12750J37680J08225
7166A773925P7809N766q2037n2159J7448J4301L2060J04560J86292K54558J97814
7155B530337K1727j12389j18591j9830N2433P5268J03119N8869l2505p8865m9996
$$ y = [80995, 33450, -42678, -172189, -381039, -605695, -758040, -796030, -762583, -844870, -1124627, -1396972, -1438870, -1257833, -1003996, -773748, -554969, -312595, -121354, -40750, -86445, -330046, -670431, -858016, -834126, -663991, -363633, -19849, 208070, 316382, 405094, 488040, 503858, 440794, 411595, 491976, 569802, 587709, 631146, 757558, 1026654, 1422094, 1825694, 2095322, 2161979, 2032191, 1762455, 1515165, 1471628, 1682808, 2092446, 2483376, 2694538, 2705981, 2530790, 2270122, 1988282, 1687748, 1456210, 1415270, 1528020, 1665700, 1773925, 1851734, 1857500, 1775463, 1723304, 1740752, 1755053, 1787113, 1891673, 2077965, 2332523, 2530337, 2552064, 2439675, 2321084, 2301254, 2353687, 2428955, 2532074, 2590943, 2558438, 2479573, 2429577]
7144B429577P3434K32422K81224J71193k6247j07162O4624K21496J11997r5370
7134C357188j42132o9412r36O3880J69511J49886n2320k29333k03084j2380J15425
7123C146293J49508J74336J33028L5645L6377J37119L28042M25582L38138L30918
7113E234986M27612N16006O15632Q03523J067385J347774J624382J893516K238713
7104A5769529K824536L581533M386382N287318O239290O917012O654264M783338
7096E6443202J362578k522315n410944o600630o429104n570480m533418l540965
7088B3197924k693979k074367j512629q88058m57424m93239q81448j310628j569896
7079A1316256j566159j311203r78101p83313p65879p91248p21346n46761l54876
$$ y = [2429577, 2503011, 2735433, 3016657, 3187850, 3161603, 3054441, 3119065, 3340561, 3452558, 3357188, 3215056, 3145644, 3144708, 3208588, 3378099, 3527985, 3475665, 3246332, 3043248, 3030868, 3146293, 3295801, 3470137, 3603165, 3638810, 3675187, 3812306, 4140348, 4565930, 4904068, 5234986, 5662598, 6178604, 6794236, 7597759, 8665144, 10012918, 11637300, 13530816, 15769529, 18594065, 22175598, 26561980, 31849298, 38088588, 45005600, 51659864, 56443202, 57805780, 55283465, 49872521, 43271891, 36842787, 31272307, 26738889, 23197924, 20503945, 18429578, 16916949, 16028891, 15571467, 15078228, 14196780, 12886152, 11316256, 9750097, 8438894, 7460793, 6677480, 5911601, 5120353, 4399007, 3852246, 3497370]
7070C497370k30019k14256k60226k75542k94336l35142l47567l15296k46028j41556
7060H37402L175J33146J69073K13153K87989K10555K0392m6857k2580J0749Q2134
7049A898331J76251J91570O6242j36620k22368j71240m0657R6641J10476q314
7039A960312j21832j12002j8003k060j05532k01062k54356k36634q9707O0779
7029H79903k7521k71319l78796l06431k26099j07160J04175K46786K81630K85802
7019D80970K34822J43450M8694m2203o5399m1153K0709Q2052N0662K6915P2914
7008A012433J05496J51176K26180J97314K4067j84924k60535j56475J2111J67520
6998A294363J37033j5526q8623q9942j47223k58726l10355k35833j5108K04833
$$ y = [3497370, 3267351, 3053095, 2792869, 2517327, 2222991, 1887849, 1540282, 1224986, 978958, 837402, 840577, 973723, 1142796, 1355949, 1643938, 1854493, 1874885, 1828028, 1805448, 1816197, 1898331, 2074582, 2266152, 2332394, 2195774, 1973406, 1802166, 1761509, 1858150, 1968626, 1960312, 1838480, 1726478, 1708475, 1706415, 1600883, 1399821, 1145465, 908831, 819124, 879903, 852382, 581063, 202267, -104164, -330263, -437423, -333248, -86462, 195168, 480970, 715792, 859242, 907936, 865733, 800334, 759181, 779890, 861942, 912604, 939519, 1012433, 1117929, 1269105, 1495285, 1692599, 1716666, 1531742, 1271207, 1114732, 1126843, 1294363, 1431396, 1415870, 1327247, 1237305, 1090082, 831356, 521001, 285168, 270060, 474893]
6988D74893K71121K54790K50226K21505R9743o4082j78238j99130p2580J02557
6978A160805J34281P2917r99j59943l19630l09704j57203m8649m7929m1564j7712
6967B64670L5196J20550J77117K18422K08234J47823J00673J7852q5540j29842
6957A075155j43735j25398j39748j94820j69616j33228k05441l26530m04344l80647
6947a148352k72264j35555P2025L61429N55512N32464M19939K90047R5761p7228
6937F93778j63985j86210j68689j64387j35369n7954j0275n3047j92609k80225
6927g18972j77129N4088K15644K12400N7032o2899K0270K02136L14347L15490
6917D32407K44393J80078K02373K58443K31014J41590R5436J10345Q8722l2947
$$ y = [474893, 746014, 1000804, 1251030, 1472535, 1572278, 1508196, 1329958, 1130828, 1058248, 1160805, 1295086, 1368003, 1367004, 1207061, 887431, 577727, 420524, 371875, 323946, 282382, 264670, 299866, 420416, 597533, 815955, 1024189, 1172012, 1272685, 1290537, 1204997, 1075155, 931420, 806022, 666274, 471454, 301838, 168610, -36831, -363361, -767705, -1148352, -1420616, -1556171, -1484146, -1122717, -567205, -34741, 385198, 675245, 771006, 693778, 529793, 343583, 174894, 10507, -124862, -182816, -193091, -246138, -438747, -718972, -896101, -842013, -626369, -413969, -356937, -419836, -399566, -197430, 116917, 432407, 676800, 856878, 1059251, 1317694, 1548708, 1690298, 1785734, 1896079, 1984801, 1951854]
6907A951854j62576k25019k08640r7526Q3756J96268P6183q9962j17109r7826
6897A309403k48066n47906o27323m58473k55673k8370J76242K43459J59713N7995
6887b18999N6318Q7428m562j85346k90941k37411r9108O5903J40676J11038Q6925
6876d88079J10456J37151J13982J68201L46840L69067Q2281k74402m03933k79856
6866a18292n9022J08747J69645J67502J03628r9995k79079k60017j09242O5277
6856c10848J46847J91041K59135K04880l4978k52155k16410P5288M02344N37020
6846A002164M08094K19809K11436K56464J46568o5530j96085j82899k0225J99527
6836A979323K74551J69171N8180L5556J3382l600J6395p499j35185k38998k52927
$$ y = [1951854, 1789278, 1564259, 1355619, 1258093, 1341849, 1538117, 1614300, 1524338, 1407229, 1309403, 1061337, 513431, -113892, -572365, -828038, -856408, -680166, -436707, -276994, -218999, -162681, -75253, -79815, -265161, -556102, -793513, -892621, -826718, -686042, -575004, -488079, -377623, -240472, -126490, 41711, 388551, 757618, 839899, 565497, 161564, -118292, -177314, -68567, 101078, 268580, 372208, 272213, -6866, -266883, -376125, -310848, -164001, 27040, 286175, 491055, 456077, 203922, -12488, 62800, 465144, 1002164, 1410258, 1630067, 1841503, 2097967, 2244535, 2179005, 1982920, 1800021, 1779796, 1979323, 2253874, 2423045, 2481225, 2516781, 2530163, 2526563, 2542958, 2535459, 2400274, 2161276, 1908349]
6825A908349j89165p9692K6937J83690L41247L23863J77309N5461p4004k01734
6815B472261k08481k6373K26780L71049L74779L12223K25749R2474m1154j29323
6805C669984j95142j02122J58245L90447N22244O18062O62363O13707N38733N22899
6795G399420O51516R26932J231040J449054J641529J940344K242208K406228K619837
6786B2508108L131685L741507M141887M337654M341764M071852L372055K047285
6778E1693797K17490j606630l071726m082629m515370m325588l704701k970791
6770B7633852k295758j761868j420862j231288j131980j228261j447909j527831
6762A5588095j434284j295369j216929j105917r03121p33676o35218n51665n44448
$$ y = [1908349, 1719184, 1639492, 1666429, 1850119, 2191366, 2515229, 2692538, 2747999, 2673995, 2472261, 2263780, 2237407, 2464187, 2835236, 3210015, 3522238, 3747987, 3840461, 3799307, 3669984, 3474842, 3372720, 3530965, 3921412, 4443656, 5061718, 5724081, 6337788, 6876521, 7399420, 8050936, 8977868, 10208908, 11657962, 13299491, 15239835, 17482043, 19888271, 22508108, 25639793, 29381300, 33523187, 37860841, 42202605, 46274457, 49646512, 51693797, 51911287, 50304657, 47232931, 43150302, 38634932, 34309344, 30604643, 27633852, 25338094, 23576226, 22155364, 20924076, 19792096, 18563835, 17115926, 15588095, 14153811, 12858442, 11641513, 10535596, 9632475, 8898799, 8263581, 7711916, 7167468]
6753G167468o06803o16807n37086l95998l03485k46792j22313j8932k3902p0352
6743D224998k8440P2444O9145m9548j69453j79637j16548j20238j69549k37302
6733C295872k66746k10027j81039j85365j80975j18975P0576K59094L38260L20885
6723C141560K73927L11499M46213N85450O24868M82919K66777P6343j7890O0205
6713F251871K75142L96772M12082N52832Q42607J070637J214169J471379J807415
6704A4294906K083281K323146K452447K225195J562511O76286k56820j061758
6696B4299194j545151j827117k062723k146197j939049j648291j505198j489955
6688A0135513j422688j075311m93174r4406j24953m32949p15596p08443n46536
$$ y = [7167468, 6560665, 5943858, 5406772, 5010774, 4707289, 4460497, 4338184, 4319252, 4295350, 4224998, 4196558, 4269002, 4338147, 4288599, 4119146, 3939509, 3822961, 3702723, 3533174, 3295872, 3029126, 2819099, 2638060, 2452695, 2271720, 2152745, 2223321, 2482415, 2820675, 3141560, 3415487, 3726986, 4173199, 4758649, 5383517, 5866436, 6133213, 6209556, 6191666, 6251871, 6527013, 6923785, 7335867, 7888699, 8731306, 9801943, 11016112, 12487491, 14294906, 16378187, 18701333, 21153780, 23378975, 24941486, 25617772, 25360952, 24299194, 22754043, 20926926, 18864203, 16718006, 14778957, 13130666, 11625468, 10135513, 8712825, 7637514, 7144340, 7049934, 6924981, 6492032, 5776436, 5067993, 4521457]
6679D521457m38488m70920n81055o05858n23749l33773l1873K12522K42823J55474
6669B146560J82517K71941K08958J21076P8124r0164k83273l18771l15079l48788
6659A653101l44928l02783k84862j98849l3179M1651K8212j0284K0487P9579O7307
6648G15452l3845k36211l53026j96265R2654K33184J68986M6180n3712o8376J3553
6637C28574N8826o7773l40681n63062n27960l04810p0067J41817L23732L79647
6627f41757K88827J66029J28493J10025M4875K9260N3249O0077L5587m675L5957
6616C05947J86569L31459L39683J53709p3851j08610o9498o7490p2628j06112
6606H19178j64670j71435p6996J15897K94963L61463L52557K84666J41601M2518
$$ y = [4521457, 4082969, 3612049, 3030994, 2425136, 1901387, 1567614, 1535741, 1748263, 1991086, 2146560, 2329077, 2601018, 2809976, 2931052, 3009176, 2919012, 2635739, 2316968, 2001889, 1653101, 1308173, 1005390, 720528, 521679, 488500, 530151, 558363, 548079, 568566, 648145, 715452, 681607, 445396, 92370, -103895, -11241, 221943, 390929, 437109, 383397, 315021, 328574, 387400, 319627, -21054, -584116, -1112076, -1416886, -1486953, -1345136, -1021404, -641757, -352930, -186901, -58408, 51617, 96492, 125752, 179001, 239078, 274665, 269990, 305947, 492516, 823975, 1163658, 1317367, 1243516, 1134906, 1065408, 997918, 925290, 819178, 654508, 483073, 406077, 521974, 816937, 1178400, 1530957, 1815623, 1957224, 1999742]
6596A999742j384j10801k58001l56344k97618j13815L944P777l3985j34307l08470
6585C96738m28455m46802l64891j91865m0624M0134N356r3022p0455J43529M39414
6574f10943O38997N80683L53435J58714N8542k145j17623j92978j91633j14835
6564E60214M2872J56708K28456K99166K69660J45181L4313p7784k01059k48618
6554A209109j82044j09952j8554P1081O8283M0899o402j45616k16231j36445p0112
6543E04016n9114K5551R1490J03686R6166j2567j22457K3864K76897K51024L4575
6532A213131j18212j49784r9081K6275J47087J02301j6664j7925J38052K48443
6522A473623K03646R0606O43j10345k81191l86205l68819k97324k31502k37158
$$ y = [1999742, 1998358, 1887557, 1629556, 1273212, 975594, 861779, 865723, 873500, 839515, 705208, 396738, -31717, -478519, -843410, -1035275, -1075899, -1035765, -1030409, -1123431, -1193886, -1050357, -610943, 28054, 608737, 962172, 1120886, 1179428, 1177283, 1059660, 866682, 675049, 560214, 603086, 759794, 988250, 1287416, 1557076, 1702257, 1736570, 1658786, 1457727, 1209109, 1027065, 917113, 898559, 969640, 1037923, 1078822, 1072420, 926804, 710573, 574128, 504016, 444902, 470453, 561943, 665629, 761795, 749228, 626771, 650635, 927532, 1178556, 1213131, 1094919, 945135, 846054, 872329, 1019416, 1121717, 1105053, 1087128, 1225180, 1473623, 1677269, 1767875, 1768518, 1658173, 1376982, 990777, 621958, 324634, 93132, -144026]
6512a44026k72237k53894j64489r6683o0550K9299J73315K93638K91868K69846
6502F6087L25649L10004K07232M0310j54621j98636j03076n0341j11683k07573
6492A23352k34007j44882p0620j4820K00644M29210M06160K25810j0714k69810
6482F40323l52509k31119j11045J1832J29934J13437L0119p7557j36915p8026
6472f1526j7246m9883q9820o5017o5241q5920r1118j22453j87629k23264j56644
6461a215761J290J80204K59488K31729J89304K19077K51052J72205N6097O1485
6451D06170J15440p5667m40327n84835m38587j72436O3270J92468K58091K51025
6441d25388R1833l7010J5939J01979J13706K9152r5948j15450m3941R309J0312
$$ y = [-144026, -416263, -670157, -834646, -931329, -991879, -962580, -789265, -495627, -203759, 66087, 391736, 701740, 908972, 949282, 794661, 596025, 492949, 442608, 330925, 123352, -110655, -255537, -326157, -340977, -140333, 288877, 695037, 920847, 910133, 640323, 287814, 56695, -54350, -42518, 87416, 200853, 230972, 153415, 16500, -61526, -78772, -128655, -218475, -283492, -348733, -434653, -525771, -648224, -835853, -1059117, -1215761, -1214471, -1034267, -774779, -543050, -353746, -134669, 116383, 288588, 344685, 406170, 521610, 445943, 5616, -579219, -1017806, -1190242, -1126972, -934504, -676413, -425388, -333555, -370565, -354626, -252647, -138941, -109789, -205737, -321187, -365128, -355819, -345507]
6430c45507p6900j65926j26423l2795J00696K56853K78753J49661j0401j13678
6420h5667k18021l02967k24798j5722J59511K18165K08845J79841J78880K10745
6410C08812K01424N5851j27199j66172j38837j42290o5688O6563J45446K47162
6400C85072K71159J08979j54962k88044j70551K5789J87902L10055L16399J91880
6390A183678M4201m4630j83796l03627k45985n1904O3037l3562j88494k66550
6380b7632k63553j78348r885J31896K16678K87856K90534K23798J31923K9763
6370H33030l4249p9850j01117l7596k3839j34873j95506j55588j30708r3857J8472
6359a35681Q9502K2316l6436R49N5260O7707J34225J98558J79923J61923J72456
$$ y = [-345507, -422407, -588333, -714756, -747551, -646855, -390002, -111249, 38412, 28011, -85667, -303688, -606655, -831453, -847175, -687664, -469499, -260654, -80813, 98067, 308812, 510236, 566087, 438888, 272716, 133879, -8411, -74099, -7536, 137910, 385072, 656231, 765210, 610248, 322204, 151653, 177442, 365344, 675399, 991798, 1183678, 1227879, 1183249, 999453, 695826, 449841, 397937, 460974, 427412, 238918, -27632, -291185, -469533, -479418, -347522, -130844, 157012, 447546, 671344, 803267, 833030, 798781, 718931, 617814, 580218, 556379, 421506, 226000, 70412, -60296, -154153, -135681, -46179, -23863, -60299, -59350, -4090, 63617, 197842, 396400, 576323, 738246, 910702]
6348I10702J54571R1427k6930j52762j73933j05468l6446j5600L4444J12677J33436
6337I26118N9743l7413n2800L4162J88690L06961K68803M8287k19063k92166j35053
6326A096269j6801k9266n1575j38495k25685j80666r9009p8651p8805j10356q9701
6315b741m5295j13006j54007q8036J6542M3487k660P3364K06786J48137L635j4916
6303G1290J0632N7570J28499J44164J86848J55814r690p1288N4417J77616K21625
6292A127497K92245K76147L4874k14945k25503j63953k03683k12774q3957Q8903
6282G14851J73765J72604J19661L3533j04928k55240k69555k10202j40680l5446
6272A98363p892m3036K350K7714j15840l01070l46029j90170P1229K66998L29403
$$ y = [910702, 1065273, 1156700, 1129770, 977008, 803075, 697607, 661161, 645561, 680005, 792682, 926118, 985861, 948448, 895648, 929810, 1118500, 1425461, 1694264, 1742551, 1523488, 1231322, 1096269, 1079468, 1050202, 998627, 860132, 634447, 453781, 354772, 276121, 197316, 86960, -2741, -48036, -161042, -315049, -403085, -386543, -343056, -345716, -272352, -65566, 82571, 86206, 71290, 81922, 139492, 267991, 412155, 599003, 754817, 745127, 673839, 728256, 905872, 1127497, 1419742, 1695889, 1730763, 1515818, 1290315, 1126362, 922679, 709905, 625948, 714851, 888616, 1061220, 1180881, 1214414, 1109486, 854246, 584691, 374489, 233809, 198363, 190471, 147435, 149785, 177499, 61659, -239411, -585440, -775610, -704381, -437383, -107980]
6261a07980K35709K8654r4868j099J94797K60420J32948p419N5553J98480K18771
6250A113966J73957L4737k58121l89549k06080j3880J1372k4821J793O5540P1764
6239E80678m663j01460j79653k02410j45955n9285r082K1345P7770J27881J91846
6228B97012K06950J21474j9526k17750m15749l33545m7435J56704K54103K89880
6218B92118K09479Q7548l0724k41863n26626o48014n13180k39643J34346N26562
6208i49997P09720N58789K73166j6071k93202m85468n07794l38141j15485K9036
6198a135447J22379J74736J54551J59290J77613J14110O089m4897J3368P8136
6188a80072N1643l1454L8714K63732L47189K42802J75704J57799R2126J4220P573
$$ y = [-107980, 127729, 156383, 61515, 60416, 255213, 515633, 648581, 641162, 696715, 895195, 1113966, 1287923, 1322660, 1064539, 674990, 468910, 455030, 466402, 441581, 443374, 508914, 580678, 576015, 474555, 294902, 92492, -53463, -112748, -121830, -100485, -22715, 105166, 297012, 503962, 625436, 605910, 388160, -27589, -361134, -408569, -251865, 2238, 292118, 501597, 589145, 558421, 316558, -210068, -858082, -1371262, -1610905, -1476559, -949997, -240277, 318512, 591678, 575607, 282405, -203063, -710857, -1048998, -1164483, -1135447, -1013068, -838332, -683781, -524491, -346878, -232768, -226679, -271576, -258208, -180072, -128429, -159883, -121169, 142563, 489752, 732554, 908258, 1066057, 1158183, 1172403, 1179976]
6177A179976J0881o6560j40092j23149j17588j91424j89546r7693j6307m9l5169
6166B13280O3240K11668J91986M5510j11631j61365j39638o2384K6576r893n2421
6155B14928J9711J40110K14450J61031K2590p6815n5883O6767J39278J26323J14069
6144A086559N1440k7587k9662q0654k11476k42691j46509j22457j59021j05723
6134A2219O9141K18639K46369K16053K36658K90362K86089J50019o8937k17857
6124A438755l21305l53023k53218j11334J2448P2644j4218j56579q2888J15657
6114C46939J78990J74210K12387K31768K36179K44179J14197j65031m57850n92966
6104E23002m29401j18129Q7382J54968K50865L71053L63655K84212K18455J59732
$$ y = [1179976, 1190857, 1124297, 984205, 861056, 743468, 552044, 362498, 264805, 248498, 248449, 213280, 276520, 488188, 680174, 725684, 614053, 452688, 313050, 250666, 277242, 267349, 214928, 234639, 374749, 589199, 750230, 772820, 696005, 640122, 706889, 846167, 972490, 1086559, 1137999, 1110412, 1080750, 1000096, 788620, 545929, 399420, 276963, 117942, 12219, 81360, 299999, 546368, 762421, 999079, 1289441, 1575530, 1725549, 1656612, 1438755, 1117450, 764427, 511209, 399875, 412323, 484967, 470749, 314170, 231282, 346939, 525929, 700139, 912526, 1144294, 1380473, 1624652, 1738849, 1573818, 1115968, 523002, 93601, -24528, 62854, 217822, 468687, 839740, 1203395, 1487607, 1706062, 1865794]
6094A865794J37210L2088j95100l38468l57736l05442j59605K8893J96028K25463
6084A129125M2445j55654j52286r671J31666K07097J90185J30294K2116q2483
6074A452834r9660r2646j42614k74468l77035k68600m129J66620J99708K10318
6064G70328J72300P6504L8166N1450j0920j30512j34231k9596O76q4668j59687
6053E59810j30449o0935o7977j47462j80201k5550J21118N8978n4927j11401m1115
6042h0111N4538J01841J11496P6494k3252j48394j98469k18160j60255J020N7056
6031d26196J5838k2414k2801q647l1385l8430j0296q797n7433r8305j23478j00534
6019i32878r805O5158K768q5051l7285R7430J98639J36797K9801J2641l5062j53998
$$ y = [1865794, 2003004, 2035092, 1839992, 1501524, 1143788, 838346, 678741, 707634, 903662, 1129125, 1171570, 1015916, 863630, 853959, 985625, 1192722, 1382907, 1513201, 1535317, 1452834, 1353174, 1260528, 1117914, 843446, 466411, 197811, 193682, 360302, 560010, 770328, 942628, 1019132, 1057298, 1108748, 1097828, 967316, 833085, 803489, 804165, 719497, 559810, 429361, 368426, 300449, 152987, -27214, -52764, 68354, 127332, 72405, -38996, -80111, -25573, 76268, 187764, 264258, 241006, 92612, -105857, -324017, -484272, -483252, -426196, -410358, -432772, -455573, -464220, -495605, -534035, -544331, -553128, -610561, -708866, -832344, -932878, -942683, -877525, -874757, -959808, -997093, -899663, -701024, -564227, -534426, -521785, -556847, -710845]
6007g10845k66530l03645k09707l7171J06387J62163K03548L25534M51810M62250
5997A83794L66606J61229m8995j22785l7517Q3192R8540M5280N84n906l5594o7537
5985F20891o6702q0521q9524j20303j13034K804J49721K84840L89660M00734K70177
5974A648743P0254j44845l58014n30787n40626m42103k90476n1887J29120J94585
5964c16036J38728k1367j58035j77219n6266L2620k3051j28720j88608k32826
5954a130780j93107j1588J41926J49216Q4675N7408J00626K55853M30836L85450
5944B70515J52768q1872l25717m41802l42290k15196j13257N4150K53957M03188
5934c85556M27231K51123L2658j4459N2714O0724M2889M4417J26996K47225L20092
$$ y = [-710845, -977375, -1281020, -1490727, -1527898, -1421511, -1259348, -1055800, -730266, -278456, 183794, 550400, 711629, 662634, 539849, 502332, 585524, 684064, 729344, 729928, 724022, 688428, 620891, 554189, 473668, 384144, 263841, 150807, 153611, 303332, 588172, 977832, 1378566, 1648743, 1718997, 1574152, 1216138, 685351, 144725, -297378, -587854, -639741, -510621, -316036, -177308, -198675, -356710, -533929, -590195, -557575, -580626, -709346, -897954, -1130780, -1323887, -1335475, -1193549, -1044333, -959658, -902250, -801624, -545771, -114935, 270515, 423283, 341411, 15694, -426108, -768398, -983594, -1096851, -1042701, -788744, -385556, 41675, 292798, 325456, 310997, 363711, 424435, 467324, 511741, 638737, 885962, 1206054]
5923A206054L80974L91359K93364K12425K21676J61327l5742k59375m20389n05519
5913A646154m74445l43958k32460j65711j21624j64462k91008l22808j58052P9080
5903e49294K18047K20297J69897J21872Q7926P3014J41033K31948K19079R7846
5893A031665j1986m2534j5342K0440k1123o5835m2093k1967J1264Q3174J80158
5882A105821K80368K49771M8435j79854k60029k13236k12486k26510j85266j26233
5872B80781p0134L712J34195K92157L14858J08189j66294l00846k87992j66819
5862A41807P119J07806J59225K67943L19792K49928J77908J71997J61110J25521
5852A890156R7318Q311j51018j55598l6296l6569j05436j71192k16740j88653
$$ y = [1206054, 1587028, 1978387, 2271751, 2484176, 2705852, 2867179, 2831437, 2572062, 2151673, 1646154, 1171709, 827751, 595291, 429580, 307956, 143494, -147514, -470322, -628374, -549294, -331247, -110950, 58947, 180819, 268745, 341759, 482792, 714740, 933819, 1031665, 1019679, 977145, 961803, 982243, 961120, 895285, 853192, 831225, 842489, 925663, 1105821, 1386189, 1635960, 1684395, 1504541, 1244512, 1031276, 818790, 592280, 407014, 280781, 210647, 214359, 348554, 640711, 955569, 1063758, 897464, 596618, 308626, 141807, 148926, 256732, 415957, 683900, 1003692, 1253620, 1431528, 1603525, 1764635, 1890156, 1987474, 1995785, 1844767, 1689169, 1652873, 1616304, 1510868, 1339676, 1122936, 934283]
5842I34283j33041j71931k33188j27338l3779r0942l4967K32832M29939M46535
5832A218403L85143K10567q4334l84891n79670n45733l04877p9219N7187J03826
5822c598M7141n191N5555J71179K08821J60323L9558p5020p8119q2586j58100
5811B79963j40964M9782J58465L8202j21789r5919J08902K43886J47704j03510
5801E64722l17868l90346l20030j79704l6247J02316K73005M36690M74567L64197
5791I71302K23046J44522M7297j19070k72369l50811l15336k49665k76056k90959
5781d88099j72644K2398K34152L40317K56242R9807l7310r5767q6673o3652l6646
5770b7875n9138j01424j13324j27458j42393l9058J77255L20487L07551J45733
$$ y = [934283, 801242, 629311, 396123, 268785, 235006, 144064, 109097, 341929, 771868, 1218403, 1603546, 1814113, 1729779, 1344888, 765218, 219485, -85392, -164611, -107424, -3598, 43543, 38352, 93907, 265086, 473907, 634230, 673788, 598768, 520649, 438063, 279963, 138999, 188781, 347246, 385448, 263659, 167740, 276642, 520528, 668232, 564722, 246854, -143492, -463522, -643226, -679473, -577157, -304152, 132538, 607105, 971302, 1194348, 1338870, 1386167, 1267097, 994728, 643917, 328581, 78916, -197140, -488099, -660743, -638345, -404193, -63876, 192366, 292173, 254863, 159096, 72423, 8771, -27875, -87013, -188437, -301761, -429219, -571612, -610670, -433415, -112928, 194623, 340356]
5760C40356o8194j92465j57714p8511j22440j70107p8836M8510J64048K41471
5750g3882J76771M3065k9131m9394M4494K16053K70689J47647K8998Q7402J32813
5739I95525m1997k26948j92169o3368K9749M4092M502j4697p5903j74789k13078
5728G0919j66638p0143P0049J92738J99953J91195K06205J43758l4771j84247
5718F19018k09139k00803j66284j30766j18231j70027k95883l00165k21403j78576
5708a372259r4064K4838Q9870J50987K27700K28467J33601Q1850R5526M7245n0529
5697d36768p8922k1112N8853J91231K77371K48121Q6352j15675k57375k92847
5687c40771k57983j84889l0725J22386J58770P7504j1990M2185R8290q0109l54090
$$ y = [340356, 272162, 79697, -78017, -156528, -278968, -449075, -527911, -479401, -315353, -73882, 102889, 145954, 116823, 67429, 111923, 327976, 598665, 746312, 775310, 862712, 995525, 953528, 726580, 534411, 471043, 500792, 544884, 549386, 534689, 458786, 283997, 70919, -95719, -165862, -95813, 96925, 296878, 488073, 694278, 838036, 803265, 619018, 409879, 209076, 42792, -87974, -206205, -376232, -672115, -972280, -1193683, -1372259, -1466323, -1441485, -1351615, -1200628, -972928, -744461, -610860, -529010, -433484, -386239, -436768, -515690, -536802, -477949, -286718, -9347, 238774, 325126, 209451, -47924, -340771, -598754, -783643, -814368, -691982, -533212, -455708, -467698, -425513, -327223, -407332, -761422]
5676g61422m07297k76656j07112J37486L58552M23937L23823J05253q5916j36942
5666d26294j44095j24194j23182j16247o2868N6599K13106K75303J81626J7772
5656b52474q3569j37026j37342j45442k38692l57488l43359n8060L24257N78649
5646h50546O25315M27582K11494J20226M4680k9081j29586k70895l23886j70162
5636c44859J49408L80688L47279K39526L09154M43984L90076J24327j64491k59449
5626A615643j81346j48646j99432j71963k9701L1391q4129j14516J03799L23234
5616A144334K74171L5682j32614j51139j47447k23488k98184k59776m2322J80543
5606C79760J64009M254j08597j44005p8222l5472q7436m7144K14236M69166M11783
$$ y = [-761422, -1168719, -1445375, -1552487, -1415001, -1056449, -632512, -308689, -203436, -289352, -426294, -570389, -694583, -817765, -934012, -996880, -940281, -727175, -451872, -270246, -252474, -336043, -473069, -610411, -755853, -994545, -1352033, -1695392, -1753452, -1429195, -850546, -225231, 202351, 413845, 534071, 578751, 549670, 420084, 149189, -174697, -344859, -195451, 185237, 532516, 772042, 1081196, 1525180, 1915256, 2039583, 1875092, 1615643, 1434297, 1285651, 1086219, 914256, 884555, 915946, 831817, 717301, 821100, 1144334, 1418505, 1454187, 1321573, 1170434, 1022987, 799499, 501315, 241539, 199217, 379760, 543769, 548023, 439426, 295421, 217199, 181727, 94291, 47147, 261383, 730549, 1142332]
5595A142332M9793k96932l72052k08405p7529j47806j62560P2176K98385K91551
5585E88953J52163J7996k9365o6778j10620p2442m9650j13017j60553j69665j10565
5574a23543J0211O9927P6981J57677L03274L39783J90283J7523m7156j16216k03432
5563F75312k67279k75602j66791J5411J72132K54405K94030L58784L28659J56257
5553A545318J2284m0094q1278j35024r4988j32403l21828l60687j77695o2698
5543A50907l4471j3593n6685q3590N3199K92138L51264J74374j2053j35350k06314
5532D79826k03142j41902K1884J19730P3097m0976j62741j84020j00482N742n656
5521a38640p9140q5457n7673p2970m6801J42720L93737M71986L34346J20203m597
$$ y = [1142332, 1192125, 895193, 523141, 314736, 237207, 89401, -73159, -983, 297402, 588953, 741116, 759112, 729747, 662969, 552349, 479907, 430257, 317240, 156687, -12978, -123543, -113332, -43405, 33576, 191253, 494527, 834310, 1024593, 1042116, 994960, 878744, 675312, 408033, 132431, -34360, -18949, 153183, 407588, 701618, 1060402, 1389061, 1545318, 1557602, 1517508, 1436230, 1301206, 1206218, 1073815, 751987, 391300, 213605, 150907, 116436, 102843, 46158, -37432, 15767, 307905, 659169, 833543, 821490, 686140, 479826, 276684, 134782, 156666, 276396, 349493, 308517, 145776, -38244, -138726, -132984, -138640, -217780, -303237, -360910, -433880, -480681, -337961, 55776, 527762, 862108, 982311, 977714]
5510I77714J4935N7260O6468K2997K7818J64915K88866K57585J14741p6195k93801
5499A623303m89433m56979j74777J5907k9710j23793m0785J55661K86016L68104
5489A133514M12882L34937J08134j27439k68008l75229m09150l38615k50642j75515
5479D4869j9031J10055O7243k8158r1177j26369j14162m6447Q3697J87812J63042
5468B31374M1588k7315Q5054L18192M19386L28128J16186m5040q9749j71752k61651
5457I44401l54327m55746m28312k66572j37884j51836j84990q5645J04736K22368
5447g93807J49644N4520J25876K90738L36091K26089J03632J03435J51585O8612
5437H16415j8703L4789R0313M4386p5597k09018k55158j81046J4320J87238J50644
$$ y = [977714, 992649, 1049909, 1116377, 1139374, 1167192, 1332107, 1620973, 1878558, 1993299, 1917104, 1623303, 1133870, 676891, 502114, 518021, 488311, 364518, 323733, 479394, 765410, 1133514, 1546396, 1881333, 1989467, 1862028, 1594020, 1218791, 809641, 471026, 220384, 44869, 25838, 135893, 203136, 174978, 83801, -42568, -156730, -203177, -119480, 68332, 231374, 272962, 245647, 330701, 648893, 1068279, 1396407, 1512593, 1467553, 1377804, 1206052, 944401, 590074, 134328, -293984, -560556, -698440, -850276, -1035266, -1120911, -1016175, -793807, -644163, -589643, -463767, -173029, 163062, 389151, 492783, 596218, 747803, 816415, 797712, 832501, 922814, 967200, 891603, 682585, 427427, 246381, 260701, 447939, 598583]
5426E98583N306q4946j65647k31942k10372j40766j9967J20323K06095J61303
5416B37970m223j47779j15018j0414j0794j4597O7340J57888J70389J32540J39824
5405F03126J09129N6720R9082J26914L4963m2346Q1963K88260K23815p7039k63139
5394A241448k50292k06642j77513j34583j12667j22151r7685m1384m8595l9680
5384A0256K6056N3997J3981j3242J3093l0135k15655l90280l95835k10190M2796
5373a095158K08172K45882K55603K20562R7018K7403J07109K18428K22164J78429
5363F85612J77083K32903L11800K93161J18616n8747r8518q3616j05503j79750
5353A293041k18221j61878r7363j07382j78023j85330o5226N6801Q1610K7318
$$ y = [598583, 603889, 518943, 353296, 121354, -89018, -229784, -249751, -129428, 76667, 237970, 233747, 85968, -29050, -39464, -50258, -64855, 2485, 160373, 330762, 463302, 603126, 712255, 768975, 868057, 994971, 1029934, 987588, 1069551, 1357811, 1581626, 1504587, 1241448, 991156, 784514, 607001, 472418, 359751, 237600, 139915, 98531, 49936, 10256, 36312, 90309, 104290, 91048, 104141, 74006, -141649, -531929, -927764, -1137954, -1095158, -886986, -641104, -385501, -164939, -67921, -40518, 66591, 285019, 507183, 685612, 862695, 1095598, 1407398, 1700559, 1819175, 1760428, 1661910, 1578294, 1472791, 1293041, 1074820, 912942, 815579, 708197, 530174, 344844, 279618, 336419, 418029, 445347]
5343D45347K0872M3732J5077r9043j91197j21423J24479L97243M82450M32165
5333A549702L80942K69112Q3193j20380l44927m63091k88722J5661J34490K0608
5323A236588j18813o8372J36403L08804K99760J46633J8870p2806j96835l20578
5313A369654l67330k24999j1207J46833J91820J15842n0417k50074m06728m61561
5303E1833m23783k93057j39714k5235O7265J40767J81197K16656K32901K48995
5293B57825K60655J18053j7057J02538L29949L85835K22498J0919o8888m4630
5283A557697r0635j99687k07068q2228L0228N8026K2524J855l2805j11443j34897
5272H11567q5156J4125J02138J08831K1839q5556p0945m3263j08774j38215n9795
$$ y = [445347, 466219, 509951, 525028, 425985, 234788, 113365, 237844, 635087, 1117537, 1549702, 1930644, 2199756, 2282949, 2162569, 1817642, 1354551, 1065829, 1081490, 1215980, 1236588, 1117775, 1049403, 1185806, 1494610, 1794370, 1941003, 1959873, 1887067, 1690232, 1369654, 1002324, 777325, 766118, 912951, 1104771, 1220613, 1170196, 920122, 513394, 51833, -371950, -665007, -804721, -829956, -762691, -621924, -440727, -224071, 8830, 257825, 518480, 636533, 619476, 722014, 1051963, 1437798, 1660296, 1671215, 1602327, 1557697, 1467062, 1267375, 1060307, 978079, 1008307, 1066333, 1088857, 1090712, 1057907, 946464, 811567, 726411, 740536, 842674, 951505, 973344, 887788, 816843, 773580, 664806, 526591, 466796]
5261D66796N6611O1292n3087j04917o9653o0855n0171N2509J64264J81734J37808
5250G82331o135k10372k41135r2869R8138K27297K10437J20372N5607Q1883J69403
5239A194957K44231K09029P0506q2722j01438p993K9105m5982k15266l60931l94008
5228E39488l12563j55416j11258k32365l30635k18774m2992Q4842J39758N5992
5218e83923k6774M004O1358O6295J6941p2551j17968j81180k70079j80408O7614
5207a216671K31615K27313J30861J2765J227J35486K86408M36678N73482N42417
5197A361581K74533R520j26195j31375m5841K1694M9564Q4410J34006J45934Q0913
5186A858744j03685l60547m75201l12878m9147Q6675O8688k4688j41496k32978
$$ y = [466796, 523407, 584699, 531612, 426695, 357042, 296187, 246016, 298525, 462789, 644523, 782331, 776196, 565824, 324689, 231820, 329958, 557255, 767692, 888064, 943671, 1025554, 1194957, 1439188, 1648217, 1718723, 1636001, 1534563, 1526570, 1555675, 1509693, 1294427, 933496, 539488, 226925, 71509, -39749, -272114, -602749, -821523, -864515, -779673, -639915, -583923, -610697, -606693, -545335, -479040, -462099, -534650, -652618, -833798, -1103877, -1284285, -1216671, -985056, -757743, -626882, -614117, -612890, -477404, -190996, 245682, 819164, 1361581, 1636114, 1645634, 1519439, 1388064, 1342223, 1363917, 1413481, 1497891, 1631897, 1777831, 1858744, 1755059, 1394512, 919311, 606433, 557286, 643961, 712649, 687961, 546465, 313487]
5176C13487k15072j8024K51472L52855K13399k5588j87164k14205j31678n276
5166C34206O4173L9378l7906r4036j45628k05750j74650O8171L57026M63465L98497
$$ y = [313487, 98415, 80391, 331863, 684718, 898117, 872529, 685365, 471160, 339482, 334206, 398379, 437757, 399851, 305815, 160187, -45563, -220213, -152042, 204984, 668449, 1066946]
$$ [...]
##END NTUPLES=NMR SPECTRUM
##END=
