##TITLE=C13cpd
##JCAMPDX= 6.0         $$ Bruker NMR JCAMP-DX V2.0
##DATA TYPE= NMR SPECTRUM
##DATA CLASS= NTUPLES
##ORIGIN= UXNMR, Bruker Analytische Messtechnik GmbH
##OWNER= root
$$ XWIN-NMR		Version 3.5
$$ Sun Feb 16 10:34:57 2025 Russian Standard Time (UT+4h)  servis@DPX200
##.OBSERVE FREQUENCY= 50.3277607988526
##.OBSERVE NUCLEUS= ^13C
##.ACQUISITION MODE= SIMULTANEOUS
##.ACQUISITION SCHEME= undefined
##.AVERAGES= 514
##.DIGITISER RES= 17
##SPECTROMETER/DATA SYSTEM= spect
##.PULSE SEQUENCE= zgpg30
##.SOLVENT NAME= DMSO
##.SHIFT REFERENCE= (INTERNAL, DMSO, 0, 219.126)
##AUDIT TRAIL= $$ (NUMBER, WHEN, WHO, WHERE, WHAT)
$$ ##TITLE= Audit trail, XWIN-NMR		Version 3.5
$$ ##JCAMPDX= 5.01
$$ ##ORIGIN= Bruker BioSpin GmbH
$$ ##OWNER= servis
$$ F:\spectra/data/av/nmr/C13cpd/1/pdata/1/auditp.txt
$$ ##AUDIT TRAIL=  $$ (NUMBER, WHEN, WHO, WHERE, WHAT)
(   1,<2025-02-16 10:33:53.87 +0400>,<servis>,<DPX200>,
      <created by zg, POWCHK disabled, PULCHK disabled
       terminated by command 'halt'
       configuration hash MD5:
       00 E9 B6 7A A2 85 ED C7 34 08 36 98 17 FE 4E 26
       data hash MD5: 32K
       12 5A 3F C8 C8 CB CC 3E 89 C8 40 43 F6 01 D2 BA>)
(   2,<2025-02-16 10:33:55.89 +0400>,<servis>,<DPX200>,
      <Start of raw data processing
       efp BC_mod = 2 LB = 2 FT_mod = 6 PKNL = 1 PHC0 = -337.663 PHC1 = 25.66493 SI = 32K 
       data hash MD5: 32K
       BF DD D8 33 4C 41 CE 24 22 5D 69 0D F1 D8 F2 93>)
(   3,<2025-02-16 10:34:13.35 +0400>,<servis>,<DPX200>,
      <pk PHC0 = -3 PHC1 = 0 
       data hash MD5: 32K
       A8 EB 81 DC 3F 5D 46 B5 A4 7D 82 C9 1D E4 53 A0>)
$$ ##END=
$$ 
$$ hash MD5
$$ 7E D7 FB D1 2F 70 DC 9F CB DE 5E B8 E4 37 03 1F
##$RELAX= 
##$RELAX= 
##$RELAX= 
##$RELAX= 
##$RELAX= 
##$RELAX= 
##$RELAX= 
##$RELAX= 
$$ Bruker specific parameters
$$ --------------------------
##$DU= <F:\spectra>
##$EXPNO= 1
##$NAME= <C13cpd>
##$PROCNO= 1
##$TYPE= <nmr>
##$USER= <av>
##$AMP= (0..31)
100 100 100 100 100 100 100 100 100 100 100 100 100 100 100 100 100 100 
100 100 100 100 100 100 100 100 100 100 100 100 100 100 
##$AQSEQ= 0
##$AQ_mod= 1
##$AUNM= <au_zg>
##$AUTOPOS= <>
##$BF1= 50.322729
##$BF2= 200.13
##$BF3= 50.322729
##$BF4= 50.322729
##$BF5= 500.13
##$BF6= 500.13
##$BF7= 500.13
##$BF8= 500.13
##$BYTORDA= 1
##$CFDGTYP= 0
##$CFRGTYP= 5
##$CHEMSTR= <none>
##$CNST= (0..31)
1 1 145 1 1 1 1 1 1 1 1 1 1 1 1 1 1 1 1 1 1 1 1 1 1 1 1 1 1 1 1 1 
##$CPDPRG= <waltz16>
##$CPDPRG1= <>
##$CPDPRG2= <waltz16>
##$CPDPRG3= <>
##$CPDPRG4= <mlev>
##$CPDPRG5= <mlev>
##$CPDPRG6= <mlev>
##$CPDPRG7= <mlev>
##$CPDPRG8= <mlev>
##$CPDPRGB= <>
##$CPDPRGT= <>
##$D= (0..31)
0 2 0.00345 0 0 0 0 0 0 0.06 0 0.03 2e-05 3e-06 0 0 0.0002 0 0 0 0 0 0 
0 0 0 0 0 0 0 0 0 
##$DATE= 1739687633
##$DBL= (0..7)
120 120 120 120 120 120 120 120 
##$DBP= (0..7)
150 150 150 150 150 150 150 150 
##$DBP07= 0
##$DBPNAM0= <>
##$DBPNAM1= <>
##$DBPNAM2= <>
##$DBPNAM3= <>
##$DBPNAM4= <>
##$DBPNAM5= <>
##$DBPNAM6= <>
##$DBPNAM7= <>
##$DBPOAL= (0..7)
$$ [...]
##$SUBNAM2= <"">
##$SUBNAM3= <"">
##$SUBNAM4= <"">
##$SUBNAM5= <"">
##$SUBNAM6= <"">
##$SUBNAM7= <"">
##$SUBNAM8= <"">
##$SUBNAM9= <"">
##$SW= 238.246396889851
##$SWIBOX= (0..15)
0 1 3 0 0 0 0 0 0 0 0 0 0 0 0 0 
##$SW_h= 11990.4076738609
##$TD= 32768
##$TD0= 1
##$TE= 0
##$TE2= 300
##$TE3= 300
##$TEG= 300
##$TL= (0..7)
0 120 120 120 120 120 120 120 
##$TP= (0..7)
150 150 150 150 150 150 150 150 
##$TP07= 0
##$TPNAME0= <>
##$TPNAME1= <>
##$TPNAME2= <>
##$TPNAME3= <>
##$TPNAME4= <>
##$TPNAME5= <>
##$TPNAME6= <>
##$TPNAME7= <>
##$TPOAL= (0..7)
0.5 0.5 0.5 0.5 0.5 0.5 0.5 0.5 
##$TPOFFS= (0..7)
0 0 0 0 0 0 0 0 
##$TUNHIN= 0
##$TUNHOUT= 0
##$TUNXOUT= 0
##$USERA1= <user>
##$USERA2= <user>
##$USERA3= <user>
##$USERA4= <user>
##$USERA5= <user>
##$V9= 5
##$VALIST= <valist>
##$VCLIST= <CCCCCCCCCCCCCCC>
##$VD= 0
##$VDLIST= <DDDDDDDDDDDDDDD>
##$VPLIST= <PPPPPPPPPPPPPPP>
##$VTLIST= <TTTTTTTTTTTTTTT>
##$WBST= 1024
##$WBSW= 20
##$XGAIN= (0..3)
0 0 0 0 
##$XL= 0
##$YL= 0
##$YMAX_a= 10743212
##$YMIN_a= -8291702
##$ZGOPTNS= <>
##$ZL1= 120
##$ZL2= 120
##$ZL3= 120
##$ZL4= 120
##$ABSF1= 0
##$ABSF2= 0
##$ABSG= 0
##$ABSL= 0
##$ALPHA= 0
##$AQORDER= 0
##$ASSFAC= 0
##$ASSFACI= 0
##$ASSFACX= 0
##$ASSWID= 0
##$AUNMP= <proc_1d>
##$AZFE= 0.1
##$AZFW= 0.5
##$BCFW= 0
##$BC_mod= 2
##$BYTORDP= 0
##$COROFFS= 0
##$CY= 12.5
##$DATMOD= 1
##$DC= 0
##$DFILT= <>
##$DTYPP= 0
##$F1P= 99.9999945759776
##$F2P= -179.999992907048
##$FCOR= 0.5
##$FTSIZE= 32768
##$FT_mod= 6
##$GAMMA= 0
##$GB= 0
##$INTBC= 1
##$INTSCL= 0
##$ISEN= 30
##$LB= 2
##$LEV0= 0
##$LPBIN= 0
##$MAXI= 10000
##$MC2= 0
##$MEAN= 0
##$ME_mod= 0
##$MI= 0
##$NCOEF= 0
##$NC_proc= 0
##$NLEV= 6
##$NOISF1= 0
##$NOISF2= 0
##$NSP= 0
##$NTH_PI= 0
##$NZP= 0
##$OFFSET= 219.1257
##$PC= 1.4
##$PHC0= -340.663
##$PHC1= 25.66493
##$PH_mod= 1
##$PKNL= yes
##$PPARMOD= 0
##$PSCAL= 4
##$PSIGN= 0
##$REVERSE= no
##$SF= 50.322729
##$SI= 32768
##$SIGF1= 0
##$SIGF2= 0
##$SINO= 80
##$SIOLD= 32768
##$SREGLST= <13C.CDCl3>
##$SSB= 0
##$STSI= 32768
##$STSR= 0
##$SW_p= 11990.4076738609
##$SYMM= 0
##$S_DEV= 0
##$TDeff= 32768
##$TDoff= 0
##$TI= <>
##$TILT= no
##$TM1= 0
##$TM2= 0
##$TOPLEV= 0
##$USERP1= <user>
##$USERP2= <user>
##$USERP3= <user>
##$USERP4= <user>
##$USERP5= <user>
##$WDW= 1
##$XDIM= 32768
##$YMAX_p= 378047917
##$YMIN_p= -5977441
$$ End of Bruker specific parameters
$$ ---------------------------------
##NTUPLES= NMR SPECTRUM
##VAR_NAME=  FREQUENCY,     SPECTRUM/REAL,   SPECTRUM/IMAG
##SYMBOL=    X,             R,               I
##VAR_TYPE=  INDEPENDENT,   DEPENDENT,       DEPENDENT
##VAR_FORM=  AFFN,          ASDF,            ASDF
##VAR_DIM=   32768,         32768,           32768
##UNITS=     HZ,            ARBITRARY UNITS, ARBITRARY UNITS
##FACTOR=    0.365929370215793, 1,           1
##FIRST=     11027.0033138647, 0,            0
##LAST=      -963.404359996184, 0,           0
##MIN=       -963.404359996184, -5977441,    0
##MAX=       11027.0033138647, 378047917,    0
$$ Real data points
##PAGE= N=1
##DATA TABLE= (X++(R..R)), XYDATA
$$ [...]
10937A592858P51284O76850M19495r8328l74659j25891K53423M22919J81717j94082
$$ 1592858 2344142 3020992 3440487 3342159 2967500 2841609 3095032 3517951 3699668 3505586
10927C505586m01062m66583m34292m91704p38280q71743o08445j89206r9010l25089
$$ 3505586 3104524 2637941 2203649 1711945 973665 101922 -506523 -695729 -794739 -1119828
10917a119828o50550q52350p17781k29828K60037M36160K92978j307j95832o7760
$$ -1119828 -1770378 -2622728 -3340509 -3570337 -3310300 -2874140 -2581162 -2582469 -2778301 -2846061
10907b846061L11327P06954P00016K75835j55667k97224k66812j05196J67878
$$ -2846061 -2534734 -1827780 -1127764 -851929 -1007596 -1304820 -1571632 -1676828 -1508950
10898a508950L16001L40727L20398K30931J8959m1378J11333Q3799M6072L61127
$$ -1508950 -1192949 -852222 -531824 -300893 -281934 -323312 -211979 -128180 -82108 279019
10888B79019P41383Q99677O86950J6490p96772j160647q67867l47671k5870K09294
$$ 279019 1020402 1920079 2607029 2623519 1826747 666100 -201767 -549438 -575308 -366014
10878c66014N19740P40623O46289L06720j66925n37111o23194m61519j51357J80241
$$ -366014 153726 894349 1540638 1847358 1680433 1143322 520128 58609 -92748 87493
10868H7493M27899O94741R68352R80746O89550M30193L12914Q6862p3282J19695
$$ 87493 515392 1210133 2178485 3159231 3848781 4278974 4591888 4678750 4605468 4725163
10858D725163K92448N6775m34472q22625r33173r00400q40735o10564k77103n295
$$ 4725163 5017611 5074386 4639914 3817289 2884116 1983716 1142981 532417 255314 250019
10848B50019J33093o3505l68240m12652j12833K37031L19026J82254K173q7041
$$ 250019 383112 319607 -48633 -461285 -574118 -337087 -18061 164193 166366 79325
10838G9325K7706L95801N84348K38542j64753l17545m33245l43613m4098K30199
$$ 79325 107031 502832 1087180 1325722 1160969 843424 410179 66566 22468 252667
10828B52667M40911N34365L97789N7033l09026l91291j43379K51710O27965P08746
$$ 252667 693578 1227943 1625732 1682765 1373739 982448 839069 1090779 1718744 2427490
10818B427490M95811J55548l05665p09810q02190n64791k91863m5781J88117L26345
$$ 2427490 2923301 3078849 2773184 2063374 1261184 696393 404530 358749 546866 873211
10808H73211M23407L13811M4101R032k0969l89393n61191k00276K98134M97062
$$ 873211 1296618 1610429 1654530 1663562 1642593 1253200 692009 491733 789867 1286929
10798A286929K68276J5638J611m3813k26363k90869j76622r7479j0525J76780
$$ 1286929 1555205 1570843 1572454 1528641 1302278 1011409 834787 737308 726783 903563
10788I03563L42960M10266J55034j32208K1367L43097L08550R9869Q2941p2469
$$ 903563 1246523 1656789 1811823 1679615 1700982 2044079 2352629 2452498 2535439 2462970
10778B462970l22047l24491j94612J03534M70168N42755M61961L08984m3824m71999
$$ 2462970 2140923 1816432 1621820 1725354 2195522 2738277 3200238 3509222 3465398 2993399
10768B993399p42137p77613n88876k78074n9229J8954K13259M85832N21215K67974
$$ 2993399 2251262 1473649 884773 606699 547470 566424 779683 1265515 1786730 2054704
10758B054704L2489q0267j99443l03083k93515k17929k4606K29918J65865J1808
$$ 2054704 2087193 2006926 1807483 1504400 1210885 992956 968350 1198268 1364133 1375941
10748A375941J22779L51394M94309M33835L16292K14589q8851m80275m17958Q3210
$$ 1375941 1498720 1850114 2344423 2778258 3094550 3309139 3220288 2740013 2322055 2405265
10738B405265M52817L16170j07285l72873m88362n09125l31974j50791j73316
$$ 2405265 2858082 3174252 3066967 2694094 2205732 1696607 1364633 1213842 1040526
10729A040526k72810k75154k97980n43473q30100q39971o60736l81263o2784J60353
$$ 1040526 767716 492562 194582 -348891 -1178991 -2018962 -2679698 -3060961 -3123745 -2963392
10719b963392L70146N47535P53615Q79598O58723J06505k72686k45106k4309K12901
$$ -2963392 -2593246 -2045711 -1292096 -412498 246225 352730 80044 -165062 -189371 23530
10709B3530M15196O39078Q17019O02076J57149k68j94175o08272p76036n46011
$$ 23530 438726 1077804 1894823 2496899 2654048 2653780 2459605 1851333 1075297 529286
10699E29286k35422O5527M01208N98802O47124N03792K30237J78213L53162M06285
$$ 529286 293864 359391 760599 1359401 2006525 2510317 2740554 2918767 3271929 3678214
10689C678214K61989j88259p53658j067688j024573o94703k79418q411r108J25830
$$ 3678214 3940203 3751944 2998286 1930598 906025 211322 -68096 -76507 -85615 40215
10679D0215N42719Q06272Q17135N87813K63467J50160O5437j59897k98142l78063
$$ 40215 582934 1389206 2206341 2794154 3057621 3207781 3273218 3113321 2815179 2437116
10669B437116n86895o96888m59611l0889L36061L89427K00483m1148j28531J6123
$$ 2437116 1850221 1153333 693722 662833 998894 1388321 1588804 1547656 1419125 1435248
10659A435248K28320K22842k1752j58093r171J93758J32070k43592n13075k67022
$$ 1435248 1663568 1886410 1864658 1706565 1697394 1891152 2023222 1779630 1266555 999533
10649I99533K48896O04886N95882M04742J85620j53148m20153l27440K20907J031608
$$ 999533 1248429 1853315 2449197 2853939 3039559 2886411 2466258 2138818 2359725 3391333
10639C391333J507927J320733P84913O13872J249397K201758L084082M182014
$$ 3391333 4899260 6219993 7004906 7618778 8868175 11069933 14154015 18336029
10631A8336029N659270P303178Q804113R762920R691105P868387L585217j762895
$$ 18336029 23995299 31298477 40102590 49865510 59556615 67425002 71010219 69247324
10623F9247324n658994p288024p364415o654713n656410m750209m322938m320791
$$ 69247324 63588330 56300306 48935891 42281178 36624768 31874559 27551621 23230830
10615B3230830m080987l302606k411304j935674j739417j363172r43266o99578
$$ 23230830 19149843 15847237 13435933 11500259 9760842 8397670 7454404 6754826
10607F754826n25361k30973J06195K62810O213m55618p90804q00356m62702j03751
$$ 6754826 6229465 5998492 6104687 6367497 6373710 5918092 5127288 4326932 3864230 3760479
10597C760479r1902l75251m77301k23611J02756K13238J80389L13883M80225L57437
$$ 3760479 3668577 3293326 2816025 2592414 2695170 2908408 3088797 3402680 3882905 4240342
10587D240342R0607j26247l33755n76121o76556m46808j02465m0825k21643l08697
$$ 4240342 4330949 4204702 3870947 3294826 2618270 2171462 2068997 2028172 1806529 1497832
10577A497832l35120l71440k53154l7045K7369o0548j18264j38277j54926k20611
$$ 1497832 1162712 791272 538118 501073 528442 467894 349630 211353 56427 -164184
10567a64184k25225J07286M44268M64545K09703j415M0865J26401K6385k70376
$$ -164184 -389409 -282123 162145 626690 836393 834978 875843 1002244 1028629 758253
10557G58253n43429n04801k59686j76970k27779m1466L05101L72894L31946K26769
$$ 758253 214824 -289977 -549663 -726633 -954412 -995878 -690777 -317883 14063 240832
10547B40832l1082k51131l87770k85654Q584O2027j59500k39150O612L31388N01381
$$ 240832 209750 -41381 -429151 -714805 -706221 -644194 -803694 -1042844 -1036232 -704844 -203463
10536b03463L44388P4956k9124Q3490K14022K37637K76247L80694L53050K0712
$$ -203463 140925 215881 186757 270247 484269 721906 998153 1378847 1731897 1752609
10526A752609k57947j76638J29819L94906M21739K07282j10436n13062q68946
$$ 1752609 1494662 1318024 1447843 1842749 2264488 2471770 2361334 1848272 979326
10517I79326q61938n91965l55593j05392J27307K78395L39810J12606j98183k24468
$$ 979326 117388 -474577 -830170 -935562 -808255 -529860 -190050 -77444 -275627 -500095
10507e00095j33406N0204L89538N97891N25661K29329m181l069K7869O2246J81693
$$ -500095 -633501 -583297 -193759 404132 929793 1159122 1154941 1151872 1179741 1241987 1423680
10496A423680K39013J88182K20888J97613j46991m66344n20908j92044K93357
$$ 1423680 1662693 1850875 2071763 2269376 2122385 1656041 1135133 943089 1236446
10487A236446M97430L93133K35097J30700j44665m45475l29645N9573K80192M5084
$$ 1236446 1733876 2127009 2362106 2492806 2348141 1902666 1573021 1632594 1912786 1957870
10477A957870l50956m35667k10085Q3082K27444J55750M5745q2272k07302o4848
$$ 1957870 1606914 1171247 961162 1044244 1271688 1427438 1473183 1390911 1183609 1118761
10467A118761J42748J88793J77733N2204q0215P0780K09232K6543n2531J51948
$$ 1118761 1261509 1450302 1628035 1680239 1600024 1670804 1880036 1906579 1854048 2005996
10457B005996J31739j22551j90667p7328n6226k36213k87319k4104J25843k49622
$$ 2005996 2137735 2015184 1824517 1747189 1690963 1454750 1167431 1143327 1269170 1019548
10447A019548p78392q84328o05327j33483L02387N13100M43699K07385L4253J05638
$$ 1019548 241156 -643172 -1248499 -1381982 -1079595 -566495 -122796 84589 118842 224480
10437B24480L46571N03867N22086M55862K47841m7592j93025r8071K3827Q806
$$ 224480 571051 1074918 1597004 2052866 2300707 2253115 2060090 1962019 1985846 1994652
10427A994652k05179n33321o19028o15435n86658m35995l85825l57381k39499
$$ 1994652 1789473 1256152 637124 21689 -564969 -1000964 -1386789 -1744170 -1983669
10418a983669k14826k00165r1987q4759j59231K27333P32399O38821L34568K80289
$$ -1983669 -2198495 -2398660 -2490647 -2575406 -2734637 -2507304 -1774905 -1136084 -801516 -521227
10408e21227L33979K48548O015p6265j8900n5307M6824J73875K48692M07966M08560
$$ -521227 -187248 61300 67315 -8950 -27850 -83157 -36333 137542 386234 794200 1202760
10397A202760J87396J37593K41391P1714j61169n2221J74552K40386K55980K37481
$$ 1202760 1390156 1527749 1769140 1840854 1679685 1627464 1802016 2042402 2298382 2535863
10387B535863q0480n47324o30671m00228m77147p13161n91255j92089R4260J26995
$$ 2535863 2455383 1908059 1277388 877160 400013 -313148 -904403 -1096492 -1002232 -875237
10377h75237M5773J80525N98280Q59078N60503J25715K8872Q0874J60682K93534
$$ -875237 -829464 -648939 -50659 808419 1368922 1494637 1523509 1604383 1765065 2058599
10367B058599M10299L31186j3694m15704n71090n09363n34492m81865k94044k50575
$$ 2058599 2468898 2800084 2786390 2370686 1799596 1290233 755741 273876 -20168 -270743
10357b70743k77477k01300o3690J63125M88488O53079L02811j18282j02088J59594
$$ -270743 -548220 -749520 -813210 -650085 -161597 491482 794293 676011 573923 733517
10347G33517M19881M87404J95334j31418k0682M80807Q00585N28699l05006r63047
$$ 733517 1153398 1640802 1836136 1704718 1684036 2164843 2965428 3494127 3189121 2226074
10337B226074q85926n71242n27862n76707n00057k05462L61589Q08825P98115
$$ 2226074 1340148 768906 241044 -335663 -835720 -1041182 -679593 129232 927347
10328I27347N64260M03741K29302j45274m72560n75197o08969n19103k50452R122
$$ 927347 1491607 1895348 2124650 1979376 1506816 931619 322650 -196453 -446905 -437783
10318d37783J31158J28336J8124K6206R9359Q587k62307n75934o80783m91304
$$ -437783 -306625 -178289 -160165 -133959 -34600 -26013 -288320 -864254 -1545037 -2036341
10308b036341j18327J99005K36292J69835J63458K39300L63260K96401K02814
$$ -2036341 -2154668 -1955663 -1719371 -1549536 -1386078 -1146778 -783518 -487117 -284303
10299b84303K04878K04977N2383k36562k70164J14206M99829L71904j75773o60816
$$ -284303 -79425 125552 177935 -58627 -328791 -214585 285244 657148 481375 -179441
10289a79441p46113n79048l73205j37702K45428P47291J016170Q21671M57582
$$ -179441 -925554 -1504602 -1877807 -2015509 -1770081 -1022790 -6620 815051 1272633
10280A272633P6825m76203q85774p52438k82298J40637J75547N8607J20058J96219
$$ 1272633 1349458 873255 -12519 -764957 -1047255 -906618 -731071 -672464 -552406 -356187
10270c56187J12087O2817K27702M30656M14369J58388j43933l46104l27064l6017
$$ -356187 -244100 -181283 46419 477075 891444 1049832 905899 559795 232731 196714
10260A96714J80143P6142p3882j70684j11030L04825Q21180R47556M42754l43206
$$ 196714 376857 452999 379117 208433 97403 402228 1223408 2170964 2613718 2270512
10250B270512o82109k21860N85585R83523P35533J84899j76108k52918k93816
$$ 2270512 1588403 1366543 1952128 2935651 3671184 3856083 3679975 3427057 3133241
10241C133241m83841n36946l34884k35003l77973n97240o25636m49109m77050
$$ 3133241 2649400 2112454 1777570 1542567 1164594 567354 -58282 -507391 -984441
10232i84441o28595l47835J22482L80482O35493Q53250O97202M31173L94976M06028
$$ -984441 -1613036 -1960871 -1838389 -1457907 -822414 30836 728038 1159211 1554187 1960215
10222A960215L03463J43292N9369K64018N71640O24969M64434L40425j7829p27442
$$ 1960215 2263678 2406970 2466339 2730357 3301997 3926966 4391400 4731825 4713996 3986554
10212C986554j199712j119388p21021l33033k1844J44274L44764P06455Q80600
$$ 3986554 2786842 1667454 946433 613400 591556 735830 1080594 1787049 2667649
10203B667649O67911J78724k10366l88586o05477p64539n97738k12284J77917
$$ 2667649 3335560 3514284 3303918 2915332 2309855 1545316 947578 735294 913211
10194I13211M86680N10713K59119j15109m23485m93630l25782j12611K93746Q63211
$$ 913211 1399891 1910604 2169723 2054614 1631129 1137499 811717 699106 992852 1856063
10184A856063Q80094J14173p57282j084985p59035k64550L7908K37096K29712
$$ 1856063 2736157 2850330 2093048 1008063 249028 -15522 22386 259482 489194
10175D89194O220K0196K40498J71483L1070K23947M40565J54516l45365m95269
$$ 489194 495414 515610 756108 927591 958661 1182608 1623173 1777689 1432324 937055
10165I37055l37043j97616j08078r6369n2546L00204P94530R85488O17867r5652
$$ 937055 600012 402396 294318 197949 145403 445607 1240137 2225625 2843492 2747840
10155B747840m67448j65427K53333L49278K60369J16640K15532M38306K63375
$$ 2747840 2280392 2114965 2368298 2717576 2977945 3094585 3310117 3748423 4011798
10146D011798j99781l38203p4997J30942K6400l70521p57641p17317m05009k72964
$$ 4011798 3812017 3473814 3398817 3529759 3556159 3185638 2427997 1710680 1305671 1032707
10136A032707m18393m42933k46942M703J90088K75752M98549P54411O32569J69788
$$ 1032707 614314 171381 -75561 -70858 119230 394982 893531 1647942 2280511 2450299
10126B450299k78129n87760n91392m06281l54288l55730k12403k3980K19003M16558
$$ 2450299 2172170 1584410 993018 586737 232449 -123281 -335684 -359664 -140661 275897
10116B75897L44791K20657N933m07489n18932j36498L58069O49597O09164L90968
$$ 275897 620688 841345 847278 439789 -79143 -215641 142428 792025 1401189 1792157
10106A792157P7604k41911m34211k94663J16835M27694N05997L92587J28052j75303
$$ 1792157 1869761 1627850 1193639 898976 1015811 1443505 1949502 2342089 2470141 2294838
10096B294838k51715j07356K6842N5421J79458M14108N06749M24239L02304J71476
$$ 2294838 2043123 1935767 1962609 2018030 2197488 2611596 3118345 3542584 3844888 4016364
10086D016364J59063K16825p4127n64755p03524m52739j40196n9401k54576l94728
$$ 4016364 4175427 4392252 4318125 3753370 3049846 2597107 2456911 2397510 2142934 1748206
10076A748206k49257j41489j59557P5166L33930L37121L84143M90396M65190K05581
$$ 1748206 1498949 1357460 1197903 1273069 1606999 1944120 2328263 2818659 3283849 3489430
10066C489430q0645j0075J51899l0095l45917l02549j02446k33244m71469m12131
$$ 3489430 3408785 3398710 3550609 3520514 3174597 2872048 2769602 2536358 2064889 1652758
10056A652758j99417l3752J84720L61817L76124J84735o0637k09753j97447j62695
$$ 1652758 1453341 1419589 1604309 1966126 2342250 2526985 2466348 2256595 2059148 1896453
10046A896453j28136P5685K72659L85799M43587K20206j07518j54540j55826m01117
$$ 1896453 1768317 1844002 2116661 2502460 2946047 3166253 3058735 2904195 2748369 2347252
10036B347252m89515l08412r4235J99815M01643L55789J52661q5708m27943p89060
$$ 2347252 1857737 1549325 1455090 1654905 2056548 2412337 2564998 2479290 2051347 1262287
10026A262287r07947p20293l67044j03319K2083J62810J59307N237q1693j94260
$$ 1262287 354340 -365953 -732997 -836316 -814233 -651423 -492116 -486879 -568572 -762832
10016g62832k46451O2346N06782O77764N86410M20141K93640J88885o9906l12062
$$ -762832 -1009283 -946937 -440155 237609 824019 1244160 1537800 1726685 1656779 1344717
10006A344717j04950M01780O70298O32026N00676J91186q2812p2295K53210P91901
$$ 1344717 1239767 1641547 2311845 2943871 3444547 3635733 3552921 3480626 3733836 4525737
9996D525737J008653Q44123M53236j63827p14797p21131l68365k40716l98279
$$ 4525737 5534390 6378513 6831749 6667922 5953125 5231994 4863629 4622913 4224634
9987D224634m50464k24934n013j24038m03318n52306n38791l39582J35674N35819
$$ 4224634 3774170 3549236 3544223 3420185 3016867 2464561 1925770 1586188 1721862 2257681
9977B257681N34003M49381K86483q2520l59066l88993k97890l13988o50395j088113
$$ 2257681 2791684 3241065 3527548 3445028 3085962 2696969 2399079 2085091 1434696 346583
9967C46583j387504j229819p40925m13798l31762j36397M51048J002703J226956
$$ 346583 -1040921 -2270740 -3011665 -3425463 -3757225 -3893622 -3442574 -2439871 -1212915
9958a212915J032377N77400L33821J37757k77653o24432p52538n73760j88406
$$ -1212915 -180538 396862 730683 868440 590787 -33645 -786183 -1359943 -1548349
9949a548349P9673J81675L97509Q22248R62559L41263n83059p96609k66279K27217
$$ -1548349 -1468676 -1287001 -889492 -67244 895315 1236578 653519 -143090 -409369 -182152
9939a82152M11908L28072Q407l77069n78264m63083l6624K52017K48180K76650
$$ -182152 229756 557828 566235 189166 -389098 -852181 -888805 -636788 -388608 -111958
9929a11958K57870K65602L02081L09320M81088O59173L50029k71004m91080l90968
$$ -111958 145912 411514 713595 1022915 1504003 2163176 2513205 2242201 1751121 1360153
9919A360153l69722m67064n21712k69003P3837K75546K63573N953j92323o1170
$$ 1360153 990431 523367 1655 -267348 -193511 82035 345608 351561 159238 98068
9909I8068R5205J01671L29617O38307O73009M91421J69658q8805k84243n89886
$$ 98068 193273 294944 624561 1262868 1935877 2427298 2596956 2508151 2223908 1634022
9899A634022r21426r83593p36772l24832R6537O13644J019220Q95650M89606K53496
$$ 1634022 712596 -270997 -1007769 -1332601 -1236064 -622420 396800 1292450 1782056 2035552
9889B035552J56650M6798q0748j87188k72481l39736k87443j93K21778K2398l94004
$$ 2035552 2192202 2239000 2158252 1971064 1698583 1358847 1071404 1071211 1292989 1315387 921383
9878I21383o11922o17108o37940n59379k80702J06351M29123N12114L48196J60484
$$ 921383 309461 -307647 -945587 -1504966 -1785668 -1679317 -1250194 -738080 -389884 -229400
9868b29400J87934L35633L06787q5696m81291n54440l44377j56274o1757J20972
$$ -229400 -41466 294167 600954 515258 33967 -520473 -864850 -1021124 -1082881 -961909
9858i61909M43493N73511M84738M64039L17415J12039J22308K95229P5344m79599
$$ -961909 -518416 55095 539833 1003872 1321287 1433326 1555634 1850863 1926207 1446608
9848A446608o47879l46457K01595O02150O13247L34907k73128q53732p92639j94227
$$ 1446608 798729 452272 653867 1256017 1869264 2204171 1931043 1077311 284672 90445
9838I0445K81021L35174K56009J09121j65462m27110n45212m77054l51823k44526
$$ 90445 371466 706640 962649 1071770 906308 479198 -66014 -543068 -894891 -1139417
9828a139417p6946J46857L08425L13329L19577L80575M94633M94627n447q37969
$$ -1139417 -1216363 -1069506 -761081 -447752 -128175 252400 747033 1241660 1236213 398244
9818C98244j370548j207166o02310N2267M71670O96236Q12919O29397J91343k12270
$$ 398244 -972304 -2179470 -2781780 -2729513 -2257843 -1561607 -748688 -119291 72052 -140218
9808a40218m09738n54023m91174r4878N34342J126575J297998J168943Q07119
$$ -140218 -549956 -1103979 -1595153 -1690031 -1155689 -29114 1268884 2437827 3244946
9799C244946J67564l14273l12963j93035l19803m77281l40473j60223k79131m83346
$$ 3244946 3412510 3098237 2785274 2592239 2272436 1795155 1454682 1294459 1015328 531982
9789E31982n05103l04772j6953L57965N92971M74777K29011P8430m5191l14852
$$ 531982 26879 -277893 -294846 63119 656090 1130867 1359878 1438308 1393117 1078265
9779A078265o59880q04881o63176l49435N8537L87857N31055N93031N00611K62348
$$ 1078265 418385 -386496 -1049672 -1399107 -1340570 -952713 -421658 171373 671984 934332
9769I34332K6056j22242k78303m89762l53267J12418K96055K1264o0940L41828
$$ 934332 960388 838146 559843 70081 -283186 -170768 125287 146551 85611 427439
9759D27439P99611R09594P14299M52328K15217o0834n07520r05125q30849l17515
$$ 427439 1227050 2136644 2850943 3303271 3518488 3457654 2950134 2045009 1214160 896645
9749H96645J79759M39132M64306K01679j60295l20047l17886l42854k20648k2608
$$ 896645 1076404 1515536 1979842 2181521 2021226 1701179 1383293 1040439 819791 797183
9739G97183J50236J44764l0020l5359J89706L45048M04067L95757J88942q1817
$$ 797183 947419 1092183 1062163 1026804 1216510 1561558 1965625 2361382 2550324 2468507
9729B468507j50810k60116m52934m15419l50762m89117m59491j80735L304J43826
$$ 2468507 2317697 2057581 1604647 1189228 838466 349349 -110142 -290877 -287573 -143747
9719a43747L86970N05919M12100J86642l029J10523J00736l61180o01137j78695
$$ -143747 243223 749142 1161242 1347884 1344855 1455378 1556114 1194934 593797 415102
9709D15102L57341M83889K36419o9555j56130q8282m8941k78150n99999o82711
$$ 415102 772443 1256332 1492751 1423196 1267066 1178784 1129843 851693 251694 -431017
9699d31017m88257p9670K54468M37827N74029O64803N44519J60268j86042k8911
$$ -431017 -919274 -998944 -744476 -306649 267380 932183 1476702 1636970 1450928 1422017
9689A422017M23395M95490K68000j7341l58525m82088j56427L79009O21810K56384
$$ 1422017 1845412 2340902 2608902 2591561 2233036 1750948 1594521 1973530 2595340 2851724
9679B851724l46148p26353p88987m96736O1326M24780L77179K42068K09300K36143
$$ 2851724 2505576 1779223 990236 493500 554826 979606 1356785 1598853 1808153 2044296
9669B044296K72834K54076J41583k0069j1533R4177J40773O2892j64907l30168
$$ 2044296 2317130 2571206 2712789 2692720 2681187 2775364 2916137 2979029 2814122 2483954
9659B483954m23107m30422l84234l36484j24016n5005m40842p44824m51929K06649
$$ 2483954 2060847 1630425 1246191 909707 785691 730686 289844 -454980 -906909 -700260
9649g00260P54539R61190P66733K63976p1632n6923M9086J46532J77013q9295
$$ -700260 54279 1015469 1782202 2046178 1974546 1917623 1966709 2113241 2290254 2200959
9639B200959m15588m49920l48082j29922J69858M78492N39290L57116K92357J38273
$$ 2200959 1785371 1335451 987369 857447 1027305 1505797 2045087 2402203 2694560 2832833
9629B832833j55628j54980Q1939J09814j75237m61543m70615k41003J13780L99552
$$ 2832833 2677205 2522225 2604164 2713978 2538741 2077198 1606583 1365580 1479360 1878912
9619A878912L98021J36628m1047r8427q8563K4482J91457L26250L98333J99086
$$ 1878912 2276933 2413561 2372514 2274087 2185524 2210006 2401463 2727713 3126046 3325132
9609C325132k47286o69195r34407q77696l58475J69657J9977l84524l66377n6082
$$ 3325132 3077846 2408651 1474244 596548 238073 407730 427707 43183 -323194 -379276
9599c79276O1645N7177K10631N17294N78175K80975j457k2737O7964N9006L114
$$ -379276 -317631 -260454 -49823 467471 1045646 1326621 1325164 1302427 1370391 1429397 1432511
9588A432511O5445J8795l02783n46233m22012p7054L68046P13191O13328L11756
$$ 1432511 1497956 1516751 1213968 667735 245723 168669 536715 1249906 1863234 2174990
9578B174990R7642o894q4026l1720J06462J40147Q5817j88736l07084j21218p7100
$$ 2174990 2272632 2265738 2181712 2149992 2256454 2396601 2482418 2293682 1986598 1865380 1788280
9567A788280p1816j141j73355n64079p98992p75381p35982n32029k07683n7596
$$ 1788280 1716464 1715323 1541968 977889 178897 -596484 -1332466 -1864495 -2072178 -2129774
9557b129774Q3428L11682N25608O51286O34225M66839L14668L06088M37243M82675
$$ -2129774 -2046346 -1734664 -1209056 -557770 76455 543294 857962 1164050 1601293 2083968
9547B083968K73617k6788j48064k9952K18840M12643L09048r4944m68017l05100
$$ 2083968 2357585 2330797 2182733 2152781 2371621 2784264 3093312 2998368 2530351 2225251
9537B225251K31317N29406M86681L51922K40861J84863L6105k36525m13716m48850
$$ 2225251 2456568 2985974 3472655 3824577 4065438 4250301 4286406 4049881 3636165 3187315
9527C187315l14441j17970L8699J41216K64295M19057N24872P20791R26777R97808
$$ 3187315 2872874 2754904 2793603 2934819 3199114 3618171 4143043 4863834 5790611 6788419
9517F788419P53066K26687P517J26785K24553L57820N16121P90837J120877J143434
$$ 6788419 7541485 7768172 7775689 7902474 8127027 8484847 9000968 9791805 10912682 12056116
9507A2056116P49304K69120J17115M49924J198048K006705K331061K353383K538617
$$ 12056116 12805420 13074540 13191655 13641579 14839627 16846332 19177393 21530776 24069393
9498B4069393K766384L065445L329459L371536L196444K878266K508406J942447
$$ 24069393 26835777 29901222 33230681 36602217 39798661 42676927 45185333 47127780
9490D7127780R11119k70483j289666k106314k713220l029721l102279l293314
$$ 47127780 48038899 47768416 46478750 44372436 41659216 38629495 35527216 32233902
9482C2233902l355900k940439k366659j951148j463592r31212p84092q97673q27342
$$ 32233902 28878002 25937563 23570904 21619756 20156164 19224952 18440860 17543187 16715845
9473A6715845p35704j001539j241848r96925o59258p78842j052275r49140o10488
$$ 16715845 15980141 14978602 13736754 12739829 12080571 11301729 10249454 9300314 8689826
9464H689826m28615m05644n13450p02638n80828k52355j54273l05923l93646j71426
$$ 8689826 8261211 7855567 7342117 6639479 6058651 5806296 5652023 5346100 4952454 4781028
9454D781028J73348L82070L75807P5194k86703m88553o84302q79978p74380m37421
$$ 4781028 4954376 5336446 5712253 5787447 5500744 5012191 4327889 3447911 2673531 2236110
9444B236110j52865q6706l17581n29589l69287L0088L88065N02081M39195L49863
$$ 2236110 2083245 1996539 1678958 1149369 780082 810170 1198235 1700316 2139511 2489374
9434B489374K36034K9865j60394k37448m00485o11686o03003m24395k17220P8974
$$ 2489374 2725408 2755273 2594879 2357431 1956946 1345260 742257 317862 100642 179616
9424A79616L81697L02466J3352k6313J71161M45206N75998K80864j86051m19552
$$ 179616 561313 863779 877131 850818 1021979 1467185 2043183 2324047 2137996 1718444
9414A718444k98447j0382J62711K28212K09212L54535M98879K60022o1713J27386
$$ 1718444 1419997 1409615 1572326 1800538 2009750 2364285 2863164 3123186 3061473 3188859
9404C188859O84262Q64477M86449l3634m36864m57265n37L30868K96138M19959
$$ 3188859 3873121 4737598 5224047 5190413 4753549 4296284 4295747 4626615 4922753 5342712
9394E342712P95105J028871R60109P49260P39000R88823J269934J186428L08986
$$ 5342712 6137817 7166688 8126797 8876057 9615057 10603880 11873814 13060242 13369228
9385A3369228q21003j179579r46381q00028q69724j064874j173234r39713n81276
$$ 13369228 12548225 11368646 10422265 9622237 8752513 7687639 6514405 5574692 4993416
9376D993416l24304k40903l24091k97821k82391m65441m52903l11447l81066m10500
$$ 4993416 4669112 4428209 4104118 3806297 3523906 3058465 2605562 2294115 1913049 1502549
9366A502549n3466M83160O60273M49819J40706m4563O8210L02132K42913j00055
$$ 1502549 1449083 1932243 2592516 3042335 3183041 3138478 3206688 3508820 3751733 3651678
9356C651678k94183k95275j92684N7689L14510K85412j46481m79744l95964k45050
$$ 3651678 3357495 3062220 2869536 2927225 3241735 3527147 3380666 2900922 2504958 2259908
9346B259908k44054k60494k05162o8469J12282K26874L28894M55112O30637O88497
$$ 2259908 2015854 1755360 1550198 1481729 1594011 1820885 2149779 2604891 3235528 3924025
9336C924025L95801p34l56210n38968l63440O6072L96353L95950L84424N25465
$$ 3924025 4319826 4319092 3962882 3423914 3060474 3126546 3522899 3918849 4303273 4828738
9326D828738O42753N70234K36166k87644q89107j064384q13853p28851o92951
$$ 4828738 5471491 6041725 6277891 5990247 5101140 4036756 3222903 2494052 1801101
9317A801101m90228m41348n19600l35156K89112R01107P54662N9064m93612n19019
$$ 1801101 1310873 869525 349925 14769 303881 1204988 1959650 2018714 1525102 1006083
9307A006083l5373N19308O96611N43740K81188j43036m86026m94087l48355k16852
$$ 1006083 970710 1490018 2186629 2730369 3011557 2868521 2382495 1888408 1540053 1323201
9297A323201j23173j20487k09300l74178m29285k97991j11508K11905M87650L95289
$$ 1323201 1200028 1079541 870241 496063 66778 -231213 -342721 -130816 356834 752123
9287G52123J13291l5437K19095O36788O13050L29848K54556K69568J25839k15737
$$ 752123 865414 829977 1049072 1685860 2298910 2628758 2883314 3152882 3278721 3062984
9277C062984o90942j039429j057915p28134l22941j13550L3982K18125L48588
$$ 3062984 2372042 1332613 274698 -453436 -776377 -889927 -855945 -637820 -289232
9268b89232L30135K87703L66925M22249J72039l81389q41863r95266q19199k90927
$$ -289232 40903 328606 695531 1117780 1289819 908430 66567 -928699 -1747898 -2038825
9258b038825J96357K67939K48128L68346M22995N05208O29591P09726M48257j34547
$$ -2038825 -1842468 -1574529 -1326401 -958055 -535060 -29852 599739 1309465 1757722 1623175
9248A623175l67235o5696L05928L51127O2759l10915m43178j66235P6680j47989
$$ 1623175 1255940 1190244 1496172 1847299 1910058 1599143 1155965 989730 1066410 918421
9238I18421o81348r85286p13163k68050O6312J99709K56204M74424P00146O89185
$$ 918421 237073 -748213 -1461376 -1729426 -1663114 -1463405 -1207201 -732777 -32631 656554
9228F56554M16430O7291j15968k6380J42497P3924k00869l78518l83264k96622
$$ 656554 1072984 1140275 1024307 997927 1140424 1214348 1013479 634961 251697 -44925
9218d4925l1885J86443J08081m4468N0041K80439K94716J23170J24283K80629
$$ -44925 -76810 109633 217714 173246 223287 503726 798442 921612 1045895 1326524
9208A326524K45843J24875J37453J07257k061M7129K27034L59802L79048L18595
$$ 1326524 1572367 1697242 1834695 1941952 1939891 1987020 2214054 2573856 2952904 3271499
9198C271499J44367k34169n33964m30087j00512Q8968k0121k19479l24057l08358
$$ 3271499 3415866 3181697 2647733 2217646 2117134 2206102 2185981 1966502 1642445 1334087
9188A334087k12460L2261K59808J87101j65276m14730l83446k36013j80995l11042
$$ 1334087 1121627 1153888 1413696 1600797 1435521 1020791 637345 401332 220337 -90705
9178i0705l62618J9144O33091P65488J84471m12086n21993j65826M15540O93082
$$ -90705 -453323 -434179 198912 964400 1148871 736785 214792 48966 464506 1157588
9168A157588O18693O36535Q05293R30821P69334R0819o18513q16331o91809m51512
$$ 1157588 1776281 2412816 3218109 4148930 4918264 5009083 4390570 3574239 2882430 2430918
9158B430918l44671k51175J54070N17833M84081L40892L37159L29229J64544l00278
$$ 2430918 2086247 1835072 1989142 2506975 2991056 3331948 3669107 3998336 4162880 3862602
9148C862602o81774n47760j46671L09504O33261L57736l49700p84963p08582m60077
$$ 3862602 3180828 2633068 2486397 2795901 3429162 3786898 3437198 2652235 1943653 1483576
9138A483576k15384o3235j35481j28464J17476M9185l86193o20302m37175j37103
$$ 1483576 1268192 1204957 1069476 941012 1058488 1107673 721480 101178 -335997 -473100
9128d73100J88417M82794M50055J04939k96169m95991m19709l23488k99318j93051
$$ -473100 -284683 198111 648166 753105 456936 -39055 -458764 -782252 -1081570 -1274621
9118a274621R7529M05385L27867m6935j54313J12799K83889K27678J08414o0627
$$ -1274621 -1177092 -771707 -443840 -490775 -645088 -532289 -248400 -20722 87692 27065
9108B7065j68850k4499J95689K57272K27538L7982l34532n98426p23652o15119
$$ 27065 -141785 -166284 29405 286677 514215 552197 217665 -380761 -1104413 -1719532
9098a719532l03778j47351j58788k7691J12176J23667J51551K02230K89715N52764
$$ -1719532 -2023310 -2170661 -2329449 -2357140 -2244964 -2121297 -1969746 -1767516 -1477801 -925037
9088i25037P35703P15828L94589k25189p13541q83586p55438n60268l82905j849
$$ -925037 -189334 526494 921083 695894 -17647 -901233 -1656671 -2216939 -2599844 -2601693
9078b601693K93327M08536L46171K3508k18598k79451p0351J44063k6938k24070
$$ -2601693 -2308366 -1899830 -1553659 -1530151 -1748749 -2028200 -2098551 -1954488 -1981426 -2205496
9068b205496o6601K01863J52606O140J77450L59868K39736q771m4381J28095J77090
$$ -2205496 -2272097 -2070234 -1917628 -1911488 -1734038 -1374170 -1134434 -1143205 -1187586 -1059491 -882401
9057h82401J69703J70218L43403N54162M32801K13376J40979L98295P32210P02537
$$ -882401 -712698 -542480 -199077 355085 787886 1001262 1142241 1540536 2272746 2975283
9047B975283M03553J18844n0844j19171j92206k42299k51594j79959m9560n3357
$$ 2975283 3378836 3497680 3446836 3327665 3135459 2893160 2641566 2461607 2412047 2358690
9037B358690j89572l12121m41063o03412m60683m5171K28350M17692O05317N30431
$$ 2358690 2169118 1856997 1415934 812522 351839 306668 535018 952710 1558027 2088458
9027B088458K34970K04156M41820M58857J25813k58984n22003o68754o77345n31168
$$ 2088458 2323428 2527584 2969404 3428261 3554074 3295090 2773087 2104333 1426988 895820
9017H95820l04219j73214j60693q2621J32266M08722N48155L71430O2901o5602
$$ 895820 591601 418387 257694 175073 307339 716061 1264216 1635646 1698547 1632945
9007A632945m2979O1576P6173j10032m61183n76872q7237L91061L63763J9105
$$ 1632945 1589966 1651542 1727715 1617683 1156500 579628 492391 883452 1247215 1266320
8997A266320l31985l87868j61932O8255J52627K10812K42733L04604N76924O61339
$$ 1266320 934335 546467 384535 452790 605417 816229 1058962 1363566 1940490 2601829
8987B601829K32850m24135r68341j285772j222898q40126m23175k01254j71668
$$ 2601829 2834679 2410544 1442203 156431 -1066467 -1906593 -2329768 -2531022 -2702690
8978b702690l9897P3798R5909K31087N00409Q29519Q93497O04055K74851K10248
$$ -2702690 -2742587 -2668789 -2572880 -2341793 -1841384 -1011865 -118368 485687 760538 970786
8968I70786K57484J28043j86466m68031l56145N627K08103K36907L56366N18347
$$ 970786 1228270 1356313 1169847 701816 345671 351298 559401 796308 1152674 1671021
8958A671021M14869M695o14144q95535n42034L4678L97496L72261J69374j72374
$$ 1671021 2085890 2090585 1476441 580906 38872 73550 471046 843307 1012681 840307
8948H40307n82583o89192m93243l01681j10024R3242K18738L19732M10110L84794
$$ 840307 257724 -431468 -924711 -1226392 -1336416 -1243174 -1024436 -704704 -294594 90200
8938I0200M61854O22463N15713K74669K92924K64559Q057l50104q38766j054800
$$ 90200 552054 1174517 1690230 1964899 2257823 2522382 2530439 2180335 1341569 286769
8928B86769p53395k56513J82022O04632Q34282O92691M66735M80830N95052M94081
$$ 286769 -466626 -723139 -541117 63515 897797 1590488 2057223 2538053 3133105 3627186
8918C627186K79038J9283k87338m92190n26372l59097j58754j57957l69599p25665
$$ 3627186 3906224 3925507 3638169 3145979 2619607 2260510 2101756 1943799 1574200 848535
8908H48535j079560j037700m74366K11576O34238P08159O96464O41959L75931
$$ 848535 -231025 -1268725 -1743091 -1531515 -897277 -189118 507346 1149305 1525236
8899A525236J09308M7172j66820n26688m66293j46784O2044L49648M67015N4192
$$ 1525236 1634544 1681716 1514896 988208 521915 375131 437175 786823 1253838 1308030
8889A308030m97072p60812o46226l27389J30787O69637R69691Q85506M72285o3772
$$ 1308030 810958 50146 -596080 -923469 -792682 -123045 846646 1732152 2204437 2140665
8879B140665m89626q03300r03317o36543j18560N85711J248796J574886J482361
$$ 2140665 1651039 847739 -55578 -692121 -810681 -224970 1023826 2598712 4081073
8870D081073R09552K04291r3928n7613p0593m14231r36239j242643j026189n72233
$$ 4081073 4990625 5194916 5100988 5043375 4972782 4558551 3622312 2379669 1353480 781247
8860G81247k33086l1104m8527k40730k91782l5484J97960K01195P3560m8531K6159
$$ 781247 548161 517057 468530 227800 -63982 -99466 98494 299689 373249 324718 350877
8849C50877L05215L96746J78126j19508m02681n56081l94981J4301N24949Q91022
$$ 350877 656092 1052838 1230964 1111456 708775 152694 -242287 -227986 296963 1187985
8839A187985P45620K88901J17989M7491j05449j86753k77405k83010k90594n40787
$$ 1187985 1933605 2222506 2340495 2387986 2282537 2095784 1818379 1535369 1244775 703988
8829G03988p57592o41726l33702m7971J62018L35396N10744P30975R03563P40281
$$ 703988 -53604 -695330 -1029032 -1077003 -914985 -579589 -68845 662130 1565693 2305974
8819B305974J51986m83687p81167m59552J82808N30367M55163L10343J81577K2290
$$ 2305974 2457960 1974273 1193106 733554 916362 1446729 1901892 2212235 2393812 2416102
8809B416102r7076r2668k8085k76395o14247n47997k78044j03062O1994K98447
$$ 2416102 2319026 2226358 2198273 1921878 1307631 759634 481590 378528 440522 738969
8799G38969N66450P79176P08983K44446j06521K3680L58094O24779Q33530Q27062
$$ 738969 1305419 2084595 2793578 3038024 2931503 2955183 3313277 3938056 4771586 5598648
8789E598648N94688N15668M38173K00381R1873Q443j54635k63020l60926n00432
$$ 5598648 6193336 6709004 7147177 7347558 7439431 7447874 7293239 7030219 6669293 6168861
8779F168861m58071k02194L4003K58708N84587Q56280P75541K41515l61725n47555
$$ 6168861 5710790 5508596 5542599 5801307 6385894 7242174 8017715 8259230 7897505 7349950
8769G349950m93093n97888q65032j142336j176575p77462l46618k05054l99636
$$ 7349950 6856857 6258969 5393937 4251601 3075026 2297564 1950946 1745892 1346256
8760A346256o18405m44183J1692M97300O82562M73662J24531n4083r13K02521
$$ 1346256 727851 283668 295360 792660 1475222 1948884 2073415 2019332 2018419 2220940
8750B220940J46866k85539o68429o06334l0392N23570N83336M38780M43121O25107
$$ 2220940 2367806 2082267 1413838 807504 777112 1300682 1884018 2322798 2765919 3391026
8740C391026P31963O83991M09491j11251n13920p44848p82350n72484m14481l05768
$$ 3391026 4122989 4806980 5216471 5105220 4591300 3846452 3064102 2491618 2077137 1771369
8730A771369k13477k53411k74162J6790O34450J147268J210343R29008P78112
$$ 1771369 1557892 1304481 1030319 1047109 1681559 2828827 4039170 4968178 5746290
8721E746290P36438L60072j30271l95954n65615p33255p96839p14777l62934J85691
$$ 5746290 6482728 6842800 6712529 6316575 5750960 5017705 4220866 3506089 3143155 3328846
8711C328846N67182O38423M18165j04467n44179o65002o90409o38930m41537j57868
$$ 3328846 3896028 4534451 4952616 4848149 4303970 3638968 2948559 2309629 1868092 1710224
8701A710224J27220L06604K52119J03754j19046m43510m37522N8623N62232O93789
$$ 1710224 1837444 2144048 2396167 2499921 2380875 1937365 1499843 1558466 2120698 2814487
8691B814487O21791M57771K61356K42559L25008L19370J40704K2409J32464O2448
$$ 2814487 3436278 3894049 4155405 4397964 4722972 5042342 5183046 5205455 5337919 5400367
8681E400367k87255n02334n96542n90701k90646M8218J63883R3846j55542l44938
$$ 5400367 5113112 4610778 4014236 3423535 3132889 3181107 3344990 3438836 3283294 2938356
8671B938356l29002k43502j60587j3989L24947O78116Q42458Q73692P95910O19923
$$ 2938356 2609354 2365852 2205265 2191276 2516223 3194339 4036797 4910489 5706399 6326322
8661F326322M46407K83387L6705j53013j68556N1779M97509Q18805Q23813N72736
$$ 6326322 6772729 7056116 7092821 6939808 6771252 6823031 7320540 8139345 8963158 9535894
8651I535894K7596n18154n24917j11248J90288K25041J34671K30480M72831N55216
$$ 9535894 9563490 9045336 8520419 8409171 8599459 8824500 8959171 9189651 9662482 10217698
8641A0217698O10691P56258Q30438Q04678P22550O46005N36014K88627J60726
$$ 10217698 10828389 11584647 12415085 13219763 13942313 14588318 15124332 15412959 15573685
8632A5573685M85679R00629J226351J631047J857189J960636K212104K531032
$$ 15573685 16059364 16959993 18186344 19817391 21674580 23635216 25847320 28378352
8624B8378352K692852K883887L285808L593323L842698M381055N208225O111571
$$ 28378352 31071204 33955091 37240899 40834222 44676920 49057975 54266200 60377771
8616F0377771P152736Q181621Q358428P413744N728802L513450J206431q24055
$$ 60377771 67530507 75712128 84070556 91484300 97213102 100726552 101932983 101108928
8608A01108928k682121m351630n518740o286889o550263o106132n417701m958033
$$ 101108928 98426807 94075177 88556437 82269548 75719285 69613153 64195452 59237419
8600E9237419m695045m403205m150763l961785l693748l276246k853726k512999
$$ 59237419 54542374 50139169 45988406 42026621 38332873 35056627 32202901 29689902
8592B9689902k232915j859585j470512j265312j161199q89787m15286j36657k00576
$$ 29689902 27456987 25597402 24126890 22861578 21700379 20810592 20395306 20258649 20058073
8583B0058073k71202l39074l38162n9665M1671k42051k58103L45281J075223J541801
$$ 20058073 19786871 19447797 19109635 19049970 19091641 18849590 18591487 18936768 20011991 21553792
8573B1553792J750009J916463K374433K902430L187533L421044L846311M229532
$$ 21553792 23303801 25220264 27594697 30497127 33684660 37105704 40952015 45181547
8565D5181547M452158M747189M979060M868456M371073L434047K126617P01342
$$ 45181547 49633705 54380894 59359954 64228410 68599483 72033530 74160147 74861489
8557G4861489n62000j469276k097343k671479l245991l863873m306874m404742
$$ 74861489 74299489 72830213 70732870 68061391 64815400 60951527 56644653 52239911
8549E2239911m079531l625677l458968l342390l142554k962255k755369k465184
$$ 52239911 48160380 44534703 41075735 37733345 34590791 31628536 28873167 26407983
8541B6407983j980437j419411j099696j059934j211009j160564r29119q08835
$$ 26407983 24427546 23008135 21908439 20848505 19637496 18476932 17547813 16738978
8533A6738978m83598j15318k62420o81965q69804p63254n97575o19641p36572
$$ 16738978 16255380 16140062 15877642 15195677 14325873 13562619 12965044 12345403 11608831
8524A1608831p31769m25736k5037M4931r5738k60317l90845m33490k58340L7512
$$ 11608831 10877062 10451326 10426289 10471220 10375482 10115165 9724320 9290830 9032490 9070002
8514I070002J72741L6412k75156n07870m39599j16657J48772K54581K00804l3465
$$ 9070002 9242743 9279155 9003999 8496129 8056530 7939873 8088645 8343226 8544030 8510565
8504H510565k70798j55792L07951P04774N98969k2216n79394o52071m16619m9052
$$ 8510565 8239767 8083975 8391926 9096700 9695669 9673453 9094059 8441988 8025369 7976317
8494G976317K94450L99606L93950K82787Q8328L8779o9855m09244p49119q26572
$$ 7976317 8270767 8670373 9064323 9347110 9435438 9474217 9404362 8995118 8245999 7419427
8484G419427p59822p77289o98022m16388P954L15278L24473Q9194j08593j12078
$$ 7419427 6659605 5882316 5184294 4767906 4775860 5091138 5415611 5504805 5396212 5284134
8474E284134r204L5022l1778j32240l05749k99644k4696K34391M84995M80203
$$ 5284134 5274930 5309952 5278174 5145934 4840185 4540541 4515845 4750236 5235231 5715434
8464E715434Q7259k11312l31082m53914n15972m56408l77522j06471M23452P65360
$$ 5715434 5802693 5591381 5260299 4806385 4290413 3834005 3456483 3350012 3773464 4538824
8454D538824Q29698Q52258P78581N77094M51515L03075J22894N1943j05598l22942
$$ 4538824 5368522 6220780 6999361 7576455 8027970 8331045 8453939 8505882 8400284 8077342
8444H077342j42859K60260M44989K50099o8875j9651K79576N35172O71389O46751
$$ 8077342 7934483 8194743 8639732 8889831 8820956 8801305 9080881 9616053 10287442 10934193
8434A0934193O25886O62445N89124N42834N97713O17133M23102Q1518n970K37378
$$ 10934193 11560079 12222524 12811648 13354482 13952195 14569328 14992430 15073948 15067978 15305356
8424A5305356N18117P38483J011096J252411J430086J594305J658989J625626
$$ 15305356 15823473 16561956 17573052 18825463 20255549 21849854 23508843 25134469
8416B5134469J698928K020791K687124L524147M259282M840411N010886M652270
$$ 25134469 26833397 28854188 31541312 35065459 39324741 44165152 49176038 53828308
8408E3828308M276790M437932N432067O612608O843751O138042M945567L264855
$$ 53828308 58105098 62543030 67975097 74587705 81431456 87569498 92515065 95779920
8400I5779920J328457l97476j770866k829149l647114m523868n367412n850331
$$ 95779920 97108377 96710901 94940035 92110886 88463772 83939904 78572492 72722161
8392G2722161n895930n681456n441992n086645m391377l550081k673856j990198
$$ 72722161 66826231 61144775 55702783 50616138 46224761 42674680 40000824 38010626
8384C8010626j949408k346131k554078k332363j790255j217709r04639q81304
$$ 38010626 36061218 33715087 31161009 28828646 27038391 25820682 24916043 24034739
8376B4034739q62601p09803n60127n53991n60997n35540n16557n44546o15328
$$ 24034739 23172138 22462335 21902208 21348217 20787220 20251680 19735123 19190577 18575249
8367A8575249m91935j12550J70760J63771M1998O0342L11427M95622L22956O0891
$$ 18575249 18083314 17970764 18141524 18305295 18347293 18407635 18719062 19214684 19537640 19598531
8357A9598531J6504J84570L89695K27321l38453q57005j010577o49682l5999M05774
$$ 19598531 19615035 19799605 20189300 20416621 20078168 19221163 18210586 17560904 17524905 17930679
8347A7930679M93168K13503q8961j17119M4772K75143M50002M11497J77478J29361
$$ 17930679 18423847 18637350 18548389 18431270 18476042 18751185 19201187 19612684 19790162 19919523
8337A9919523O30205J387848J876874J608345P13299l3649k82122l32922q7536
$$ 19919523 20549728 21937576 23814450 25422795 26136094 26102445 25820323 25487401 25399865
8328B5399865N39332J071831J205241J269164J468664J811709K250418K480181
$$ 25399865 25939197 27011028 28216269 29485433 30954097 32765806 35016224 37496405
8320C7496405K320141K256302K457010K670483K977219L245389L173458K720911
$$ 37496405 39816546 42072848 44529858 47200341 50177560 53422949 56596407 59317318
8312E9317318K179462J729601J276140Q55999K65832o42210j375327j702123k005664
$$ 59317318 61496780 63226381 64502521 65358520 65624352 64982142 63606815 61904692 59899028
8303E9899028k282356k439946k424752k172057j832168j781895k177585k335770
$$ 59899028 57616672 55176726 52751974 50579917 48747749 46965854 44788269 42452499
8295D2452499k021892j638421j315548j120108j034126p09983J3194Q09262J261971
$$ 42452499 40430607 38792186 37476638 36356530 35322404 34612421 34625615 35434877 36696848
8286C6696848J146899N14695j55751k88876J75347P73308J041625R66100P83560
$$ 36696848 37843747 38358442 38202691 37913815 38089162 38862470 39904095 40870195 41653755
8277D1653755P99674J292283K243811L105573L408678L235882K988670K961633
$$ 41653755 42453429 43745712 45989523 49095096 52503774 55739656 58728326 61689959
8269F1689959L226288L703661M196108M744747N577008O575755P301503P681391
$$ 61689959 64916247 68619908 72816016 77560763 83137771 89713526 97015029 104696420
8261A04696420P979953Q260383Q583138Q695575Q376221P724719O631711N059830
$$ 104696420 112676373 120936756 129519894 138215469 146591690 154316409 160948120 166007950
8253A66007950L279317J563310J21752j261421k795719m235946n274715o086638
$$ 166007950 169287267 170850577 170972329 169710908 166915189 162679243 157404528 151317890
8245A51317890o894950p250668p322356p186375o341490n107863m285532l949049
$$ 151317890 144422940 137172272 129849916 122663541 116322051 111214188 106928656 102979607
8237A02979607l781640l686752l662289l656785l467781k990599k229381j276322
$$ 102979607 99197967 95511215 91848926 88192141 84724360 81733761 79504380 78228058
8229G8228058m49184q3884J35483K98035K13734M18524Q76155J024202J124721
$$ 78228058 77778874 77694990 77830473 78128508 78342242 78760766 79636921 80661123 81785844
8220H1785844J511518K242658L101133L771191M227173M709615N548469O469943
$$ 81785844 83297362 85540020 88641153 92412344 96639517 101349132 106897601 113367544
8212A13367544P003259P544129Q636370J0069900J1392546J2327875J3004556
$$ 113367544 120370803 127914932 136551302 146621202 158013748 170341623 183346179
8205A83346179J3868811J4846406J5397792J5397854J5280487J5242792J4701445
$$ 183346179 197214990 212061396 227459188 242857042 258137529 273380321 288081766
8198B88081766J3175200J0636399P441648L911738O02336k249656m940681p686117
$$ 288081766 301256966 311893365 319335013 323246751 323849087 321599431 316658750 308972633
8190C08972633j0386398j2574383j3828009j4192102j3992959j3529650j3030195
$$ 308972633 298586235 286011852 272183843 257991741 243998782 230469132 217438937
8183B17438937j2549386j2011198j1154848r911875q619681p436768o486138n821897
$$ 217438937 204889551 192878353 181723505 171811630 163191949 155755181 149269043 143447146
8175A43447146n058652m360680l994376l619878k968171k325455j974188j712807
$$ 143447146 138388494 134027814 130033438 126413560 123445389 121119934 119145746 117432939
8167A17432939j457132j103995n89606J51997J096210K028092L004773M044776
$$ 117432939 115975807 114871812 114282206 114434203 115530413 117558505 120563278 124608054
8159A24608054M567733M665266M970767N785210O835149P681495Q353579R305258
$$ 124608054 129175787 133841053 138811820 144597030 151432179 159113674 167467253 176772511
8151A76772511J0668939J2297161J4134736J5661752J6500115J7046038J7543342
$$ 176772511 187441450 199738611 213873347 229535099 246035214 263081252 280624594
8144B80624594J7631195J7273349J6500195J5152446J2990542R862579N997330
$$ 280624594 298255789 315529138 332029333 347181779 360172321 370034900 376032230
8137C76032230K015687j812275n539429r083962j2075440j4397945j6145575j7145131
$$ 376032230 378047917 376235642 370696213 361612251 349536811 335138866 318993291 301848160
8129C01848160j7399787j7241482j6806288j5961086j4635132j3472221j2660507
$$ 301848160 284448373 267206891 250400603 234439517 219804385 206332164 193671657
8122A93671657j1799096j0717669r551450q283029o893862n560403m633565m139036
$$ 193671657 181872561 171154892 161603442 153320413 146426551 140866148 136232583 132093547
8114A32093547l804534l277689k644914k354559k264869j926029j387098q06025
$$ 132093547 128289013 125011324 122366410 120011851 117746982 115820953 114433855 113627830
8106A13627830r6798P82204J637474K216639K463612K800112L533112M422557
$$ 113627830 113531032 114313236 115950710 118167349 120630961 123431073 126964185 131386742
8098A31386742N203125N754982O443694P591122Q962488J0240035J1376291J2303668
$$ 131386742 136589867 142344849 148788543 156379665 165342153 175582188 186958479 199262147
8090A99262147J3090643J3845253J4455041J4719509J4314257J3515053J2734390
$$ 199262147 212352790 226198043 240653084 255372593 269686850 283201903 295936293
8083B95936293J1486970R212128N796060J789160k003238n213377p868188j0130891
$$ 295936293 307423263 316635391 322431451 324220611 322217373 317003996 309135808 299004917
8075B99004917j2079006j3617573j4640985j5039483j4709266j3941976j3201288
$$ 299004917 286925911 273308338 258667353 243627870 228918604 214976628 201775340
8068B01775340j2477916j1717568j0942390r995723r015897q203388p469506o647782
$$ 201775340 189297424 177579856 166637466 156641743 147625846 139422458 131952952 125305170
8060A25305170n658883m585144l665719l217921l200543l351902l538417l505003
$$ 125305170 119646287 115061143 111395424 108177503 104976960 101625058 98086641 94581638
8052I4581638l075010k378985j553054p90321j90564L34312O14715M57817K31683
$$ 94581638 91506628 89127643 87574589 86784268 86593704 86928016 87542731 88000548 88232231
8043H8232231L30896Q44607J617904K356391K775929L101940L693649M660134
$$ 88232231 88563127 89407734 91025638 93382029 96157958 99259898 102953547 107613681
8035A07613681N820554O885554P697284Q425002R269817R915310J0039094R738448
$$ 107613681 113434235 120319789 128017073 136442075 145711892 155627202 165666296 175404744
8027A75404744R213344Q430172P587246O653761N118070L063846Q27112j647910
$$ 175404744 184618088 193048260 200635506 207289267 212407337 215471183 216298295 214650385
8019B14650385m205732o421745q257138r757767j0753092j1258306j1135868j0434960
$$ 214650385 210444653 204022908 195765770 186008003 175254911 163996605 152860737 142425777
8011A42425777r632462q928879q336956p758068p069495o286831n546403n045897
$$ 142425777 132793315 123864436 115527480 107769412 100699917 94413086 88866683 83820786
8003H3820786m707396m359016m166740l974989l596624l221650l077404k870993
$$ 83820786 79113390 74754374 70587634 66612645 63016021 59794371 56716967 53845974
7995E3845974k136058j156421o97324j038011j662295k009527j896465j412380
$$ 53845974 51709916 50553495 49856171 48818160 47155865 45146338 43249873 41837493
7987D1837493q47287l31135K14144P18778Q20737O81400P00200P06493O70645
$$ 41837493 40990206 40659071 40873215 41591993 42412730 43094130 43794330 44500823 45171468
7978D5171468R40601J508421J878480J994295K075347K008116K002742K179091
$$ 45171468 46112069 47620490 49498970 51493265 53568612 55576728 57579470 59758561
7970E9758561K285168K287249K163151J593596O51966j44186o64418j238551j854440
$$ 59758561 62043729 64330978 66494129 68087725 68739691 68595505 67931087 66692536 64838096
7961F4838096k248166k643700l171543l612669l743931l298940k389670j686504
$$ 64838096 62589930 59946230 56774687 53162018 49418087 46119147 43729477 42042973
7953D2042973j568944j891071k365446k589981k361622k035367j978166j992655
$$ 42042973 40474029 38582958 36217512 33627531 31265909 29230542 27252376 25259721
7945B5259721j682322j117460o16040l21324k54345k37714l36147n93175p53016
$$ 25259721 23577399 22459939 21843899 21522575 21268230 21030516 20694369 20101194 19348178
7936A9348178p50390o42005l81606j26928j50945l67131n04033o20321q15362
$$ 19348178 18597788 17955783 17574177 17447249 17296304 16929173 16425140 15804819 14989457
7927A4989457q61293m38697J65892K98036N1692l3684J48328K06617j35941m99946
$$ 14989457 14128164 13689467 13855359 14153395 14205087 14171403 14319731 14526348 14390407 13890461
7917A3890461n41425l84502q9865n8369l24869m86827n88339n82930m81829l45841
$$ 13890461 13349036 12964534 12874669 12816300 12491431 12004604 11416265 10833335 10351506 10005665
7907A0005665j78430J5559L13090L81384N8739j99678l91221o11208n86764k81411
$$ 10005665 9827235 9842794 10155884 10537268 10596007 10396329 10005108 9393900 8807136 8525725
7897H525725k8460j14588m88477n98261k79539K3696J08189J7889j33087k59520
$$ 8525725 8497265 8382677 7894200 7295939 7016400 7040096 7148285 7166174 7033087 6773567
7887F773567l57886m86951n43766j57596N38098Q47743N53815K43994K67896M30271
$$ 6773567 6415681 5928730 5384964 5227368 5765466 6613209 7167024 7411018 7678914 8109185
7877H109185L05522j77524n13736m27966p4841M0216k69094n51851o11307o41186
$$ 8109185 8414707 8237183 7723447 7295481 7220640 7260856 6991762 6439911 5828604 5187418
7867E187418q39432j048694j016988n62859J95805Q68877J141463R65514O97822
$$ 5187418 4347986 3299292 2282304 1719445 1915250 2784127 3925590 4891104 5588926
7858E588926L61591j21220m00556j98104K6168j26314m13269o97903q71003q17614
$$ 5588926 5950517 5829297 5428741 5230637 5256805 5130491 4717222 4019319 3148316 2330702
7848B330702o70883n37992m52006k29817j4407n5498j15131N0572J16412j16237
$$ 2330702 1659819 1121827 669821 440004 425597 370099 254968 305540 421952 305715
7838C05715l01165J15713R12548J247006P19456r1245l91463k27706m2095K18134
$$ 305715 4550 120263 1032811 2279817 2999273 2908028 2516565 2288859 2246764 2464898
7828B464898N03938L86306k41828q77046r06653l62314L28880Q37217Q73632P25332
$$ 2464898 2968836 3355142 3113314 2236268 1329615 967301 1296181 2133398 3007030 3732362
7818C732362O35955L89130l3170l29766l62382j98101R437J06513p1116m87417
$$ 3732362 4368317 4757447 4724277 4394511 4032129 3834028 3843465 3949978 3878862 3391445
7808C391445o44494m74259k55661j49604j36409N3620L56472L85700L46903M90482
$$ 3391445 2746951 2272692 2017031 1867427 1731018 1784638 2141110 2526810 2873713 3364195
7798C364195L40764k27913o38004n02655k32510k10661j99049j99983l05813l25672
$$ 3364195 3704959 3477046 2839042 2336387 2103877 1893216 1694167 1494184 1188371 862699
7788H62699j87369L35321J144748J503686J087770L32623l86720p61616o93313
$$ 862699 675330 1010651 2155399 3659085 4746855 5079478 4692758 3931142 3237829
7779C237829m60257j54763N7971J31525L57471P39815Q58520N86974L88160N22455
$$ 3237829 2777572 2622809 2680780 2812305 3169776 3909591 4768111 5355085 5743245 6265700
7769F265700O17538K55022n07040j137903j198915q53088m42068o2915J20016
$$ 6265700 6883238 7138260 6631220 5493317 4294402 3441314 2999246 2936331 3056347
7760C056347J96561M60055Q00398P60019J48073n85431q14345n18088l06841k54833
$$ 3056347 3252908 3712963 4513361 5273380 5421453 4836022 4021677 3503589 3196748 2941915
7750B941915q8662R6486K50737M44236O09409N67900L59347J74716J99340K20732
$$ 2941915 2853253 2949739 3200476 3644712 4254121 4822021 5181368 5356084 5555424 5776156
7740E776156N3644j22555m48423o12737l30561j35799l46973n53734k97405J21741
$$ 5776156 5829800 5707245 5258822 4646085 4315524 4179725 3832752 3279018 2981613 3103354
7730C103354L60633M38275L43338L04998L28191J64694j28821k59418N4427N41067
$$ 3103354 3463987 3902262 4245600 4550598 4878789 5043483 4914662 4655244 4709671 5250738
7720E250738P51901N12858L1633l48136m37601l41110j80675j1075r0879k59441
$$ 5250738 6002639 6515497 6547130 6198994 5761393 5420283 5239608 5228533 5137654 4878213
7710D878213j29086k9792k51282k78431J22429N09466O24082K67812k99054l46764
$$ 4878213 4749127 4719335 4468053 4189622 4312051 4821517 5445599 5713411 5414357 5067593
7700E067593n1496K5566j21730l00367m88385o37591n66191l02745Q6046L37731
$$ 5067593 5016097 5041663 4919933 4619566 4131181 3493590 2927399 2624654 2710700 3048431
7690C048431J76074j9574n9520r5318m4533J69789L84093M56621O00728O06373
$$ 3048431 3224505 3204931 3145411 3050093 3005560 3175349 3559442 4016063 4616791 5223164
7680E223164K97605J07041P0818j62049n66741p58167m22612N5341K48556J99101
$$ 5223164 5520769 5627810 5698628 5536579 4969838 4211671 3789059 3844400 4092956 4292057
7670D292057J52585J12302P2288Q3710l7583m34202p44665o15478k78684j32769
$$ 4292057 4444642 4556944 4629232 4712942 4675359 4241157 3496492 2881014 2602330 2469561
7660B469561l0005J33954K20649L18608N12886O62356N37427K73093O9986j76536
$$ 2469561 2439556 2573510 2794159 3112767 3625653 4288009 4825436 5098529 5168515 4991979
7650D991979k95031J13071M44944K16541n0235J2906K17069K15082K52368M89594
$$ 4991979 4696948 4810019 5254963 5471504 5421269 5434175 5651244 5866326 6118694 6608288
7640F608288N12781L04568J96157K30050K02843j6542k50176k14969N5553M63170
$$ 6608288 7121069 7425637 7621794 7851844 8054687 8038145 7787969 7573000 7628553 8091723
7630H091723Q83427J337142J807795J864400J677386J684082J778068J685583
$$ 8091723 8975150 10312292 12120087 13984487 15661873 17345955 19124023 20809606
7622B0809606J372139J339924J884235K652302L339132L711029L773077L644766
$$ 20809606 22181745 23521669 25405904 28058206 31397338 35108367 38881444 42526210
7614D2526210L206577K261474R36326k10907j065606j775392k373963k748575
$$ 42526210 45732787 47994261 48930587 48719680 47654074 45878682 43504719 40756144
7606D0756144k893363k941965k905128k745602k340296j950796k033105j981968
$$ 40756144 37862781 34920816 32015688 29270086 26929790 24978994 22945889 20963921
7598B0963921j425824r54806j047214j284248j100918q09905n44259l03303l18534
$$ 20963921 19538097 18583291 17536077 16251829 15150911 14341006 13796747 13493444 13174910
7589A3174910n38968p50263q59420p41440l66973j49682l23544m77951m80344
$$ 13174910 12635942 11885679 11026259 10284819 9917846 9768164 9444620 8966669 8486325
7580H486325n05279n35312n00685l48909k53265m70392p04597n02381l2599L28169
$$ 8486325 7981046 7445734 6945049 6596140 6342875 5872483 5167886 4665505 4632906 4961075
7570D961075N64175P16134O27822L75668J53959o8772k55596l06140j81305p8179
$$ 4961075 5525250 6241384 6869206 7244874 7398833 7330061 7074465 6768325 6587020 6508841
7560F508841k98675p38992q58516n42964j06720J15382q052k36967l12510k57422
$$ 6508841 6210166 5471174 4612658 4069694 3962974 4078356 4070304 3833337 3520827 3263405
7550C263405k39757k46082j91120P2709M17521M95946K85403J88487J69985j69506
$$ 3263405 3023648 2777566 2586446 2659155 3076676 3572622 3858025 4046512 4216497 4046991
7540D046991p84058j333327j382201q92319l48362J24984M54660M33859K87171
$$ 4046991 3262933 1929606 547405 -344914 -693276 -568292 -113632 320227 607398
7531F07398L99210Q24104J164140J144296Q56104M54394Q8333k33300k67002m8466
$$ 607398 1006608 1830712 2994852 4139148 4995252 5449646 5537979 5304679 5037677 4989211
7521D989211J8965l27662n22135k87783k10101m44359o24562m97868j85207P7482
$$ 4989211 5008176 4680514 4158379 3870596 3660495 3216136 2591574 2093706 1908499 1985981
7511A985981L07322M53632L39380J62805O8895J33232J98086K503l35139o56296
$$ 1985981 2293303 2746935 3086315 3249120 3318015 3451247 3649333 3651836 3316697 2660401
7501B660401p42941n03386j90935J87994M46019K98817j16250n50853n64115j37003
$$ 2660401 1917460 1414074 1223139 1411133 1857152 2155969 2039719 1488866 924751 787748
7491G87748J80707J54880J16192K74127L37995K07123J29603J03348K776j3404
$$ 787748 968455 1123335 1239527 1513654 1851649 2058772 2188375 2291723 2294499 2281095
7481B281095N657m9014P742R9574M7987o9852k2401p9743m56987o85275m71620
$$ 2281095 2286752 2237738 2245480 2345054 2393041 2323189 2300788 2221045 1764058 1078783 607163
7470F07163j24589J0681j32339j57218K50422O62908N21232J66332J4107r3841
$$ 607163 482574 493255 360916 203698 454120 1117028 1638260 1804592 1818699 1724858
7460A724858j76913j78533j48367j12814n0950J3704Q3092J23972K13138M37439
$$ 1724858 1547945 1369412 1221045 1108231 1057281 1070985 1154077 1278049 1491187 1928626
7450A928626O75310O19245L02742J70799J34427l59318j080014j388492j124931
$$ 1928626 2603936 3223181 3525923 3696722 3831149 3471831 2391817 1003325 -121606
7441a21606n90217m6378L51928M55383J21519k78426l66438j88396O4747J56804
$$ -121606 -711823 -758201 -406273 49110 170629 -107797 -474235 -662631 -597884 -441080
7431d41080L3007l7419l0514r2876o9758J31505K84267M14606N30490O60623O70135
$$ -441080 -408073 -445492 -476006 -568882 -638640 -507135 -222868 191738 722228 1382851 2052986
7420B052986L84862J86809K76068L30887K32300p1433m64476m94337k17205M3167
$$ 2052986 2437848 2624657 2900725 3231612 3463912 3392479 2928003 2433666 2216461 2259628
7410B259628K46058L59338K44231P1295R9847J69888J50801J57886J44035N6590
$$ 2259628 2505686 2865024 3109255 3180550 3280397 3450285 3601086 3758972 3903007 3959597
7400C959597j1803j16443o6362J48298J69201k522j21662k24857k69201j60999
$$ 3959597 3947794 3831351 3764989 3913287 4082488 4079966 3958304 3733447 3464246 3303247
7390C303247j65658j82159N6014L15202K25489M1568J41823K61973J41645j27069
$$ 3303247 3137589 2955430 3011444 3326646 3552135 3593703 3735526 3997499 4139144 4012075
7380D012075n92375j000454r15205m17577R5408L12492J03219l63417p79038r67479
$$ 4012075 3419700 2419246 1504041 1086464 1181872 1494364 1597583 1234166 455128 -512351
7370e12351r06269m96019o1924J88693L95521M99794M39341M23140M42331M15650
$$ -512351 -1418620 -1914639 -1976563 -1787870 -1392349 -892555 -453214 -30074 412257 827907
7360H27907M00216J85119l16601p33171o52164j17168K83645L42801L28399M43103
$$ 827907 1228123 1413242 1096641 363470 -288694 -405862 -122217 220584 548983 992086
7350I92086O28076N36044J84354k53262n61174n42554k79131P707J52126L12983
$$ 992086 1620162 2156206 2340560 2087298 1526124 983570 704439 712146 864272 1177255
7340A177255M49390L16036J43708J64040J30660j55033l90218j97769J69221J98483
$$ 1177255 1626645 1942681 2086389 2250429 2381089 2226056 1835838 1638069 1807290 2005773
7330B005773K08252M65555N88936N19725M91237M69890J69604j94843k63029l28417
$$ 2005773 2214025 2679580 3268516 3788241 4279478 4749368 4918972 4724129 4461100 4132683
7320D132683n70114p54872n92758j31975L11348M47401M13105L81983K65580K06648
$$ 4132683 3562569 2807697 2214939 2082964 2394312 2841713 3254818 3636801 3902381 4109029
7310D109029J87948Q1868k8806q2908q7996k73927n70040n21609n8299K24348
$$ 4109029 4296977 4378845 4350039 4267131 4179135 3905208 3335168 2813559 2755260 2979608
7300B979608n5428m00903l63320j35947j50619k64440j86635j1624K0332j944
$$ 2979608 2924180 2523277 2159957 2024010 1873391 1608951 1422316 1410692 1431024 1429080
7290A429080L1007R1541J57542N6930k23875m20644k25822J92057N42521N74729
$$ 1429080 1460087 1551628 1709170 1766100 1542225 1121581 895759 1087816 1630337 2205066
7280B205066L73433L66802N69829N88001K28192m43539j053814j101682o43808
$$ 2205066 2578499 2945301 3515130 4103131 4331323 3887784 2833970 1732288 1088480
7271A088480J7168L65182J87897p7686j99163l00393l26901k20608J39803P40273
$$ 1088480 1105648 1470830 1658727 1581041 1381878 1081485 754584 533976 673779 1414052
7261A414052R47154O32997K96838J37993l7404j54380r0159j7489N3357M4290
$$ 1414052 2361206 2994203 3291041 3429034 3391630 3237250 3147091 3129602 3182959 3227249
7251C227249j4168Q0836K75226L52662J29889l22568n65366l86404k5407K11164
$$ 3227249 3213081 3293917 3569143 3921805 4051694 3729126 3163760 2777356 2751949 2963113
7241B963113J55298j12338n47721r73352r13289l57071K04309M75403N94822P66995
$$ 2963113 3118411 3006073 2458352 1485000 571711 214640 418949 894352 1489174 2256169
7231B256169Q41617N44843J16059k05732m24752m48436l84856m02204m39284l19371
$$ 2256169 3097786 3642629 3758688 3552956 3128204 2679768 2294912 1892708 1453424 1134053
7221A134053q7754J39706L50605N22366O00450O26826N68616M94121M32936R9501
$$ 1134053 1046299 1186005 1536610 2058976 2659426 3286252 3854868 4348989 4781925 4881426
7211D881426l91875n86807m93363m74621m02086j75528q4754k04868k83127j56964
$$ 4881426 4489551 3902744 3409381 2934760 2532674 2357146 2272392 2067524 1784397 1627433
7201A627433r8763j52429q6414O6068J55846K98467M54832L32479L5065k12377
$$ 1627433 1528670 1376241 1289827 1355895 1511741 1810208 2265040 2597519 2632584 2420207
7191B420207l53620k16671K21427N54179N67939M57730L03628Q2204j31088j66811
$$ 2420207 2066587 1849916 2071343 2625522 3193461 3651191 3954819 4037023 3905935 3739124
7181C739124j99383k77965j38393P040n527J67379M43550M74456M18633O19249
$$ 3739124 3539741 3261776 3123383 3130423 3124896 3292275 3735825 4210281 4628914 5248163
7171E248163R18025Q44687K03727m91215p17852p47745o95503n23461j94275K06937
$$ 5248163 6166188 7010875 7214602 6723387 6005535 5257790 4562287 4038826 3844551 4051488
7161D051488L31284K76066K83523J91316j56487m82352n55510l65727m2766P0519
$$ 4051488 4382772 4658838 4942361 5133677 4977190 4494838 3939328 3573601 3530835 3601354
7151C601354j8041p4248m0673j42708k66811o4354L19271M59316L62693J36223
$$ 3601354 3583313 3509065 3468392 3325684 3058873 2994519 3313790 3773106 4135799 4272022
7141D272022j41511j29547N1127J47050J72060J22245R9077J60798J81858K93584
$$ 4272022 4130511 4000964 4052091 4199141 4371201 4493446 4592523 4753321 4935179 5228763
7131E228763N27324N16410K21932m3142j72066m31215o41102l41525L18535P31297
$$ 5228763 5756087 6272497 6494429 6451287 6279221 5848006 5206904 4865379 5183914 5915211
7121E915211P52058O61935M01789O195k20639k26944j35987Q2379L47232N83469
$$ 5915211 6667269 7329204 7730993 7737188 7516549 7289605 7153618 7235997 7583229 8166698
7111H166698P72959P43757N51639N49604Q63999J343412J721026J881126J863676
$$ 8166698 8939657 9683414 10235053 10784657 11648656 12992068 14713094 16594220 18457896
7102A8457896J923991K437630L390120M562351N870862P464495R530338J2109774
$$ 18457896 20381887 22819517 26209637 30771988 36642850 44107345 53637683 65747457
7094F5747457J5258638J8528959K0707103J9756631J3408085J857449j0055663
$$ 65747457 81006095 99535054 120242157 139998788 153406873 155264322 145208659
7087A45208659j7069392j8418705j6633968j4220070j1894160r910214q369722
$$ 145208659 128139267 109720562 93086594 78866524 66972364 57062150 48692428
7080D8692428o867995n428212m312299l528341k871618k392826k155691j828512
$$ 48692428 41824433 36396221 32083922 28555581 25683963 23291137 21135446 19306934
7072A9306934j454362j177058q56175p41499p67194n89337l27254k68365m53768
$$ 19306934 17852572 16675514 15819339 15077840 14310646 13721309 13394055 13125690 12671922
7063A2671922o13541o09815n08113n25236p45812r31803p25589l53405k56193
$$ 12671922 12058381 11448566 10940453 10415217 9669405 8737602 8012013 7658608 7402415
7054G402415k43305j35496j16711k11444j78523j65440n0632K64526M68837N93080
$$ 7402415 7159110 7023614 6906903 6695459 6516936 6351496 6300864 6565390 7034227 7627307
7044G627307N29590K54383j76304o78961q36031o60463n43414m93688m31574j62228
$$ 7627307 8156897 8411280 8234976 7556015 6719984 6059521 5516107 5022419 4590845 4428617
7034D428617L62691N47430K03058k45953l17491Q2377M84284O55182L42470l37093
$$ 4428617 4791308 5338738 5541796 5295843 4978352 5060729 5545013 6200195 6542665 6205572
7024F205572q33095q68522o31405m35890l62886m43407o68610o90374l90535q6782
$$ 6205572 5372477 4503955 3872550 3436660 3073774 2630367 1961757 1271383 880848 794066
7014G94066K5999J17642J56977j30236k68179N5414K81944J69396j29630k66007
$$ 794066 820065 937707 1094684 964448 696269 751683 1033627 1203023 1073393 807386
7004H07386n6418K64231J81976k38158n14813m06647m926N06104Q05825N42387
$$ 807386 750968 1015199 1197175 959017 444204 37557 32631 538735 1344560 1886947
6994A886947p1728m93836n61055m83754l70992j91455J79702O04074O91321N45158
$$ 1886947 1815219 1321383 760328 276574 -94418 -285873 -106171 497903 1189224 1734382
6984A734382N01249M38606L37150M84826P31800M78590k7114r9420O7594M9758
$$ 1734382 2235631 2674237 3011387 3496213 4228013 4706603 4679489 4580069 4647663 4697421
6974D697421j1599K068n6674L1247N84220J218934J582758J735752K037849K517916
$$ 4697421 4685822 4687890 4631216 4662463 5246683 6465617 8048375 9784127 11821976 14339892
6964A4339892K832166K324180N56626j445179k494153k553313k180987j813968
$$ 14339892 17172058 19496238 20052864 18607685 16113532 13560219 11379232 9565264
6956I565264j522923j131728o68212k54162J7454P8451k6946k34496m57142o62017
$$ 9565264 8042341 6910613 6242401 5988239 6005693 6084144 6057198 5822702 5365560 4703543
6946D703543p46991o76225n90890n01979j78086K26790M52652M68269L40757J17233
$$ 4703543 3956552 3280327 2689437 2187458 2009372 2236162 2688814 3157083 3497840 3615073
6936C615073j90572m50331n19695l52105m1264L38889O26507J020892J644660
$$ 3615073 3424501 2974170 2454475 2102370 2061106 2399995 3026502 4047394 5692054
6927E692054K167264K398854K234985J664100M83508j129221k364741k813300
$$ 5692054 7859318 10258172 12493157 14157257 14640765 13511544 11146803 8333503
6919H333503k486730j700654p60952l7497J28792o0600k59562k67195k08837k22315
$$ 8333503 5846773 4146119 3385167 3347670 3476462 3415862 3156300 2889105 2680268 2457953
6909B457953j09497J31575J78932J2802q8746j05774j92173r1750K76663N66379
$$ 2457953 2348456 2480031 2658963 2671765 2583019 2477245 2285072 2193322 2469985 3036364
6899C036364N70882L88915O6991l50427o59331o49377l78564j83511l62838n99291
$$ 3036364 3607246 3996161 4063152 3712725 3053394 2404017 2025453 1841942 1479104 879813
6889H79813o01431l77209J7358K27664J71587J26336J18773L5277n1938L30M23873
$$ 879813 278382 -98827 -81469 146195 317782 444118 562891 598168 546230 546560 970433
6878I70433J018370J342274J327170J076624O80136K01624j35084l11712n49656
$$ 970433 1988803 3331077 4658247 5734871 6415007 6616631 6481547 6169835 5620179
6869E620179p57165q07194p47694n81148k80454Q55O822j99838l39390j60206
$$ 5620179 4863014 4055820 3308126 2726978 2446524 2447379 2454201 2254363 1914973 1754767
6859A754767K47833M44429L57526K55505K50956L38913M44313L89131J14814l7734
$$ 1754767 2002600 2447029 2804555 3060060 3311016 3649929 4094242 4483373 4598187 4560453
6849D560453J97419M96760M65282R5390l40756o44490p07382l44970K50464N68227
$$ 4560453 4757872 5254632 5719914 5815304 5474548 4830058 4122676 3777706 4028170 4596397
6839D596397N09016K59259J64070K60068K51940O8350j55802l98698o74663q05652
$$ 4596397 5105413 5364672 5528742 5788810 6040750 6109100 5953298 5554600 4879937 4074285
6829D074285o54049l06106p4470N0099J31406J3611l15768n52368m03954P1508
$$ 4074285 3420236 3114130 3039660 3089759 3221165 3234776 2919008 2366640 1962686 2034194
6819B034194N95735Q97423J067709J149676R22490M98162J7324l83700n62165
$$ 2034194 2629929 3527352 4595061 5744737 6667227 7165389 7182713 6799013 6236848
6810F236848m58137k9048M48178N52074J82503j45359P6525P10570J181129J363053
$$ 6236848 5778711 5749663 6197841 6749915 6932418 6787059 6863584 7574154 8755283 10118336
6800A0118336J555584J710673J806220J753126J535406J275359J174400J191597
$$ 10118336 11673920 13384593 15190813 16943939 18479345 19754704 20929104 22120701
6792B2120701J175925J431332K023483K602343K975329L483043M402841N672709
$$ 22120701 23296626 24727958 26751441 29353784 32329113 35812156 40214997 45887706
6784D5887706P147406Q888142J0938909J2883124J4323619J4704196J3631179
$$ 45887706 53035112 61923254 72862163 85745287 100068906 114773102 128404281
6777A28404281J1106486O968804J464049m137622q452240j0930008j1854270j1821062
$$ 128404281 139510767 146479571 147943620 143805998 135353758 124423750 112569480 100748418
6769A00748418j1271430j0437305r395509q148466o945094n896556m912336l943430
$$ 100748418 89476988 79039683 69644174 61495708 54550614 48654058 43741722 39798292
6761C9798292l131640k732792k673180k585349k281569j979439j975417k206609
$$ 39798292 36666652 33933860 31260680 28675331 26393762 24414323 22438906 20232297
6753B0232297k136884j662111j086184p71698r84081j336866j393208j180368
$$ 20232297 18095413 16433302 15347118 14575420 13591339 12254473 10861265 9680897
6745I680897r54736p65944m70440j29897N3496O0439Q0269k5494j32464j17055
$$ 9680897 8726161 7960217 7489777 7359880 7413376 7473815 7554084 7528590 7396126 7279071
6735G279071j29110K0743K20805J03422j63395k59744n8472M29657Q59630Q84444
$$ 7279071 7149961 7170704 7391509 7494931 7331536 7071792 7013320 7442977 8302607 9187051
6725I187051N96680L50828L16930L97747M90864N29188N32708O53189Q43477Q80383
$$ 9187051 9783731 10134559 10451489 10849236 11340100 11869288 12401996 13055185 13898662 14779045
6715A4779045J008547J276776J446814J727164K164205K534769K692424K763119
$$ 14779045 15787592 17064368 18511182 20238346 22402551 24937320 27629744 30392863
6707C0392863L229261L913307M266638M478219N092464N660863N219177L509049
$$ 30392863 33622124 37535431 41802069 46280288 51372752 57033615 62252792 65761841
6699F5761841J028561j467783l496192m956842n624587n343243m721291m278559
$$ 65761841 66790402 65322619 61826427 56869585 51244998 45901755 41180464 36901905
6691C6901905l885471l338088k959544k777267k376839j949312j945118j995487
$$ 36901905 33016434 29678346 26718802 23941535 21564696 19615384 17670266 15674779
6683A5674779j714598j217988q75775q85409r40975p26478m62541k82364j23748
$$ 15674779 13960181 12742193 11866418 10981009 10040034 9313556 8851015 8568651 8444903
6674H444903k49084n19106n30024k85272n6954Q1775K00774K62870J37989k58378
$$ 8444903 8195819 7676713 7146689 6861417 6804463 6886238 7087012 7349882 7487871 7229493
6664G229493p23551j032032j102056r92475q38132l56573K19519L52428K97702
$$ 7229493 6505942 5473910 4371854 3379379 2541247 2184674 2404193 2756621 3054323
6655C054323M29255N94973M03872j11316n75310p02805l52449K99878R41879J180537
$$ 3054323 3483578 4078551 4482423 4371107 3795797 3092992 2740543 3040421 3982300 5162837
6645E162837Q15718K073q64726j332944j080911m76137R2171O95759J243184J354136
$$ 5162837 5978555 5980628 5115902 3782958 2702047 2225910 2318081 3013840 4257024 5611160
6635E611160P97976J63748p8794j44275k04085k88120n86934r21924j017132r15967
$$ 5611160 6409136 6572884 6494090 6349815 6145730 5857610 5270676 4348752 3331620 2415653
6625B415653p07942l80471j10740j56768k47990j03219K36802N13146M74491K11933
$$ 2415653 1707711 1327240 1216500 1059732 811742 708523 945325 1458471 1932962 2144895
6615B144895J34644K33054K9922l09999l20527j43250Q9862K60185K44302M5722
$$ 2144895 2279539 2512593 2542515 2232516 1911989 1768739 1858601 2118786 2363088 2408810
6605B408810m00958p38511o02793j72453J70477Q8827k12527k48152n9205J18115
$$ 2408810 2007852 1269341 666548 494095 664572 753399 540872 292720 233515 351630
6595C51630R8014k8046p0808N6771K64363L01655J51694J79172L89770L29022
$$ 351630 449644 421598 350790 407561 671924 973579 1125273 1304445 1694215 2023237
6585B023237o943k17737N4169O12018Q86114O74979M45324M41784L9626q61713
$$ 2023237 2016294 1798557 1852726 2464744 3350858 4025837 4471161 4912945 4952571 4090858
6575D090858j441595j325256p28191j24062L65858O53434M87261M6127k49565
$$ 4090858 2649263 1324007 595816 471754 837612 1491046 1978307 2024434 1774869
6566A774869l32216l55612k17544m0986j1513M340N7069m1416j55791o6784K0910
$$ 1774869 1442653 1087041 869497 828511 816998 821338 878407 836991 681200 614416 635326
6555F35326J04401L42097M79191K35793j50591l14516k72917m02252n77199n84863
$$ 635326 739727 1081824 1561015 1796808 1646217 1331701 1058784 656532 79333 -505530
6545e05530l91655m8072L29813M40600L38085M57786Q00620R71401N12875l99609
$$ -505530 -897185 -945257 -615444 -174844 163241 621027 1421647 2393048 2905923 2506314
6535B506314r96004q64671l44641K6309J05948p2205j77847P6283M91105R60059
$$ 2506314 1510310 645639 300998 327307 433255 361050 183203 259486 750591 1710650
6525A710650J192098R63185O36718N32335L90665k6223l18029j71217o1553m17640
$$ 1710650 2902748 3865933 4502651 5034986 5425651 5399428 5081399 4910182 4848629 4430989
6515D430989r41964r32416l34630L37424P12759O35466L30339K36375L03189L72746
$$ 4430989 3489025 2556609 2221979 2559403 3272162 3907628 4237967 4474342 4777531 5150277
6505E150277K88570J81178N4258k30794m47622m28490l72427l80420k53857M6059
$$ 5150277 5438847 5620025 5674283 5443489 4995867 4567377 4194950 3814530 3560673 3606732
6495C606732K58672K55628J14493j88930n93850p26951m44413k30840l19947k03022
$$ 3606732 3865404 4121032 4235525 4046595 3452745 2725794 2281381 2050541 1730594 1527572
6485A527572L02640N72816M42495K88438J90569K58108L78396J85242j93523n75394
$$ 1527572 1830212 2403028 2845523 3133961 3324530 3582638 3961034 4146276 3952753 3377359
6475C377359q63347r38201p95416m41214j35026O396P1652o3623k73463l88133
$$ 3377359 2514012 1575811 780395 339181 204155 210551 282203 218580 -54883 -443016
6465d43016k93607K3673K01333R0443k7514J5776O9346Q8059K00982M11743L10373
$$ -443016 -736623 -712950 -511617 -421174 -448688 -432912 -363566 -275507 -74525 337218 647591
6454F47591J07202J71373K69529M45173O14471N01580P4545l48912n08129m87025
$$ 647591 754793 926166 1195695 1640868 2255339 2756919 2831464 2482552 1974423 1487398
6444A487398l96975l14548j36740J48879L01744M29125O95725Q77836N11524k30259
$$ 1487398 1090423 775875 639135 788014 1089758 1518883 2214608 3092444 3603968 3373709
6434C373709o20755n63295m11872j66346K43172L95434K26027J42530K02695K42363
$$ 3373709 2752954 2189659 1777787 1611441 1854613 2250047 2476074 2618604 2821299 3063662
6424C063662J11851j36305m46864n77981k64310K10250M54459L16797m3803j66534
$$ 3063662 3175513 3039208 2592344 2014363 1750053 1960303 2414762 2731559 2687756 2521222
6414B521222j3243K898q6510j62055k86809m03949m32801k66593n8242J78042
$$ 2521222 2507979 2510877 2424367 2262312 1975503 1571554 1138753 872160 813918 991960
6404I91960N26204O23230L83882P2887k26787l97948k31302j89948l66131l40844
$$ 991960 1518164 2141394 2525276 2598163 2371376 1973428 1742126 1552178 1186047 845203
6394H45203j30675J66335L40240K79684K47479K18438R4067o075J01137K50163
$$ 845203 714528 880863 1221103 1500787 1748266 1966704 2060771 2054696 2155833 2405996
6384B405996K41871K13950K04036O1313k94742o21708q35148q03961l46613M32954
$$ 2405996 2647867 2861817 3065853 3127166 2832424 2210716 1375568 571607 224994 657948
6374F57948J034148R69329L13057j81157k27570j94413J5686L89069M90194L57244
$$ 657948 1692096 2661425 2974482 2793325 2565755 2371342 2387028 2776097 3266291 3623535
6364C623535K35495J72990J05877R3896K5715p6059K12010O04205N77465J29943
$$ 3623535 3859030 4032020 4137897 4231793 4257508 4181449 4393459 4997664 5575129 5705072
6354E705072m62723p79598o52464m80034m08452j12693M92756Q22147M93222j28463
$$ 5705072 5242349 4462751 3810287 3330253 2921801 2809108 3301864 4124011 4617233 4488770
6344D488770n65565p63567q32401o79490k94614P4724K89453M08353N20784P61900
$$ 4488770 3923205 3159638 2327237 1647747 1353133 1427857 1717310 2125663 2646447 3408347
6334C408347J059769J023450N35543j94735r33755j222721j003981o90330p09328
$$ 3408347 4468116 5491566 6027109 5832374 4898619 3675898 2671917 1981587 1272259
6325A272259p25242k67939J31376L19865P11093J034941Q82611L60700j83871
$$ 1272259 547017 279078 410454 730319 1441412 2476353 3358964 3719664 3535793
6316C535793m22332l62460k96035j56204J96442L95588L58641K67070J02586r0827
$$ 3535793 3113461 2751001 2454966 2298762 2495204 2890792 3249433 3516503 3619089 3528262
6306C528262k61889k65285o0606P9190o4024k88311l27485l59041p88535j450332
$$ 3528262 3266373 3001088 2940482 3019672 2955648 2667337 2339852 1980811 1192276 -258056
6296b58056j655698j147726n34794k26886N1724L79741O62433R56248J123010
$$ -258056 -1913754 -3061480 -3596274 -3823160 -3771436 -3391695 -2729262 -1773014 -650004
6287f50004J041690N65692N9649n0257R0328Q1126J3254J51433L41282L73796
$$ -650004 391686 957378 1017027 966770 1057098 1138224 1151478 1302911 1644193 2017989
6277B017989J30036j64124j97552p5541j14556l22192m95205n71414o22638n72411
$$ 2017989 2148025 1983901 1786349 1710808 1596252 1274060 778855 207441 -415197 -987608
6267i87608n01907m25798q1522M21702M94810L75200M91998O13596N13799L44888
$$ -987608 -1489515 -1915313 -1996835 -1575133 -1080323 -705123 -213125 400471 914270 1259158
6257A259158K42971J72365J15045N9172l6243j9530J54870K96064K90638K64946
$$ 1259158 1502129 1674494 1789539 1848711 1812468 1792938 1947808 2243872 2534510 2799456
6247B799456K01337j12236m36067l79191n1282J02948j31617m45702n28951k86157
$$ 2799456 3000793 2888557 2452490 2073299 2022017 2124965 1993348 1547646 1018695 732538
6237G32538K67746P03349O26035K20527j28862j86722j56997j69783J931M37835
$$ 732538 1000284 1703633 2329668 2550195 2421333 2234611 2077614 1907831 1909762 2347597
6227B347597P56971O43905J70608k31719k00601l850k5829j73355j39702k3373
$$ 2347597 3104568 3748473 3919081 3687362 3486761 3482911 3457082 3283727 3144025 3120652
6217C120652j45204m46499o24062n53351l61201j71862l8213j06437k46216l24380
$$ 3120652 2975448 2528949 1904887 1351536 990335 818473 780260 673823 427607 103227
6207A03227l11985n4436J63526P6222m1376m4261N29J1055K19013O27604O32485
$$ 103227 -208758 -263194 -99668 -23446 -64822 -109083 -108554 -97499 121514 749118 1381603
6196A381603J83754p2446J47799M83611M93195O1654m42931o22869m41796q7539
$$ 1381603 1565357 1492911 1640710 2124321 2617516 2679170 2236239 1613370 1171574 1084035
6186A084035J10451J29911J71235L25136M72948L08407j94946m87643n47130p20250
$$ 1084035 1194486 1324397 1495632 1820768 2293716 2602123 2407177 1919534 1372404 652154
6176F52154p83611o22205m93274l84871k28721m8903K17958M46693M02000J60331
$$ 652154 -131457 -753662 -1246936 -1631807 -1860528 -1909431 -1691473 -1244780 -842780 -682449
6166f82449M5500J7076j33564k84246j39180L10379O15814N10614K94008J50174
$$ -682449 -636949 -619873 -753437 -1037683 -1176863 -866484 -250670 259944 553952 704126
6156G04126k7471l11091n37699k62326J77398L49440M95447O83985P20082N64521
$$ 704126 676655 365564 -172135 -434461 -257063 92377 587824 1271809 1991891 2556412
6146B556412L19348L798l34946n73365m45364J42482O04000M10350k37788p84175
$$ 2556412 2875760 2879558 2544612 1971247 1525883 1668365 2272365 2682715 2444927 1660752
6136A660752q73678n51207r8272J16072J55747M27290P51080N87515R2467l15529
$$ 1660752 787074 235867 137595 253667 409414 836704 1587784 2175299 2267766 1952237
6126A952237l94695m2443K76365K28491J84804J39590j25085m27349n32956l34063
$$ 1952237 1557542 1515099 1791464 2019955 2204759 2344349 2219264 1791915 1258959 924896
6116I24896Q9783L46188K15845o0217k58201j94916O4329L04860J82052k97051
$$ 924896 1014679 1360867 1576712 1516495 1258294 1063378 1127707 1432567 1614619 1317568
6106A317568n84838m48569j44843Q9303J71140N8365j73830l24767l60566l31610
$$ 1317568 732730 284161 139318 228621 399761 458126 284296 -40471 -401037 -732647
6096g32647m21792o32252o33607l85093q3436J55394M85754Q29364R36237Q14798
$$ -732647 -1154439 -1786691 -2420298 -2805391 -2888827 -2733433 -2247679 -1418315 -482078 332720
6086C32720L50809q1137j00557j3641j19108l13684l29510j21988q2919l15178
$$ 332720 683529 602392 501835 488194 369086 55402 -274108 -396096 -479015 -794193
6076g94193m27721k08021O7295K46214K38842M0946K71154P26772Q94191O71729
$$ -794193 -1221914 -1429935 -1362640 -1116426 -877584 -836638 -565484 161288 1055479 1727208
6066A727208K76173K61539O51138R37338P48533K97249N7381j08177l19550l51598
$$ 1727208 2003381 2264920 2916058 3853396 4601929 4899178 4956559 4848382 4528832 4177234
6056D177234l28740m81156o84103n52819l51055p01287j140583j109763q67547
$$ 4177234 3848494 3367338 2683235 2130416 1779361 1078074 -62509 -1172272 -2039819
6047b039819p60967o03834j04888O97401J446304J633583J194741L71166k66361
$$ -2039819 -2800786 -3404620 -3509508 -2812107 -1365803 267780 1462521 1833687 1567326
6038A567326l74000k89309j67616J38038M86633M76417L61450L80158K06086j51380
$$ 1567326 1193326 904017 736401 874439 1361072 1837489 2198939 2579097 2785183 2633803
6028B633803l62080k90078k771K86483L39433J85256J08893k5237l16769m07566
$$ 2633803 2271723 1981645 1978874 2265357 2604790 2790046 2898939 2873702 2556933 2149367
6018B149367k13926J46774L99165M11237K45108j38924n89452r12847j098105
$$ 2149367 1935441 2082215 2481380 2892617 3137725 2998801 2409349 1496502 398397
6009C98397j029823o81893l04013k69269m00630k45274J56670N16186P25358P21762
$$ 398397 -631426 -1313319 -1617332 -1886601 -2287231 -2532505 -2375835 -1859649 -1134291 -412529
5999d12529P15117Q96781R48200M36769m67721p98652l15100j8727k27626l37543
$$ -412529 302588 1199369 2147569 2584338 2116617 1317965 1002865 984138 756512 418969
5989D18969m3082N03768Q88724Q27737L82067j94862o04851o67003m02915j93255
$$ 418969 375887 879655 1768379 2596116 2978183 2783321 2178470 1511467 1108552 915297
5979I15297k01297k18941k94284l02385j04035R228J0128J72429N09116N95829
$$ 915297 714000 495059 200775 -101610 -205645 -196417 -186289 -13860 495256 1091085
5969A091085K84729l6004j97563j65403r1102p503J16645K24986K67744K18579
$$ 1091085 1375814 1339810 1142247 976844 885742 878239 994884 1219870 1487614 1706193
5959A706193K72028K98370J16213j5925N6674K41411M20697N13020L93160O1524
$$ 1706193 1978221 2276591 2392804 2376879 2433553 2674964 3095661 3608681 4001841 4063365
5949D063365l14162n64647p46501r08045q15690o02462n21737l60031j91922k92313
$$ 4063365 3749203 3184556 2438055 1530010 714320 111858 -409879 -769910 -961832 -1254145
5939a254145m49983k02133K64233M70518L49943O9556l98789r41406j087953o61096
$$ -1254145 -1704128 -1906261 -1642028 -1171510 -821567 -752011 -1150800 -2092206 -3180159 -3841255
5929c841255j89677K04984N47194O84638P23867N87303L73295L33804L45803K53289
$$ -3841255 -4030932 -3825948 -3278754 -2594116 -1870249 -1282946 -909651 -575847 -230044 23245
5919B3245J93618j204m52956r28434q81987j55283M82167N35775L24403J57037
$$ 23245 216863 215659 -237297 -1165731 -2047718 -2203001 -1720834 -1185059 -860656 -703619
5909g03619J90431K99636K69297m8465m66249m48733r125K88664J33019j21820
$$ -703619 -513188 -213552 55745 7280 -458969 -907702 -916827 -628163 -495144 -616964
5899f16964q1116K01441N47884P53916P44865N04869J41849k8099j10579k54824
$$ -616964 -698080 -496639 51245 805161 1550026 2054895 2196744 2168645 2058066 1803242
5889A803242k19829j14970l07444m63745l11273L060M50964P76394P46472N09223
$$ 1803242 1583413 1468443 1160999 697254 385981 389041 840005 1616399 2362871 2872094
5879B872094J92489K8801j095j38614m21229n63562l88049j1779L15824L09293
$$ 2872094 3064583 3093384 3092289 2953675 2532446 1968884 1580835 1569056 1884880 2194173
5869B194173J76552p2335m05202l84298j66096n3032J42894L31607M29813K63513
$$ 2194173 2370725 2298390 1893188 1508890 1342794 1289762 1432656 1764263 2194076 2457589
5859B457589j05349l85490l04418J52995P02195J006347P90118K04403l41687
$$ 2457589 2352240 1966750 1662332 1815327 2517522 3523869 4313987 4518390 4176703
5850D176703n71963m71177k02553J83888N51309N10484J24348j65261k29596k8822
$$ 4176703 3604740 3133563 2931010 3114898 3666207 4176691 4301039 4135778 3906182 3877360
5840C877360M09054O40961J79048n39890o95315m54039k22346m9634Q4861K33551
$$ 3877360 4286414 4927375 5106423 4566533 3871218 3417179 3194833 3145199 3230060 3463611
5830C463611M71531N75531K58193k77249o30994n95582k89492j2401J31514K21138
$$ 3463611 3935142 4510673 4768866 4491617 3860623 3265041 2975549 2963148 3094662 3315800
5820C315800J29329p8276k42887k29396j59654j83951k52751k97139l60253l49398
$$ 3315800 3445129 3366853 3123966 2894570 2734916 2550965 2298214 2001075 1640822 1291424
5810A291424j27594J14905M5483k76668m76190l13673J76408P49703J055139Q49692
$$ 1291424 1163830 1278735 1324218 1047550 571360 257687 434095 1183798 2238937 3088629
5800C088629M26523l2795m65853o35577m52622j83748l4597r5941k21145l24175
$$ 3088629 3515152 3482357 3016504 2380927 1928305 1744557 1709960 1614019 1392874 1068699
5790A068699l46594j68156J09625M01817P33269Q19679M99674O2230k33384l01105
$$ 1068699 722105 553949 663574 1065391 1798660 2618339 3118013 3180243 2946859 2645754
5780B645754o2359J46133J42670L85401N36375J67016k82148l70837k27844k27795
$$ 2645754 2583395 2729528 2872198 3257599 3793974 3960990 3678842 3308005 3080161 2852366
5770B852366k96249k04220j54982q2401N4865K3759O1884M74228P53682M50243
$$ 2852366 2556117 2351897 2196915 2114514 2169379 2193138 2255022 2729250 3482932 3933175
5760C933175r4765n27532o27828m80353l27837l30357k00669K55307P02939J039949
$$ 3933175 3838410 3310878 2683050 2202697 1874860 1544503 1343834 1599141 2302080 3342029
5750C342029J322583J230195P34157K93508L19231P80078J340640J681053J688770
$$ 3342029 4664612 5894807 6628964 6922472 7241703 8021781 9362421 11043474 12732244
5741A2732244J607172J353723O31512m23822j350225j750986j482681r55543p17117
$$ 12732244 14339416 15693139 16324651 15900829 14550604 12799618 11316937 10361394 9644277
5732I644277p63450q07171p29407o18571n64823o55872q71939r44387n75274O3184
$$ 9644277 8880827 8073656 7344249 6725678 6160855 5504983 4633044 3688657 3113383 3176567
5722C176567M13486K02038J100K25150K61269q0865m54528o34422n54432m40618
$$ 3176567 3590053 3792091 3793191 4018341 4279610 4198745 3744217 3109795 2555363 2114745
5712B114745l11871j52271j53787k30022j21148p1268k96792l34985N4772L12091
$$ 2114745 1802874 1650603 1496816 1266794 1145646 1074378 777586 442601 497373 809464
5702H09464K07008P9216P2802L0698J25481M46820M92631J70766j33161l19314
$$ 809464 1016472 1095688 1168490 1199188 1324669 1771489 2264120 2434886 2301725 1982411
5692A982411k96588l7048K76448L50790n35n30392p26675l59677L77076R27813
$$ 1982411 1685823 1648775 1925223 2276013 2275478 1745086 1018411 658734 1035810 1963623
5682A963623R34735O65575L53445J16385j09562m92293p70988q44648q85768q73679
$$ 1963623 2898358 3563933 3917378 4033763 3924201 3431908 2660920 1816272 930504 56825
5672E6825n26385o927L53853L81345J75535m0093j88914j54850P8788K25930J01426
$$ 56825 -469560 -476487 -122634 258711 434246 394153 205239 50389 129177 355107 456533
5661D56533O432J97806M75269P08038P84653O44122L61149k2615l51863m22983
$$ 456533 462965 660771 1136040 1844078 2628731 3272853 3634002 3611387 3259524 2836541
5651B836541k00473L0309L5079q1195j69808j83769K3620L58015L92158p292m61047
$$ 2836541 2636068 2666377 2701456 2620261 2450453 2266684 2290304 2648319 3040477 3033185 2572138
5640B572138n61882l17382j29404q0030k30711m99726m57604P5016M49322L34398
$$ 2572138 2010256 1692874 1563470 1483440 1252729 753003 295399 370415 819737 1154135
5630A154135K31140L14019K76607J88069R0231j04636k01966p4248J33996M17028
$$ 1154135 1385275 1699294 1975901 2163970 2254201 2149565 1947599 1873351 2007347 2424375
5620B424375O91526P05908M82328K19918J30787K21650K10305M4192j56203k94331
$$ 2424375 3115901 3821809 4304137 4524055 4654842 4876492 5086797 5130989 4974786 4680455
5610D680455k45365K8621K34193r1148n75060n77188l86120k83098k50649k70902
$$ 4680455 4435090 4463711 4697904 4606756 4031696 3454508 3068388 2785290 2534641 2263739
5600B263739l05091l48268m10826n47363o98638p37153o50469m52141j74957J54939
$$ 2263739 1958648 1610380 1199554 652191 -46447 -783600 -1434069 -1886210 -2061167 -1906228
5590a906228L61841L14111Q0396l03391m89593k77111l3053O2713K50311M81980
$$ -1906228 -1544387 -1230276 -1149880 -1453271 -1942864 -2219975 -2253028 -2190315 -1940004 -1458024
5580a458024N06654L37454K19013K35078K85471J73380m1824j65715k04649j83198
$$ -1458024 -951370 -613916 -394903 -159825 125646 299026 257202 91487 -113162 -296360
5570b96360m280K33186K55491J92335K72451L26127J71750j806j25994j61792
$$ -296360 -300640 -67454 188037 380372 652823 978950 1150700 1148894 1022900 861108
5560H61108L7013M42899P81500O26144J7412m44894n90227n65314k57401L93511
$$ 861108 898121 1341020 2122520 2748664 2766076 2321182 1730955 1165641 908240 1301751
5550A301751Q34672O75136M02646J35548k34756n39868o67808n04074j05409K68603
$$ 1301751 2136423 2811559 3214205 3349753 3114997 2575129 1907321 1403247 1297838 1566441
5540A566441M21324M54573M42181L79503K09625J8271N0256K8549k71101o06200
$$ 1566441 1987765 2442338 2884519 3264022 3473647 3491918 3542174 3570723 3299622 2693422
5530B693422n84728j89136K00431K09167j81868m69338m67320k30393L4353J19243
$$ 2693422 2108694 1919558 2119989 2329156 2147288 1677950 1210630 980237 1014590 1133833
5520A133833M4710l5533j52320m02145m57060k35453o2427R2401K80976L94255
$$ 1133833 1178543 1143010 990690 588545 131485 -103968 -166395 -73994 206982 601237
5510F01237L58967O7891k72042l41681j64162J37792M46169N65317N12099K86551
$$ 601237 960204 1028095 756053 414372 250210 388002 834171 1399488 1911587 2198138
5500B198138J33330L23849O02686P16853N77181L12034O0142j50418j9651L58899
$$ 2198138 2331468 2655317 3258003 3974856 4552037 4864071 4924213 4773795 4754144 5113043
5490E113043M34646J22078j73815l57990n26053o66807p80589q30258p36739n72319
$$ 5113043 5547689 5669767 5495952 5137962 4611909 3945102 3164513 2334255 1597516 1025197
5480A025197m76172l31298j54420j93709l15298j95118K5057J80713L38144N21299
$$ 1025197 549025 217727 63307 -130402 -445700 -640818 -615761 -435048 -96904 424395
5470D24395O39789M14139R9147J12302J77863J42669P0524j48240k56057O5865
$$ 424395 1064184 1478323 1577470 1689772 1867635 2010304 2080828 1932588 1676531 1742396
5460A742396M10004M40025M17941L98264K45706l8927k90315l91515m80647m93135
$$ 1742396 2152400 2592425 3010366 3408630 3654336 3615409 3325094 2933579 2452932 1959797
5450A959797l25683n7135J46831K45980L44560K96120Q3106m6415n0136j21432
$$ 1959797 1634114 1576979 1723810 1969790 2314350 2610470 2693576 2647161 2597025 2475593
5440B475593l17781m64265k91642J55089M07571N35487M93050R1388l41905l30111
$$ 2475593 2157812 1693547 1401905 1556994 1964565 2500052 2993102 3084490 2742585 2412474
5430B412474K6437L64503M24887J23583j97434m11680m10494j22382j05024m19334
$$ 2412474 2438911 2803414 3228301 3351884 3154450 2742770 2332276 2209894 2104870 1685536
5420A685536o10237n37705l12841L8348M49256Q40880P40883p5897p55591q50589
$$ 1685536 1075299 537594 224753 263101 712357 1553237 2294120 2218223 1462632 612043
5410F12043n70664q5516L06066L55530K43020J32914j3442j18744K9538L17694
$$ 612043 41379 -44137 261929 617459 860479 993393 979951 861207 890745 1208439
5400A208439L05365l8550k43646j57241l5370R3383M10539N92536N65930N83947
$$ 1208439 1513804 1475254 1231608 1074367 1038997 1132380 1542919 2135455 2701385 3285332
5390C285332O21632O29806N63417K85830j31937m10575n09253n31693n48058n04874
$$ 3285332 3906964 4536770 5100187 5386017 5254080 4843505 4334252 3802559 3254501 2749627
5380B749627k60317m217n0604k82135l74664l77898m48337k45547K53205M21832
$$ 2749627 2489310 2485093 2434489 2152354 1777690 1399792 951455 705908 959113 1380945
5370A380945K91380K64748K86796J23974j28420q1311R9616p6375l97019n81933
$$ 1380945 1672325 1937073 2223869 2347843 2219423 2138112 2237728 2161353 1764334 1182401
5360A182401n65524k85677J36791L67663L39129Q9256l75659p25627o11484o9794
$$ 1182401 616877 331200 467991 835654 1174783 1264039 888380 162753 -448731 -518525
5350e18525L81626L27636Q0586r8234k88655l96856l53350k04384J18057N60937
$$ -518525 -136899 190737 271323 173089 -115566 -512422 -865772 -1070156 -952099 -391162
5340c91162Q96128Q96121N89787K79297L21940M97831M98059M87560M08624K58895
$$ -391162 504966 1401087 1990874 2270171 2592111 3089942 3588001 4075561 4484185 4743080
5330D743080J08807J02081K14020O5145l15563n15996l10159n5619j20676l59422
$$ 4743080 4851887 4953968 5167988 5233133 4917570 4401574 4091415 4035796 3915120 3555698
$$ [...]
##END NTUPLES=NMR SPECTRUM
##END=
