##TITLE=C13cpd
##JCAMPDX= 6.0         $$ Bruker NMR JCAMP-DX V2.0
##DATA TYPE= NMR SPECTRUM
##DATA CLASS= NTUPLES
##ORIGIN= UXNMR, Bruker Analytische Messtechnik GmbH
##OWNER= root
$$ XWIN-NMR		Version 3.5
$$ Sat Feb 15 11:16:48 2025 Russian Standard Time (UT+4h)  servis@DPX200
##.OBSERVE FREQUENCY= 50.3277607988526
##.OBSERVE NUCLEUS= ^13C
##.ACQUISITION MODE= SIMULTANEOUS
##.ACQUISITION SCHEME= undefined
##.AVERAGES= 1203
##.DIGITISER RES= 17
##SPECTROMETER/DATA SYSTEM= spect
##.PULSE SEQUENCE= zgpg30
##.SOLVENT NAME= CDCl3
##.SHIFT REFERENCE= (INTERNAL, CDCl3, 0, 219.126)
##AUDIT TRAIL= $$ (NUMBER, WHEN, WHO, WHERE, WHAT)
$$ ##TITLE= Audit trail, XWIN-NMR		Version 3.5
$$ ##JCAMPDX= 5.01
$$ ##ORIGIN= Bruker BioSpin GmbH
$$ ##OWNER= servis
$$ F:\spectra/data/av/nmr/C13cpd/1/pdata/1/auditp.txt
$$ ##AUDIT TRAIL=  $$ (NUMBER, WHEN, WHO, WHERE, WHAT)
(   1,<2025-02-15 11:15:43.43 +0400>,<servis>,<DPX200>,
      <created by zg, POWCHK disabled, PULCHK disabled
       terminated by command 'halt'
       configuration hash MD5:
       00 E9 B6 7A A2 85 ED C7 34 08 36 98 17 FE 4E 26
       data hash MD5: 32K
       DC 25 BD 59 37 BE 27 27 6E DE A3 D6 A0 87 77 3E>)
(   2,<2025-02-15 11:15:53.53 +0400>,<servis>,<DPX200>,
      <Start of raw data processing
       efp BC_mod = 2 LB = 2 FT_mod = 6 PKNL = 1 PHC0 = -323.4862 PHC1 = 11.06496 SI = 32K 
       data hash MD5: 32K
       28 FE A9 CC 93 C5 53 59 5A 08 D4 1D 08 5C 80 AC>)
(   3,<2025-02-15 11:16:27.68 +0400>,<servis>,<DPX200>,
      <pk PHC0 = -16.57676 PHC1 = 14.59997 
       data hash MD5: 32K
       2E 53 DF 84 7D EE B8 3F DD 93 AC 21 20 EC 6E C8>)
$$ ##END=
$$ 
$$ hash MD5
$$ 56 6F 83 30 FC 40 2D 10 AE 53 7F 30 14 C0 61 4B
##$RELAX= 
##$RELAX= 
##$RELAX= 
##$RELAX= 
##$RELAX= 
##$RELAX= 
##$RELAX= 
##$RELAX= 
$$ Bruker specific parameters
$$ --------------------------
##$DU= <F:\spectra>
##$EXPNO= 1
##$NAME= <C13cpd>
##$PROCNO= 1
##$TYPE= <nmr>
##$USER= <av>
##$AMP= (0..31)
100 100 100 100 100 100 100 100 100 100 100 100 100 100 100 100 100 100 
100 100 100 100 100 100 100 100 100 100 100 100 100 100 
##$AQSEQ= 0
##$AQ_mod= 1
##$AUNM= <au_zg>
##$AUTOPOS= <>
##$BF1= 50.322729
##$BF2= 200.13
##$BF3= 50.322729
##$BF4= 50.322729
##$BF5= 500.13
##$BF6= 500.13
##$BF7= 500.13
##$BF8= 500.13
##$BYTORDA= 1
##$CFDGTYP= 0
##$CFRGTYP= 5
##$CHEMSTR= <none>
##$CNST= (0..31)
1 1 145 1 1 1 1 1 1 1 1 1 1 1 1 1 1 1 1 1 1 1 1 1 1 1 1 1 1 1 1 1 
##$CPDPRG= <waltz16>
##$CPDPRG1= <>
##$CPDPRG2= <waltz16>
##$CPDPRG3= <>
##$CPDPRG4= <mlev>
##$CPDPRG5= <mlev>
##$CPDPRG6= <mlev>
##$CPDPRG7= <mlev>
##$CPDPRG8= <mlev>
##$CPDPRGB= <>
##$CPDPRGT= <>
##$D= (0..31)
0 2 0.00345 0 0 0 0 0 0 0.06 0 0.03 2e-05 3e-06 0 0 0.0002 0 0 0 0 0 0 
0 0 0 0 0 0 0 0 0 
##$DATE= 1739603743
##$DBL= (0..7)
120 120 120 120 120 120 120 120 
##$DBP= (0..7)
150 150 150 150 150 150 150 150 
##$DBP07= 0
##$DBPNAM0= <>
##$DBPNAM1= <>
##$DBPNAM2= <>
##$DBPNAM3= <>
##$DBPNAM4= <>
##$DBPNAM5= <>
##$DBPNAM6= <>
##$DBPNAM7= <>
##$DBPOAL= (0..7)
$$ [...]
##$SUBNAM2= <"">
##$SUBNAM3= <"">
##$SUBNAM4= <"">
##$SUBNAM5= <"">
##$SUBNAM6= <"">
##$SUBNAM7= <"">
##$SUBNAM8= <"">
##$SUBNAM9= <"">
##$SW= 238.246396889851
##$SWIBOX= (0..15)
0 1 3 0 0 0 0 0 0 0 0 0 0 0 0 0 
##$SW_h= 11990.4076738609
##$TD= 32768
##$TD0= 1
##$TE= 0
##$TE2= 300
##$TE3= 300
##$TEG= 300
##$TL= (0..7)
0 120 120 120 120 120 120 120 
##$TP= (0..7)
150 150 150 150 150 150 150 150 
##$TP07= 0
##$TPNAME0= <>
##$TPNAME1= <>
##$TPNAME2= <>
##$TPNAME3= <>
##$TPNAME4= <>
##$TPNAME5= <>
##$TPNAME6= <>
##$TPNAME7= <>
##$TPOAL= (0..7)
0.5 0.5 0.5 0.5 0.5 0.5 0.5 0.5 
##$TPOFFS= (0..7)
0 0 0 0 0 0 0 0 
##$TUNHIN= 0
##$TUNHOUT= 0
##$TUNXOUT= 0
##$USERA1= <user>
##$USERA2= <user>
##$USERA3= <user>
##$USERA4= <user>
##$USERA5= <user>
##$V9= 5
##$VALIST= <valist>
##$VCLIST= <CCCCCCCCCCCCCCC>
##$VD= 0
##$VDLIST= <DDDDDDDDDDDDDDD>
##$VPLIST= <PPPPPPPPPPPPPPP>
##$VTLIST= <TTTTTTTTTTTTTTT>
##$WBST= 1024
##$WBSW= 20
##$XGAIN= (0..3)
0 0 0 0 
##$XL= 0
##$YL= 0
##$YMAX_a= 23075453
##$YMIN_a= -17138768
##$ZGOPTNS= <>
##$ZL1= 120
##$ZL2= 120
##$ZL3= 120
##$ZL4= 120
##$ABSF1= 0
##$ABSF2= 0
##$ABSG= 0
##$ABSL= 0
##$ALPHA= 0
##$AQORDER= 0
##$ASSFAC= 0
##$ASSFACI= 0
##$ASSFACX= 0
##$ASSWID= 0
##$AUNMP= <proc_1d>
##$AZFE= 0.1
##$AZFW= 0.5
##$BCFW= 0
##$BC_mod= 2
##$BYTORDP= 0
##$COROFFS= 0
##$CY= 12.5
##$DATMOD= 1
##$DC= 0
##$DFILT= <>
##$DTYPP= 0
##$F1P= 99.9999945759776
##$F2P= -179.999992907048
##$FCOR= 0.5
##$FTSIZE= 32768
##$FT_mod= 6
##$GAMMA= 0
##$GB= 0
##$INTBC= 1
##$INTSCL= 0
##$ISEN= 30
##$LB= 2
##$LEV0= 0
##$LPBIN= 0
##$MAXI= 10000
##$MC2= 0
##$MEAN= 0
##$ME_mod= 0
##$MI= 0
##$NCOEF= 0
##$NC_proc= 1
##$NLEV= 6
##$NOISF1= 0
##$NOISF2= 0
##$NSP= 0
##$NTH_PI= 0
##$NZP= 0
##$OFFSET= 219.1257
##$PC= 1.4
##$PHC0= -340.063
##$PHC1= 25.66493
##$PH_mod= 1
##$PKNL= yes
##$PPARMOD= 0
##$PSCAL= 4
##$PSIGN= 0
##$REVERSE= no
##$SF= 50.322729
##$SI= 32768
##$SIGF1= 0
##$SIGF2= 0
##$SINO= 80
##$SIOLD= 32768
##$SREGLST= <13C.CDCl3>
##$SSB= 0
##$STSI= 32768
##$STSR= 0
##$SW_p= 11990.4076738609
##$SYMM= 0
##$S_DEV= 0
##$TDeff= 32768
##$TDoff= 0
##$TI= <>
##$TILT= no
##$TM1= 0
##$TM2= 0
##$TOPLEV= 0
##$USERP1= <user>
##$USERP2= <user>
##$USERP3= <user>
##$USERP4= <user>
##$USERP5= <user>
##$WDW= 1
##$XDIM= 32768
##$YMAX_p= 389419318
##$YMIN_p= -3594526
$$ End of Bruker specific parameters
$$ ---------------------------------
##NTUPLES= NMR SPECTRUM
##VAR_NAME=  FREQUENCY,     SPECTRUM/REAL,   SPECTRUM/IMAG
##SYMBOL=    X,             R,               I
##VAR_TYPE=  INDEPENDENT,   DEPENDENT,       DEPENDENT
##VAR_FORM=  AFFN,          ASDF,            ASDF
##VAR_DIM=   32768,         32768,           32768
##UNITS=     HZ,            ARBITRARY UNITS, ARBITRARY UNITS
##FACTOR=    0.365929370215793, 1,           1
##FIRST=     11027.0033138647, 0,            0
##LAST=      -963.404359996184, 0,           0
##MIN=       -963.404359996184, -3594526,    0
##MAX=       11027.0033138647, 389419318,    0
$$ Real data points
##PAGE= N=1
##DATA TABLE= (X++(R..R)), XYDATA
$$ [...]
10977A312526M16354J11917j04427k57439m97963o90725n89755k49744M626J58272
10967c86358K50586L43100L45785m4191o54441r83146o80604p1551L93288O60881
10957h26651P82165Q28211O70165J71229l84998o61179n05934q0192L13959N49767
10947H56542O89207N98339K33038M5734R0674P4342M8758l856j56322l07403l15447
10936A853606l19233m32780k95785N8689J90779o959l30019m95209l32778J04079
10926e610M46203M30132J97485Q9517O9124j15417k91952k26163P5675L80573
10916A049567L97973K18699J0603j25649l0162J96512N0815j96141o1638J19324
10906A629903M2995j62494l27537m15848l90044k28455J09842N01351N97063L18654
$$ y = [1312526, 1728880, 1840797, 1736370, 1478931, 980968, 290243, -299512, -549256, -544630, -386358, -135772, 207328, 553113, 508922, -145519, -1128665, -1809269, -1880820, -1487532, -826651, -44486, 783725, 1453890, 1625119, 1240121, 578942, 73008, -7184, 306775, 856542, 1545749, 2144088, 2377126, 2422860, 2513534, 2587876, 2636634, 2632778, 2476456, 2169053, 1853606, 1534373, 1101593, 805808, 864497, 1055276, 1048317, 718298, 223089, -109689, -5610, 440593, 870725, 1068210, 1157727, 1226851, 1111434, 819482, 593319, 668994, 1049567, 1447540, 1666239, 1676842, 1551193, 1521031, 1717543, 1768358, 1572217, 1510579, 1629903, 1672898, 1510404, 1182867, 767019, 376975, 148520, 258362, 759713, 1356776, 1675430]
10896A675430P7607J6117o500O5167J84541J18626j53767m54878n17042l26006
10886F79295j7696J96295K05311J20865p6703l16593k16090K13471L02634P0389
10876A161178L3814R1119J04415K38902M64002N97611N18828K98071J21048K2931
10866C651919M1288R3549l507k27081l73901k72681K6541K18774K45772J02708
10856C503381r3638j43848k5283J7632l5137o0183n3948J796P2979J75140K19984
10845C578875R3310K0016J6675j12402l40898n16952l86332k5916q738k92927
10835B024711m42789n01072n09011l14699m0122J09243J57476Q8999l7333j10374
10825D25029o2506M9287J8572j44082k58865k14002k0523J88986L77951N86589
$$ y = [1675430, 1753037, 1769154, 1762654, 1827821, 2012362, 2130988, 1977221, 1522343, 1005301, 679295, 661599, 857894, 1063205, 1184070, 1107367, 790774, 574684, 788155, 1090789, 1161178, 1194992, 1286111, 1390526, 1629428, 2093430, 2691041, 3209869, 3507940, 3628988, 3651919, 3693207, 3786756, 3783249, 3556168, 3182267, 2909586, 2936127, 3154901, 3400673, 3503381, 3409743, 3265895, 3240612, 3258244, 3223107, 3162924, 3108976, 3110772, 3183751, 3358891, 3578875, 3672185, 3692201, 3708876, 3596474, 3255576, 2738624, 2352292, 2326376, 2317638, 2024711, 1581922, 1080850, 571839, 257140, 217018, 326261, 483737, 572736, 535403, 425029, 362523, 411810, 430382, 286300, 27435, -186567, -207090, -18104, 359847, 946436]
10815I46436N63155K24873o6637n2570R9767J62768J12869M253j99637m89503
10805A305774n58820l44908j84095j02896Q4513K23402K14789J76716J50505K2230
10795I87210o625P6188P8335J42933K20305J84487J65581K77164K98336J15038
10785B538952j3589J46629L66403K84016p1330m09050n05213l51005j63148k38085
10775A584580m48779l45022M855J82281J86986J74735R9765O8141K16404M10020
10765B133966M82496L08895j9721k12384j54246J25170L81768K92251o8177n35527
10755B734491p98508o08068j98340J1993l8113n6764Q709J44579L83613O10938
10745B194530N58698K32921N6124J01666K14057K65460K58765J83742l9488k17000
$$ y = [946436, 1509591, 1734464, 1667827, 1615257, 1715024, 1877792, 1990661, 1994914, 1795277, 1305774, 746954, 402046, 217951, 115055, 199568, 422970, 637759, 814475, 964980, 987210, 980585, 1056773, 1135108, 1278041, 1498346, 1682833, 1848414, 2125578, 2423914, 2538952, 2525363, 2671992, 3038395, 3322411, 3251081, 2842031, 2336818, 1985813, 1822665, 1584580, 1135801, 790779, 795634, 977915, 1164901, 1339636, 1439401, 1507542, 1723946, 2133966, 2616462, 2925357, 2905636, 2693252, 2539006, 2664176, 3045944, 3338195, 3270018, 2734491, 1935983, 1327915, 1129575, 1141568, 1103455, 1046691, 1055400, 1199979, 1583592, 2194530, 2753228, 2986149, 3042273, 3143939, 3357996, 3623456, 3882221, 4065963, 4026475, 3809475]
10735C809475k55364j67559J00685K14601K1654l06058n68663n82796m34804k23383
10725A607788N8375L23826M80467N09273L33593J08673J49921M54534O65693O67833
10715E359976M73932J09911k85872m92081m66872n37757o38768l60920J08237
10706C269786K93522J98488K9458j20987j46436o4207n0184k04948l81038l98730
10696B424724k94068j96761k77069m93456o51545o80028n54822k28077J74589
10687g76513N00027O04820M21050J57521J35415L88567N74897M66127K57323o6472
10677B662762l72701l03844M44J85551J22326n0829k23207k78999k59397j89374
10667A292732j07168p34P5978M1625J7317J09183K14429K27059J62711k1994j15725
$$ y = [3809475, 3554111, 3386552, 3487237, 3701838, 3723492, 3417434, 2848771, 2265975, 1831171, 1607788, 1666163, 1989989, 2470456, 2979729, 3313322, 3421995, 3571916, 4026450, 4692143, 5359976, 5833908, 5943819, 5657947, 5165866, 4698994, 4161237, 3522469, 3161549, 3269786, 3563308, 3761796, 3791254, 3670267, 3523831, 3459624, 3409440, 3204492, 2823454, 2424724, 2130656, 1933895, 1656826, 1163370, 511825, -168203, -723025, -951102, -776513, -276486, 328334, 749384, 906905, 1042320, 1430887, 2005784, 2471911, 2729234, 2662762, 2290061, 1986217, 1986661, 2172212, 2294538, 2243709, 2020502, 1741503, 1482106, 1292732, 1185564, 1184830, 1260808, 1302433, 1319750, 1428933, 1643362, 1870421, 2033132, 2011138, 1895413]
10656A895413M1492L03370L19256l9344k99791j42875P0110K19679L89474L66631
10646C123415K29718J39179m7180l90597n99967n44855k61900J0923J09006J51097
10636A918839J35756J14176J6810k02152l90904m43294n15996o46643n04468j32522
10626f50398J55638M05950O80286Q50325O48000J81826n2749q2223r5265R9661
10616B141051K54423L3179l97520o35282m92598k33863J452L73097P57960P12011
10606B513910K58651o1718o3683p0434k52426l78610k03354P9212J71962J52332
10596B145842K19410J90934L2297L654N3166J8473k9404O6827L14921M85316L66794
10585C868230P7237o5913l8919K6746Q2295J9635k29452m28469m92532m35167
$$ y = [1895413, 1936905, 2240275, 2559531, 2520187, 2220396, 2077521, 2147631, 2367310, 2756784, 3123415, 3353133, 3492312, 3445132, 3054535, 2454568, 1909713, 1647813, 1658736, 1767742, 1918839, 2054595, 2168771, 2185581, 1983429, 1592525, 1149231, 633235, -13408, -517876, -650398, -494760, -88810, 591476, 1441801, 2089801, 2271627, 2218878, 2136655, 2041390, 2141051, 2395474, 2428653, 2031133, 1395851, 903253, 669390, 670842, 1043939, 1801899, 2513910, 2772561, 2710843, 2647160, 2576726, 2324300, 1945690, 1742336, 1821548, 1993510, 2145842, 2365252, 2556186, 2588483, 2592137, 2645303, 2663776, 2634372, 2701199, 3016120, 3501436, 3868230, 3945467, 3879554, 3840635, 3867381, 3949676, 3969311, 3739859, 3311390, 2818858, 2383691]
10575B383691k31241J8792J40342P9953J34611L29079K64416r5039m40158o67774
10565A916672n68036j43762K06882L01301K70140J87453L9809m1684r3914l00379
10555A774482m86049l44151j27804k02032m53275o87264n55018P6660N88223O50223
10545B33995N43575M07787L46824L55077K65326j2745j63440r0409K1005J42482
10535B049477K83061L09142J95380N2653o4689j21673m5160K70635O48000P48172
10525D324998M45112K1906k02765j63814p1234j04250j70082j77330j67606r2444
10515C642491q5203k14006l04300k53206k82582n28309n52562l38054j51097J44715
10505A077887L79106K37097k1241K7820K22812L38812K74194l36j83982k26014
$$ y = [2383691, 2152450, 2171242, 2311584, 2391537, 2526148, 2855227, 3119643, 3024604, 2584446, 1916672, 1348636, 1204874, 1411756, 1713057, 1983197, 2170650, 2210459, 2168775, 2074861, 1774482, 1288433, 944282, 816478, 614446, 161171, -526093, -1081111, -1004451, -416228, 233995, 777570, 1185357, 1532181, 1887258, 2152584, 2139839, 1976399, 1885990, 1906995, 2049477, 2332538, 2641680, 2837060, 2889713, 2825024, 2703351, 2658191, 2928826, 3576826, 4324998, 4770110, 4792016, 4589251, 4425437, 4354203, 4249953, 4079871, 3902541, 3734935, 3642491, 3557288, 3343282, 3038982, 2785776, 2503194, 1974885, 1422323, 1084269, 933172, 1077887, 1456993, 1694090, 1672849, 1700669, 1923481, 2262293, 2536487, 2536151, 2352169, 2126155]
10495B126155k00825j35013k45291m49611m28643k23468N077K25654K70591J00748
10485A045374l9587p9341j4735M4466q6539k90449k44878r1753k84637o80350
10475g22429q03028m84313N8785O01439J047621J150978J021151R19395P36477
10466C526076M24195Q6267j01440o5413J65379M68677N09424L27293L22396M82028
10456F144882M70989J74436k65696m96910l75679p2001K79130M90694N21756N88533
10446G460134O17007M32966J77908J480j51097k69387j05020K82049N27937N62073
10436I536050M96775M41124O34732J012408J190801J010539Q23911R58508J228001
10427A7332849J336737J268113J452593K250387L286475M077960M677778N283635
$$ y = [2126155, 1925330, 1790317, 1545026, 1095415, 666772, 443304, 448381, 674035, 944626, 1045374, 1005787, 926446, 911711, 956177, 869638, 579189, 334311, 242558, -42079, -722429, -1525457, -2009770, -1950985, -1349546, -301925, 849053, 1870204, 2789599, 3526076, 3950271, 4036538, 3935098, 3869685, 4035064, 4503741, 5013165, 5340458, 5662854, 6144882, 6615871, 6790307, 6524611, 6027701, 5652022, 5580021, 5859151, 6349845, 6871601, 7460134, 8077141, 8510107, 8688015, 8689495, 8538398, 8269011, 8163991, 8446040, 8973977, 9536050, 10032825, 10473949, 11108681, 12121089, 13311890, 14322429, 15146340, 16104848, 17332849, 18669586, 19937699, 21390292, 23640679, 26927154, 31005114, 35682892, 40966527]
10419D0966527N995405P014536Q531804J0109289J1071240J0968955R061307M766791
10411A08485854j079607o615876j0155873j1292739j0796322r609553q266863
10404E0669021o890363n711464n025292m570533m023935l448981k715372j918136
10396A6364945j323761r49735q60936j067621j390140j517508j295470r09153
10388G050621o22063l58676r3616j86741n37208o76390n48305l63362k16097j70735
10378C277428j76732j94969j42036P4023K81789L32902K35764K12112L18707K15262
10368D434250j10075l23852k87236j53277o1965r0415k01277l88155n11722n78946
10358A727330o62449o28270l98491n0527J95026K99010L77101M09250L30956J26076
$$ y = [40966527, 46961932, 53976468, 62508272, 72617561, 83688801, 94657756, 103719063, 108485854, 107406247, 100790371, 90634498, 79341759, 68545437, 58935884, 50669021, 43778658, 38067194, 33041902, 28471369, 24447434, 20998453, 18283081, 16364945, 15041184, 14091449, 13230513, 12162892, 10772752, 9255244, 7959774, 7050621, 6428558, 6069882, 5976266, 5789525, 5252317, 4575927, 4027622, 3664260, 3448163, 3277428, 3100696, 2905727, 2763691, 2837714, 3119503, 3452405, 3688169, 3900281, 4218988, 4434250, 4324175, 4000323, 3713087, 3559810, 3497845, 3407430, 3206153, 2817998, 2306276, 1727330, 1064881, 436611, 38120, -12407, 182619, 481629, 858730, 1267980, 1598936, 1725012]
10348A725012j11818j48090q3865K1046K01718K99005K12733l0690k68975l76416
10338A439660k81730Q2865N54954Q76519P20890K15774n7109J1479J01370k4975
10328C639697k00990j84420r5101r1030Q538J41075k8817k94393l03714k38172
10318B352673k81609l13048j10411L29898O70360O35202K43346j58959l06579
10309C060873k74956k58873l40388m36731l73903j48264k2593n8851k01784k95940
10299F48590j51849k2414j17209l01615l04385P5576N27151O13673M80708M22394
10289A870620K68299q7277l62625m47657m45545l05279m0777J45825J64880L0994
10279G91458j96325k57202k5339N30104J088970J082743N24176o7684l48684l00448
$$ y = [1725012, 1613194, 1465104, 1381239, 1402285, 1604003, 1903008, 2115741, 2085051, 1816076, 1439660, 1157930, 1240795, 1795749, 2672268, 3393158, 3608932, 3551823, 3563302, 3664672, 3639697, 3438707, 3254287, 3159186, 3068156, 3076694, 3217769, 3188952, 2894559, 2590845, 2352673, 2071064, 1758016, 1647605, 1977503, 2647863, 3283065, 3526411, 3367452, 3060873, 2785917, 2527044, 2186656, 1749925, 1376022, 1227758, 1205165, 1146314, 944530, 648590, 496741, 474327, 357118, 55503, -248882, -173306, 353845, 967518, 1448226, 1870620, 2138919, 2051642, 1689017, 1241360, 795815, 490536, 449759, 595584, 760464, 791458, 595133, 337931, 312592, 842696, 1931666, 3014409, 3538585, 3470901, 3122217, 2821769]
10269B821769o6321n3534l51594n19069m07291k50745j73054q9390M4063J80835
10259A135669K34922K16131J61502N1263m2826j56654j85110j90009j98472m2082
10249I84334J20271J52289m6564l72914l74194j3953K31946K83982K91539J43836
10239A400572j30115l66336m13406l27757k51782j22478P6698K52185L89592K66903
10229G74076j16858l41246j83772J82227M80396O67514P82339O69452L87781J08302
10219C410211j61153l77512l86378k14822l9480R348m5259p9871j28278o2237
10209A924569J46045J48141j46527k16699J8758R407l48212n71011l96498j25489
10199D42484k6510j25566j89209k01992l31591k57768K04306P65444R51047P45955
$$ y = [2821769, 2755448, 2701914, 2350320, 1831251, 1423960, 1173215, 1000161, 910771, 954834, 1135669, 1370591, 1586722, 1748224, 1799487, 1756661, 1600007, 1414897, 1224888, 1026416, 984334, 1104605, 1256894, 1210330, 837416, 463222, 449269, 681215, 965197, 1256736, 1400572, 1270457, 904121, 490715, 162958, -88824, -211302, -134604, 117581, 507173, 774076, 657218, 315972, 132200, 314427, 794823, 1462337, 2244676, 2914128, 3301909, 3410211, 3249058, 2871546, 2485168, 2270346, 2230866, 2240214, 2194955, 2115084, 1986806, 1924569, 2070614, 2218755, 2072228, 1855529, 1874287, 1883694, 1535482, 964471, 567973, 442484, 415974, 290408, 101199, -100793, -432384, -690152, -485846, 279598, 1230645, 1976600]
10189A976600N00753M77250L75562L4735k92301m93815m35003j61435J7747O4008
10179B064101J84142L87468M12881R9602k55568k93012j12393Q382r4845l17181
10169B083577m41520m00428l19839k52485j36907p8945o6874j10578l9462J91115
10159D27654J79402k34958p13739q04632n75527k73017J9800K38006M03131N26976
10149h06904M19636L6334k71141k87887m1475J49844J36454O2091J24891J32856
10139c45301J0554J15946L87053L60759l0558k80719p6332L79881N97297N24930
10129A643510N01250M55292K99737J74396L9797j10163j49924j10221k12794m18965
10119B111915n40305m33804j58740K1748n672j36245k68077j81739P5192J72900
$$ y = [1976600, 2477353, 2954603, 3330165, 3364900, 3072599, 2578784, 2143781, 1982346, 2000093, 2064101, 2248243, 2635711, 3048592, 3148194, 2892626, 2599614, 2487221, 2495603, 2400758, 2083577, 1642057, 1241629, 921790, 669305, 532398, 453453, 386579, 276001, 236539, 427654, 607056, 372098, -341641, -1146273, -1721800, -1994817, -1975017, -1737011, -1333880, -806904, -387268, -350934, -622075, -909962, -951437, -801593, -665139, -603048, -478157, -345301, -334747, -218801, 168252, 529011, 498453, 217734, 141402, 521283, 1118580, 1643510, 2144760, 2600052, 2899789, 3074185, 3113982, 3003819, 2853895, 2743674, 2530880, 2111915, 1571610, 1137806, 979066, 1000814, 995142, 858897, 590820, 409081, 484273, 657173]
10109F57173J56526K72820K45547l4540k01704k28054j09870K9541O0357R7624
10099I45420K08724K87331K57059J50095p8478j84660k1872M0570o5431O080K07634
10088A752472K00770P5234J20229M30693O71190N89104M06506K60645J6798k73468
10078D250173m04797m19929m35778l97745l40288k76214k96853l65513l41864
10069I71192j21869J48374Q5573j33898k93360m12629m33440j12616M24877P14132
10059H36336O91983N01690K35009p9081l98292o16802o37593o08522o50762n97374
10049a323408m45455m74764o12922l96523L4036L08341M37891N51189O42797O93948
10039e84870O38771M13674J25011j08977j81478j01988m885J56543L15055J52290
$$ y = [657173, 813699, 1086519, 1332066, 1297526, 1095822, 867768, 757898, 787439, 847796, 945420, 1154144, 1441475, 1698534, 1848629, 1770151, 1585491, 1563619, 1604189, 1538758, 1544838, 1752472, 1953242, 2028476, 2148705, 2579398, 3250588, 3839692, 4246198, 4506843, 4523641, 4250173, 3845376, 3425447, 2989669, 2591924, 2251636, 1975422, 1678569, 1313056, 971192, 849323, 997697, 1083270, 949372, 656012, 243383, -190057, -302673, 122204, 836336, 1528319, 2030009, 2265018, 2185937, 1787645, 1170843, 533250, -75272, -726034, -1323408, -1768863, -2243627, -2856549, -3253072, -3219036, -2910695, -2472804, -1921615, -1278818, -584870, 53901, 467575, 592586, 483609, 302131, 200143, 195258, 351801, 666856, 819146]
10029H19146n6436j66040k52529m1357K58204L34038K29067R6420J04319J70987
10019A495819J21417Q75j16058k68250k79067o7567Q5550P5434N2825J96070L58106
10008A655154J83245k33095m33511l97324m54314m94930k98333Q08J94652K44120
9998c3528K10590R4711j20690k22775j86188q094J96560K23657J43249O1484L6062
9987C95038L1489q141J05771K50440K82053L50270N24298O74112O94722M81484
9977C781536L3917l12416l41388l23374m79568o05457n47693l36324R497L45226
9967A223956N45352N30927J28174l85250m49323r7773K29568K35768P1205J20562
9957B153166K42443J66229p7656m98970q10983o88538k86612R182N4837Q4449
$$ y = [819146, 762710, 596670, 344141, 302784, 560988, 895026, 1124093, 1220513, 1324832, 1495819, 1617236, 1618111, 1502053, 1233803, 954736, 887169, 972719, 1048153, 1100978, 1297048, 1655154, 1838399, 1605304, 1171793, 774469, 320155, -174775, -473108, -472300, -277648, -33528, 177062, 271773, 151083, -71692, -257880, -265974, -69414, 154243, 297492, 358976, 395038, 426527, 418386, 524157, 774597, 1056650, 1406920, 1931218, 2605330, 3300052, 3781536, 3815453, 3503037, 3161649, 2838275, 2358707, 1753250, 1205557, 869233, 878730, 1223956, 1769308, 2300235, 2428409, 2043159, 1593836, 1496063, 1725631, 1961399, 2032604, 2153166, 2395609, 2561838, 2484182, 1985212, 1174229, 485691, 199079, 208261, 263098, 347547]
9947C47547K21019J75451k7867p496K30062M59865N57008O03647N02206j6086
9937C045356o48162q74518p51121n41698l56256k43901k13471k18169k12380k34879
9927a249199k41096j25134O7654J70265K56964M76790M96448L24252L49336M94748
9917A021028N54271M20597K74775J59927j67902n70571p46481n55211l1667M55140
9907H13906O32227N42584L04550M6329o2441N8934J39797O7835K8733J00696J22552
9896B795702P0969m9079k87382o10119p91719o18349k80436k2576L19513N81326
9886A107850M29106P1099j37870j97996k77258m25849m47421j32722L06308M94041
9876G89288M09490K89525R0303k48708m22783l09118j77704j87786j81113p1326
$$ y = [347547, 568566, 744017, 716150, 708654, 938716, 1398581, 1955589, 2559236, 3061442, 3045356, 2397194, 1522676, 771555, 229857, -126399, -370300, -583771, -801940, -1014320, -1249199, -1490295, -1615429, -1547775, -1377510, -1120546, -643756, -147308, 176944, 526280, 1021028, 1575299, 1995896, 2270671, 2430598, 2262696, 1692125, 945644, 390433, 358766, 813906, 1446133, 1988717, 2293267, 2339596, 2277155, 2336089, 2475886, 2543721, 2572454, 2673150, 2795702, 2866671, 2817592, 2530210, 1920091, 1128372, 510023, 229587, 207011, 526524, 1107850, 1536956, 1608055, 1470185, 1272189, 994931, 569082, 121661, -11061, 295247, 789288, 1198778, 1488303, 1578606, 1329898, 907115, 597997, 420293, 232507, 51394, -19932]
9866a9932J36674K98955L46472K85005J50384J36440J06215r5808k79406l15855
9856G49144l49194m30801l85625m7107M39889O90855N95866M18846K19864r2461
9846A809276l23819l88610m60776n70277l39447J75202L98649Q1420l41606m00528
9836c60516j51735J01949J83407J71864J94933K10217J58423K24509L74201L59441
9826A466693J85990K3520k002O2678P0497k2904k9414J25612J23760j03335l09648
9815A591447m10520k67128o2130j7969p5228j86548l24129m15412l16792M6766
9805d37643M50722N39064L88043K18566M5178n6322L8831J14240J08304K42339
9795A651322L19943K26589L3512M711J86231K05963O526k43442l24823k20268
$$ y = [-19932, 116742, 415697, 762169, 1047174, 1197558, 1333998, 1440213, 1344405, 1064999, 749144, 399950, -30851, -416476, -463583, -23694, 667161, 1263027, 1681873, 1901737, 1809276, 1485457, 1096847, 636071, 65794, -273653, -98451, 300198, 381618, 40012, -360516, -512251, -410302, -226895, -55031, 139902, 350119, 508542, 733051, 1107252, 1466693, 1652683, 1676203, 1674201, 1736879, 1807376, 1784472, 1755058, 1880670, 2004430, 1901095, 1591447, 1180927, 913799, 851669, 833700, 758472, 571924, 247795, -167617, -484409, -437643, 13079, 552143, 940186, 1158752, 1203930, 1147608, 1186439, 1300679, 1408983, 1651322, 1971265, 2197854, 2231366, 2236077, 2422308, 2628271, 2634797, 2391355, 2066532, 1846264]
9785A846264k62356m35216n01326l96644p4075J97962J86451P6109m278r9767
9775E33124L8200L70972N61171O24675O28465N44021L87761R7415k65128l41887
9765C178789k44296l79202n95791m36385o8666R9674J16505O1655k6934o0645
9755A644704l2376q6181k77651k10753K2224J03195K57708M93223N04713L88419
9745B807225M44650N60023M91574K58168K7083q6116j41111m01118q98016j163441
9735A898921q43665j65087M0896m59390q06030n06234O6959M26301M67041L74648
9725D94360M38102O37681O41544L15304M9810R8611K58003L65992L75375K56996
9715C931778R2332j30614l20156l58680j51238J32526J35900j4959j9984J74520
$$ y = [1846264, 1583908, 1148692, 647366, 250722, 176647, 374609, 561060, 637169, 632891, 533124, 571324, 942296, 1503467, 2128142, 2756607, 3300628, 3688389, 3785804, 3520676, 3178789, 2934493, 2555291, 1959500, 1523115, 1454449, 1554123, 1670628, 1732283, 1705349, 1644704, 1612328, 1526147, 1248496, 1037743, 1059967, 1163162, 1420870, 1914093, 2418806, 2807225, 3251875, 3811898, 4303472, 4561640, 4588723, 4502607, 4361496, 3960378, 3062362, 1898921, 1055256, 890169, 931065, 471675, -334355, -840589, -773630, -347329, 119712, 494360, 932462, 1570143, 2211687, 2526991, 2576801, 2675412, 2933415, 3299407, 3674782, 3931778, 4024110, 3893496, 3573340, 3214660, 3063422, 3195948, 3331848, 3316889, 3296905, 3471425]
9705C471425L30827J54188k06442n12562n81667l90432j88472q3323j97016m37764
9695A358762n60623m56966l24643k50928J5033M32562O75213O72279M36064k0314
9685A976439k54613J3725M62275N70078K46689n7372j85685l53003l44181p4065
9675B000287O977j10205j80291k46758l23668m38861m72120k72320R0627M27292
9665D80960N78629N46911K76212q5459m0933J96156L00910L00026K74098L75438
9655C202948M53569K74333n695k08061l59383l24137m807K99360L37536J94686
9645C860349O0788j9771m3390q3856k61534k77195M8146K83142J76675j11471
9635C631883l52353m26481l97847l31510k32625j38826j18824j91026k80655k99142
$$ y = [3471425, 3802252, 3956440, 3749998, 3237436, 2655769, 2265337, 2076865, 1993542, 1796526, 1358762, 798139, 341173, 16530, -234398, -219365, 213197, 888410, 1560689, 1996753, 1976439, 1721826, 1735551, 2197826, 2767904, 3014593, 2957221, 2771536, 2418533, 2074352, 2000287, 2007264, 1897059, 1716768, 1470010, 1146342, 707481, 235361, -36959, 53668, 480960, 1059589, 1606500, 1882712, 1797253, 1756320, 1952476, 2253386, 2553412, 2827510, 3202948, 3656517, 3930850, 3925155, 3717094, 3357711, 3033574, 3028767, 3328127, 3665663, 3860349, 3921137, 3901366, 3857976, 3774120, 3512586, 3235391, 3283537, 3566679, 3743354, 3631883, 3279530, 2853049, 2455202, 2123692, 1891067, 1752241, 1633417, 1442391, 1161736, 862594]
9625H62594k05163Q2891M93614O25387M05444J21724n4571j14293K9774K29317
9615B476718L65713L14186j3406k55852l06424l53943l05683j95150j31665o7061
9605A527433j43547l81863l90471Q744L89630N36523O15646O56172M95009J39864
9595C453140j82980n10298q18582r19574o70365j63493J88516J31439q0157j4562
9585D13084K45896K67762J03137J87887L61475K74667J70446K91110L99777L12672
9575C027913Q9286j61646k33941j30935m5628K9256J23600K53882L29000K80252
9565C561039J23519o1039k01275k50405j89514j92922l26545m42897m02865j77158
9555A439938J0773l6864k62855k95514L5502K74854K90868L09006L43249J99912
$$ y = [862594, 657431, 740322, 1233936, 1859323, 2264767, 2386491, 2331920, 2217627, 2247401, 2476718, 2842431, 3156617, 3143211, 2887359, 2580935, 2226992, 1921309, 1726159, 1594494, 1527433, 1383886, 1002023, 611552, 620296, 1009926, 1546449, 2162095, 2818267, 3313276, 3453140, 3270160, 2759862, 1941280, 1021706, 351341, 187848, 376364, 507803, 427646, 413084, 658980, 926742, 1029879, 1217766, 1579241, 1853908, 2024354, 2315464, 2715241, 3027913, 3117199, 2955553, 2721612, 2590677, 2545049, 2574305, 2697905, 2951787, 3280787, 3561039, 3684558, 3623519, 3422244, 3171839, 2982325, 2789403, 2462858, 2019961, 1617096, 1439938, 1450711, 1413847, 1150992, 855478, 890980, 1165834, 1456702, 1765708, 2108957, 2308869]
9545B308869j34572l54023l94701k89784j36032k9128p6560k49582k07601P3641
9535E10527J58214J88317L76287N76246N28502K74126K01825K79167J39715j92590
9525C040336l74718k88796j64925j77111j27579m14N1377O3100K00315L51664
9515B573249L21644J30039m8754n1883j190J1240L1563J24611L41025K58243k61070
9504C428717o13087n24119l21733j36478J16886K95779K70915P9855j17029j53806
9494B325900j43016k39591k43217o5716O4020K79854O00034O17763K25949k86862
9484C135118n63795n01135k74725k75855m82259m88526k22489J39605N27568P17644
9474A711151L59021k12779n04263m60299j38779J85244K93998J37421j48144j44620
$$ y = [2308869, 2174297, 1820274, 1425573, 1135789, 999757, 970629, 894069, 644487, 436886, 510527, 668741, 857058, 1233345, 1809591, 2338093, 2612219, 2814044, 3093211, 3232926, 3040336, 2665618, 2376822, 2211897, 2034786, 1907207, 1906793, 1958170, 2021270, 2221585, 2573249, 2894893, 3024932, 2976178, 2924295, 2923105, 2934345, 2965908, 3090519, 3431544, 3689787, 3428717, 2815630, 2291511, 1969778, 1833300, 1950186, 2245965, 2516880, 2596735, 2479706, 2325900, 2182884, 1943293, 1700076, 1634360, 1698380, 1978234, 2578268, 3196031, 3421980, 3135118, 2571323, 2070188, 1795463, 1519608, 1037349, 548823, 326334, 465939, 993507, 1711151, 2070172, 1857393, 1353130, 892831, 754052, 939296, 1233294, 1370715, 1222571, 1077951]
9464A077951J35110K17837R3419j50296l62993l95113m09322l62734j11270J62878
9454a04533K47548K05152J87672K39841L25051L67473L13781K20403J94554J83213
9444B380155J00613P8870Q2511J45351M08630O78622P24267M23833j04448m78643
9434D439761m68605k13083M12m7429j94386q8424K68543O80549P63375L80571
9424E521284j49065n13038o27084n14855m11776n06730n81944l55076R3040N06689
9414B461445P91369P49978K76408k25407l23334j73726j829J49744J16998j31723
9404C689923k26819n3989J77131K93571K45408P7588o8690l7767L0431j07014
9394D019773l22825k52976m1902R652l2890j57311k93557k95887j08466L9935
$$ y = [1077951, 1213061, 1430898, 1524317, 1374021, 1011028, 615915, 206593, -156141, -267411, -104533, 143015, 348167, 535839, 775680, 1100731, 1468204, 1781985, 2002388, 2196942, 2380155, 2480768, 2559638, 2642149, 2787500, 3196130, 3874752, 4599019, 5022852, 4918404, 4439761, 3971156, 3758073, 3758485, 3711056, 3516670, 3428246, 3696789, 4377338, 5140713, 5521284, 5372219, 4859181, 4232097, 3717242, 3305466, 2798736, 2216792, 1861716, 1954756, 2461445, 3252814, 4002792, 4279200, 4053793, 3730459, 3556733, 3554904, 3704648, 3821646, 3689923, 3463104, 3409115, 3586246, 3879817, 4125225, 4202813, 4134123, 4096356, 4126787, 4019773, 3696948, 3443972, 3402070, 3411722, 3378832, 3221521, 2927964, 2632077, 2523611, 2563546]
9384B563546j62731m39072m65061j74858K22152L66594K17928L8130o0479k47575
9374A858574n87612p23075m00121P6906M05185N04768L27524R9763n0339j82504
9364A329069j49297O2307P8821k77833o11690o04446l47749K3428L31745L80813
9354B15168K31262m5909k18272k88209l70289k73896j6056J74624L18155N22155
9344B48733M76042K87326L30821L84582L04562K45319J89803l557m21899q54685
9334A187047r32766o07988j06965L68908P12315Q09646O17499L00870J72956L15475
9324B836997N38079M98234J99477j38693l24124l95344m87236m48985k42739k01004
9314A834662k48057l5079K62823L77293K51566m6278l47358m84888n44615n84203
$$ y = [2563546, 2400815, 1961743, 1496682, 1321824, 1543976, 1910570, 2128498, 2166628, 2106149, 1858574, 1270962, 547887, 147766, 224672, 629857, 1134625, 1462149, 1561912, 1511573, 1329069, 1179772, 1242079, 1320900, 1043067, 431377, -173069, -520818, -497390, -165645, 215168, 446430, 400521, 182249, -105960, -476249, -750145, -766201, -591577, -273422, 248733, 724775, 1012101, 1342922, 1727504, 2032066, 2277385, 2467188, 2463631, 2041732, 1187047, 254281, -353707, -460672, -91764, 620551, 1430197, 2047696, 2348566, 2521522, 2836997, 3375076, 3873310, 4072787, 3934094, 3609970, 3214626, 2727390, 2278405, 2035666, 1834662, 1586605, 1551526, 1814349, 2191642, 2443208, 2396930, 2049572, 1564684, 1020069, 435866]
9304D35866m57860k01770J64963M55838L94449J66027J04371K41307L43126M07395
9294B053712K68481q3847l53035k69820J7578K01606K06849J37577J7749n2360
9284B144490M1470P2050p2566k50301k43529M5997L37350M67895M62260L22265
9274C327381K48132K56166N3783l05451n76197p00300n78513k79986k2636J86844
9264A609223K04680N2098j70982l15509l13059l66953m64058l87125j14087J15674
9254a50098Q2042r4256r2196P2964J94640K16854L15755N44278P45878Q70646
9244B706507P06292K20172k16145n77035r29171r72621o38337k89955j88822j71394
9234c50509l8818J34714L08663L49937K85197K66211J81238p4181k73146k19178
$$ y = [435866, -21994, -223764, -58801, 397037, 791486, 957513, 1061884, 1303191, 1646317, 2053712, 2322193, 2238346, 1885311, 1615491, 1633069, 1834675, 2041524, 2179101, 2196850, 2144490, 2185960, 2258010, 2185444, 1935143, 1691614, 1737611, 2074961, 2542856, 3005116, 3327381, 3575513, 3831679, 3885462, 3580011, 3003814, 2303514, 1725001, 1445015, 1422379, 1609223, 1813903, 1866001, 1695019, 1379510, 1066451, 699498, 235440, -151685, -265772, -150098, -68056, -162312, -254508, -181544, 13096, 229950, 545705, 1089983, 1835861, 2706507, 3412799, 3632971, 3416826, 2839791, 1910620, 937999, 299662, 9707, -179115, -350509, -389327, -254613, 54050, 403987, 689184, 955395, 1136633, 1062452, 789306, 570128]
9224E70128n9802N3438k6005k29328k05014l1104k2590j33905k70384l93781l27388
9213a075735o5841J30217J66168J95955L59077N42266N27669L83786K54589J66176
9203A584327J573k31789m03502l86848j18539J94180M80714O75224O10679L08586
9193B714605q2761m43782n97661m02326j10386Q5392K84059M45349K89729j9425
9183B162793m3053J15094O3678K5848N6567L4869Q0100K27192K93010J66908j0350
9172C172656Q249K96486L89145M2208k75342k92208k21917j99977m8241J60528
9162C031587K19723R9277j9759L5997L24175O18864P01696M80325M8727k14791
9152E325821l42658n04251o26613p03546o58833m97364m39344m74977m31422j92034
$$ y = [570128, 510326, 563764, 537759, 308431, 103417, 72313, 49723, -84182, -354566, -748347, -1075735, -1141576, -1011359, -845191, -649236, -290159, 252107, 779776, 1163562, 1418151, 1584327, 1585900, 1354111, 950609, 563761, 445222, 639402, 1120116, 1795340, 2406019, 2714605, 2631844, 2188062, 1590401, 1188075, 1077689, 1163081, 1447140, 1892489, 2182218, 2162793, 2119740, 2234834, 2298512, 2324360, 2380927, 2415796, 2495896, 2723088, 3016098, 3183006, 3172656, 3180905, 3477391, 3866536, 3908744, 3633402, 3341194, 3119277, 2919300, 2871059, 3031587, 3251310, 3350587, 3330828, 3366825, 3691000, 4309864, 5011560, 5491885, 5540612, 5325821, 4983163, 4478912, 3852299, 3148753, 2489920, 1992556, 1553212, 1078235, 646813, 454779]
9142D54779O1726K12952K83929J24266j95435k11252J72143O88028R23207Q19125
9132C333468O26993L44525O1789j15837k91085l35235k59855k88624l25533k87334
9122B463272k64846l68594o13903p30491n12690j77301O6569J50572K29991L39225
9112E81804K07312j24301j68023M3295j5242l00118m89379m47763k53613m575
9102i70603K66575M04177K84835J43428J92373K24491J01780m2336j24504k00309
9092B79907j97228j9338J83482K91227L06703K57765K46726J08735k66929n51710
9082F39340m90545j86588Q1395R7618Q810R0369K31076J04087j60736j21865K83522
9071E76483P36299P66219L74220J21436K11724L62107L82184J99971j2429l1687
$$ y = [454779, 516505, 729457, 1013386, 1137652, 942217, 730965, 903108, 1591136, 2514343, 3333468, 3960461, 4304986, 4366775, 4250938, 3959853, 3624618, 3364763, 3076139, 2750606, 2463272, 2198426, 1829832, 1215929, 485438, -27252, -204553, -137984, 12588, 242579, 581804, 789116, 664815, 496792, 540087, 524845, 224727, -264652, -712415, -966028, -970603, -704028, -299851, -15016, 128412, 320785, 545276, 647056, 604720, 480216, 279907, 82679, 63341, 246823, 538050, 844753, 1102518, 1349244, 1457979, 1191050, 639340, 148795, -37793, 43602, 141220, 150030, 240399, 471475, 575562, 414826, 292961, 576483, 1312782, 2079001, 2453221, 2574657, 2786381, 3148488, 3530672, 3730643, 3718214, 3686527]
9061C686527K8841r6514l26826m89053n74157n21155k77746m7657J0126q4043
9051A308343k27682l49236l58844j36097J55509J89796J30998J43974k1338k64039
9041E71384k66411o2080J03523J06680j1308J4260J64810K1960k65488l54270
9031B3060k51732l1939K47446M09272L46869J41645O9005K01894L24131K44887
9021A724538M2945o5706j09611p2096j58425l38342l00514j5108K62085K70014
9011A239780J52015K88515N77468O04212K09476l34728o86112o49755l49088r1802
9001I59981L0951m1186j99536k84809k30604j16468K5351J64893L83489N65772
8991A257834N18343M46489M04826L78992L73053M07370M84882M41322K93038K17209
$$ y = [3686527, 3715368, 3618854, 3292028, 2802975, 2228818, 1707663, 1429917, 1382260, 1392386, 1308343, 1080661, 731425, 372581, 236484, 391993, 581789, 712787, 856761, 835423, 571384, 304973, 242893, 346416, 453096, 441788, 456048, 620858, 642818, 377330, 23060, -228672, -260611, -13165, 396107, 742976, 884621, 953626, 1155520, 1479651, 1724538, 1767483, 1701777, 1592166, 1520070, 1361645, 1023303, 722789, 707681, 969766, 1239780, 1391795, 1680310, 2257778, 2861990, 3071466, 2736738, 2050626, 1400871, 1051783, 959981, 990932, 949746, 750210, 465401, 234797, 118329, 143680, 308573, 692062, 1257834, 1776177, 2222666, 2627492, 3006484, 3379537, 3786907, 4271789, 4713111, 5006149, 5223358]
8981E223358N3749k33781n31187o73953o97590p79781q02389m94697J79558P23140
8971A966427P96675N04324J30911J27287N28203P35383O30145L56911l7092l62187
8961E376987m82406j80559L12938L92262O3721l39351o06258o80637n36924k08606
8951C111167J09650K04467L8469j88070l77693m43355k65687l6341O1419j16994
8941B097032l72978l87862l10433l05478j86237J07337M64910P38846P68716O35134
8931C248987N02164K84471j46381n11123n40101k75279J17508L54557K32287O4741
8921C331831L2983q8873k30584m28287p12173p62226m55219L677L33568M66577
8911A491274L87030J75055m0776j40493m357M9285j90301m30148m04869m3739
$$ y = [5223358, 5277107, 5043326, 4512139, 3838186, 3140596, 2360815, 1558426, 1063729, 1243287, 1966427, 2763102, 3267426, 3398337, 3525624, 4053827, 4789210, 5419355, 5776266, 5739174, 5376987, 4894581, 4714022, 5026960, 5419222, 5482943, 5143592, 4537334, 3856697, 3319773, 3111167, 3220817, 3425284, 3463753, 3275683, 2897990, 2454635, 2188948, 2152607, 2214026, 2097032, 1724054, 1336192, 1025759, 720281, 534044, 641381, 1106291, 1845137, 2613853, 3248987, 3751151, 4035622, 3889241, 3378118, 2838017, 2562738, 2680246, 3034803, 3267090, 3331831, 3364814, 3275941, 3045357, 2617070, 1904897, 1142671, 687452, 691129, 1024697, 1491274, 1878304, 2053359, 2012583, 1872090, 1867733, 1917018, 1726717, 1296569, 891700, 847961]
8901H47961N31063R45964R28091N61672L11438K30715J35005K3465r5837J9840
8891D439377L07543N04196N12345J82365l87987q95546j178916j143293j010885
8882A329199r26149o97267j58616L90162N73815L89177J89381Q2617M0254J18042
8872A330615J83199O5996j65460j23023J11395O0043k01609j40963K39915M55755
8862A815863M68804L62567J18266l915J5131J3705o1327j87363k85633k72995
8852A983103l32078n51182m96727o9834L72907O85392P40556M62264K00241J34755
8842C129397l9071k13697j24369J10259K23480R9182J0471J28349J28615k48156
8832C204460p36650r26250p03721k56475J59491L48384M02126M43194M22868K93247
$$ y = [847961, 1379024, 2324988, 3253079, 3814751, 4126189, 4356904, 4491909, 4515374, 4419537, 4439377, 4746920, 5251116, 5763461, 5945826, 5557839, 4662293, 3483377, 2340084, 1329199, 403050, -294217, -452833, -62671, 511144, 900321, 1089702, 1172319, 1212573, 1330615, 1513814, 1579810, 1414350, 1291327, 1402722, 1462765, 1261156, 1120193, 1360108, 1815863, 2284667, 2647234, 2765500, 2761585, 2776716, 2790421, 2729094, 2541731, 2256098, 1983103, 1651025, 1099843, 603116, 533282, 906189, 1591581, 2332137, 2794401, 2994642, 3129397, 3090326, 2876629, 2752260, 2862519, 3085999, 3185181, 3195652, 3324001, 3452616, 3204460, 2467810, 1541560, 837839, 581364, 740855, 1089239, 1491365, 1934559, 2357427, 2650674]
8822B650674K05630J13441o1577j94155k23964q6048K17697L57966J49044k79484
8812B849224o80738o77594l45827Q297L27150M05425K43083J36407J22990P3149
8802B461566K8148l1878q4678L7415J67608j8326l67975m82825l22281j01980
8792A284794J58808M51669N26848M55641L37967J05495j60575l53297l82887k44998
8782B179465o8789j4776o5324q6317j20648j25528l4127k0020j31602k88004l99596
8771H24734k95026l9252K19521L74064L87769L05807J00036j29676l11324j86281
8761A250372K27421M94137N75367N37542L56269R4408j69280n17621q42304r23436
8751A082875o65636k36309J15602L54874M62336L55904J00006o4208N3767K49614
$$ y = [2650674, 2856304, 2969745, 2908168, 2714013, 2490049, 2404001, 2621698, 2979664, 3128708, 2849224, 2168486, 1490892, 1145065, 1153362, 1480512, 1885937, 2129020, 2265427, 2388417, 2461566, 2489714, 2457836, 2373158, 2410573, 2578181, 2559855, 2191880, 1709055, 1386774, 1284794, 1443602, 1895271, 2422119, 2877760, 3215727, 3321222, 3160647, 2807350, 2424463, 2179465, 2110676, 2095900, 2030576, 1944259, 1823611, 1698083, 1663956, 1643936, 1512334, 1224330, 824734, 529708, 490456, 709977, 1084041, 1471810, 1777617, 1877653, 1747977, 1436653, 1250372, 1477793, 1971930, 2547297, 3084839, 3441108, 3535516, 3366236, 2848615, 2006311, 1082875, 417239, 180930, 296532, 651406, 1113742, 1469646, 1569652, 1505444, 1559211, 1808825]
8741A808825K01865P1107N0698J76503M41420O77309O63133M71707K99343M7192
8731D909102j80124l99120o64078p08531m28317M1171L63471M19990L73016K97466
8721D024046K28323J67303m9040k91475k14188J06297L54044L54043J41499m4433
8711D776419j75966k72595k11431j47000k25721k85673k64365l60875n87514p17489
8701A527790o23183l38431N5191L46500L67572K43136J13529M9001j5673n4527
8691A670905L7950J77823K47598J78591R6285J01621K13764L72200N18208M34393
8681D049338J329m27054m14384k0147J95825J27431J80819M22632M69356K28408
8671D813553m085o3679P5831K50088J66428j731o3365j34348j96637k34596k48389
$$ y = [1808825, 2010690, 2081797, 2132495, 2308998, 2750418, 3427727, 4090860, 4562567, 4861910, 4909102, 4728978, 4329858, 3665780, 2957249, 2528932, 2570103, 2933574, 3353564, 3726580, 4024046, 4252369, 4419672, 4370632, 4079157, 3864969, 3971266, 4325310, 4679353, 4820852, 4776419, 4600453, 4327858, 4116427, 3969427, 3743706, 3458033, 3193668, 2832793, 2245279, 1527790, 904607, 566176, 621367, 967867, 1335439, 1578575, 1692104, 1741105, 1725432, 1670905, 1708855, 1886678, 2134276, 2312867, 2409152, 2510773, 2724537, 3096737, 3614945, 4049338, 4050667, 3623613, 3209229, 3189082, 3384907, 3512338, 3693157, 4115789, 4585145, 4813553, 4809468, 4745789, 4821620, 5071708, 5238136, 5236405, 5173040, 5038692, 4842055, 4607459, 4359070]
8660D359070l17795n57172q45076r21690n13521J10309L47790L62949L84004J08878
8650B517746k25087l15850k53135K0353L66444M61214L43451J24270K1613K06171
8640C267190M04491L80161K00259Q2270J23831J76839J82329L33833O07005P64734
8630F522942O17117J63165l33397n22504l67084j98590n1326n0134k76725m09949
8620E093515l70990l57815l22061j41888J5804j7726m520J51443J89890J54625
8610D390277J74891K44999K97478K59819K32568K22283Q4009J9841J16381J43163
8600F185709J67474K16059J68824R0869J21976K73080M29651M58996M58395L87986
8590H959019J40674J1048K02720M36217M61136M73164N93146P34363R00411R98426
$$ y = [4359070, 4041275, 3484103, 2639027, 1717337, 1203816, 1314125, 1661915, 2024864, 2408868, 2517746, 2292659, 1976809, 1723674, 1744027, 2110471, 2571685, 2915136, 3039406, 3061019, 3267190, 3671681, 4051842, 4252101, 4334371, 4458202, 4635041, 4817370, 5151203, 5758208, 6522942, 7140059, 7303224, 6969827, 6447323, 6080239, 5881649, 5830323, 5780189, 5503464, 5093515, 4722525, 4364710, 4042649, 3900761, 3916565, 3898839, 3894319, 4045762, 4235652, 4390277, 4565168, 4810167, 5107645, 5367464, 5600032, 5822315, 5906324, 5926165, 6042546, 6185709, 6353183, 6569242, 6738066, 6828935, 6950911, 7223991, 7653642, 8112638, 8571033, 8959019, 9099693, 9110741, 9313461, 9749678, 10210814, 10683978, 11277124, 12011487, 12911898, 13910324]
8580A3910324J101670J191538J124750R32029P76160P01552O69428Q98781J306457
8571B2612689J599206J843686K189172K674199L184078L377551L448349L652941
8563D4581871L830455M073866M494402N019329N429281N462308M885548L596276
8555H1373336J721039l58453k143413l478565m406346n047317n491987n634142
8547E6534152n312841m767034m191468l670012l163944k554521j996255j791158
8539B9086919k009975k108485j782526j316512j031976r65147q98971q21539q59944
8530A7291844q27240p27308q61030j087140j102676q13039k31091L10886M66556
8521A2419762K29458l42728p64234p00573m44936k81810l50365o44342q49975
$$ y = [13910324, 15011994, 16203532, 17328282, 18260311, 19036471, 19738023, 20407451, 21306232, 22612689, 24211895, 26055581, 28244753, 30918952, 34103030, 37480581, 40928930, 44581871, 48412326, 52486192, 56980594, 61999923, 67429204, 72891512, 77777060, 81373336, 83094375, 82735922, 80592509, 77113944, 72707598, 67660281, 62168294, 56534152, 51221311, 46454277, 42262809, 38592797, 35428853, 32874332, 30878077, 29086919, 27076944, 24968459, 23185933, 21869421, 20837445, 19872298, 18973327, 18151788, 17291844, 16464604, 15737296, 14876266, 13789126, 12686450, 11873411, 11642320, 11953206, 12419762, 12649220, 12306492, 11542258, 10841685, 10396749, 10114939, 9764574, 9120232, 8270257]
8512H270257q17123n21868j18008K73559O00359P15369M79635k9077n66749p39447
8502G546907m90106k07218k8743J11759K92521L95931K34077q3597j59222p3685
8492G538624r9087j84281l09116m60128n41914n96706o50880o05677m55400k56263
8482C379172M0540M43720O34074L89741K1938r1418J08396L00060K38993M8352
8472E513568q7683l3250J13038L1616k25271k88883k51049m09151n02997k91583
8462C568355j2999P4798L7108L9651J95308K23899l5460k13021m8429K75957L45274
8451D450441J12911j3619J18312J98953N2090k13807n49183q27039p63117l94525
8441B171417l2655J90023K53729K62217M33780N84702L18975K1747J39900L68764
$$ y = [8270257, 7453134, 6931266, 6813258, 7086817, 7687176, 8402545, 8882180, 8853103, 8286354, 7546907, 7056801, 6849583, 6820840, 6932599, 7225120, 7621051, 7855128, 7771531, 7612309, 7538624, 7439537, 7255256, 6946140, 6486012, 5944098, 5347392, 4696512, 4090835, 3635435, 3379172, 3419712, 3863432, 4497506, 4887247, 4909185, 4817767, 4926163, 5226223, 5465216, 5513568, 5425885, 5392635, 5505673, 5537289, 5312018, 5023135, 4772086, 4362935, 3859938, 3568355, 3555356, 3630154, 3667262, 3706913, 3902221, 4126120, 4090660, 3877639, 3829210, 4105167, 4450441, 4563352, 4549733, 4668045, 4866998, 4919088, 4705281, 4156098, 3329059, 2565942, 2171417, 2138762, 2328785, 2582514, 2844731, 3278511, 3863213, 4182188, 4203935, 4343835, 4712599]
8431D712599L64022J28301l2862n8328J8408K39896M38848M94348L79615J90736
8421F875583J11343N5966n4401k02487l61104m55150m55653n97611p71523n66884
8411C578079j46924M8999J13946L58786N45321M53694M35073M33088K41509P9551
8401F141122k2063j49351l33003m57194l68472j59623L1171K43027M77570N42104
8391E945288M25328J19510j67806j47504L5612M9690p083J4625L9166k3138j34558
8380F149130j24269L5968J69202J02715o3979l11961n12813l98617p4705J46651
8370E117322K04367K34121J12943j54739l24635j46075K88805N61697N45053N28054
8360F966913N14377M14700M79939O81317M61113k1950k43466k08526j56855k25169
$$ y = [4712599, 5076621, 5204922, 5172060, 5113732, 5132140, 5372036, 5810884, 6305232, 6684847, 6875583, 6986926, 7042892, 6988491, 6786004, 6424900, 5969750, 5514097, 4916486, 4144963, 3578079, 3431155, 3480154, 3594100, 3952886, 4498207, 4951901, 5386974, 5820062, 6061571, 6141122, 6119059, 5969708, 5636705, 5179511, 4811039, 4651416, 4682587, 4925614, 5403184, 5945288, 6370616, 6490126, 6322320, 6174816, 6210428, 6260118, 6253035, 6267660, 6306826, 6283688, 6149130, 6024861, 6060829, 6230031, 6332746, 6268767, 5956806, 5443993, 5045376, 4970671, 5117322, 5321689, 5555810, 5668753, 5514014, 5189379, 5043304, 5332109, 5893806, 6438859, 6966913, 7481290, 7895990, 8375929, 9057246, 9518359, 9496409, 9252943, 9044417, 8887562, 8662393]
8350H662393j83398K0753L38137N54379M46080Q9291j67901k1159M85283Q84055
8340A1107913Q85730P15007N98030O06731P96676Q86710P43379N26484K53290
8331A7119950l9926k5051K43233M13438M78805N65067N22943L58490L67323O70460
8321B0674732R76919J229583J446158J496182J556151J790303K048560K336526
8313C3555114K750925L281952L716283L953431M078637M032703L692430L010497
8305F2071972K070048R74304j33644j095506j899317k510072k996073l387925
8297E3093787l580542l555245l354165l070316k741603k115898j256663n67594
8289C2851761q2034J40837M6241j23831k77742m70249o94755o32208j85364K24702
$$ y = [8662393, 8478995, 8499748, 8837885, 9392264, 9838344, 9927635, 9759734, 9738575, 10223858, 11107913, 11993643, 12708650, 13306680, 13913411, 14710087, 15596797, 16340176, 16866660, 17119950, 17080024, 17054973, 17298206, 17711644, 18190449, 18755516, 19278459, 19636949, 20004272, 20674732, 21651651, 22881234, 24327392, 25823574, 27379725, 29170028, 31218588, 33555114, 36306039, 39587991, 43304274, 47257705, 51336342, 55369045, 59061475, 62071972, 64142020, 65116324, 64982680, 63887174, 61987857, 59477785, 56481712, 53093787, 49513245, 45958000, 42603835, 39533519, 36791916, 34676018, 33419355, 32851761, 32769727, 32910564, 32956805, 32832974, 32555232, 32084983, 31390228, 30758020, 30572656, 30797358]
8279C0797358K99522K00180K45977N06952Q16695J039822J077315R73424J049762
8270C7007007J401841J683820J601196J438599J501415J842574K409586K935522
8262E1821560L348692L874648M503855N112961N774194O748066Q199930R785311
8254I9169217J0960987J1597291J1898929J1877397J1017739R049103O220090
8247A71790753K889911o70529m106173p015138r200463j0722308j1512450j1372116
8239A20081487j0374605q889906p421903o282309n461665m570628l540421k743377
8231G0796673k347131k026484j591661j183277j019243j080279j018300p17341
8223E9812957m87480n37574o20786m91892j34188L93256Q52418J181232J489922
$$ y = [30797358, 31096880, 31297060, 31543037, 32049989, 32866684, 33906506, 34983821, 35957245, 37007007, 38408848, 40092668, 41693864, 43132463, 44633878, 46476452, 48886038, 51821560, 55170252, 59044900, 63548755, 68661716, 74435910, 81183976, 89383906, 99169217, 110130204, 121727495, 133626424, 145503821, 156521560, 165570663, 171790753, 174680664, 174010135, 169903962, 162888824, 153688361, 142966053, 131453603, 120081487, 109706882, 100816976, 93395073, 87112764, 81651099, 77080471, 73540050, 70796673, 68449542, 66423058, 64831397, 63648120, 62628877, 61548598, 60530298, 59812957, 59325477, 58787903, 58167117, 57675225, 57541037, 57934293, 58786711, 59967943, 61457865]
8214F1457865J728343J915775K300837K815793L168650L435310L834871M619281
8206H5276725N681265O732927P766937Q940138J0267406J1884335J3703722J5519557
8198A65773012J7473882J9659564K1714353K3051311K3237241K2081329J9360463
8191C12351155J4910096Q913542J991857n273671j2172457j7751940k1339415
8184B81629167k2853144k2731791k1559364j9819746j7807584j5532956j3069110
8177A48255472j0813928q988617p509812o306421n264675m335507l512358k959746
8169I8564408k873089l023126k979200k552357k035615j617083j215134q27892
8161H1440912n32325l06261j24874j5848K35717Q64045J819172K808170L435152
$$ y = [61457865, 63186208, 65101983, 67402820, 70218613, 73387263, 76822573, 80657444, 85276725, 90957990, 97690917, 105457854, 114397992, 124665398, 136549733, 150253455, 165773012, 183246894, 202906458, 224620811, 247672122, 270909363, 292990692, 312351155, 327261251, 336174793, 338166650, 332892979, 320720522, 302968582, 281629167, 258776023, 236044232, 214484868, 194665122, 176857538, 161324582, 148255472, 137441544, 128452927, 120943115, 114636694, 109372019, 105036512, 101524154, 98564408, 95691319, 92668193, 89688993, 87136636, 85101021, 83483938, 82268804, 81440912, 80908587, 80602326, 80477452, 80461604, 80697321, 81561366, 83380538, 86188708, 89623860]
8152H9623860L788142M318279N099031N992483P013380Q137431R420107J0894981
8144A44287694J2560126J4427053J6350229J8712641K1599048K4272546K6081592
8137B78290929K6677529K5834524K3245878J8712640J2289020M368798m224199
8130C85195119j2354976j9044648k3803425k6509840k7305810k6468307k4567794
8123B25140319k2336402j9954326j7280567j4531265j2027380j0098709q768652
8116A20143018p574711o384092n345130m329869l327318k642007k485867k726979
8108H5327045k984171k826145k203076j620084j358235j050915m85119J09856
8100G2909156N45825R43062J464269J996708K460989K852319L275346L909981
$$ y = [89623860, 93412002, 97730281, 102829312, 108821795, 115835175, 123972606, 133392713, 144287694, 156847820, 171274873, 187625102, 206337743, 227936791, 252209337, 278290929, 304968458, 330802982, 354048860, 372761500, 385050520, 389419318, 385195119, 372840143, 353795495, 329992070, 303482230, 276176420, 249708113, 225140319, 202803917, 182849591, 165569024, 151037759, 139010379, 128911670, 120143018, 112568307, 106184215, 100839085, 96509216, 93181898, 90539891, 88054024, 85327045, 82342874, 79516729, 77313653, 75693569, 74335334, 73284419, 72799300, 72909156, 73454981, 74398043, 75862312, 77859020, 80320009, 83172328, 86447674, 90357655]
8092I0357655M691483N538730O477701P402593Q452748J0003370J1914686J3753433
8084A58592399J5611475J7561212J9425869K0946461K1819094K1618213K0007622
8077B95582345J6943990J2264156O041939j104286q347943j4716236j9375029
8070B87288936k2264217k3587058k3424076k2163534k0313103j8110965j5771157
8063A41654826j3599331j1515670r479566p801660o606334n835982n404778m953438
8055G6458067m303400l606572l110227k856013k676233k379102j990056j718104
8047E3818360j551030j396248j231103q74567j68514O20561J109489J222176J094000
8038E2643124J042390J094442J217679J492118J886937K362701K925628L635951
$$ y = [90357655, 95049138, 100587868, 107065569, 114468162, 122920910, 132924280, 144838966, 158592399, 174203874, 191765086, 211190955, 232137416, 253956510, 275574723, 295582345, 312526335, 324790491, 330832430, 329728144, 321380201, 306663965, 287288936, 265024719, 241437661, 218013585, 195850051, 175536948, 157425983, 141654826, 128055495, 116539825, 107060259, 99258599, 92652265, 86816283, 81411505, 76458067, 72154667, 68548095, 65437868, 62581855, 59905622, 57526520, 55536464, 53818360, 52267330, 50871082, 49639979, 48765412, 48596898, 49217459, 50326948, 51549124, 52643124, 53685514, 54779956, 55997635, 57489753, 59376690, 61739391, 64665019, 68300970]
8030F8300970M488648N499650O568502P596024Q544461R441848J0357342J1085236
8022A31882681J1236675J0603178R094405O679437L521601N1151l227173o112927
8014A63729028q580132j0317825j1215077j1442119j1081409j0460799r788675
8007I0842992q855247p704532o450572n192209m228289l683946l321853k908605
7999D8497739k387203j745944j182703r10433p31855l50689M4114L98252Q96755
7990D2528033J393477J741872J908241K037061K258837K683968L224999L764016
7982F1540504M362752M948868N461497N903201O209752O259547N747587M493207
7974A04926915K829757J117334n06928j731479k477957k871811k715892k029116
$$ y = [68300970, 72789618, 78289268, 84857770, 92453794, 100998255, 110440103, 120797445, 131882681, 143119356, 153722534, 162816939, 169496376, 173017977, 173069128, 169841955, 163729028, 155148896, 144831071, 133615994, 122173875, 111092466, 100631667, 90842992, 81987745, 74283213, 67832641, 62640432, 58412143, 54728197, 51406344, 48497739, 46110536, 44364592, 43181889, 42271456, 41539601, 41188912, 41233026, 41631278, 42528033, 43921510, 45663382, 47571623, 49608684, 51867521, 54551489, 57776488, 61540504, 65903256, 70852124, 76313621, 82216822, 88426574, 94686121, 100433708, 104926915, 107756672, 108874006, 108367078, 106635599, 104157642, 101285831, 98569939, 96540823]
7966I6540823j405237j242877j306440j405508j683153k188964k773647l320886
7958H1214111l919585m581410n156702n488145n371335m869420m335152l871706
7950D3620656l429682l009842k666199k622690k693480k467259j997693j600718
7942B3133093j406329j316970j239081j117972r13257p06894p44424q29219p11493
7933A4147454o28221o37394o08110m53351j38363K05753L79530L92861K65414
7924A2925573M913k26007k87084k34466l12765m62589o21681p97790q11759n59275
7914H617070k99041k03461j65832m2028K74986N20401K97282k35249o05252p16843
7904G442033p40984o08042j86300L08737N69959N10640L54945L54440M55989N05645
$$ y = [96540823, 95135586, 93892709, 92586269, 91180761, 89497608, 87308644, 84534997, 81214111, 77294526, 72713116, 67556414, 62068269, 56696934, 51827514, 47492362, 43620656, 40190974, 37181132, 34514933, 31892243, 29198763, 26731504, 24733811, 23133093, 21726764, 20409794, 19170713, 18052741, 17139484, 16432590, 15688166, 14858947, 14147454, 13519233, 12881839, 12273729, 11820378, 11682015, 11887768, 12267298, 12660159, 12925573, 12930486, 12704479, 12417395, 12182929, 11870164, 11407575, 10785894, 9988104, 9176345, 8617070, 8318029, 8114568, 7948736, 7906708, 8181694, 8702095, 8999377, 8764128, 8158876, 7442033, 6701049, 6093007, 5906707, 6215444, 6785403, 7296043, 7650988, 8005428, 8461417, 8967062]
7894H967062M98073K79908j05260m21505n71406n66331l86597p7784R7264M5877
7884G759301j01965j76515k05680k17645J0551L00571M58567N27478L80221K53322
7874H988206L34717M17894L86167K41816O8737o8450L802K64883N04307O40728
7864A1782807N25344K85823K09745K67789K70845K38271K22420J44736N5527R0770
7854A4094077J08531N6324R6981J50782R3060r5311k39950j05891K50261N85204
7844A4994068P31403P79962Q65710P51121M50952K51592K48387N19672Q54384
7835B0447251R26055R27455J036288J207217J475026J618818J384830R79269Q27771
7826C0829980J233746J907627K326798K395966K367605K553041L002069L465346
$$ y = [8967062, 9465135, 9745043, 9639783, 9218278, 8646872, 8080541, 7693944, 7616160, 7713424, 7759301, 7657336, 7480821, 7275141, 7057496, 7068047, 7368618, 7827185, 8354663, 8734884, 8988206, 9322923, 9740817, 10126984, 10368800, 10437537, 10369087, 10372889, 10637772, 11142079, 11782807, 12308151, 12593974, 12803719, 13071508, 13342353, 13580624, 13803044, 13947780, 14003307, 14094077, 14202608, 14258932, 14355913, 14506695, 14599755, 14504444, 14264494, 14158603, 14408864, 14994068, 15725471, 16505433, 17371143, 18122264, 18573216, 18824808, 19073195, 19592867, 20447251, 21373306, 22300761, 23337049, 24544266, 26019292, 27638110, 29022940, 30002209, 30829980, 32063726, 33971353, 36298151, 38694117, 41061722, 43614763, 46616832, 50082178]
7818E0082178L812123M121252M521956N091180N582882N785114N975083O513308
7810I1485076P489643Q747077J0030917J1288472J2548907J3538728J3953224
7803A69082044J3665750J2548359J0548367P631490L800570p11745n260917r159678
7795B02144240j1963747j3697627j4531922j4334926j3502243j2671232j1831042
7788A09611501j0784188r523955q213716p074721o220701n588926n121718m640160
7780E2443416l981816l310406k742361k339810k111259k039293k062271k156382
7772C1699818k256113k183986j843008j369523j026694q83162p13668m69708m39408
7763B0514548o25249p90147p82392o47124n47109n80231n06924j90222J17343
$$ y = [50082178, 53894301, 58015553, 62537509, 67628689, 73211571, 78996685, 84971768, 91485076, 98974719, 107721796, 117752713, 129041185, 141590092, 155128820, 169082044, 182747794, 195296153, 205844520, 213476010, 217276580, 216564835, 211303918, 202144240, 190180493, 176482866, 161950944, 147616018, 134113775, 121442543, 109611501, 98827313, 89303358, 81089642, 74014921, 67794220, 62205294, 57083576, 52443416, 48461600, 45151194, 42408833, 40069023, 37957764, 35918471, 33856200, 31699818, 29443705, 27259719, 25416711, 24047188, 23020494, 22137332, 21423664, 20953956, 20514548, 19889299, 19099152, 18316760, 17669636, 17122527, 16542296, 16035372, 15845150, 15962493]
7754A5962493J40355k16250n59803n73143m52700l28516k76628k78409k16912
7745A3200487k33036m41219n73092m70904l67527m02173l96621k08299p9477k30115
7735I798024n14491o29573n40771m80997m40370m06541m66049l92795k13593j82638
7725E530206j77154r4158p5129j32786k73817m09491n32117n49366l99358n5788
7715B831042L45251M04947K24478O5216o9610l94992o48700n70892l14310m3138
7705A829292J01500J66009L12650N82832O16804L24154J31397J33665J02973j07986
7695D193290l09450k65707j50059o5487R8459L39992O42680Q66892P26301L58110
7685F435021R6843p3964j60413k5124J48139K15834J02166m4165p0284k85775
$$ y = [15962493, 16102848, 15886598, 15326795, 14753652, 14300952, 13972436, 13695808, 13417399, 13200487, 12967451, 12526232, 11953140, 11482236, 11114709, 10712536, 10315915, 10107616, 10028139, 9798024, 9283533, 8653960, 8113189, 7632192, 7191822, 6785281, 6319232, 5926437, 5712844, 5530206, 5353052, 5258894, 5183765, 5050979, 4777162, 4367671, 3835554, 3286188, 2886830, 2831042, 3176293, 3581240, 3805718, 3870934, 3801324, 3406332, 2757632, 2186740, 1872430, 1829292, 1930792, 2096801, 2409451, 2992283, 3609087, 3933241, 4064638, 4198303, 4301276, 4193290, 3883840, 3618133, 3468074, 3402587, 3501046, 3841038, 4483718, 5350610, 6076911, 6435021, 6531864, 6457900, 6297487, 6272363, 6420502, 6636336, 6738502, 6694337, 6624053, 6338278]
7675F338278o83039r33563q69472n64449l67650m23012m73942k36576K88140O48693
7665B723408O15894M29197J83066j12790l20101k38076J41068M45182L49177r864
7655D206161l64591m73061k04334R3877J95395J90342J26117J73333L72067N15884
7645D831190M78958K92368l70j58484j10932J4006Q1281J7301j1418M1928J10354
7634E586182R9854N5654l9610j45260J5536J50948q3358k64988l2591L61304O14366
7623F318037P27099O42690L73918j09061n78178p98061p55559m00194q7556j02595
7613E230540j26978K67077Q04787P77674K39996j76890l19587l47769k53977O0485
7603F155358L61861N72165Q19295P98325L98241K57408N93596P83382O36918N31688
$$ y = [6338278, 5655239, 4721676, 3852204, 3287755, 2920105, 2497093, 2023151, 1786575, 2074715, 2723408, 3339302, 3768499, 3951565, 3838775, 3518674, 3280598, 3421666, 3866848, 4216025, 4206161, 3841570, 3368509, 3164175, 3258052, 3453447, 3643789, 3769906, 3943239, 4315306, 4831190, 5310148, 5602516, 5602146, 5443662, 5332730, 5346736, 5428017, 5445318, 5433900, 5475828, 5586182, 5686036, 5741690, 5702080, 5556820, 5572356, 5723304, 5639946, 5374958, 5342367, 5703671, 6318037, 7045136, 7687826, 8061744, 7952683, 7374505, 6576444, 5820885, 5420691, 5333135, 5230540, 5103562, 5370639, 6175426, 6953100, 7193096, 7016206, 6696619, 6348850, 6094873, 6155358, 6517219, 7089384, 7908679, 8707004, 9105245, 9362653, 9956249, 10739631, 11376549, 11908237]
7593A1908237O23965O26196N50528N36231N46530N10913L69873K53074M56329
7584A6381876Q78684R68267N16348l8965j55516Q9515L15449M77694O60424Q73851
7574B0967627J070113J099873J141570J327299J477655J501615J614063J676197
7566C1876012J537435J517922J679423J918440K247587K687601L058928L419825
7558D9943173L901689M377931M858404N372211N754848O173423O638876P174857
7550I4195412Q039221R160801J0438455J1541343J2059295J2150696J1874231
7543A69459454J0994444R458164P161314M206379P98149k853603o214126q891763
7535A84118412j0931596j2302839j2842223j2605569j1963931j1232728j0293134
$$ y = [11908237, 12532202, 13158398, 13708926, 14245157, 14791687, 15302600, 15672473, 15925547, 16381876, 17260560, 18228827, 18745175, 18706210, 18550694, 18640209, 18955658, 19433352, 20093776, 20967627, 22037740, 23137613, 24279183, 25606482, 27084137, 28585752, 30199815, 31876012, 33413447, 34931369, 36610792, 38529232, 40776819, 43464420, 46523348, 49943173, 53844862, 58222793, 63081197, 68453408, 74208256, 80381679, 87020555, 94195412, 102234633, 111395434, 121833889, 133375232, 145434527, 157585223, 169459454, 180453898, 189912062, 197073376, 201279755, 202077904, 199224301, 193010175, 184118412, 173186816, 160883977, 148041754, 135436185, 123472254, 112239526, 101946392]
7528A01946392r230893q257825p321008o443368n721092n171599m701024m251476
7520E0848107l717931l119061k860249k869152k665246k186230j679784j261358
7512C0489096j067818j100295j267934j423748j402886j256623r67033o99652
7504B1303107o26102n27313l53534k87969l01603k88827k41340j84992j24609
7495A8366818l01447p10424r63433q96787o94726m73901l19610l97665n72947
7486A3035878n65903l79724k00090r0157L0908O9425n4786j77245l27263n20610
7476A0820433m59681k32685j77596j85888N4359L73287L94274J32297j72719k34657
7466A0311424k87571n44151o45348m97868l78247m24565m19027k41161j17948
$$ y = [101946392, 92715499, 84457674, 77136666, 70693298, 64972206, 59800607, 55099583, 50848107, 47130176, 44011115, 41150866, 38281714, 35616468, 33430238, 31750454, 30489096, 29421278, 28320983, 27053049, 25629301, 24226415, 22969792, 22002759, 21303107, 20677005, 20149692, 19796158, 19508189, 19206586, 18917759, 18676419, 18491427, 18366818, 18065371, 17354947, 16391514, 15494727, 14800001, 14326100, 14006490, 13608825, 13035878, 12469975, 12090251, 11890161, 11800004, 11830912, 11900337, 11845551, 11668306, 11341043, 10820433, 10360752, 10128067, 9950471, 9764583, 9818942, 10192229, 10586503, 10718800, 10546081, 10311424, 10023853, 9479702, 8834354, 8336486, 7958239, 7533674, 7114647, 6873486, 6755538]
7457F755538j65152l02398n91734q57427p45953m04942k60602k57841k40124l18839
7447B610526k61350j46476j30270n014K79927M82908L73163K65469K78072J95423
7437C942378J51663J50356k1472k99080m79369m02389j22763R9039J65477K61299
7427C445139L91876J84011j26879j51456L353P0373r2953k05996l416J30048j67738
7416C476362p06054r08112o18620k97054n7653J48235K37001K94444L51003M33470
7406B353022M45513J43708j93183k91426j12453K40237M83295M79289L58586K21971
7396D128559O4435j28838l33416l74541j33575J83996L20562L81075M99808M84338
7386E092403J37614m41770r74337j087614p99200n29639l16118M3744M46203O22723
$$ y = [6755538, 6590386, 6287988, 5696254, 4838827, 4092874, 3687932, 3427330, 3169489, 2929365, 2610526, 2349176, 2202700, 2072430, 2067416, 2347343, 2830251, 3203414, 3468883, 3746955, 3942378, 4094041, 4244397, 4222925, 3923845, 3444476, 3042087, 2919324, 3018363, 3183840, 3445139, 3837015, 4021026, 3894147, 3742691, 3746044, 3816417, 3723464, 3517468, 3514052, 3644100, 3476362, 2770308, 1862196, 1243576, 946522, 888869, 1037104, 1274105, 1568549, 1919552, 2353022, 2798535, 2942243, 2749060, 2457634, 2345181, 2585418, 3068713, 3548002, 3906588, 4128559, 4192994, 4064156, 3730740, 3356199, 3222624, 3406620, 3727182, 4108257, 4608065, 5092403, 5230017, 4788247, 3813910, 2726296, 1927096, 1397457, 1081339, 1125083, 1571286, 2194009]
7376B194009N90197K98151j25266j62526J56688J89847j39531k81259k36777l01926
7366B181607m26380m51903m67038n72943l40785J29729K90430M05581O67285P34098
7356B149681M05219J1570j29800j15954l5846J44069J28022k35747m79336l59521
7346A482357r3670J75302M35643N81296L93558k20l32645l90235k81129k82806
7336A687451k42476l11306m48499j76217L68897O13336M64220L36228L62771J43183
7326B797588k74906m70443m43777m42041m77239l99756j24017L32680O57888O01740
7316A757717K42247k33207n12699l01403J49100L94980L07212K4126j70869k02578
7306A454626j80243k45167l54596j44790L35446N88617M53100J41563K8209J53087
$$ y = [2194009, 2784206, 3082357, 2957091, 2794565, 2951253, 3141100, 3001569, 2720310, 2483533, 2181607, 1755227, 1303324, 836286, 263343, -77442, 52287, 342717, 748298, 1415583, 2149681, 2554900, 2566470, 2436670, 2320716, 2284870, 2428939, 2556961, 2321214, 1841878, 1482357, 1388687, 1563989, 1999632, 2580928, 2974486, 2974266, 2641621, 2251386, 1970257, 1687451, 1444975, 1133669, 685170, 508953, 877850, 1491186, 1955406, 2291634, 2654405, 2797588, 2522682, 2052239, 1608462, 1166421, 689182, 289426, 165409, 498089, 1155977, 1757717, 1999964, 1766757, 1254058, 952655, 1101755, 1496735, 1803947, 1828073, 1657204, 1454626, 1274383, 1029216, 674620, 529830, 865276, 1453893, 1906993, 2048556, 2076765, 2229852]
7296B229852K12732J21553j23477k70229p2824J66962K53120K59874N8956k20574
7286B615945l43883l61891j04800L80715O00140L26018n8542j62932L7514K25147
7276C153431K26954J41913M3319q3601k02036k28308j45999l8701m2974k35254
7266B588744l86002k98546K1360K26992J85943M8941j9459N0585J37345J84458
7256B740361J67495k4506j62439J11840N03209M33200l34m31956p30450q06246
7246A800174p27397o30522o02783n93415n01838k47702o7519j34785k94968j27257
7236b128012M21349R29058J171570J093197O45308P2586l01347m66680m77411
7227I59618l00991k29290l58884l79696k19063j73150l27717m27453k97803J07275
$$ y = [2229852, 2442584, 2564137, 2440660, 2170431, 2097607, 2264569, 2517689, 2777563, 2836519, 2615945, 2272062, 1910171, 1805371, 2186086, 2786226, 3112244, 3053702, 2890770, 2928284, 3153431, 3380385, 3522298, 3565617, 3482016, 3279980, 3051672, 2905673, 2866972, 2823998, 2588744, 2202742, 1904196, 1925556, 2152548, 2338491, 2387432, 2367973, 2418558, 2555903, 2740361, 2907856, 2883350, 2720911, 2832751, 3335960, 3769160, 3768826, 3336870, 2606420, 1800174, 1072777, 442255, -160528, -753943, -1255781, -1503483, -1571002, -1705787, -2000755, -2128012, -1706663, -777605, 393965, 1487162, 2132470, 2205056, 1903709, 1437029, 959618, 658627, 429337, 70453, -309243, -528306, -701456, -1029173, -1456626, -1754429, -1647154]
7217a647154M46397M58451K62194M5649L832J87763M40001N95813O11295M75906
7207A880147K55191J3535k25498k67299j80960k13007j36080J43048K67757K68159
7197A804993K67663K03186J62205K33667L25052L14248M7577m05992n16294j45152
7187B291153J92775K69612J66571L7730p9833j85099k73268l54986l05363k91803
7177A467489k73542j8846L61611N38455M36813K63359J53172J82833K44154J44063
7167C499561J2595o5760k69727m87890m66716j76706P499k63388o38939p28904
7157D21625o00224l40383m6785L02912O12343N70375L04257J26385r7983l43438
7147I09084k98855j17321J38970L81045L70336K02243J07301L4155j35750j91710
$$ y = [-1647154, -1200757, -742306, -480112, -434463, -430631, -242868, 197133, 792946, 1404241, 1880147, 2135338, 2148873, 1923375, 1656076, 1475116, 1262109, 1126029, 1269077, 1536834, 1804993, 2072656, 2275842, 2438047, 2671714, 2996766, 3311014, 3358591, 2952599, 2436305, 2291153, 2483928, 2753540, 2920111, 2957841, 2878008, 2692909, 2419641, 2064655, 1759292, 1467489, 1193947, 1175101, 1536712, 2075167, 2511980, 2775339, 2928511, 3111344, 3355498, 3499561, 3512156, 3446396, 3176669, 2688779, 2222063, 2045357, 2052856, 1789468, 1150529, 421625, -178599, -518982, -565767, -262855, 349488, 919863, 1224120, 1350505, 1252522, 909084, 610229, 492908, 631878, 1012923, 1383259, 1585502, 1692803, 1726958, 1591208, 1399498]
7137A399498k8745K43808M54398M07454K18889J37132K02012K72288J91950o6395
7127C432289l90336n01811l25932o7813N4448k2824n20P6611k03810n77681n45129
7116I27492k32233J00331K99496K63722Q8243r1838j09919Q6099K32961J56969
7106A721323n6706j68452j66168j26981j34305k30080k73840m7669M07439P21900
7096A646461O53015L60002Q2219L6333K30415L66396L08678K05167J37489M2246
7086D068421q3892j60474j83146n6052l1240k05820l80043l55139k17514j85469
7076B209632k53353m31930n20328k73908J31813L76630M38001K24491n5498L0336
7066A875886K99706K83656p8806m41211n30507l42825r5779J22890K98671L65343
$$ y = [1399498, 1370753, 1614561, 2068959, 2476413, 2695302, 2832434, 3034446, 3306734, 3498684, 3432289, 3041953, 2540142, 2214210, 2146397, 2200845, 2178021, 2177501, 2254112, 2050302, 1472621, 927492, 695259, 795590, 1095086, 1358808, 1447051, 1355213, 1245294, 1331393, 1564354, 1721323, 1664617, 1496165, 1329997, 1203016, 1068711, 838631, 564791, 517122, 924561, 1646461, 2299476, 2659478, 2741697, 2778030, 3008445, 3374841, 3683519, 3888686, 4026175, 4068421, 3984529, 3824055, 3640909, 3584857, 3553617, 3347797, 2967754, 2612615, 2395101, 2209632, 1956279, 1524349, 1004021, 730113, 861926, 1238556, 1676557, 1901048, 1845550, 1875886, 2175592, 2459248, 2380442, 1939231, 1408724, 1065899, 970120, 1093010, 1391681, 1757024]
7056A757024K96713P8918k72733m63718k83483J87853N92794N79720L06156J09971
7046B889215j1099j28029o2022j4801k63750m56766k52122R8819J77057j81304
7036A795198p09198j022463r09154m83434l0517L52875O52519P01788M77703O2445
7026H87762k21828k86204l01804k71475j45976J10672M01863M47138K57007J81919
7016A059074L18763M36569M46241M61550N73953N13188J41983k80290n21819l49101
7006B800111O1860K36061O0725k19202j93907J44732L31305K15487J26090N9294
6996C622556j15308k01099j15118j08021j85281k42398j64907j38414l38315m83021
6986A530674n66193o84357o73029k80457L58497Q39686R53585O49503J14919k46848
$$ y = [1757024, 2053737, 2132655, 1859922, 1396204, 1112721, 1300574, 1893368, 2473088, 2779244, 2889215, 2878116, 2750087, 2688065, 2673264, 2409514, 1952748, 1700626, 1799445, 1976502, 1795198, 1086000, 63537, -845617, -1329051, -1359568, -1006693, -354174, 347614, 825317, 887762, 665934, 379730, 77926, -193549, -339525, -228853, 173010, 620148, 877155, 1059074, 1377837, 1814406, 2260647, 2722197, 3296150, 3809338, 3951321, 3671031, 3149212, 2800111, 2861971, 3098032, 3158757, 2939555, 2745648, 2890380, 3221685, 3437172, 3563262, 3622556, 3507248, 3306149, 3191031, 3083010, 2897729, 2655331, 2490424, 2352010, 2013695, 1530674, 964481, 280124, -392905, -673362, -314865, 524821, 1478406, 2127909, 2242828, 1995980]
6976A995980k55655l4639K51557M40314N69657O55400M45442j8717m03699n12607
6966C133033m24200l41446k92919j96834k1586J05042J48457L67456N89655M72009
6956C538667L1815m68762n87522j47992M30556Q29583R78697P69777L61500j4652
6946E721667l25313m28974j78301K81733N43817K79118k09222l51518j66262n6876
6936E109869o4702p3428n4513J11807L20038L70994L22317L43300M19339N19139
6926G324160R47466J715023K455838K871367L038075K984779K396643J125148
6918B4858499m82490j785322k519296k806657k778087k388426j851930j455075
6910H791216j192501r46243n99975j30432K77065K95209p3594n01347p53296o79317
$$ y = [1995980, 1740325, 1705686, 1957243, 2397557, 2967214, 3622614, 4068056, 4049339, 3645640, 3133033, 2708833, 2367387, 2074468, 1877634, 1856048, 1961090, 2109547, 2477003, 3066658, 3538667, 3570482, 3101720, 2514198, 2366206, 2796762, 3626345, 4605042, 5374819, 5736319, 5721667, 5396354, 4967380, 4789079, 5070812, 5614629, 5893747, 5684525, 5333007, 5166745, 5109869, 5045167, 4971739, 4917226, 5029033, 5349071, 5720065, 6042382, 6385682, 6805021, 7324160, 8271626, 9986649, 12442487, 15313854, 18351929, 21336708, 23733351, 24858499, 24376009, 22590687, 20071391, 17264734, 14486647, 12098221, 10246291, 8791216, 7598715, 6652472, 6052497, 5922065, 6199130, 6494339, 6420745, 5919398, 5166102, 4486785]
6900D486785l46342j9756J85752J92418J07901J9950j7715O9527K61539L45245
6890E285304J54709k14711n92143p45251o74278n79183n32712n17829m27350l15398
6880H41158k36149L3511M46134O14317M07277K09326J30986K7519j31544l86640
6870A955895l54589j1439K74920N18035N58880M34636M23057L51916J62068J09269
6860D422648J17490k8887k62140m10910m46974l65906k18286j97373k68630k51665
6850B089367k5341M13651P46504P65022N98893K84603j76727n02023n42895n46020
6840C105034m54861j54435J07372K28235K89142J57890j27436k40077j76095J6776
6830B751545K85915L50048J5914l46901m16836l99570m50019m09934j40180J89471
$$ y = [4486785, 4140443, 4120687, 4306439, 4498857, 4606758, 4626708, 4608993, 4678520, 4940059, 5285304, 5440013, 5225302, 4633159, 3887908, 3213630, 2634447, 2101735, 1583906, 1156556, 841158, 605009, 638520, 1084654, 1698971, 2106248, 2315574, 2446560, 2474079, 2342535, 1955895, 1601306, 1589867, 1864787, 2382822, 2941702, 3376338, 3799395, 4151311, 4313379, 4422648, 4540138, 4511251, 4249111, 3838201, 3391227, 3025321, 2807035, 2609662, 2341032, 2089367, 2064026, 2477677, 3224181, 3989203, 4588096, 4872699, 4695972, 4193949, 3651054, 3105034, 2650173, 2495738, 2603110, 2831345, 3120487, 3278377, 3150941, 2910864, 2734769, 2751545, 3037460, 3387508, 3403422, 3056521, 2639685, 2240115, 1790096, 1380162, 1239982, 1429453]
6820A429453K45834J12800k2276j28178j73572r4851o99K6793k03N9467K35845
6809A690413M11376M42485J88856j25539l34017m56205m52974l25840q8624J65389
6799A115320K28209J68985J67207J44935L9136J31476M06997N55672N42157L83989
6789C884083m267l61193m23021l70543l44163l37515k48788m7190J14697J61577
6779B023677K47884M43046M83572J78847j59050j10629J48218K23036J35999R2767
6769C707367J10437J36147J12465O5020l0088j03427o2050m8770k35068m09449
6759C242584k34580M5333Q3246J04758K28688K61768J99093J41699O6213r0889
6749D047913l36671m79653l60613k91985l63323n66335p66176n11569P5008M78012
$$ y = [1429453, 1675287, 1788087, 1765811, 1637633, 1464061, 1369210, 1368511, 1395304, 1395101, 1454568, 1690413, 2101789, 2544274, 2733130, 2607591, 2273574, 1817369, 1364395, 1038555, 949931, 1115320, 1343529, 1512514, 1679721, 1824656, 1863792, 1995268, 2402265, 2957937, 3500094, 3884083, 3879816, 3518623, 3095602, 2725059, 2380896, 2043381, 1794593, 1747403, 1862100, 2023677, 2271561, 2714607, 3198179, 3377026, 3217976, 3107347, 3255565, 3478601, 3614600, 3707367, 3817804, 3953951, 4066416, 4131436, 4101348, 3997921, 3935871, 3887101, 3652033, 3242584, 3008004, 3053337, 3136583, 3241341, 3470029, 3731797, 3930890, 4072589, 4138802, 4047913, 3711242, 3231589, 2870976, 2578991, 2215668, 1649333, 883157, 371588, 446596, 924608]
6739I24608N60477N29551L78751o8673m42130l97799k54808k26254j71901k12567
6729F19255k51265J4501L03152M25605M74997M26450K67403K13608L59984M89355
6719C343045L28668k51525q37907p00836n4052L69641M12764L18645L10718L41485
6709C580646J46933j23482j47900k7319Q3587O4540o0930n5279J08623J80389
6699C749808J45466K42241O54265J060001R80904M72201j02481l54688p8604M44905
6689G214018P35121N82250J59657j42989j4285K88080L30047J39613k2181k9460
6679I239871l8640j76609j90039o5614j21253l31377m46132l60523j45770R4182
6669G458096K33307J73302L4568k0332j05777p2144K70285O42533O78215M47532
$$ y = [924608, 1485085, 2014636, 2393387, 2324714, 1882584, 1484785, 1229977, 1003723, 831822, 619255, 367990, 382491, 685643, 1111248, 1586245, 2012695, 2280098, 2493706, 2853690, 3343045, 3671713, 3420188, 2582281, 1881445, 1827393, 2197034, 2609798, 2928443, 3239161, 3580646, 3727579, 3604097, 3456197, 3428878, 3512465, 3577005, 3516075, 3460796, 3569419, 3749808, 3895274, 4137515, 4791780, 5851781, 6832685, 7304886, 7202405, 6847717, 6769113, 7214018, 7949139, 8531389, 8691046, 8548057, 8533772, 8821852, 9151899, 9291512, 9269331, 9239871, 9201231, 9024622, 8834583, 8768969, 8647716, 8316339, 7870207, 7509684, 7363914, 7458096, 7691403, 7864705, 7899273, 7878941, 7773164, 7701020, 7971305, 8613838, 9292053, 9739585]
6659I739585L33638L78349M32840M11097L65102N54247R61386J190951J043451
6650A5410646O71559L08329J45822P0532P4766L08287O15620P77435Q77623J050616
6640B0311235J065837P78816N69704N63812N67561O32715P34349P29199R71339
6631B6924567J627817K373224K883827L064121L055728K998931L059658L410409
6623D9398282L931298M468968N158671O099224P111255Q068721R126059J0467390
6615A03829868J2073025J3724489J5339641J7001123J8660392K0051540K0521866
6608B21201944J9098288J5138224Q674485M29523p997686j4803840j9170468k1213817
6600B01356653k1308237j9973999j8070641j6154988j4352430j2695360j0914530
$$ y = [9739585, 10073223, 10451572, 10884412, 11295509, 11660611, 12214858, 13176244, 14367195, 15410646, 16082205, 16390534, 16536356, 16606888, 16681654, 16989941, 17605561, 18382996, 19260619, 20311235, 21377072, 22155888, 22725592, 23289404, 23856965, 24489680, 25224029, 25953228, 26924567, 28552384, 30925608, 33809435, 36873556, 39929284, 42928215, 45987873, 49398282, 53329580, 57798548, 62957219, 69056443, 76167698, 84236419, 93362478, 103829868, 115902893, 129627382, 144967023, 161968146, 180628538, 200680078, 221201944, 240300232, 255438456, 264112941, 264542464, 256544778, 241740938, 222570470, 201356653, 180048416, 160074417, 142003776, 125848788, 111496358, 98800998, 87886468]
6593H7886468r070509p663359o666509n836201n159906m639003m231726l817468
6585D0801787l371502k855181k434409k172932j852140j735319j818111j704354
6577B2857839j386037j078986q59638o44753l63175j93775k25413l87494o25840
6568A7092728q59452j069689j226728j003332l57817K33748N15516O35454L95722
6559A4356150l49685j079832j245901r48878o92560n56743l84230l16229m09108
6550H372984m25677l75886l98701m04545k51796j43497k57470l83841k85073q2113
6540E364385j7008K9514J29414J89688J60685J05379J23574J05432R3402J01863
6530F386328K458k23197l81437k77376M3823L48312K48911j54166m85285n99326
$$ y = [87886468, 78815959, 71152600, 64486091, 58649890, 53489984, 48850981, 44619255, 40801787, 37430285, 34575104, 32140695, 29967763, 28115623, 26380304, 24562193, 22857839, 21471802, 20392816, 19533178, 18888425, 18525250, 18331475, 18106062, 17718568, 17092728, 16233276, 15163587, 13936859, 12933527, 12575710, 12809458, 13324974, 13960428, 14356150, 14006465, 12926633, 11680732, 10731854, 10039294, 9482551, 9098321, 8782092, 8372984, 7947307, 7571421, 7172720, 6768175, 6516379, 6372882, 6115412, 5731571, 5446498, 5364385, 5347377, 5376891, 5506305, 5695993, 5856678, 5962057, 6085631, 6191063, 6284465, 6386328, 6388786, 6165589, 5784152, 5506776, 5550599, 5898911, 6147822, 5993656, 5508371, 4909045]
6520D909045o23594n58010k40518J31928L79992L86672J91322J47546K81467L02547
6510E308397J15862l9352j5226J4004k40714o46297p97818o70670m57910l02442
6500B267834j67392J82440N53066O20131N01450L65565R5130k77375m77876n20451
6490C142522m86152l78084k91930j51653O0454Q2057j32343k40976j829J95578
6480A797644p0272m81053n56755l96860l16438m16379m40201q4968L76857N47212
6470d1213N75945N92384M28668K32091J76989M7126l8052Q6859R5941j28939k47454
6459A780345n1989K65676M12918L06527L2685k68379l33148j25410J44192K79893
6449B443310K53340J30081N4741O7793Q2183M2754l6393j55937k27462j48613
$$ y = [4909045, 4285451, 3727441, 3486923, 3618851, 3998843, 4385515, 4576837, 4724383, 5005850, 5308397, 5424259, 5384907, 5369681, 5383685, 5142971, 4496674, 3698856, 3028186, 2570276, 2267834, 2100442, 2282882, 2835948, 3456079, 3957529, 4323094, 4418224, 4140849, 3662973, 3142522, 2656370, 2278286, 1986356, 1834703, 1895157, 1977214, 1844871, 1603895, 1602066, 1797644, 1727372, 1246319, 689564, 292704, -23734, -440113, -880314, -965282, -588425, -41213, 534732, 1127116, 1555784, 1787875, 1964864, 2011990, 1973938, 2060797, 2156738, 2027799, 1780345, 1728356, 1994032, 2406950, 2713477, 2746162, 2477783, 2144635, 2019225, 2163417, 2443310, 2696650, 2826731, 2881472, 2949265, 3031448, 3074202, 3037809, 2881872, 2654410, 2505797]
6439B505797q3419k63274n13486n68314l96468k6457K38776J00508j75318j87106
6429F31239L6856K83087L35593K49966J71206L6035q3445n1130M8682J80564L42992
6418B181645N05951N55812L25761O086q3439j53510l73698n03225m48166k15935
6408A797282J24899K46921o2801m23196n27916n06309n04102m23475j29489J89974
6398b18212L44505L59182L70123M09750L44194J17942j94703m89769n96893n10702
6388f4583l26563m3549K14442K65071L54443O76803Q29626O88480M69971K07537
6378C271678j0214k37000n74271q19948p16170k71700l521j97560m18738k61708
6368b39152R8430L61547L88110L01256J32819j10022j86302j02880M2879K16088
$$ y = [2505797, 2422378, 2159104, 1645618, 1077304, 680836, 654379, 893155, 993663, 818345, 631239, 668095, 951182, 1286775, 1536741, 1707947, 1743982, 1660537, 1609407, 1658089, 1838653, 2181645, 2687596, 3243408, 3569169, 3575255, 3491816, 3338306, 2964608, 2461383, 2013217, 1797282, 1922181, 2169102, 2106301, 1683105, 1155189, 648880, 144778, -278697, -408186, -218212, 126293, 485475, 855598, 1265348, 1609542, 1727484, 1532781, 1043012, 446119, -64583, -391146, -434695, -220253, 44818, 399261, 1076064, 1905690, 2594170, 3064141, 3271678, 3261464, 3024464, 2450193, 1630245, 914075, 642375, 638854, 441294, 22556, -239152, -140722, 220825, 608935, 910191, 1043010, 932988, 746686, 643806, 686685, 902773]
6358I02773K79601K20944K48144K43007R2233n0233r3520j27632p5281m7497k18862
6347A373677m34698m68162l64554k93554k44187l61096n58342m73966k22822p5034
6337b122738j92724l66559k60107J04468M02971M78374N63122O21740M21005K17778
6327a32670L96457O99181P34644M86464J29822q2509o9169n5381J7939K92060
6317B416838N70018N54931J89769k64570n74056n73901l12884p1553K0508j4934
6307A940166r6259j06631j9196K42549M79309L58536q3005n70882p26343n16341
6297I01903j92771P701J22218L78887N31977L64564R6314j2322m7466n8225n5809
6286B036971k30375l56274j30791J83747K13857J6097j47664k10042k36428k54209
$$ y = [902773, 1182374, 1403318, 1651462, 1894469, 1986702, 1936469, 1842949, 1715317, 1640036, 1592539, 1373677, 938979, 470817, 106263, -187291, -431478, -792574, -1350916, -1824882, -2047704, -2122738, -2315462, -2682021, -2942128, -2837660, -2434689, -1956315, -1393193, -771453, -350448, -132670, 263787, 962968, 1697612, 2184076, 2313898, 2231389, 2162220, 2106839, 2124778, 2416838, 2986856, 3541787, 3731556, 3466986, 2892930, 2319029, 2006145, 1934592, 1955100, 1940166, 1843907, 1737276, 1718080, 1960629, 2439938, 2798474, 2715469, 2144587, 1418244, 901903, 709132, 716833, 839051, 1217938, 1749915, 2114479, 2210793, 2198471, 2151005, 2092780, 2036971, 1806596, 1450322, 1319531, 1503278, 1717135, 1733232, 1585568, 1375526, 1139098, 884889]
6276H84889k26145r9164Q6940K13043J29145r2460j64076k2312N3793j27975k41116
6265C94562j18251l5893K4798K37327M45134M57170L68812L56360M81844P14742
6255C326605Q45006P80673M61367o4005o29125q99450o42538j70823M7012O366
6245C061088r6445k75128m16292k35328K21590M70752K22631k39347n27821p31587
6235A454113q12475o47822l45392k1447J59645K51506L50457M42231M03444J70444
6225A404704j36601k56138j9001K08920J21647j7792M0299N8099r4000k25746
6215A084391k46651r2693K05185L48996L42107L62553L28344K07759J39941J12915
6205B792847P9653P9948j08286l51037l14035q4265K35298L25890R6768k99429
$$ y = [884889, 658744, 559580, 646520, 859563, 988708, 896248, 732172, 709860, 763653, 635678, 394562, 276311, 240418, 265216, 502543, 947677, 1404847, 1773659, 2130019, 2611863, 3326605, 4171611, 4952284, 5413651, 5349646, 4720521, 3821071, 3178533, 3007710, 3054722, 3061088, 2964643, 2689515, 2273223, 2037895, 2259485, 2730237, 2952868, 2713521, 2185700, 1454113, 641638, -6184, -351576, -373023, -213378, 38128, 388585, 830816, 1234260, 1404704, 1268103, 1011965, 992964, 1201884, 1323531, 1305739, 1346038, 1404137, 1310137, 1084391, 837740, 745047, 950232, 1299228, 1641335, 2003888, 2332232, 2539991, 2679932, 2792847, 2872500, 2952448, 2844162, 2493125, 2179090, 2094825, 2330123, 2656013, 2752781, 2453352]
6195B453352n08277m59704l67560m6520L36429L17657O3272j42053k75592l00215
6185A070789k42681j03042K16234M62120L73029K00448J50974R0876n8354j41073
6175B019320j85075k67332k21990p3443K9543P5801N5910q543j33116j25841n9717
6164A105517j05693o0414J31713L28641M08660M20940L69154M5054m83683o86136
6154A473753m57928q0416K56266O55757R49438P41033J54815l71529o57199p72162
6144A891828p39110n40436j84037O9582J35756K62866M40850M18450K07389J82258
6134B145396L59471L99180J33401j32962j67118j98367l86493n72180n50134k83335
6124G46859P501J16699O8292l6691k45687o69468j106986j131021o02239R7909
$$ y = [2453352, 1945075, 1485371, 1117811, 1071291, 1407720, 1725377, 1788649, 1646596, 1371004, 1070789, 828108, 725066, 941300, 1403420, 1776449, 1976897, 2127871, 2218747, 2160393, 2019320, 1834245, 1566913, 1344923, 1271480, 1301023, 1376824, 1432734, 1424191, 1291075, 1165234, 1105517, 999824, 939410, 1071123, 1399764, 1808424, 2229364, 2598518, 2643572, 2159889, 1473753, 1015825, 935409, 1191675, 1847432, 2796870, 3537903, 3692718, 3321189, 2663990, 1891828, 1152718, 612282, 428245, 497827, 633583, 896449, 1337299, 1755749, 1963138, 2145396, 2504867, 2904047, 3037448, 2904486, 2737368, 2539001, 2152508, 1580328, 1030194, 746859, 754360, 871059, 939351, 902660, 656973, -12495, -1119481, -2250502, -2852741, -2754832]
6114b754832O00487P93756O79657M13999J58323K2295N9265J57534R9517j40527
6104H9474k76001O7380N81775O05506L41137K73493M94532P31145O41415K96704
6094C846560J50112J94155J47803L3559j27543q6146J69218K14051k0581l06463
6084D214725m41767l80772k19632j35621r1569r6146l37364o80307o65567k23372
6074I42608J13525P3533j18042k68543l59124l62023j99429K3994R8438Q5554
6064C0491J11378J65253J86151J82890K52979K56642L0118k53704l97669m07352
6054A57177m03670m37446l72595m2740M33681N60217K60601j972m1768J04251
6044B15736J42002j62653n70280o82166m47287j09582J03742K79862M13098L74883
$$ y = [-2754832, -2154345, -1360589, -680932, -266933, -108610, -86315, -27050, 130484, 230001, 89474, -186527, -119147, 462628, 1068134, 1409271, 1682764, 2177296, 2908441, 3549856, 3846560, 3996672, 4190827, 4338630, 4372189, 4244646, 4158500, 4327718, 4541769, 4521188, 4214725, 3772958, 3392186, 3172554, 3036933, 2945364, 2849218, 2511854, 1831547, 1165980, 942608, 1056133, 1129666, 1011624, 743081, 383957, 21934, -177495, -153501, -55063, 30491, 141869, 307122, 493273, 676163, 929142, 1185784, 1215902, 962198, 564529, 157177, -246493, -683939, -1056534, -1099274, -665593, -105376, 155225, 153253, 111485, 215736, 357738, 195085, -375195, -1057361, -1504648, -1614230, -1510488, -1230626, -817528, -442645]
6034d42645K10519K4935P035J13947K01585J64111N3624k8192j62725k28874j8637
6023a05317K57231J89142n8744l5528O7833J45031L40766L83540O7803l60522
6013H91235n83475m09550j06023p5901j77371j08550L4040k7884k29619k39922
6003a033020M1604L13017K65583N041k09869k66050k90586k63118j51018L8533
5993a549883L78836O28104O57839N76413M11014K28607J64612L28860N53032N85694
5983B963128L57559J00486o7249k85081m58221m43473l55214k47872r5617k3760
5973A444686j59194l34215l76755l05066j84656j03308n9549J16510K37988J78575
5963D55016M5079j60805j46804K2076R945j36534l94541n59504l67148N2559L00293
$$ y = [-442645, -232126, -207191, -200156, -86209, 115376, 279487, 333111, 304919, 142194, -86680, -105317, 151914, 341056, 282312, 246784, 314617, 459648, 800414, 1183954, 1251757, 891235, 307760, -101790, -207813, -283714, -461085, -569635, -535595, -563479, -793098, -1033020, -991416, -678399, -412816, -407775, -617644, -883694, -1174280, -1437398, -1588416, -1549883, -1171047, -542943, 114896, 691309, 1102323, 1330930, 1495542, 1824402, 2377434, 2963128, 3320687, 3421173, 3353924, 3068843, 2610622, 2167149, 1811935, 1564063, 1468446, 1444686, 1285492, 951277, 574522, 269456, 84800, -18508, -78057, 38453, 276441, 455016, 500095, 339290, 192486, 214562, 224507, 87973, -306568, -866072, -1233220, -1180661, -880368]
5952h80368K52953K30579L10911L23424J92186N7634Q8277J35659l1293k35086
5942D44876j12936K74573N90083N70911J46957l49883n91464m56096k00054j59402
5932A57565j81002k3179K60908N64392O91142M23563L6297j06282K8929J61053
5922B013386L6199j07456M140J85599R7169k40451m69186m16131k91688l48876
5912D62705n58675n58043j77292J76110J98062J78946J87958J48285K29041K88025
5902E75122J40093N5954J42341J72830J36363J60215K69159L44770K25394k687
5892B219554J277K26526L92866K61672j60440n13567o25269n81582m75019l04897
5882D41121j54542r5102r7182j60864r6877J03739J02107q7636J0739M64252P15498
$$ y = [-880368, -627415, -396836, -85925, 237499, 429685, 487319, 575596, 711255, 679962, 444876, 331940, 606513, 1196596, 1767507, 1914464, 1564581, 973117, 517021, 316967, 157565, -23437, -46616, 214292, 778684, 1469826, 1893389, 1929686, 1823404, 1852333, 2013386, 2049585, 1942129, 1946269, 2131868, 2229037, 1988586, 1519400, 1103269, 811581, 462705, -95970, -654013, -831305, -655195, -457133, -278187, -90229, 58056, 287097, 575122, 715215, 771169, 913510, 1086340, 1222703, 1382918, 1652077, 1996847, 2222241, 2219554, 2220831, 2447357, 2840223, 3101895, 2941455, 2427888, 1802619, 1221037, 746018, 441121, 286579, 191477, 94295, -66569, -163446, -59707, 42400, -45236, -34497, 429755, 1145253]
5871A145253N86399L29863J10489q891j03974k34052k05512j1029R8825J38969
5861A846340J96896J06029J3429P4534J33301r694j82602j06510J5139P8988J52595
5850B318445M1742j68819j85203N104J77553J09473k2320j9273q8999j33659O9420
5839B103464L36518M76310L21155j12160n69104p82033p11593m88756l90250n16579
5829c33028n05128j73144K70925N39378N03162L00711k1687l43302m88017n10892
5819g61022l97498n3856K10428Q3238k06875k28820J23947N43142P27233P60062
5809G99979O10874L04911K0211j81797j93057o9085O3044K57806M10898L01763
5799B325547N3941j59675j88821M9788L57274N47033N78218N12958L85275J36309
$$ y = [1145253, 1731652, 2061515, 2172004, 2163113, 2059139, 1825087, 1619575, 1608546, 1707371, 1846340, 2043236, 2149265, 2162694, 2237228, 2370529, 2360835, 2178233, 2071723, 2086862, 2165850, 2318445, 2360187, 2191368, 2006165, 2011269, 2188822, 2298295, 2275975, 2256702, 2167703, 2034044, 2103464, 2439982, 2916292, 3237447, 3125287, 2556183, 1774150, 1062557, 573801, 183551, -333028, -838156, -1011300, -740375, -200997, 302165, 602876, 581189, 237887, -250130, -761022, -1158520, -1212376, -1001948, -918710, -1125585, -1354405, -1230458, -687316, 39917, 799979, 1410853, 1715764, 1735975, 1554178, 1361121, 1292036, 1355080, 1612886, 2023784, 2325547, 2379488, 2219813, 2030992, 2080780, 2438054, 2985087, 3563305, 4076263, 4461538, 4597847]
5789D597847j17588j97428j98699k50102m12802n62775m33204j66174l1234J1535
5779B239376m9510j35396j14892m1182m8125m6728Q2891J73685K38784K98865
5769B597768J83142m7946o5317P9681J65186L01640M67300L47283L2987j70991
5759C890733k28347j51264p5788j0493K21924M69895M69748J47353l29497p84622
5749C619642r18746n15965J44658M92162K69309j17435k24132j51212R503J70619
5739B778403J87384J27848M2169m3232k39180m72525n14597m90027n04287l35810
5729E36146j10919k5637J2224K03156N34695O67459M79665J28553p5533j2282
5719B337527J97845L57863J25769n10138r36290p06738l3811M95803N14309K17643
$$ y = [4597847, 4480259, 4282831, 4084132, 3834030, 3421228, 2858453, 2425249, 2259075, 2227841, 2239376, 2189866, 2054470, 1939578, 1898396, 1850271, 1803543, 1886434, 2060119, 2298903, 2597768, 2780910, 2732964, 2667647, 2747328, 2912514, 3214154, 3681454, 4028737, 4061724, 3890733, 3662386, 3511122, 3435334, 3424841, 3646765, 4116660, 4586408, 4733761, 4404264, 3619642, 2700896, 2184931, 2329589, 2821751, 3091060, 2973625, 2749493, 2598281, 2607784, 2778403, 2965787, 3093635, 3135804, 3092572, 2853392, 2380867, 1866270, 1376243, 871956, 536146, 425227, 399590, 411814, 614970, 1149665, 1817124, 2296789, 2425342, 2349809, 2337527, 2535372, 2893235, 3019004, 2508866, 1572576, 865838, 832027, 1327830, 1842139, 2059782]
5709B059782O7817M7619n8620j22112j18924k31638l38127l60681l33316j20573
5699D91227K45708M45243L72092J97169M2992p1123j08016j4436J5591k06131
5689A410316m05080l23523j91517q4238J12286L04655L34781J92764p3266k89101
5679I88077j63680J58331K62496O6918j27844k12935k65851j82960l5378N0910
5669E38084P2096J6476p5768j58742j72585m8938J60397K36784Q8203J03170J96348
5658I55525J5924l28153n32651m38875j61799K0413k8126k5334J34799L71646
5648a6631O57891P24121N06216K47531K9460p5623m4778J5196R4225R6657r0098
5637B144167k42606k24910m4016L21499N63227N50363L62965J59684k2719j52422
$$ y = [2059782, 2127599, 2175218, 2116598, 1994486, 1875562, 1643924, 1305797, 945116, 611800, 491227, 736935, 1182178, 1554270, 1751439, 1794431, 1723308, 1615292, 1600856, 1616447, 1410316, 1005236, 681713, 490196, 405958, 518244, 822899, 1157680, 1350444, 1277178, 988077, 824397, 982728, 1245224, 1312142, 1184298, 971363, 705512, 522552, 487174, 538084, 610180, 626656, 550888, 392146, 219561, 170623, 331020, 567804, 656007, 759177, 955525, 971449, 643296, 110645, -328230, -490029, -469616, -497742, -523076, -388277, -16631, 641260, 1365381, 1871597, 2119128, 2148588, 2072965, 2028187, 2043383, 2137608, 2234265, 2144167, 1901561, 1676651, 1632635, 1954134, 2517361, 3067724, 3430689, 3590373, 3567654, 3415232]
5627C415232j17291k129J73269J85251k00505o58996p83874n70994m32424l85363
5617F22176j89876O7938K97113M66151N44074M81682K59234J1410k73119m49004
5607A837779m23669m28926l90153q4137K20984Q3821l31717o49173n95481j41510
5597i02182K77996L73897M23503M33214J34571k54363m34020l18710j94983l37563
5587g98640m61643k75352K2151J86253J66801m650K5198K76493M73086M88539
5577I8236M12482L88408M38846N07817M23541J44635j21350q7023J53536J95633
5567B554761L3491k06263m35892o09037o73335n53527l59030l12545l17078k02798
5557a081253l737J95893L36684K95773P8902j19188k40450k69838j06969O2397
$$ y = [3415232, 3297941, 3295812, 3469081, 3654332, 3453827, 2794831, 2010957, 1439963, 1007539, 622176, 432300, 500238, 797351, 1263502, 1807576, 2289258, 2548492, 2559902, 2286783, 1837779, 1414110, 985184, 595031, 510894, 731878, 815699, 483982, -165191, -760672, -902182, -624186, -250289, 173214, 606428, 740999, 486636, 52616, -266094, -461077, -798640, -1260283, -1535635, -1513484, -1327231, -1160430, -1165080, -1139882, -863389, -390303, 98236, 510718, 899126, 1337972, 1845789, 2269330, 2413965, 2292615, 2205592, 2359128, 2554761, 2588252, 2381989, 1946097, 1337060, 663725, 110198, -248832, -561377, -878455, -1081253, -1084990, -889097, -552413, -256640, -177738, -296926, -537376, -807214, -914183, -851786]
5547h51786j36861n56662p24332n12277j91061P9540K19923L57376N20940L59877
5537a435323J61664L23696M17687J97651R151j03794k19994j40596K62616P97239
5527B69997R16727N91384J60775j13079o5592J72131L71029L49373J28887p5022
5517B706610q2949j28736k94153l93047m40001l90347j93771K13858P84625J070262
5507B852351Q64569L80366j80390n69776o47670n69211l47005k0275J54339J51552
5497B068850n984k75482m34640l27809k49334k58583k07368j32469J07384K84411
5487E68976J37119j2769K3801m3693j92204j68186k9792q3530k75587l69969l38926
5476g84760j90825J20095N10577O30417M11890J70713P8720R0829L23975O08399
$$ y = [-851786, -988647, -1545309, -2269641, -2781918, -2972979, -2893439, -2673516, -2316140, -1795200, -1435323, -1273659, -949963, -532276, -334625, -325474, -429268, -649262, -789858, -527242, 269997, 1186724, 1778108, 1938883, 1825804, 1760212, 1932343, 2303372, 2652745, 2781632, 2706610, 2623661, 2494925, 2200772, 1807725, 1367724, 977377, 783606, 997464, 1782089, 2852351, 3716920, 4097286, 3916896, 3347120, 2699450, 2130239, 1783234, 1762959, 1917298, 2068850, 2062866, 1787384, 1352744, 1024935, 775601, 517018, 309650, 177181, 284565, 568976, 706095, 693326, 717127, 673434, 481230, 313044, 283252, 199722, -75865, -445834, -784760, -975585, -855490, -344913, 285504, 697394, 868107, 946827, 1037656, 1361631, 1970030]
5466A970030N55027J68791k55845l83540j64004J26370K13085J20819j00209l64798
5456A885726l55051k7081L60048M29129J30960k64418m34828k64238J677O7274
5446A529198j04253l16095m25572m41603m20168k89707m7937J10340J77706J85086
5436d3005Q5550o0156j13286j17498k29075k62280j57346m3153L4121K064J08197
5425g95867M09835M34676J40134o1534j00494j1437L5177L071M4476J19400J11530
5414C28967r5626m05997o02294m69887l3433L63639M89630M40238L15482J2900
5404C43619l02611l72686l12435l88476n97963o06524k55616J78485M10336N11839
5394a392032N50607N12530M04532M25121N44518M25189R1230k00087l70514k30460
$$ y = [1970030, 2525057, 2693848, 2438003, 2054463, 1890459, 2016829, 2229914, 2350733, 2250524, 1885726, 1530675, 1503594, 1863642, 2292771, 2423731, 2159313, 1724485, 1460247, 1461924, 1529198, 1424945, 1108850, 683278, 241675, -178493, -468200, -516137, -405797, -228091, -43005, 42545, -17611, -130897, -248395, -477470, -739750, -897096, -940249, -906128, -904064, -795867, -386032, 48644, 188778, 127244, 26750, 15313, 50490, 53561, 98037, 217437, 328967, 233341, -172656, -774950, -1244837, -1278270, -914631, -425001, 15237, 330719, 343619, 41008, -331678, -644113, -1032589, -1630552, -2237076, -2492692, -2314207, -1903871, -1392032, -841425, -328895, 75637, 500758, 1045276, 1470465, 1561695, 1361608, 991094, 760634]
5384G60634J89857M48923M03444K90261J00704k15739m78441o82365p22403m45216
5374c50341j59969n2848J1733J32371J71608K15523M29551O65555O33298L65983
5364B062464J35180j76283n45807o05658l08640M4662J58465j07301l69886k63102
5354B4094R647K45163L79910L00689P6683n0288j25461l61493o46406o38067l82011
5343a167540j97418n9543o114m4667J07570L75139M56337K74820J6200m6406P0736
5332b20886L8064k22725m22423l71165k4976L08585J23801m17068p28814n75669
5322b513276j36424K55015N02440P09274Q02546N51468N1264k84152k61564m5069
$$ y = [760634, 950491, 1399414, 1802858, 2093119, 2193823, 1978084, 1499643, 817278, 94875, -350341, -510310, -563158, -551425, -419054, -247446, -31923, 397628, 1063183, 1696481, 2062464, 2197644, 2021361, 1475554, 869896, 561256, 605918, 764383, 657082, 287196, 24094, 33741, 278904, 658814, 959503, 1036186, 985898, 860437, 498944, -147462, -785529, -1167540, -1364958, -1424501, -1430615, -1475282, -1367712, -992573, -536236, -261416, -245216, -291622, -220886, -182822, -405547, -827970, -1199135, -1224111, -915526, -791725, -1208793, -1937607, -2513276, -2649700, -2394685, -1892245, -1182971, -380425, 171043, 222307, -61845, -323409, -368478]
$$ [...]
##END NTUPLES=NMR SPECTRUM
##END=
