##TITLE=C13cpd
##JCAMPDX= 6.0         $$ Bruker NMR JCAMP-DX V2.0
##DATA TYPE= NMR SPECTRUM
##DATA CLASS= NTUPLES
##ORIGIN= UXNMR, Bruker Analytische Messtechnik GmbH
##OWNER= root
$$ XWIN-NMR		Version 3.5
$$ Sat Feb 22 11:19:33 2025 Russian Standard Time (UT+4h)  servis@DPX200
##.OBSERVE FREQUENCY= 50.3277607988526
##.OBSERVE NUCLEUS= ^13C
##.ACQUISITION MODE= SIMULTANEOUS
##.ACQUISITION SCHEME= undefined
##.AVERAGES= 960
##.DIGITISER RES= 17
##SPECTROMETER/DATA SYSTEM= spect
##.PULSE SEQUENCE= zgpg30
##.SOLVENT NAME= DMSO
##.SHIFT REFERENCE= (INTERNAL, DMSO, 0, 219.126)
##AUDIT TRAIL= $$ (NUMBER, WHEN, WHO, WHERE, WHAT)
$$ ##TITLE= Audit trail, XWIN-NMR		Version 3.5
$$ ##JCAMPDX= 5.01
$$ ##ORIGIN= Bruker BioSpin GmbH
$$ ##OWNER= servis
$$ F:\spectra/data/av/nmr/C13cpd/1/pdata/1/auditp.txt
$$ ##AUDIT TRAIL=  $$ (NUMBER, WHEN, WHO, WHERE, WHAT)
(   1,<2025-02-22 11:19:06.82 +0400>,<servis>,<DPX200>,
      <created by zg, POWCHK disabled, PULCHK disabled
       terminated by command 'halt'
       configuration hash MD5:
       00 E9 B6 7A A2 85 ED C7 34 08 36 98 17 FE 4E 26
       data hash MD5: 32K
       B9 8B D4 E3 1E 7D 38 5C E7 19 8A 1B 0E C3 E6 3B>)
(   2,<2025-02-22 11:19:08.65 +0400>,<servis>,<DPX200>,
      <Start of raw data processing
       efp BC_mod = 2 LB = 2 FT_mod = 6 PKNL = 1 PHC0 = -340.663 PHC1 = 25.66493 SI = 32K 
       data hash MD5: 32K
       21 DB 7A 36 0D E4 FB 08 5F B0 14 00 36 5B 1C B9>)
$$ ##END=
$$ 
$$ hash MD5
$$ E3 4F 8D 6E AE E5 5A EC 6E 5D 7B 69 A2 6E CE 46
##$RELAX= 
##$RELAX= 
##$RELAX= 
##$RELAX= 
##$RELAX= 
##$RELAX= 
##$RELAX= 
##$RELAX= 
$$ Bruker specific parameters
$$ --------------------------
##$DU= <F:\spectra>
##$EXPNO= 1
##$NAME= <C13cpd>
##$PROCNO= 1
##$TYPE= <nmr>
##$USER= <av>
##$AMP= (0..31)
100 100 100 100 100 100 100 100 100 100 100 100 100 100 100 100 100 100 
100 100 100 100 100 100 100 100 100 100 100 100 100 100 
##$AQSEQ= 0
##$AQ_mod= 1
##$AUNM= <au_zg>
##$AUTOPOS= <>
##$BF1= 50.322729
##$BF2= 200.13
##$BF3= 50.322729
##$BF4= 50.322729
##$BF5= 500.13
##$BF6= 500.13
##$BF7= 500.13
##$BF8= 500.13
##$BYTORDA= 1
##$CFDGTYP= 0
##$CFRGTYP= 5
##$CHEMSTR= <none>
##$CNST= (0..31)
1 1 145 1 1 1 1 1 1 1 1 1 1 1 1 1 1 1 1 1 1 1 1 1 1 1 1 1 1 1 1 1 
##$CPDPRG= <waltz16>
##$CPDPRG1= <>
##$CPDPRG2= <waltz16>
##$CPDPRG3= <>
##$CPDPRG4= <mlev>
##$CPDPRG5= <mlev>
##$CPDPRG6= <mlev>
##$CPDPRG7= <mlev>
##$CPDPRG8= <mlev>
##$CPDPRGB= <>
##$CPDPRGT= <>
##$D= (0..31)
0 2 0.00345 0 0 0 0 0 0 0.06 0 0.03 2e-05 3e-06 0 0 0.0002 0 0 0 0 0 0 
0 0 0 0 0 0 0 0 0 
##$DATE= 1740208746
##$DBL= (0..7)
120 120 120 120 120 120 120 120 
##$DBP= (0..7)
150 150 150 150 150 150 150 150 
##$DBP07= 0
##$DBPNAM0= <>
##$DBPNAM1= <>
##$DBPNAM2= <>
##$DBPNAM3= <>
##$DBPNAM4= <>
##$DBPNAM5= <>
##$DBPNAM6= <>
##$DBPNAM7= <>
##$DBPOAL= (0..7)
0.5 0.5 0.5 0.5 0.5 0.5 0.5 0.5 
##$DBPOFFS= (0..7)
0 0 0 0 0 0 0 0 
##$DE= 6
##$DECBNUC= <off>
##$DECIM= 12
##$DECNUC= <off>
##$DECSTAT= 4
##$DIGMOD= 1
##$DIGTYP= 9
##$DL= (0..7)
$$ [...]
##$SUBNAM2= <"">
##$SUBNAM3= <"">
##$SUBNAM4= <"">
##$SUBNAM5= <"">
##$SUBNAM6= <"">
##$SUBNAM7= <"">
##$SUBNAM8= <"">
##$SUBNAM9= <"">
##$SW= 238.246396889851
##$SWIBOX= (0..15)
0 1 3 0 0 0 0 0 0 0 0 0 0 0 0 0 
##$SW_h= 11990.4076738609
##$TD= 32768
##$TD0= 1
##$TE= 0
##$TE2= 300
##$TE3= 300
##$TEG= 300
##$TL= (0..7)
0 120 120 120 120 120 120 120 
##$TP= (0..7)
150 150 150 150 150 150 150 150 
##$TP07= 0
##$TPNAME0= <>
##$TPNAME1= <>
##$TPNAME2= <>
##$TPNAME3= <>
##$TPNAME4= <>
##$TPNAME5= <>
##$TPNAME6= <>
##$TPNAME7= <>
##$TPOAL= (0..7)
0.5 0.5 0.5 0.5 0.5 0.5 0.5 0.5 
##$TPOFFS= (0..7)
0 0 0 0 0 0 0 0 
##$TUNHIN= 0
##$TUNHOUT= 0
##$TUNXOUT= 0
##$USERA1= <user>
##$USERA2= <user>
##$USERA3= <user>
##$USERA4= <user>
##$USERA5= <user>
##$V9= 5
##$VALIST= <valist>
##$VCLIST= <CCCCCCCCCCCCCCC>
##$VD= 0
##$VDLIST= <DDDDDDDDDDDDDDD>
##$VPLIST= <PPPPPPPPPPPPPPP>
##$VTLIST= <TTTTTTTTTTTTTTT>
##$WBST= 1024
##$WBSW= 20
##$XGAIN= (0..3)
0 0 0 0 
##$XL= 0
##$YL= 0
##$YMAX_a= 13265484
##$YMIN_a= -9385798
##$ZGOPTNS= <>
##$ZL1= 120
##$ZL2= 120
##$ZL3= 120
##$ZL4= 120
##$ABSF1= 0
##$ABSF2= 0
##$ABSG= 0
##$ABSL= 0
##$ALPHA= 0
##$AQORDER= 0
##$ASSFAC= 0
##$ASSFACI= 0
##$ASSFACX= 0
##$ASSWID= 0
##$AUNMP= <proc_1d>
##$AZFE= 0.1
##$AZFW= 0.5
##$BCFW= 0
##$BC_mod= 2
##$BYTORDP= 0
##$COROFFS= 0
##$CY= 12.5
##$DATMOD= 1
##$DC= 0
##$DFILT= <>
##$DTYPP= 0
##$F1P= 99.9999945759776
##$F2P= -179.999992907048
##$FCOR= 0.5
##$FTSIZE= 32768
##$FT_mod= 6
##$GAMMA= 0
##$GB= 0
##$INTBC= 1
##$INTSCL= 0
##$ISEN= 30
##$LB= 2
##$LEV0= 0
##$LPBIN= 0
##$MAXI= 10000
##$MC2= 0
##$MEAN= 0
##$ME_mod= 0
##$MI= 0
##$NCOEF= 0
##$NC_proc= 1
##$NLEV= 6
##$NOISF1= 0
##$NOISF2= 0
##$NSP= 0
##$NTH_PI= 0
##$NZP= 0
##$OFFSET= 219.1257
##$PC= 1.4
##$PHC0= -340.663
##$PHC1= 25.66493
##$PH_mod= 1
##$PKNL= yes
##$PPARMOD= 0
##$PSCAL= 4
##$PSIGN= 0
##$REVERSE= no
##$SF= 50.322729
##$SI= 32768
##$SIGF1= 0
##$SIGF2= 0
##$SINO= 80
##$SIOLD= 32768
##$SREGLST= <13C.CDCl3>
##$SSB= 0
##$STSI= 32768
##$STSR= 0
##$SW_p= 11990.4076738609
##$SYMM= 0
##$S_DEV= 0
##$TDeff= 32768
##$TDoff= 0
##$TI= <>
##$TILT= no
##$TM1= 0
##$TM2= 0
##$TOPLEV= 0
##$USERP1= <user>
##$USERP2= <user>
##$USERP3= <user>
##$USERP4= <user>
##$USERP5= <user>
##$WDW= 1
##$XDIM= 32768
##$YMAX_p= 278730812
##$YMIN_p= -2968176
$$ End of Bruker specific parameters
$$ ---------------------------------
##NTUPLES= NMR SPECTRUM
##VAR_NAME=  FREQUENCY,     SPECTRUM/REAL,   SPECTRUM/IMAG
##SYMBOL=    X,             R,               I
##VAR_TYPE=  INDEPENDENT,   DEPENDENT,       DEPENDENT
##VAR_FORM=  AFFN,          ASDF,            ASDF
##VAR_DIM=   32768,         32768,           32768
##UNITS=     HZ,            ARBITRARY UNITS, ARBITRARY UNITS
##FACTOR=    0.365929370215793, 1,           1
##FIRST=     11027.0033138647, 0,            0
##LAST=      -963.404359996184, 0,           0
##MIN=       -963.404359996184, -2968176,    0
##MAX=       11027.0033138647, 278730812,    0
$$ Real data points
##PAGE= N=1
##DATA TABLE= (X++(R..R)), XYDATA
$$ [...]
11003C376561J80511q0308n87788j018227r70347l88551J57142L35436K43207
10994A247636l858k38722k87927k00353q0127p804r8045j37482P9666L12973L74196
10983I60153J59654k44368n15449n61471l95571m8689L08332M49748L25813J00874
10973E39026K8222M1720p0781j77266j33307o429J16129K48010K29773j8444k56225
10962E40428j39145K88003N87655M60307J08490k09325l01113j37791L2056K5149
10952A254714m627P9692J16093J83854K70862L51395M00611K81194J17813m6405
10942C005196k98647o47080q13539o48462k85376K06526N53751N68016M97904
10933B138289M51697L09732P7482o4060O1606L19621M47418K41834j51168k85740
$$ plain form
11003 3376561 3557072 3476764 2888976 1870749 900402 511851 668993 1004429 1247636
10994 1247636 1243778 1005056 717129 516776 436649 428845 330800 193318 272984 585957 960153
10983 960153 1119807 875439 359990 -201481 -597052 -645741 -337409 112339 438152 539026
10973 539026 567248 608968 538187 360921 227614 221185 337314 585324 815097 796653 540428
10962 540428 401283 689286 1276941 1737248 1845738 1636413 1335300 1197509 1229565 1254714
10952 1254714 1250087 1329779 1445872 1629726 1900588 2251983 2652594 2933788 3051601 3005196
10942 3005196 2706549 2059469 1245930 597468 312092 518618 1072369 1640385 2138289
10933 2138289 2589986 2899718 2977200 2913140 2974746 3294367 3741785 3983619 3832451 3546711
10923C546711k40979k72912l11443k43886j04458j66320n09485p43069n68371
10914C85788k39397j08350j97429k30462q4991N2121L0911J6488N7849J06809
10904b10663K19901L90858L58581J07075n8817p2168l1429J08756K15842O4859
10894A092795j40977j46289n3418j1060K5982J4656o9114k10061l17705k75671
10884i0862q3637O2854n74j14192j33421r1791q4690j5985K78827N76042O19821
10873I22392M38103J83100J21898J47055O2139p5745k84955m22086k56295J8699
10863H54305K18112L33425K41434J3556j35378r1357J90890M40728L83871K51774
10853B701360K89143L32038J88092K7474n2838m6507k0651j22608j67438J5002
$$ plain form
10923 3546711 3305732 3032820 2721377 2477491 2373033 2206713 1697228 954159 385788
10914 385788 146391 38041 -159388 -389850 -474841 -422720 -391809 -375321 -317472 -210663
10904 -210663 9238 400096 758677 865752 806935 734767 703338 812094 1027936 1092795
10894 1092795 951818 805529 752111 741051 767033 781689 712575 502514 184809 -90862
10884 -90862 -174499 -111645 -112219 -226411 -359832 -451623 -536313 -552298 -273471 302571 922392
10873 922392 1360495 1543595 1665493 1812548 1874687 1798942 1513987 1091901 835606 854305
10863 854305 1072417 1405842 1647276 1660832 1525454 1434097 1624987 2065715 2449586 2701360
10853 2701360 2990503 3322541 3510633 3538107 3485269 3438762 3418111 3295503 3128065 3143067
10843C143067K26008K90540J71052r9354m29404o00311m53987n4580K93647L98143
10833B884821L20151J32609j02872k77204l25567k15319m0708j10O0316J72225
10823B608342K04555K27576K46895K57314J42209j26330k02396q8042o3437j76511
10813C030175k35540j04488m9317k36533n05011o55104o33203m75303k67319j08164
10803b39807q922J40872K57984J96839M3898n107K13224N27046O62033O29910
10793B417970N28255L17219J23381R260k68275o14301p16044n48228l92125l08761
10783E48351j61504q2313j55350j27844j1775q100N3707L31030O08188P21477
10773A715867N65537J92175r7819j97762l13184l29186j12580K6044J01906J80135
$$ plain form
10843 3143067 3369075 3659615 3830667 3731313 3301909 2701598 2247611 2193031 2486678 2884821
10833 2884821 3204972 3337581 3234709 2957505 2631938 2416619 2375911 2375801 2436117 2608342
10823 2608342 2812897 3040473 3287368 3544682 3686891 3560561 3358165 3270123 3206686 3030175
10813 3030175 2794635 2690147 2640830 2404297 1899286 1244182 610979 135676 -131643 -239807
10803 -239807 -248729 -107857 150127 346966 390864 385757 598981 1126027 1788060 2417970
10793 2417970 2946225 3263444 3386825 3396085 3127810 2513509 1797465 1249237 857112 548351
10783 548351 386847 304534 149184 21340 9565 1465 55172 386202 994390 1715867
10773 1715867 2281404 2473579 2375760 2177998 1864814 1535628 1423048 1449092 1550998 1731133
10763A731133J10872o3031j71079l7814K96278M48681K12399k63534n79621n61425
10753A122859l67475j00991N6278n4990j58740j5610K25245K77655J09771p7731
10743A016271j90363k83501k04099P5313J95597j8840j78393q5657Q8240J79920
10733E94488J43620J56673Q5942j96779l67509l20124j86035L2259K14861R7210
10723B54606k45261l52616j45386J13527K86295K77846J36406K4197J2165J47818
10713E09597L41147M31986L53409K59023J75842J00652P6731K5571j4825k9405
10703B229728j57434j83933k6675R8099J48517Q5426J2034K1436K8820m2206j41801
10692B072011j50465j85064k11607l8664J26731J5939p3910N1729J54878O4942
$$ plain form
10763 1731133 1842005 1778974 1607895 1570081 1866359 2315040 2527439 2263905 1684284 1122859
10753 1122859 755384 654393 710671 655681 496941 481331 706576 984231 1094002 1016271
10743 1016271 825908 542407 338308 413621 609218 590378 411985 326328 414568 594488
10733 594488 738108 894781 980723 783944 416435 96311 -89724 -57465 157396 254606
10723 254606 9345 -343271 -488657 -375130 -88835 189011 325417 349614 361779 509597
10713 509597 850744 1282730 1636139 1895162 2071004 2171656 2248387 2273958 2259133 2229728
10703 2229728 2072294 1888361 1861686 1959785 2108302 2193728 2205762 2227198 2256018 2213812 2072011
10692 2072011 1921546 1736482 1524875 1486211 1612942 1628881 1554971 1606700 1761578 1826520
10682A826520j12356p4216J09694J99187J64797J88066J98431J24811J61353K76608
10672C062895K83774J96568J54132J21768K4761m4515j53276l21748m43099n47547
10662B333713n28194m27423k68471n1511K7098r4635k17595j20493J67957L68477
10652A188923L05630J3934l45337o11914n27903j26820J54818J84109O9812r8923
10642B06329k23447j63325J0501J44856J12446K3128M8287J48531K00480R2808
10632F00594j28647m09596n42650l60355m9809K48428M68307N37336M06134O1970
10622H31712k91192m45526m76356m05812j31214L38699N91456M09031Q3073o4602
10612D39269J6952J39485K28382L30935L10946K62896K55999J57962k3844k07625
$$ plain form
10682 1826520 1714164 1639948 1749642 1948829 2113626 2301692 2500123 2624934 2786287 3062895
10672 3062895 3346669 3543237 3697369 3819137 3843898 3799383 3646107 3324359 2881260 2333713
10662 2333713 1805519 1378096 1109625 1058114 1085212 990577 772982 652489 820446 1188923
10652 1188923 1494553 1508487 1163150 551236 23333 -103487 51331 235440 305252 206329
10642 206329 -17118 -180443 -169942 -25086 87360 110488 158775 307306 507786 600594
10632 600594 471947 62351 -480299 -840654 -890463 -642035 -173728 363608 769742 831712
10622 831712 540520 94994 -381362 -787174 -918388 -579689 11767 420798 503871 439269
10612 439269 456221 595706 824088 1155023 1465969 1728865 1984864 2142826 2118982 1911357
10602A911357l05859m37205n84195n59352m06814l11971k12565J42266N11566
10593b52772M85698L16776K98855M31215L68691Q2024j02230j36297j32744j10469
10583A248747L855J22855J00082j742m5932M3261K11295L03775K27879J96837
10573B410912L95909N46601L39805j41237m20713j81716K55750L24915J17517
10564C647743J11996K12892P3050k00545k81770k83931l69498l38519j67158O3613
10554B467873K77837M09500M18114K10242j55627m46582n71859n68613l99174
10545A641711k25658k59144l26988j22116K54158N42131N34587K90207O1614n8680
10535B331822m6762j55684m50808m48629j15726J36074J54257J14130J84361J37051
$$ plain form
10602 1911357 1605498 1168293 584098 24746 -382068 -694039 -906604 -764338 -252772
10593 -252772 232926 549702 848557 1279772 1648463 1730487 1628257 1491960 1359216 1248747
10583 1248747 1252602 1375457 1475539 1473797 1427865 1471126 1682421 1986196 2214075 2410912
10573 2410912 2806821 3353422 3693227 3551990 3131277 2949561 3205311 3530226 3647743
10564 3647743 3759739 3972631 4045681 3845136 3563366 3279435 2909937 2571418 2404260 2467873
10554 2467873 2745710 3155210 3573324 3783566 3627939 3181357 2609498 2040885 1641711
10545 1641711 1416053 1156909 829921 707805 961963 1504094 2038681 2328888 2390502 2331822
10535 2331822 2285060 2129376 1678568 1229939 1114213 1250287 1404544 1518674 1703035 1840086
10525A840086o7861k82293m76389m79539j60762J92189L07906K49827K18984L59904
10515A702052N48935L58107j39855m98142o23912n48600l03423j34840j80553
10506A79769j96812j1894L91362P02959O17616M06979L74548M43659L90647K32289
10496C531122K66936L50441K12556j11010l41923l88010k94270j79015j82445
10487B864382l28888n28286o05366m93237l27366j44298J35306L95577M65883
10478A433707K77799j4156j4378K03797J58470n3432j38684j038K02014J88332
10468B242431q550n4384R0462J02866m6103j14484o8603m2406q2913j4055J70191
10457B174452K27848K12854L66582O52214Q35153P88078N89090L75654J55309
$$ plain form
10525 1840086 1772225 1489932 1013543 534004 373242 565431 873337 1123164 1342148 1702052
10515 1702052 2250987 2609094 2469239 1971097 1347185 798585 495162 360322 179769
10506 179769 -17043 -28937 362425 1065384 1683000 2089979 2464527 2908186 3298833 3531122
10496 3531122 3798058 4148499 4361055 4250045 3908122 3520112 3225842 3046827 2864382
10487 2864382 2535494 2007208 1401842 908605 581239 436941 572247 967824 1433707
10478 1433707 1711506 1697350 1682972 1886769 2045239 1991807 1853123 1852085 2054099 2242431
10468 2242431 2233881 2179497 2269959 2372825 2326722 2212238 2143635 2101229 2018316 2004261 2174452
10457 2174452 2402300 2615154 2981736 3633950 4469103 5257181 5846271 6221925 6377234
10448F377234j81460n24669p05299o71641n46361l79257j58188L1823J73869K79857
10438C695908K13932j9112k09303j49403J94024N53926O64184O22812O54730P16237
10428F937935P48273P82191P90285P02739O88519J000683J487617J838688J941736
10419A6918666J938308K000280K173598K359825K309012J703584M60836j019699
10411B8844410k092682k447225k348945k136075j873710j559846j313243j232461
10403A3840223j224084j170068j052412q41084o22696n26293n45570n60836n37468
10394F759712n88868n17331k09559K9125N8081r5773l08130n31435o47288m97754
10384C450780l00009l00329l79344l71181k98527r9175J69633L09384K56492J55795
$$ plain form
10448 6377234 6195774 5671105 4965806 4294165 3747804 3368547 3210359 3242182 3416051 3695908
10438 3695908 3909840 3890728 3681425 3532022 3726046 4279972 4944156 5566968 6221698 6937935
10428 6937935 7686208 8468399 9258684 9961423 10649942 11650625 13138242 14976930 16918666
10419 16918666 18856974 20857254 23030852 25390677 27699689 29403273 29864109 28844410
10411 28844410 26751728 24304503 21955558 19819483 17945773 16385927 15072684 13840223
10403 13840223 12616139 11446071 10393659 9552575 8929879 8403586 7858016 7297180 6759712
10394 6759712 6170844 5653513 5443954 5473079 5531160 5435387 5127257 4595822 3948534 3450780
10384 3450780 3150771 2850442 2471098 2099917 1801390 1702215 1871848 2181232 2437724 2593519
10374B593519J75660L15883M15202L45104J47265r4419l35363n02887m45344k38146
10364B376474j20544n9712k9247j77974m54039n16208j82653K66192N20509N78901
10354B201699M32906J52698j7304j03851j76800q4180Q3699K5618k30743m78232
10344A805510o36528o17954m19349k11884j32097j35982j02873J793J46086K65359
10334c7919K74537J09636r7199k63038k99063j66222k7692J53814L28922L25117
10324C00893J97089Q2511O4772J24482J51381O6508n2279j18955m6028J60872
10314I31246K86045K25727R7281j743j23081k22568l08756k82926j94240l06498
10304A00487m29360l34934j54970L8374K15172K34865K55316L47844L01376J51668
$$ plain form
10374 2593519 2769179 3085062 3500264 3845368 3992633 3898214 3562851 3059964 2614620 2376474
10364 2376474 2255930 2196218 2166971 1988997 1534958 1018750 836097 1102289 1622798 2201699
10354 2201699 2634605 2787303 2769999 2666148 2489348 2405168 2488867 2514485 2283742 1805510
10344 1805510 1168982 551028 131679 -80205 -212302 -348284 -451157 -449364 -303278 -37919
10334 -37919 236618 346254 249055 -13983 -313046 -479268 -506960 -353146 -24224 300893
10324 300893 497982 580493 645265 769747 921128 987636 935357 816402 770374 931246
10314 931246 1217291 1443018 1540299 1538556 1415475 1192907 884151 601225 406985 100487
10304 100487 -328873 -663807 -818777 -780403 -565231 -330366 -75050 272794 574170 725838
10294G25838L687K3954J98702L07232K66813P8886p1660n6957N6264J74973J86437
10283A894169N1721r9002r8021J8308P8247M4865j9579k0105n1879k04393k42263
10272A352068j54075J2155J49692K03561K96816L48620K39826R3461J1600l6777
10262B516947j26139k53291l01294k65664k06154k84302m35348m30877k82234
10253f8356k24942k51011j80126J17N3820k47514o31299n71850K5229O84201R81397
10242d30334Q80699O02945L26966J27052K2733k8427J0558R5883J57068Q3470
10232A848613j38928k32977r0589K47459O04705P23527N40016K99579K19904J76474
10222D197783r4984n98081r19997p91572m55720l04653k88479k67799j16587J97970
$$ plain form
10294 725838 729525 753479 952181 1259413 1526226 1605112 1533452 1476495 1532759 1707732 1894169
10283 1894169 1945890 1846888 1748867 1767175 1845422 1890287 1870708 1850603 1798724 1594331 1352068
10272 1352068 1197993 1210148 1359840 1563401 1860217 2208837 2448663 2542124 2553724 2516947
10262 2516947 2390808 2137517 1836223 1570559 1364405 1080103 644755 213878 -68356
10253 -68356 -293298 -544309 -724435 -724318 -670498 -918012 -1549311 -2121161 -2095932 -1411731 -430334
10242 -430334 450365 1053310 1380276 1507328 1530061 1501634 1512192 1608075 1765143 1848613
10232 1848613 1709685 1476708 1386119 1633578 2238283 2961810 3501826 3801405 4021309 4197783
10222 4197783 4102799 3504718 2584721 1793149 1337429 1032776 744297 476498 359911 557881
10212E57881M42560N73882O81363O34220M58358L74231K50717m5677k99414m22898
10202C205223m22936m30421n87136o10653l01541N6340K29525K24934K17861J33327
10192A714523j78391m43059l19902j08442j81529k10576N815J63991J08592l2536
10182E18486k312K61592N31386L92536j70635n66062m73592j59187K17947N10600
10172A060759M38443J33693L366N1021R3573K9784j91385l99345l77456j83649
10162F58804p2344j49030k42108j80918m0131P3958K99180N84510O80782N32229
10152B144932K84223J54997N8272r4675j99793k35194l22011m15626m26434k74245
10142F74446L6615K78048M28762M47202M23865L79539J70758l8285r1380L5341
$$ plain form
10212 557881 1000441 1574323 2255686 2889906 3348264 3722495 3973212 3927535 3628121 3205223
10202 3205223 2782287 2351866 1764730 1154077 852536 908876 1138401 1363335 1581196 1714523
10192 1714523 1536132 1093073 773171 664729 483200 272624 278439 442430 551022 518486
10182 518486 516174 777766 1309152 1701688 1531053 964991 491399 332212 550159 1060759
10172 1060759 1499202 1632895 1636261 1687282 1780855 1810639 1619254 1219909 842453 658804
10162 658804 586460 437430 195322 14404 -25727 48231 347411 931921 1612703 2144932
10152 2144932 2429155 2584152 2642424 2547749 2347956 2112762 1790751 1375125 948691 674446
10142 674446 711061 989109 1417871 1865073 2288938 2668477 2839235 2800950 2709570 2744911
10132B744911K48818M29431L81119J17442j18569k47000l42333m97054o55008
10123B061757o32919m24349o7886K96825M99079M88564K78471J12125J64752J80052
10113B956471o2916k23451k3091L38113N74168P14832P79837N52259K6128n21913
10103E110437p68649o69628m74727l64624k51759q8184K8517J82255L09027K12625
10093C225290K06070L73082L77962J47923q0798k28138k90998m09381n90898n55007
10083B175107k44540J46722L17093J48792j31870l06536l57460l53487l23426
10074A070395l40624m04373l81696j52579P9925K1790l3168J45568K83071K11584
10064D99893P3482N2643R1117J6206j41893j84020k62301m25078l80710j58566
$$ plain form
10132 2744911 2993729 3423160 3804279 3921721 3803152 3556152 3213819 2716765 2061757
10123 2061757 1428838 1004489 936603 1233428 1732507 2221071 2499542 2611667 2776419 2956471
10113 2956471 2893555 2670104 2647013 2985126 3559294 4274126 5053963 5606222 5632350 5110437
10103 5110437 4341788 3672160 3197433 2832809 2581050 2492866 2521383 2703638 3012665 3225290
10093 3225290 3431360 3804442 4182404 4330327 4249529 4021391 3730393 3321012 2730114 2175107
10083 2175107 1930567 2077289 2394382 2543174 2411304 2104768 1747308 1393821 1070395
10074 1070395 729771 325398 -56298 -208877 -128952 -107162 -140330 5238 288309 499893
10064 499893 573375 626018 717135 733341 591448 407428 145127 -279951 -660661 -819227
10054h19227M206R6286K87519M86562N80594O55766N90432K55931m4189j36186
10044A957694k43543l34962j19791K57606N34080O23684M30889L0492l17489m91819
10034B326841m21451j11501J58716J43939j01898k59603j28847J00035J92978
10025A899209J50289j4995j99348k07824j99766k59449k26035m0303K12423K85976
10015A400177K2907k67803k50945j45883j38357j94025k75180m27003n06175k67824
10005a050111J10306K19650M1209l2143J86432M55140N21603M25323L61752L87001
9995A626162L98690L45751J75580j08696l48503m11515l53440k33358m7414M4977
9985A088234j40729m34683n06864m98997m52080k09951N6005J62215J56970K17535
$$ plain form
10054 -819227 -815021 -718735 -431216 55346 635940 1291706 1882138 2138069 2093880 1957694
10044 1957694 1714151 1379189 1259398 1517004 2051084 2674768 3105657 3136149 2818660 2326841
10034 2326841 1905390 1793889 1952605 2096544 1994646 1735043 1606196 1706231 1899209
10025 1899209 2049498 2034503 1835155 1627331 1427565 1168116 942081 901778 1114201 1400177
10015 1400177 1423084 1155281 904336 758453 620096 426071 150891 -276112 -782287 -1050111
10005 -1050111 -939805 -720155 -678946 -711089 -524657 -69517 452086 877409 1239161 1626162
9995 1626162 2024852 2370603 2546183 2437487 2088984 1677469 1324029 1090671 1043257 1088234
9985 1088234 947505 512822 5958 -493039 -945119 -1155070 -1099065 -936850 -779880 -562345
9975e62345L25895L30704L23733K81758L0478l23547m36842k56794k8814J26160
9965a89614J74341J74070J45087K3210j29827j49735O7911L12333K22547n5632
9955E94691q9610L6920J02310O9867P768j9821P6227K72473L85871M06424K74588
9944B117708R6510J7060k179M121k6798m1533M2779J47398K54698K94591K33695
9933C138050R3281j35017l09649l07664j78494j1748o5668l02653k37981J1032
9923A693489k9637k92639m19886j82582K18393K65454L4871k7069N6135K9253
9913A345782l9032o9417j66411j49049l380N0189L1439n964j01617k31212l04570
9902C56758j73914P1916J50500M2157O8334K35712J04430j57338j93906j13780
$$ plain form
9975 -562345 -236450 94254 417987 699745 730223 406676 -30166 -286960 -315774 -189614
9965 -189614 -15273 158797 303884 327094 197267 47532 115443 427776 650323 594691
9955 594691 505081 542001 644311 714178 721946 702125 778352 1050825 1436696 1843120 2117708
9944 2117708 2214218 2231278 2229099 2233220 2206422 2164889 2207668 2355066 2609764 2904355 3138050
9933 3138050 3231331 3096314 2786665 2479001 2300507 2288759 2223091 1920438 1682457 1693489
9923 1693489 1663852 1371213 951327 768745 987138 1252592 1287463 1260394 1316529 1345782
9913 1345782 1306750 1237333 1070922 921873 918493 968682 1000121 994157 892540 661328 356758
9902 356758 182844 254760 405260 447417 515751 751463 855893 698555 504649 390869
9892C90869O1757K22833Q3903k13097l43807j99959J11154L52279L18651M1208
9882H25791j79493o5369K22069K85132J08967n6178j34375o7174J76664M78205
9872A594239O37906M92629J99917l8337j11129q4044j39684k20159j79620L652
9862B155370J63697J40839m6813k81447m31445l51748j28095k5025q4204m5952
9852A065177M6060l4631k26931n22236o74463l55101K51862N32476M02630K25360
9842G10203N7724M5822K36880L29066K13244q7976l23404k50181j593J53971J25864
9831A209620J66968M50347O80177O10856K55660j06947l18289l29275j11086K8489
9821B536520o0249k47660l09189j37404J08987K90258L25803J12184j98494l46464
$$ plain form
9892 390869 452626 675459 759362 546265 202458 2499 113653 465932 784583 825791
9882 825791 646298 580929 802998 1088130 1197097 1140919 1006544 939370 1116034 1594239
9872 1594239 2232145 2724774 2924691 2886354 2775225 2691181 2551497 2331338 2151718 2155370
9862 2155370 2319067 2459906 2413093 2131646 1700201 1348453 1220358 1195333 1111129 1065177
9852 1065177 1111237 1076606 849675 327439 -347024 -702125 -450263 82213 484843 710203
9842 710203 767927 813749 1050629 1379695 1592939 1504963 1181559 931378 929785 1083756 1209620
9831 1209620 1376588 1826935 2507112 3117968 3373628 3266681 2948392 2619117 2508031 2536520
9821 2536520 2476271 2228611 1919422 1782018 1891005 2181263 2507066 2619250 2420756 2074292
9811B074292k31681j15088j82708k34181r8061J18144J24309j01001k08171r5006
9801A050848P8289J96221O5629k14547l42137j93873O0585J85346N1248j32031
9791H05578p5322J3500r5928k75160k75011j19234O8343K20758L35493M04884
9781A007901L24472J30334k4832j23307j58858r6888O9179K73375L39414K62878
9771B003668J36913J2549n8222j04221k11962m15332m13117j44069K11560M13306
9761A431073L05493J66274J60660J99863J23238j86984n16118n12356j67597J37780
9751A141326J59602O669j42273r2602J16370J48127j43096l58471j74901K34329
9741H95080N11660M56306J96805m8445j37964j78868k40115j80403k2736K63045
$$ plain form
9811 2074292 1842611 1727523 1544815 1310634 1212573 1330717 1455026 1354025 1145854 1050848
9801 1050848 1129137 1325358 1390987 1176440 834303 640430 701015 886361 937609 805578
9791 805578 730256 743756 647828 372668 97657 -21577 46766 267524 603017 1007901
9781 1007901 1332373 1462707 1437875 1314568 1155710 1058822 1128001 1401376 1740790 2003668
9771 2003668 2140581 2153130 2094908 1990687 1778725 1363393 950276 806207 1017767 1431073
9761 1431073 1736566 1902840 2063500 2263363 2386601 2199617 1683499 1171143 1003546 1141326
9751 1141326 1300928 1307597 1165324 1072722 1189092 1337219 1194123 835652 660751 895080
9741 895080 1406740 1863046 2059851 2011406 1873442 1694574 1454459 1274056 1251320 1514365
9731A514365N50429N41762J82709k76417n24547m91712l55800j91306R4788L81392
9721A425663M63014J87963k46016m32215l42178k49013k13765j04871P98M0495
9711E29875N8338M9045J28663K31317J31384j37771l72536m04778j99946J34808
9701A48399M69388N94237M37926K21471o2358n13467q41881o67709k01105N2204
9691c62895J0034l777K14827N19691N14834K17701J3474j8992L2436R4240J81806
9680A413379J58867N0211J51764M69981O47446N02133J04575l80237o11108m51613
9670B055398l08845l25092j74897R3444J88829J10357N8107O0161k2247r3792
9660A641423J58067M50141L68358N4897k17589m47960o06380o17387n48515n24343
$$ plain form
9731 1514365 2064794 2606556 2789265 2512848 1988301 1496589 1140789 949483 1044271 1425663
9721 1425663 1888677 2076640 1830624 1398409 1056231 807218 593453 488582 489380 529875
9711 529875 588213 637258 765921 997238 1128622 990851 618315 213537 13591 148399
9701 148399 617787 1212024 1649950 1871421 1809063 1295596 453715 -213994 -415099 -362895
9691 -362895 -352861 -356638 -141811 377880 892714 1110415 1123889 1104897 1137333 1231573 1413379
9680 1413379 1572246 1622457 1774221 2244202 2891648 3393781 3498356 3118119 2507011 2055398
9670 2055398 1746553 1421461 1246564 1340008 1528837 1639194 1697301 1757462 1735215 1641423
9660 1641423 1799490 2249631 2617989 2672886 2455297 2007337 1400957 783570 235055 -289288
9650b89288m53807j26752J74356J49218J14405K75181L98907J94806j00260j98113
9640A38653q4896Q3837K11433L61459L98450P8668m49278q21339o24327j9421
9630g26761L61691L84047L42714L53427L85804L81088K01654p5849k56550l08230
9620A043035l80576m29992l83749k28962N530K35483L68312K87807J61991K79461
9610I58340M35250L76950K03000P5409L32r1222j34810j22208j65440k04982r1646
9599A238973J2645p6762j66981o9650J25242K15378K37705L34091L51999K55524
9589B458164J38575j6742j26077r5024j710j5879q8829n8046N9873Q8225l9255
9578B303275k96130m99824o11304o75747m95295j10030K74831O29433Q16720O63728
$$ plain form
9650 -289288 -743095 -869847 -695491 -546273 -431868 -156687 242220 437026 336766 138653
9640 138653 53757 137594 349027 710486 1108936 1187604 738326 -83013 -707340 -726761
9630 -726761 -365070 18977 361691 715118 1100922 1482010 1683664 1607815 1351265 1043035
9620 1043035 662459 232467 -151282 -380244 -374714 -139231 229081 516888 678879 958340
9610 958340 1393590 1770540 1973540 2048949 2049281 1958059 1823249 1701041 1535601 1330619 1238973
9599 1238973 1251618 1174856 1007875 938225 1063467 1278845 1516550 1850641 2202640 2458164
9589 2458164 2596739 2579997 2453920 2358896 2357186 2341307 2252478 2194432 2254305 2342530 2303275
9578 2303275 2007145 1507321 896017 220270 -275025 -385055 -110224 519209 1335929 1999657
9568A999657L36225K31065K51385J91330K24632K16739p5561m52024l57385R2810
9558B658873K76109L19347L78009K48879J6433k36969l62448k29654J1697J80758
9548C261034J88221R0595j44142m15963m44703o5491M11159N67142M11599P1701
9538C931152l70441n92886n06268l03910m4149J55133J81609L6003j80489j94315
9528B111439r6418j16311k23987k42345j65688j18699j83475k54272j77879n3970
9518D78395J3202J4647m5301k11151m79669o21944m40095l8589K89840L69100
9508f71565M17736N66486O19158M87476K21164n6918j58717l7570J14778P8372
9498A580400n8173n4172M093J2570K9746J8375j01127k73773l75879m45517m07950
$$ plain form
9568 1999657 2335882 2566947 2818332 3009662 3234294 3451033 3375472 2923448 2566063 2658873
9558 2658873 2934982 3254329 3632338 3881217 3897650 3660681 3298233 3068579 3080276 3261034
9548 3261034 3449255 3539850 3395708 2979745 2535042 2469551 2880710 3447852 3859451 3931152
9538 3931152 3560711 2967825 2461557 2157647 2113498 2268631 2450240 2486243 2305754 2111439
9528 2111439 2015021 1898710 1674723 1432378 1266690 1147991 964516 710244 532365 478395
9518 478395 491597 506244 460943 249792 -229877 -851821 -1291916 -1330505 -1040665 -671565
9508 -671565 -253829 312657 931815 1419291 1640455 1583537 1424820 1387250 1502028 1580400
9498 1580400 1522227 1468055 1472148 1484718 1514464 1532839 1431712 1157939 782060 336543 -71407
9487g1407j38349J92369L39379L51564L47331K80729J35805K9477J01343K22240
9477A790481J15889k01041n38352n97194k38193J37342J31200j05223j40230K9792
9467C84471O6728j23878k40684j09151L9229J3736L7643J73955K23780K85354
9457G51183M17590M41933L09312J16717m6075r0236m3433L2443N3855K5406J885
9446A970580M9427K59692L65578J34745k95198n41110m27522l16613m48999m92087
9436B58493k35534J6562J49938K59235L84971O20489Q26274P59866M28532K8641
9426C497467j56478j43314j21033m2616j08230l28894l99459l78738j95990J14040
9416A736755K59921K27175Q2649j1715k1173l5453p7728r3576o3717R8088L87610
$$ plain form
9487 -71407 -209756 -17387 321992 673556 1020887 1301616 1437421 1466898 1568241 1790481
9477 1790481 1906370 1705329 1166977 569783 331590 468932 600132 494909 354679 384471
9467 384471 451199 327321 86637 -22514 16715 30451 68094 242049 465829 751183
9457 751183 1168773 1610706 1920018 2036735 1990660 1900424 1856991 1889434 1943289 1968695 1970580
9446 1970580 2020007 2279699 2645277 2780022 2484824 1943714 1516192 1199579 750580 258493
9436 258493 22959 39521 189459 448694 833665 1454154 2280428 3040294 3468826 3497467
9426 3497467 3340989 3197675 3076642 3034026 2925796 2596902 2197443 1818705 1622715 1736755
9416 1736755 1996676 2223851 2306500 2294785 2273612 2238159 2160431 2066855 2003138 2101226 2488836
9405B488836O20876O38005M67768J46510k74602n08351n95680o56104n59288k63999
9395A503971J44292M58162N65326N59384M87601L98554K73259J07550j12147l22402
9385D063550m92017o77581q45306p52713l85389M4150L96179N95455N69700M17126
9375B933154L15293K58942J70513O4962k1466j78519m71472o72995p66207q16139
9365H16066n91543j72206J09015K61645M55196N47647L30862J21788J25987M6925
9355B051382l34607o70590n87803j90785J36804J55172l7803j22205L2747J89614
9345F21926K28002K40035K61885K03635J58099J83717l5829n37648q36422p37597
9335b50197m47885k41643j86238J6555K48318L38168L55629L28693L62020O39218
$$ plain form
9405 2488836 3109712 3747717 4215485 4361995 4087393 3579042 2983362 2327258 1767970 1503971
9395 1503971 1648263 2106425 2671751 3231135 3718736 4117290 4390549 4498099 4385952 4063550
9385 4063550 3571533 2893952 2048646 1295933 910544 954694 1350873 1946328 2516028 2933154
9375 2933154 3248447 3507389 3677902 3742864 3721398 3542879 3071407 2398412 1632205 816066
9365 816066 224523 52317 161332 422977 878173 1425820 1756682 1878470 2004457 2051382
9355 2051382 1716775 1046185 458382 267597 404401 559573 521770 399565 432312 621926
9345 621926 849928 1089963 1351848 1555483 1713582 1897299 1861470 1323822 487400 -250197
9335 -250197 -698082 -939725 -1125963 -1109408 -861090 -522922 -167293 161400 523420 1162638
9325A162638Q60970O88436L80508J96470J12782J89019L52830K69452L452k40667
9315C975890l57715l52928l67495l73080k47264l5135J58660K92839K97799K01207
9305C192778R9209k1721j38769k45219l16779k62836j76039j79995k06704l02141
9295A441784m34686l16932q5353j76110l99894m68938m04953k37279O802L06748
9285g68811N02225M83369L90694L75700M58822M82420L40124R9417j20010j60738
9275B083212m816O5141j29859l52603m63806n50492n14168k53434K4246J97335
9265A00756L57198M49339L91239J89231n6054j80586j08897K5730R0255K9402
9255A287613j07385k00238j41247N3347J96664J12555k2384l7762J07488K85262
$$ plain form
9325 1162638 2023608 2712044 3092552 3289022 3401804 3590823 3943653 4213105 4216557 3975890
9315 3975890 3618175 3265247 2897752 2524672 2277408 2242273 2400933 2693772 2991571 3192778
9305 3192778 3291987 3270266 3131497 2886278 2569499 2306663 2130624 1950629 1743925 1441784
9295 1441784 1007098 690166 604813 428703 28809 -440129 -845082 -1082361 -1075559 -768811
9285 -768811 -266586 216783 607477 983177 1441999 1924419 2264543 2363960 2243950 2083212
9275 2083212 2078396 2143537 2013678 1661075 1197269 646777 132609 -120825 -96579 100756
9265 100756 457954 907293 1298532 1487763 1431709 1251123 1142226 1167956 1258211 1287613
9255 1287613 1180228 979990 838743 892090 1088754 1201309 1178925 1141163 1248651 1533913
9245A533913K68407O4541j14883j09303L8522J79518K95402M46202N51571M56505
9235C610395K17754o8241k92438m95610o63022o44041o14128o74744n30470j79493
9225c34038K03024M50686M15365J21526j96292k82714m0748L26316N24689L71212
9215A559026l8941k23305j59047j63401k57098k82176j42385o0969j47838j06753
9205b2887o090P92J22969M23070N74640M57703K57610J09108r7184l18580l67141
9194A134010j79025J56514K67359J22464n1688r4827L8696J60392J29524K9243
9184A712662K3472N4238R6892O9992o2835o5646J39866L33439K79204L0720k67330
9173B344674n70266p18228n90916k80486K7555J89031J51706j13383m55344n02821
$$ plain form
9245 1533913 1802320 1866861 1751978 1642675 1681197 1860715 2156117 2602319 3153890 3610395
9235 3610395 3828149 3759908 3467470 2971860 2308838 1664797 1050669 375925 -154545 -334038
9225 -334038 -131014 319672 735037 856563 660271 377557 336809 663125 1187814 1559026
9215 1559026 1520085 1296780 1137733 974332 717234 435058 292673 231704 83866 -22887
9205 -22887 -28977 -28185 94784 517854 1092494 1550197 1807807 1916915 1819731 1501151 1134010
9194 1134010 954985 1111499 1378858 1501322 1449634 1354807 1393503 1553895 1683419 1712662
9184 1712662 1736134 1790372 1887264 1957256 1894421 1828775 1968641 2302080 2581284 2612004 2344674
9173 2344674 1774408 1056180 465264 184778 212333 401364 553070 439687 -15657 -518478
9163e18478k96406m9387J96458M31184O06257N91009L52489M5829j99242l92986
9153G66727m28884k65023k7871J84212K13279J10190K1170R6484K88819K53786
9143A212889j8195j54453j77298k56415l23480l38721k99776k40406j79496o6770
9133h42121J4137M3483M7070J442j8313J43707L55785K63070P7864R9213J34824
9122C20161J38678L05514M26254K50835p0216l99189m74951j08142K85517L48967
9112A023428K11606M4512l5071m7201L1391J04968j67440m77591k79406L14505
9102G23701O92338M90754J02251q1774k20962m03177n07132m72237l50173j40168
9092a66579J04948K69931K27398q480j50191j23090L137O4246J18477K63711L02372
$$ plain form
9163 -518478 -814884 -864271 -667813 -236629 369628 960637 1313126 1358955 1159713 766727
9153 766727 337843 72820 44949 229161 442440 552630 573800 670284 959103 1212889
9143 1212889 1194694 1040241 862943 606528 283048 -55673 -355449 -595855 -775351 -842121
9133 -842121 -827984 -784501 -737431 -735989 -754302 -610595 -254810 8260 86124 185337 320161
9122 320161 458839 764353 1190607 1441442 1371226 972037 497086 388944 674461 1023428
9112 1023428 1235034 1279546 1244475 1197274 1228665 1333633 1166193 688602 409196 723701
9102 723701 1416039 1906793 2009044 1927270 1706308 1303131 795999 323762 -26411 -166579
9092 -166579 -61631 208300 435698 427218 277027 153937 157074 221320 339797 603508 905880
9081I05880K17590R0662J7341P4167J1040k74402m13140j51621L30482M91235
9071A299234J25891l57431n94227m56189L50L54643L40745K41134K71659K19876
9061A445685O4873j39059j46984J05226L18616M17825K61948p9344k40749n6697
9051A951340J83212J82362p117l16209n48007m30631r5868P5583l3812j20996
9041H39857P4189K34360R6163j98218m13706m08647l37258l79463l69715k04974
9031a067412L4545K58029J91110K8840J91162N09882N87286L91685L03927L94990
9021A824044L68527J21937j56351l30359l85764k58003Q204J66888R0187n623
9011A443687K3635J30777K00291J22051j2145j97862m15326n02576m00059k49326
$$ plain form
9081 905880 1123470 1214132 1231473 1305640 1316680 1042278 629138 477517 807999 1299234
9071 1299234 1425125 1067694 473467 17278 17628 372271 713016 954150 1225809 1445685
9061 1445685 1510558 1371499 1224515 1329741 1648357 2066182 2328130 2248786 2008037 1951340
9051 1951340 2134552 2316914 2309797 1993588 1445581 1014950 919082 994665 960853 839857
9041 839857 914046 1148406 1244569 1046351 632645 223998 -113260 -492723 -862438 -1067412
9031 -1067412 -1032867 -774838 -583728 -554888 -363726 146156 733442 1125127 1429054 1824044
9021 1824044 2192571 2314508 2158157 1827798 1442034 1184031 1192235 1359123 1449310 1443687
9011 1443687 1467322 1598099 1798390 1920441 1908296 1710434 1295108 792532 392473 143147
9001A43147j16682K1169J00140R7863n68j79391k88438j52815K12908M58583N52972
8990H48888O56050O50347M28935k4451m59502n00524k11336o7649j87726k50340
8980H82692k23403k36248k54626k03521j33104O2808K93072K14442m4376j86637
8970A71099j09670R4069L29784M17517K57733L3715p7041m5262p131m7877j56401
8959H60535k99920k46458l6992J12906Q2568p0276q8575l8367l6105L3280J71762
8948D44358K30009J08117o7081m4126J69837L01042K93516K55655L03786N14100
8938B509213O42599M80071J90577j31696m13235m21601j75107P3485J56292J38872
8928C049470O6211k9989j55687l14327l61950l33630l40953l41394k28138j23923
$$ plain form
9001 143147 26465 47634 147774 245637 245069 65678 -222760 -375575 -162667 295916 848888
8990 848888 1504938 2155285 2584220 2559769 2100267 1599743 1388407 1320758 1133032 882692
8980 882692 659289 423041 168415 -35106 -168210 -105402 187670 402112 357736 171099
8970 171099 61429 155498 485282 902799 1160532 1194247 1117206 1071944 1064813 1016936 860535
8959 860535 560615 314157 277165 390071 472639 402363 313788 275421 239316 272596 444358
8948 444358 674367 782484 715403 671277 841114 1142156 1435672 1691327 1995113 2509213
8938 2509213 3151812 3631883 3822460 3690764 3277529 2855928 2680821 2754306 2910598 3049470
8928 3049470 3115681 3085692 2930005 2615678 2253728 1920098 1579145 1237751 1009613 885690
8918H85690j03774m4355K9344Q9829Q8876L1036J08434J93440J59644J24914L6743
8907A599821j60698l40677m91484o23778o21128l19199J21787L23492K81178K51958
8897B1272K05440Q3481K0259J0747j0638N6901K18263L51744L09060R3100l1685
8886A327944m8279p1228k2540Q7919K31251M48796O44810N91202L26414J23233
8876C639522J01967L3741j93019l41208l72925k13870O2475J71653M3815k23619
8866B708532l27594j29965K38680N41160N92816L09834j73652m98828n08233m55719
8856B297031m56905l64336p2105K18412K06348Q2676l3168j80008k07434j18033
8846A372478j6497K14263N09469M82094J27042q8787j61963k11535m5096K82070
$$ plain form
8918 885690 781916 737561 766905 856734 945610 976646 1085080 1278520 1438164 1563078 1599821
8907 1599821 1439123 1098446 606962 -16816 -637944 -957143 -835356 -511864 -230686 21272
8897 21272 226712 310193 330452 341199 330561 387462 605725 957469 1266529 1359629 1327944
8886 1327944 1279665 1208437 1185897 1273816 1505067 1953863 2598673 3189875 3516289 3639522
8876 3639522 3741489 3775230 3582211 3241003 2868078 2654208 2716683 2888336 2932151 2708532
8866 2708532 2380938 2250973 2489653 3030813 3623629 3933463 3759811 3260983 2752750 2297031
8856 2297031 1840126 1475790 1403685 1622097 1828445 1911121 1877953 1697945 1490511 1372478
8846 1372478 1355981 1570244 2079713 2561807 2688849 2600062 2438099 2226564 2181468 2463538
8836B463538L89320J90523L6863Q3531J10784R9321O2515j64171n63782q53267
8826A855175p80163m47670j99745j11849N389J63086K71839K61126J91611R7527
8816A306326m0503k14722l28840k57797q6387O5189L02475M35302K66500J4987
8806A462530j48118j93072o8511Q9879J14721K11493M07481M78935N14435M95299
8796C365072L26673J17383l9204k09317m47313n02730k05733K25114L51878R7251
8786C079074j40625j68574k47703l98408l19469o5966K13196L43699J69516j07963
8776B356777k81249k55106j68124j96943k32582m8903L41015O48736N61502K27218
8766B952341j6418j4544J14969K15697J92464q4999l42638l26937j14405K43642
$$ plain form
8836 2463538 2852858 3043381 3080244 3163775 3274559 3373880 3436395 3272224 2708442 1855175
8826 1855175 1075012 627342 427597 315748 321137 484223 756062 1017188 1208799 1306326
8816 1306326 1265823 1051101 722261 464464 378077 443266 745741 1181043 1447543 1462530
8806 1462530 1314412 1121340 1052829 1142708 1257429 1468922 1876403 2355338 2869773 3365072
8796 3365072 3691745 3809128 3769924 3560607 3113294 2610564 2404831 2629945 2981823 3079074
8786 3079074 2938449 2769875 2522172 2123764 1804295 1738329 1951525 2295224 2464740 2356777
8776 2356777 2075528 1820422 1652298 1455355 1222773 1173870 1514885 2163621 2725123 2952341
8766 2952341 2935923 2921379 3036348 3252045 3444509 3359510 3016872 2689935 2575530 2819172
8756B819172M40613M62210M13757J83396p9234j23501J3844J74053K56634K03914
8746D764858M6103j79813l19073k99991k26701k40688k25964p6104K384j14574
8736C130437q2966J65620J50799j01967j97274q7242J1638N0174K01672L66506
8726C607397L55634J84228L5504Q0999R4560j11144l06372j67861K43549N02620
8716D519114M24018J76474J26975K70512L25271J63747j58364l95580l22343r5811
8706E034013K5589J8153q0200j21983j47615k33536l18992l20708k69136k76005
8696C309580k42660k3040K46358K70276O0472o4652o6029o7202q4977o2530o3840
8685C211756j79390k97716k65562n1960J44191K24146K35995K12509J75410L14406
$$ plain form
8756 2819172 3259785 3721995 4135752 4319148 4239914 4116413 4130257 4304310 4560944 4764858
8746 4764858 4810961 4631148 4312075 4012084 3785383 3544695 3318731 3242627 3245011 3130437
8736 3130437 3047471 3213091 3363890 3261923 3064649 2977407 2989045 3039219 3240891 3607397
8726 3607397 3963031 4147259 4182763 4263762 4358322 4247178 3940806 3772945 4016494 4519114
8716 4519114 4943132 5119606 5246581 5517093 5842364 6006111 5847747 5452167 5129824 5034013
8706 5034013 5059602 5077755 4997555 4875572 4727957 4494421 4175429 3854721 3585585 3309580
8696 3309580 3066920 3043880 3290238 3560514 3620986 3556334 3490305 3423103 3338126 3275596 3211756
8685 3211756 3032366 2734650 2469088 2417128 2561319 2785465 3021460 3233969 3409379 3723785
8675C723785N31759M71016K41368J40479J33475J04572J161k18728m39762m66680
8665D222445j93762J70469L24625K36284N7971p9578j35656j64147k33722l30683
8655C874246k37968J16403M97344N66877L47760J49542P255n5452j18157k33096
8645D914754j66314K0879P9192M9753J37034K10908J20554K2055m9591K085K48893
8634E590202M28522M04389J85001L2699J98691M02752M75074N50863O28045N92221
8624I488459N27471N54728N27301M96380N65234M70708L39419N10472P78339P54164
8614A5012675N68148N17854O63845Q30673R42829R85480R31215P16020K57328
8605B1426067k39449n62097o16186n91556q41990j234003j397409j290605j102772
$$ plain form
8675 3723785 4255544 4726560 4967928 5108407 5241882 5346454 5347615 5128887 4689125 4222445
8665 4222445 4028683 4199152 4523777 4760061 4818032 4738454 4602798 4438651 4204929 3874246
8655 3874246 3636278 3752681 4250025 4816902 5164662 5314204 5321459 5266007 5147850 4914754
8645 4914754 4748440 4769319 4848511 4898264 5035298 5246206 5366760 5388815 5339224 5341309 5590202
8634 5590202 6018724 6423113 6608114 6640813 6839504 7242256 7717330 8268193 8896238 9488459
8624 9488459 10015930 10570658 11097959 11594339 12159573 12630281 12969700 13480172 14258511 15012675
8614 15012675 15580823 16098677 16762522 17593195 18536024 19521504 20452719 21168739 21426067
8605 21426067 21186618 20624521 20008335 19416779 18574789 17340786 15943377 14652772 13550000
8596A3550000r32418p85809p44803p49921p13687o17282m55867k03618m0650k55403
8586H050542m40481k99107j92456j69020j33991j76342k79263l31252l54291k69239
8576E405100n8419K24130M02658L53464J89011L8349m2989n7864q528q0855k32726
8565F131331k20285R804K67649L53751J45818k52889m51615k92843q6514r2864
8555E511343r9270j02873j68584j54146p6330m7547j3189R7873O3838k26976n03117
8544D281022m89654k53923R0950M82540O86621M80851O5115k03902k55467j62379
8534D721774j34980j92617j47397k4919O1640J53366J71056R0055N0176l6003
8524D712151j05865K3083J71217J17867j05862k80736k28150J2735J12820j75391
$$ plain form
8596 13550000 12617582 11831773 11086970 10337049 9623362 9006080 8550213 8346595 8305945 8050542
8586 8050542 7610061 7310954 7118498 6949478 6815487 6639145 6359882 6028630 5674339 5405100
8576 5405100 5346681 5570811 5973469 6326933 6515944 6554293 6511304 6453440 6444912 6364057 6131331
8565 6131331 5911046 5920850 6188499 6542250 6688068 6435179 5983564 5690721 5604207 5511343
8555 5511343 5412073 5309200 5140616 4986470 4910140 4862593 4849404 4947277 5011115 4784139 4281022
8544 4281022 3791368 3537445 3628395 4110935 4797556 5278407 5343522 5139620 4884153 4721774
8534 4721774 4586794 4394177 4246780 4221861 4283501 4436867 4607923 4697978 4748154 4712151
8524 4712151 4606286 4629369 4800586 4918453 4812591 4531855 4303705 4316440 4429260 4253869
8514D253869n70637o83629n00185l13664k03235j65897k15157j98691j9774K11996
8504A594996M11983O52184R34680J061162R52014N92825P6369k22742j80735q1213
8494E791523M065J40835Q6560k20444m57693m42587k69647q2328m7095j50012
8484D353177j29095J15322L62934L16532J08751Q2241J93498J71220l1292k81085
8474E262203l53812j90348m7838k2812M2073K05578L75833M32462L18256J13208
8464F134803n4513j34116j54064k10780k91923l11723m48975o79564o46791l48087
8454B854267n0564J48043L02479L26216K39967J81826J18251j3824n070J58506
8444D260097L30307N16182O86415P17001N01420Q1433l81523q95531j118912o30999
$$ plain form
8514 4253869 3683232 2999603 2499418 2185754 1982519 1816622 1601465 1402774 1383000 1594996
8504 1594996 2006979 2659163 3593843 4655005 5607019 6199844 6276213 6053471 5872736 5791523
8494 5791523 5795588 5936423 6022983 5802539 5344846 4902259 4632612 4550284 4503189 4353177
8484 4353177 4224082 4339404 4702338 5018870 5127621 5209862 5403360 5574580 5543288 5262203
8474 5262203 4908391 4718043 4670205 4647393 4689466 4895044 5270877 5703339 6021595 6134803
8464 6134803 6080290 5946174 5792110 5581330 5289407 4977684 4528709 3849145 3202354 2854267
8454 2854267 2803703 2951746 3254225 3580441 3820408 4002234 4120485 4106661 4101591 4260097
8444 4260097 4590404 5106586 5793001 6510002 7011422 7092855 6711332 5815801 4696889 4065890
8434D065890R84J12885k22381n32943m84968k78755j74583j43993j42465j71982
8424B027689j75241j82511j71386N7714M13371N76798N05050L15756J06306Q0360
8414C553906K27666K51589K6242o3870J93964M44202M58319K34507j01694l39547
8404D885284l23269j35140N5848J04596J0132p0987p6353N4079K63968L46224
8394E114382J47106j96670l84273k96061p2120K30543M69049N79335O75219P43484
8384G009994O25640K87071j41361n38702o89113n04830k34745n4638J66100L34197
8374F259613K60692J24189Q1666J29405J53754p0280m14833o04652o14713m58619
8364D846222k50863j29747q2988Q2892L86473N54818M36967K67060J96095K80304
$$ plain form
8434 4065890 4066874 4179759 3957378 3424435 2939467 2660712 2486129 2342136 2199671 2027689
8424 2027689 1852448 1669937 1498551 1556265 1969636 2546434 3051484 3367240 3473546 3553906
8414 3553906 3781572 4033161 4059403 3995533 4189497 4633699 5092018 5326525 5224831 4885284
8404 4885284 4562015 4426875 4482723 4587319 4597451 4526464 4450111 4504190 4768158 5114382
8394 5114382 5261488 5064818 4680545 4384484 4312364 4542907 5011956 5591291 6266510 7009994
8384 7009994 7635634 7922705 7781344 7242642 6553529 6048699 5813954 5759316 5925416 6259613
8374 6259613 6520305 6644494 6726160 6855565 7009319 6939039 6524206 5919554 5304841 4846222
8364 4846222 4595359 4465612 4382624 4465516 4851989 5406807 5843774 6110834 6306929 6587233
8354F587233L69764M29569M53410K37735l9120r4023j23875k92011l51669k19758
8344F957255j20739j15350J5116K86311L45867K47110J58641L7933L3257J28387
8334G973788R3527J19552L63325N30811N67538O01330O50769P13146P10932N19403
8324A2844121J63880j78328j91922J61621O31347Q86791Q42331P46313P68230
8315A6674384Q44783J006245J233248J335235J278439J206591J253376J448274
8307B6280575J780366K236617K626695K940032L160041L045933K510188J650592
8299D6231039O93160m9506m71121p56326j137064j633778j989212k072027k066948
8290C6748217k090959j975576j696478j429432j174136q63192n99535o19616q14441
$$ plain form
8354 6587233 6956997 7386566 7839976 8077711 8038591 7944568 7820693 7528682 7177013 6957255
8344 6957255 6836516 6721166 6736282 7022593 7368460 7615570 7774211 7812144 7845401 7973788
8334 7973788 8067315 8186867 8550192 9081003 9648541 10249871 10900640 11613786 12324718 12844121
8324 12844121 13008001 12829673 12637751 12799372 13430719 14317510 15159841 15906154 16674384
8315 16674384 17519167 18525412 19758660 21093895 22372334 23578925 24832301 26280575
8307 26280575 28060941 30297558 32924253 35864285 39024326 42070259 44580447 46231039
8299 46231039 46924199 46874693 46403572 45647246 44510182 42876404 40887192 38815165 36748217
8290 36748217 34657258 32681682 30985204 29555772 28381636 27518444 26918909 26299293 25484852
8281B5484852q84942p79126m96997r3755M32356R03213R97980O36710J91571J50956
8271B6542818L02864J91365m2483m3031L01352P20416R69337J086199J238603
8262C1267440J604132K026507K156541K116632K294464K683599L058899L383668
8254E0591882L795509M389667N038579N553312N850904N954801O215457O697178
8246I4087289P017899O918251O367397N422912L944388J995829l6336j986923
8238A23730706m020693n880930p008294p310990p263949p025070o474518n721761
8230G3024501m898818m176101l537389k888462k436266k305059k083853j603217
8222D9095336j070296o58046l57370r3407J51923K75124K69581K14138K94420
$$ plain form
8281 25484852 24599910 23820784 23323787 23230032 23662388 24565601 25563581 26200291 26391862 26542818
8271 26542818 26845682 27037047 26994564 26951533 27252885 27973301 28942638 30028837 31267440
8262 31267440 32871572 34898079 37054620 39171252 41465716 44149315 47208214 50591882
8254 50591882 54387391 58777058 63815637 69368949 75219853 81174654 87390111 94087289
8246 94087289 101105188 108023439 114390836 119813748 123758136 125753965 125717629 123730706
8238 123730706 119710013 113829083 106820789 99509799 92245850 85220780 78746262 73024501
8230 73024501 68125683 63949582 60412193 57523731 55087465 52782406 50698553 49095336
8222 49095336 48025040 47366994 47009624 46916217 47068140 47343264 47612845 47826983 48121403
8213D8121403O46280R81149J010428R46175R82571J063893J267110J695270K197851
8204E8912130K566080K870874L292205L785930M462067N302449O029892O740205
8196I3961832P585979Q537148R590801J0734005J1917169J3021537J3824267J4274115
8188A83446853J4322952J3590891J1865958R288655N950868J981065k398259o825517
8180B31223466j0668938j3460348j5150263j5741340j5285195j4184987j2905560
8173A33826835j1427925r865738q547673p307508n979538m690355l620067k891969
8165G9496062k422146k035366j683848j340937j088649r83645q84570q13784p57636
8156F7485481n77059k93738Q0564M98426R73713J397207J495810J381351J440877
$$ plain form
8213 48121403 48767683 49748832 50759260 51705435 52688006 53751899 55019009 56714279 58912130
8204 58912130 61478210 64349084 67641289 71427219 75889286 81191735 87221627 93961832
8196 93961832 101547811 110084959 119675760 130409765 142326934 155348471 169172738 183446853
8188 183446853 197769805 211360696 223226654 232515309 238466177 240447242 238048983 231223466
8180 231223466 220554528 207094180 191943917 176202577 160917382 146732395 133826835
8173 133826835 122398910 112533172 103985499 96677991 90698453 86008098 82388031 79496062
8165 79496062 77073916 75038550 73354702 72013765 70925116 69941471 69056901 68243117 67485481
8156 67485481 66908422 66614684 66695248 67193674 68167387 69564594 71060404 72441755 73882632
8147G3882632J782580K292772K832967L474564M308114N250798O307320P501962
8139A07633709Q718100R919188J1164339J2352034J3443848J4475389J5391471
8132A93098078J6038662J6185206J5694816J4372963J1853156Q083580L404351
8125B78730812j569729o457230j0993004j4677382j7294311j8970220j9418509
8118A89350427j8340470j6336285j4126391j2052559j0190995q499148p094200
8111A02710379o159014n591654n136023m517947l740474l193008l077167l015767
8103F8279325k510095j639919q61168n74035o60882q31082q65884n45503J6695
8094E9807452N33723R63671J262639J449185J788740K386020K984571L469797
$$ plain form
8147 73882632 75665212 77957984 80790951 84265515 88573629 93824427 100131747 107633709
8139 107633709 116351809 126270997 137435336 149787370 163231218 177706607 193098078
8132 193098078 209136740 225321946 241016762 255389725 267242881 275326461 278730812
8125 278730812 277161083 270703853 259710849 245033467 227739156 208768936 189350427
8118 189350427 171009957 154673672 140547281 128494722 118303727 109804579 102710379
8111 102710379 96551365 90959711 85823688 81305741 77565267 74372259 71295092 68279325
8103 68279325 65769230 64129311 63268143 62694108 62033226 61202144 60336260 59790757 59807452
8094 59807452 60341175 61304846 62567485 64016670 65805410 68191430 71176001 74645798
8086G4645798L791050M100328M667675N557285O657930P714421Q676961R652781
8078A25464229J0607433J1615842J2681115J3517060J3815910J3517883J2492779
8071B13712251J0526950P756675M251787O4594m252987q143394j1420406j3955232
8063A98540238j5560033j6001808j5427716j4432356j3223518j1737962j0153126
8056A02003719q746439p537837o443646n537764m817082m230326l653309k967366
8048E8069950k349221j912873j710826j591573j240813q47700p30011o89425n08586
8039D6488922l38855m05101o28005o48556m26767j66822J14878N41491J064963
8030D5596148J520309J753064J824236J964980K303480K785564L366644L967940
$$ plain form
8086 74645798 78436848 82537176 87204851 92762136 99420066 107134487 115811448 125464229
8078 125464229 136071662 147687504 160368619 173885679 187701589 201219472 213712251
8071 213712251 224239201 231995876 236247663 236312257 232059270 223915876 212495470 198540238
8063 198540238 182980205 166978397 151550681 137118325 123894807 112156845 102003719
8056 102003719 93257280 85719443 79275797 73738033 68920951 64690625 61037316 58069950
8048 58069950 55720729 53807856 52097030 50505457 49264644 48416944 47686933 46997508 46488922
8039 46488922 46150067 45744966 45116961 44468405 44041638 43874816 43989694 44531185 45596148
8030 45596148 47116457 48869521 50693757 52658737 54962217 57747781 61114425 65082365
8022F5082365M535693N055441N439870N734153O025230O226853O347293O238863
8014A10685761N658277M555356K930346Q70315j449050l562395n164663o413301
8006A08110646p304227p869055q085175p797880o983110n842050m811680m076228
7998E5341241l429525k720627k098430j757549j593143j356931r62477m63596
7990D0958963J8152L27696M28981M73238O26001O57810L64354L5013j54479m10958
7980D3324771r12831j468748j703749j503109j137604q18535o45855o81902p21461
7971C3730977n16894j73244J5948M4198J49001L86315O60555R44804J138862J298013
7961C7678535J479297J625162J768126J745872J379948Q17718L23533k19994q44586
$$ plain form
8022 65082365 69618058 74673499 80113369 85847522 91872752 98099605 104446898 110685761
8014 110685761 116344038 120899394 123829740 124700055 123251005 119688610 114523947 108110646
8006 108110646 100806419 92937364 84852189 77054309 70071199 64229149 59417469 55341241
7998 55341241 51911716 49191089 47092659 45335110 43741967 42385036 41422559 40958963
7990 40958963 40977115 41304811 41733792 42207030 42833031 43490841 43855195 43890208 43735729 43324771
7980 43324771 42411940 40943192 39239443 37736334 36598730 35780195 35134340 34452438 33730977
7971 33730977 33214083 33040839 33056787 33100985 33249986 33636301 34296856 35241660 36380522 37678535
7961 37678535 39157832 40782994 42551120 44296992 45676940 46494658 46818191 46598197 45753611
7952D5753611j334847j565621j683841j991668k416261k586299k542264k588789
7944B9044021k635840k569092k378965k066469j628884j253266j075884r61317
7936A4474304p93415o19601n17519n22556n13153m07011l13260j92667l1261p8686
7926A0485175l57999o23283p43913p13163n62330k90743L7403K83907L07377K17949
7916H040380J61833K338k89155m50180k66507l8037q2170k26065l25797m09684
7906F116956k91734L9138K95126L77172K47551o8675l62588l59161j04466J45189
7896F034508K35998L57862L61716M6424k54943l03982j89572j91456n14781q94369
7886D687405q31683l77508O2932L65979N72195N03862K84002K69700M43507L63333
$$ plain form
7952 45753611 44418764 42853143 41169302 39177634 36761373 34175074 31632810 29044021
7944 29044021 26408181 23839089 21460124 19393655 17764771 16511505 15435621 14474304
7936 14474304 13680889 13061288 12543769 12021213 11508060 11101049 10787789 10595122 10563861 10485175
7926 10485175 10127176 9503893 8759980 8046817 7484487 7193744 7231147 7515054 7822431 8040380
7916 8040380 8202213 8204551 7915396 7465216 7198709 7160672 7078502 6852437 6526640 6116956
7906 6116956 5825222 5864360 6159486 6536658 6784209 6715534 6352946 5993785 5889319 6034508
7896 6034508 6270506 6628368 6990084 7036508 6781565 6477583 6288011 6096555 5581774 4687405
7886 4687405 3855722 3478214 3541146 3907125 4479320 4983182 5267184 5536884 5980391 6343724
7876F343724o1827l17295k00088J09742M03158L76011N6413k66842m13420m25576
7866E604000l19857L866L68912M51909K01970j38585l51404l62858k39015q3689
7856E135249J20418L70415M97604M61627L48901J61398K7596J0605m1832j56373
7846F935608k08750j62619r8078N05M23764R61322J041617P72663N92818N72711
7836A0831561O18893O96283O17315M30569M34514N73602P10755P92910Q52613
7827A6559015J025712J196843J186498J153385J233398J370481J518459J661877
7819B6905668J872286K266485K690879K877317K932246L120738L399865L474970
7811D9540454L293404L208702L192599K937769K426267J802684J018985p2526
$$ plain form
7876 6343724 6281897 5964602 5764514 5874256 6277414 6653425 6709838 6442996 6029576 5604000
7866 5604000 5284143 5288009 5656921 6108830 6310800 6172215 5820811 5457953 5218938 5135249
7856 5135249 5255667 5626082 6123686 6585313 6934214 7095612 7123208 7133813 7091981 6935608
7846 6935608 6726858 6564239 6466161 6466666 6890430 7851752 8893369 9666032 10258850 10831561
7836 10831561 11450454 12146737 12764052 13194621 13629135 14202737 14913492 15706402 16559015
7827 16559015 17584727 18781570 19968068 21121453 22354851 23725332 25243791 26905668
7819 26905668 28777954 31044439 33735318 36612635 39544881 42665619 46065484 49540454
7811 49540454 52833858 56042560 59235159 62172928 64599195 66401879 67420864 67348338
7803F7348338j158552k013325k873830l709990m172389m153057l906554l683366
7795D1677275l511272l305292l061112k771414k535294k391008k149696j833361
7787B0118826j535879j330750j223425j143547j120700j116670r74477o50743
7779A1022635k80867p3325o4357m6523M4018k9907l65599o90433o08528k92945
7769H614169j30732j16126k36082l17974k13769k18623k86277k86294k62034k64648
7759F281610k12156j05036r7995l9437J03101J2321k78285l91144k71700m5087
7749D956192J84674K79442K17546O8116o2892o112R8469j50690n04396n58841
7739D521508l83548k29213j57153o9833K7999Q1809R0250J03838P1949m9023j92401
$$ plain form
7803 67348338 66189786 64176461 61302631 57592641 53420252 49267195 45360641 41677275
7795 41677275 38166003 34860711 31799599 29028185 26492891 24101883 21952187 20118826
7787 20118826 18582947 17252197 16028772 14885225 13764525 12647855 11673378 11022635
7779 11022635 10741768 10668443 10604086 10557563 10601581 10571674 10206075 9515642 8907114 8614169
7769 8614169 8483437 8367311 8131229 7813255 7599486 7380863 7094586 6808292 6546258 6281610
7759 6281610 6069454 5964418 5866423 5826986 5930087 5942408 5664123 5272979 5001279 4956192
7749 4956192 5140866 5420308 5637854 5705970 5643078 5636966 5735435 5584745 5080349 4521508
7739 4521508 4137960 3908747 3751594 3681761 3709760 3791569 3881819 3985657 4057606 4008583 3816182
7728C816182l84376m76103l12665r912L04387N59876N10224J85747k29898n56012
7718C407450n38622k09330J59482K97054K08815L6567j10722j65755j47775r3547
7708B843617j52642l83399m67370k50523R1752L48454N07043N52217M63870L55048
7698C908067K78710L50812M13308K58112k5527k51984l20998l75741m85349n94586
7688C154824o02130m24502j70303q366J03725K16812K35660L21414N56147O69986
7678D053267M92338J17842j22002j05668k5804r4923k31300k45703j70689l2641
7668C634717L9309r3999k15297k17190k47917k12057K3628K03191J00142r6884
7658B917643j06093J50186M24818L53308O7308j30665j88672p7626L6575j2045
$$ plain form
7728 3816182 3431806 2955703 2643038 2633126 2937513 3497389 4007613 4193360 3963462 3407450
7718 3407450 2868828 2659498 2818980 3116034 3324849 3361416 3250694 3084939 2937164 2843617
7708 2843617 2690975 2307576 1840206 1589683 1681435 2029889 2536932 3089149 3553019 3908067
7698 3908067 4186777 4537589 4950897 5209009 5183482 4931498 4610500 4234759 3749410 3154824
7688 3154824 2552694 2128192 1957889 1949523 2053248 2270060 2505720 2827134 3383281 4053267
7678 4053267 4545605 4663447 4541445 4435777 4409973 4315050 4083750 3838047 3667358 3634717
7668 3634717 3674026 3580027 3364730 3147540 2899623 2687566 2711194 2914385 3014527 2917643
7658 2917643 2811550 2961736 3386554 3739862 3807170 3676505 3487833 3410207 3446782 3434737
7648C434737j32881j91815j44793o6265k7555O5791J92385K07857J56466J06929
7638C600856J47434K21886J06179m6970m7272K8204J11360L6620j09679j60772
7628C887846j59955o8891K3272j23776l13385k09548R5228L02553L64288L26912
7618D124544J84702K12772L15290K22267P593k17531l09491j48687J01673K06577
7608D699709J50788N8527L8894P220j9239L3891J36969J89818J74537J15000l292
7597E582822l285K63290M75421L75935L16675M64204L97245r3027m50907l71598
7587F956775j76396k2625P2604L871k03157k77014k25786j43096J40681O39711
7577F765568J057382J178710J014298P88339M46155K6918n8787J79549K29977
$$ plain form
7648 3434737 3301856 3110041 2965248 2898983 2871428 2937219 3129604 3337461 3493927 3600856
7638 3600856 3748290 3970176 4076355 4029385 3982113 4010317 4121677 4158297 4048618 3887846
7628 3887846 3727891 3659000 3682272 3558496 3245111 3035563 3130791 3433344 3797632 4124544
7618 4124544 4309246 4522018 4837308 5059575 5067168 4849637 4540146 4391459 4493132 4699709
7608 4699709 4850497 4909024 4947918 4955138 4935899 4969790 5106759 5296577 5471114 5586114 5582822
7597 5582822 5579537 5842827 6318248 6694183 7010858 7475062 7872307 7779280 7328373 6956775
7587 6956775 6780379 6757754 6830358 6834229 6631072 6354058 6128272 5985176 6125857 6765568
7577 6765568 7822950 9001660 10015958 10804297 11250452 11277370 11218583 11398132 11628109
7568A1628109k7704j18995J43560N13349P91000Q97036Q05624O31131N54491M96692
7558A6314293M13621N91388J016265J304721J493805J712171J919981J932251
7550B6698496J645459J382111J528570K124615K926806L551930L746583L683000
7542D7287570L599203L552295L475425L260072K856876K121459J042861k00881
7534F6994880j439675k571014l430911l874755l994818m044857m060165l892372
7526C9686313l593262l164396k647101k166018j871945j818075j794700j686677
7518B0944139j516948j330273j230159j204535j203887j184872j158686j137383
7510A0977396r64739o51832l29970l5969K21813L08686J4736l52844n67454o11672
$$ plain form
7568 11628109 11600405 11481410 11624970 12138319 12929319 13826355 14631979 15263110 15817601 16314293
7558 16314293 16727914 17319302 18335567 19640288 21134093 22846264 24766245 26698496
7550 26698496 28343955 29726066 31254636 33379251 36306057 39857987 43604570 47287570
7542 47287570 50886773 54439068 57914493 61174565 64031441 66152900 67195761 66994880
7534 66994880 65555205 62984191 59553280 55678525 51683707 47638850 43578685 39686313
7526 39686313 36093051 32928655 30281554 28115536 26243591 24425516 22630816 20944139
7518 20944139 19427191 18096918 16866759 15662224 14458337 13273465 12114779 10977396
7510 10977396 10012657 9360825 9030855 8994886 9216699 9525385 9540121 9187277 8619823 8008151
7500H008151m12995k46121k60052l27411l47956l15168k75454k20294k06908j71004
7490E224788J8011L22735N30296N21646L83833J42018m9696N532Q6397m8355l64403
7479F772802o33442o46234m58338m04472o11189q23014q16945n29306k02054n1442
7469A596366K5311K84190N60029N62760M73729M47081K82216k7820k24185k00391
7459C779286K6461K68254L62977K62973J17665K2605o5581r5958p3320n3850k9674
7448D521838j52803l45106l78042l04248k15609j70390k31638k41429M2022M35762
7438B960357N74426M43609K94844J86236J27202K28838J86885q7758k40879j84913
7428D488847n1199J04418J23301q9237j29709L8567R2789r1229m65762o79332
$$ plain form
7500 8008151 7595156 7349035 7088983 6761572 6413616 6098448 5822994 5602700 5395792 5224788
7490 5224788 5242799 5565534 6095830 6617476 7001309 7143327 7093631 7099163 7185560 7137205 6772802
7479 6772802 6139360 5493126 5034788 4630316 4019127 3196113 2379168 1849862 1647808 1596366
7469 1596366 1621677 1905867 2465896 3028656 3502385 3949466 4231682 4203862 3979677 3779286
7459 3779286 3805747 4074001 4436978 4699951 4817616 4840221 4774640 4678682 4605362 4551512 4521838
7448 4521838 4369035 4023929 3645887 3341639 3126030 2955640 2724002 2482573 2524595 2960357
7438 2960357 3534783 3978392 4273236 4459472 4586674 4815512 5002397 4914639 4673760 4488847
7428 4488847 4437648 4542066 4665367 4576130 4446421 4484988 4577777 4486548 4020786 3341454
7418C341454m52465k182L06814M02608K71503k5710k29655k90416k07147j71742
7408B943062l76200o53610r21794j054199p83864l56836r3535J19521K50822K18273
7398g08360J78273K26367K89604L15274L25359L16596K50321J83880J74153J62716
7388A714183M3525R001K64222M25152J81206q5474o4734J08405J82859P3700p7651
7377B774394j27808j07018l8084j9933j07464j71870m9154R2204N5431p3290k11743
7366B015665k46752k16125j97023k36910l15242k61408n7323J00160O0988j05043
7356E40987j07395J6467J37825K22363J33389j28609l19965j84905J63298N03752
7346I77207P22348N87500J27228k75423l62764k12594j40041j77854o8440J83877
$$ plain form
7418 3341454 2888989 2886807 3193621 3596229 3867732 3842022 3612367 3321951 3114804 2943062
7408 2943062 2566862 1913252 991458 -62741 -846605 -1203441 -1296976 -1177455 -926633 -708360
7398 -708360 -530087 -303720 -14116 301158 626517 943113 1193434 1377314 1551467 1714183
7388 1714183 1757708 1766709 2030931 2456083 2637289 2551815 2487081 2595486 2778345 2852045 2774394
7377 2774394 2646586 2539568 2501484 2481551 2374087 2202217 2153063 2245267 2300698 2227408 2015665
7366 2015665 1768913 1552788 1355765 1118855 803613 542205 484882 585042 646030 540987
7356 540987 433592 450059 587884 810247 943636 815027 495062 310157 473455 977207
7346 977207 1699555 2287055 2414283 2138860 1776096 1563502 1423461 1245607 1177167 1361044
7336A361044L54104L19311j9232m34816n45501l51975R090K70796L12239K75480
7326A550540J19678j33883k35502N6811M86809N49997K67436k5681k71473l39797
7316B024935j34486J71771M21890L85882O7102j33380J1867K23504K48908J72415
7306C460408J46306J30478N3987j3453j35372m08223o41017o21494n62584n95011
7296H14025n16756k29936p441l2807m7952O3841K83236M89269M00500J54756l6618
7285A334117q7362Q323J33699K33357J84277K46j50225j37516M368Q4423P8827
7274A686534J66093L05462K90022J32979r8612l17284l31524k04065J8019K87022
7264A934646L88853L01196K30713L38194L88087Q3659l15938m31185j67809J20836
$$ plain form
7336 1361044 1715148 2034459 2015227 1580411 1034910 682935 692025 962821 1275060 1550540
7326 1550540 1670218 1536335 1300833 1357644 1844453 2394450 2661886 2636205 2364732 2024935
7316 2024935 1890449 2062220 2484110 2869992 2937094 2803714 2815581 3039085 3287993 3460408
7306 3460408 3606714 3737192 3791179 3777726 3642354 3234131 2593114 1971620 1409036 814025
7296 814025 297269 67333 59892 27085 -20867 42974 326210 815479 1215979 1370735 1334117
7285 1334117 1246755 1255078 1388777 1622134 1806411 1806657 1656432 1518916 1523284 1607707 1686534
7274 1686534 1852627 2158089 2448111 2581090 2482478 2165194 1833670 1629605 1647624 1934646
7264 1934646 2323499 2624695 2855408 3193602 3581689 3665348 3349410 2918225 2750416 2871252
7254B871252J00701k08545m28435m09105m24726n04969n39409n41887m01889j9826
7244e06838M12415N84263M20214P6863j92861j88023J2666J29162Q2047K7272
7234H57180N9616J86110L12830K89663J89240J80587K55605J00280l65367o82645
7224A383099o46126m27455O6287N50838M53951j8039l10494k02571J38958M15661
7214A404109M44800L33404J76724l1442j38994n8188J07708K36334L47726M32725
7204C254906M05106K64547j6717l95926n67221l80551k04136j20590N8227J76128
7194B473773L7066r8771j48582l61158n52013l94187N3068L85375K58510o3674
7184A589407j39484N6250K78116L18891K25765J19233m8063j83843o3794J75420
$$ plain form
7254 2871252 2971953 2763408 2334973 1925868 1501142 996173 456764 -85123 -487012 -506838
7244 -506838 -94423 489840 910054 986917 794056 606033 618699 747861 829908 857180
7234 857180 916796 1102906 1415736 1705399 1894639 2075226 2330831 2431111 2065744 1383099
7224 1383099 736973 309518 375805 926643 1380594 1362555 1052061 849490 988448 1404109
7214 1404109 1848909 2182313 2359037 2327595 2188601 2130413 2238121 2474455 2822181 3254906
7204 3254906 3660012 3924559 3907842 3511916 2944695 2564144 2360008 2239418 2297645 2473773
7194 2473773 2510839 2412068 2263486 1902328 1350315 956128 1009196 1394571 1653081 1589407
7184 1589407 1449923 1506173 1784289 2103180 2328945 2448178 2400115 2216272 2152478 2327898
7174B327898J37158j25484j95773n2035M6124J35676J95075J13592N8566J60656
7164B801453K50285J33474r3805j49747j9963r741j60327k39213j21244n7803
7154B333369k72938n16077n53430n26637n95274o26132n05766k75700m7145K51471
7144a334259N16822M95057K73997P9306o154L0471J53750K54763K35103J87546
7134H86402J48463P3199L0347J29253L04574L02611N3867q7827Q2392L27712K69518
7123B520511o7550k05210n8350J37132L27680N02028M02217m1565l41871k55677
7113B919345J021K85608M67113L88448J13990k11663l71013l26742l20850m62371
7103B482886o46321p83302p64649n51410k57785J0001K95335O26328P04845M24881
$$ plain form
7174 2327898 2465056 2339572 2143799 2091764 2137888 2273564 2468639 2582231 2640797 2801453
7164 2801453 3051738 3185212 3091407 2941660 2921697 2911956 2751629 2512416 2391172 2333369
7154 2333369 2060431 1544354 990924 464287 -130987 -757119 -1262885 -1538585 -1585730 -1334259
7144 -1334259 -817437 -322380 -48383 30923 24769 55240 208990 463753 698856 886402
7134 886402 1034865 1108064 1138411 1267664 1572238 1874849 1928716 1840889 1923281 2250993 2520511
7123 2520511 2452961 2247751 2189401 2326533 2654213 3156241 3558458 3516893 3175022 2919345
7113 2919345 2920366 3205974 3673087 4061535 4175525 3963862 3592849 3266107 2945257 2482886
7103 2482886 1836565 1053263 288614 -262796 -520581 -510580 -215245 411083 1115928 1540809
7093A540809O6423j78485k09204n6362K9167R3789K07246J33162k17695n37049
7083H71801n07763k48481j43429l11814n19814m81965k65883r4312L8917K06526
7073a456217K45181J28383j8861j94226l46191m13321m14319k17970R0100K81044
7063b316397M44326N50654N08664M70194M48106M31248M54675L21515P1337M4494
7053A428816J22709J72888K71143K84360J29271j92886n25811n90253l88684j63358
7043E48195p2627j18297k09799k88998k69504o4449K24883K86991Q4725q8359
7033C2761q602J11894Q6730n6527k43527k72938q0861J43409K04845J33142M2768
7022I3094j5011k133J25653L16629L30126J14570j02774j05961j1330j1521o489
$$ plain form
7093 1540809 1607232 1428747 1219543 1163181 1192348 1286137 1493383 1626545 1408850 871801
7083 871801 364038 115557 -27872 -339686 -859500 -1341465 -1607348 -1701660 -1662743 -1456217
7073 -1456217 -1211036 -1082653 -1101514 -1295740 -1641931 -2055252 -2469571 -2687541 -2597441 -2316397
7063 -2316397 -1872071 -1321417 -812753 -342559 105547 536795 991470 1312985 1384322 1428816
7053 1428816 1551525 1724413 1995556 2279916 2409187 2216301 1690490 1100237 711553 548195
7043 548195 475568 357271 147472 -141526 -411030 -475479 -250596 36395 121120 32761
7033 32761 24159 136053 222783 166256 -77271 -350209 -431070 -287661 -82816 50326 93094
7022 93094 78083 75950 201603 518232 848358 962928 860154 754193 742863 731342 724853
7011G24853o4235j59205k1530J62432J75047P1334k9565k8506P8744K67254K74130
7000A450753L5457j56693j47000j25251o7468k1079o7218m6201L1722J29311J91398
6989A207731J57379J59511K06027J83583J02509N5968J16508J85179J47306R5951
6979B617652P3846j27336m09579n22516n49061m57829j60473K07575M28634L96506
6969A497419J77633j06234k58076k33280j69589n6779M5089J7670j4235J59585
6959A059203L94915L64807m5577m84370n72744l40773k771J77101J10005N3936
6949G13732J37516K65929K99067L00579L21094L79525M20837L04873L7318j43714
6939C036756j43718K5287J34275P2796J80347L49600P2063m55096o57805n60658
$$ plain form
7011 724853 660618 501413 479883 642315 817362 888696 859131 830625 909369 1176623 1450753
7000 1450753 1486210 1329517 1182517 1057266 989798 968719 901501 855300 887022 1016333 1207731
6989 1207731 1365110 1524621 1730648 1914231 2016740 2072708 2189216 2374395 2521701 2617652
6979 2617652 2691498 2564162 2154583 1632067 1083006 625177 464704 672279 1100913 1497419
6969 1497419 1675052 1568818 1310742 1077462 907873 851094 896183 913853 899618 1059203
6959 1059203 1454118 1818925 1773348 1288978 716234 375461 372690 549791 659796 713732
6949 713732 851248 1117177 1416244 1716823 2037917 2417442 2838279 3143152 3180470 3036756
6939 3036756 2893038 2918325 3052600 3125396 3305743 3655343 3727406 3272310 2614505 2053847
6929B053847l80651j84634p403R8798J24103L7560k04380n10792p98538r38371
6919g10461p28487k97202R1746L27887M69168N33053N32054M66075K54824l0658
6909I07999j27644l3284Q4229J25376J67035K64224K76580P5644j07157o5233
6899A567769O3859J83485J77009J5862o8473k2387R9195K72502L93320L48814
6889C030955K63880K84569L17049K67137J99894J78370J05164j52524m71629n67114
6879C455751m05505k25696k01100k49990k42445j92461n4767K44603M46091K77836
6869B852317l7171k08985k26442j70897j08407m6426k5270o5125n0199L991J42401
6858B059787L93903O24590P45543N99557L52765J60727K3881j25812k52242l89189
$$ plain form
6929 2053847 1673196 1488562 1481159 1579957 1704060 1741620 1537240 1026448 227910 -710461
6919 -710461 -1438948 -1736150 -1644404 -1316517 -847349 -314296 217758 683833 938657 907999
6909 907999 780355 747071 831300 956676 1123711 1387935 1664515 1740159 1633002 1567769
6899 1567769 1631628 1815113 1992122 2007984 1939511 1917124 2016319 2288821 2682141 3030955
6889 3030955 3294835 3579404 3896453 4163590 4363484 4541854 4647018 4494494 4022865 3455751
6879 3455751 3050246 2824550 2623450 2373460 2131015 1938554 1883787 2128390 2574481 2852317
6869 2852317 2815146 2606161 2379719 2208822 2100415 2053989 2028719 1963594 1913395 1917386 2059787
6858 2059787 2453690 3078280 3823823 4423380 4776145 4936872 4960753 4834941 4582699 4193510
6848D193510n74546n57466l04693j50384k42273n16678p61204o51919l59119j30857
6838e5629J75638M86277O02181O26653N86254M51144J85033j14583k60140k85547
6828B397281k43979k32997k32859q0322J46289L74764O25952P78383P49862O00369
6818D882743L47971M7385k40323n08065o85067o71882n63209m84814m06134j43747
6808A574858J57904L09465M05243L22237P3545o4340o1400J24996K77730K14259
6798C334497N5126q0470k37233n50075q37695q63734o48117l56541j28107m5268
6788c57617n1415l5905o0981q7810j6464Q8590R6310J77851M09295N72154N59484
6777A293492L64689J55206N1818J1325n8428k48145m70131n57815m48296j21707
$$ plain form
6848 4193510 3618964 3061498 2756805 2606421 2364148 1847470 1086266 434347 75228 -55629
6838 -55629 120009 606286 1208467 1835120 2421374 2872518 3057551 2942968 2682828 2397281
6828 2397281 2153302 1920305 1687446 1607124 1753413 2128177 2754129 3532512 4282374 4882743
6818 4882743 5230714 5278099 5037776 4529711 3844644 3172762 2609553 2124739 1718605 1574858
6808 1574858 1732762 2042227 2447470 2769707 2843252 2778912 2717512 2842508 3120238 3334497
6798 3334497 3389623 3309153 3071920 2521845 1684150 820416 172299 -184242 -312349 -357617
6788 -357617 -409032 -444937 -505918 -593728 -610192 -521602 -425292 -247441 161854 734008 1293492
6777 1293492 1658181 1813387 1865205 1876530 1818102 1569957 1099826 542011 93715 -27992
6767b7992J89734K25853J50825J19753J62573J23277j07351k61933M1715N39123
6757A155577O26445M10437K94513M07317M60095L43858K25481J82732K26647J48081
6747D481183j00648k94012k96527j65608o1121R852N7790j5812j33009j39902
6737C342186r0868j9731R0942J3192k54052k71659P9569L42321K95249J95377
6727C722526K97522L77047K21704P7010k9755j23101j66536r3461j6376j88933
6717D077647m81041n71185m71498m97354p29237p79551m13886j1520K89995N60525
6707I72895N59374L47756J14369m3702q6305L0571K95846O00880O55559K50250
6697C697493k81478m15560k68748j78655j24950M0107K28497K35750J05825p0657
$$ plain form
6767 -27992 161742 387595 538420 658173 820746 944023 836672 574739 616454 1155577
6757 1155577 1782022 2192459 2486972 2894289 3354384 3698242 3923723 4106455 4333102 4481183
6747 4481183 4380535 4086523 3789996 3624388 3563267 3573119 3630909 3615097 3482088 3342186
6737 3342186 3251318 3231587 3322529 3335721 3081669 2810010 2889579 3231900 3527149 3722526
6727 3722526 4020048 4397095 4618799 4695809 4666054 4542953 4376417 4282956 4266580 4077647
6717 4077647 3596606 3025421 2553923 2056569 1327332 547781 133895 122375 412370 972895
6707 972895 1532269 1880025 1994394 1950692 1864387 1894958 2190804 2791684 3447243 3697493
6697 3697493 3416015 3000455 2731707 2553052 2428102 2468209 2696706 2932456 3038281 2967624
6687B967624j97692k63479k56731j90520k7789J55155L16988M27525L98507L69623
6677C699211M01145L42347J88868J58932K33861K86319K16350M9187j16218k41822
6667E218180l00068l26860l13851j73340N752J60388L26435L35911K72141N60283
6657E764971R68551R10920N64277K59291N6488P0486K04573K69208K83508L83077
6647I735350N69245O54110M84311J99306J16806J55913M0479j16968k17174k51206
6637A1370172k04976j11889J37084N07935O58109L09488k29496l97859j39234
6628A1899334K10502M77451P08636Q36872J000536J299190J472411J435065J361941
6619B0701938J482678J816995K160663K505837K980781L539801L991958M169717
$$ plain form
6687 2967624 2769932 2506453 2249722 2059202 2031413 2186568 2503556 2931081 3329588 3699211
6677 3699211 4100356 4442703 4631571 4790503 5024364 5310683 5527033 5576220 5460002 5218180
6667 5218180 4918112 4591252 4277401 4104061 4109813 4270201 4596636 4932547 5204688 5764971
6657 5764971 6733522 7644442 8208719 8468010 8524498 8594984 8799557 9068765 9352273 9735350
6647 9735350 10304595 10958705 11443016 11642322 11759128 11915041 11955520 11838552 11621378 11370172
6637 11370172 11165196 11053307 11190391 11698326 12356435 12665923 12436427 12038568 11899334
6628 11899334 12109836 12587287 13295923 14132795 15133331 16432521 17904932 19339997 20701938
6619 20701938 22184616 24001611 26162274 28668111 31648892 35188693 39180651 43350368
6611D3350368M165633M257782M571761N030758N427605N405216M587746L035402
6603G9832271J161412r08228k986218m666783n727643o252966o421976o284145
6595D7745724n825481n123013m458593l806089l076169k326718j659882j173575
6587B0296204r87366j056297j187009j239112j169668j062738j008587r54015
6579A1631412q61313r62206j137068j101805q72616n48681j83891J56680L19492
6570F440004J27026k44457l87894l65415m15199l66133j02872P2484J20878J06112
6560D984534J50504L52736M92677L39944r1792m85646o86132o48462m42714k56121
6550C709528k62353l32208j95483Q8829K11032J11716Q5580J86251K05424N5354
$$ plain form
6611 43350368 47516001 51773783 56345544 61376302 66803907 72209123 76796869 79832271
6603 79832271 80993683 80085455 77099237 72432454 66704811 60451845 54029869 47745724
6595 47745724 41920243 36797230 32338637 28532548 25456379 23129661 21469779 20296204
6587 20296204 19308838 18252541 17065532 15826420 14656752 13594014 12585427 11631412
6579 11631412 10770099 9807893 8670825 7569020 6696404 6147723 5963832 6120512 6440004
6570 6440004 6567030 6322573 5934679 5569264 5154065 4787932 4685060 4757544 4878422 4984534
6560 4984534 5135038 5487774 5980451 6320395 6228603 5742957 5056825 4408363 3965649 3709528
6550 3709528 3447175 3114967 2919484 3008313 3219345 3331061 3416641 3602892 3808316 3863670
6540C863670k54788m83690l78270j60571l5681O8672R2651O7826O9287j1945j31861
6529B705300j53928j32560r1868j4986k792l1346J03757J36564m1510j85463j62684
6518B128484l7590J30277K46930J92981M5898K0491J18085J30352J29234K64839
6508C369981K53001N8367p8378p5473j2806j9644j48833k27487k14212k49477
6498B655039l37084m85783o25772n52360l35185n2113K70731M02564L45270K54056
6488A539363J12858p0371j1074L44804O15883O21233O29275O09716L03374k29484
6478D465577n85349n13417k26286n4125k1917O1043J82215J25101j16388l82345
6468B934109n16753l90737j8048L82810N88977N31217M04986L08449P0205k68753
$$ plain form
6540 3863670 3608882 3125192 2746922 2586351 2550670 2619342 2711993 2779819 2849106 2837161 2705300
6529 2705300 2551372 2418812 2326944 2311958 2309166 2277820 2381577 2518141 2476631 2291168 2128484
6518 2128484 2090894 2221171 2468101 2661082 2706980 2727471 2845556 2975908 3105142 3369981
6508 3369981 3622982 3681349 3602971 3527498 3514692 3495048 3346215 3118728 2904516 2655039
6498 2655039 2317955 1832172 1206400 654040 318855 266742 537473 940037 1285307 1539363
6488 1539363 1652221 1581850 1570776 1915580 2531463 3152696 3781971 4391687 4695061 4465577
6478 4465577 3880228 3366811 3140525 3086400 3064483 3125526 3307741 3432842 3316454 2934109
6468 2934109 2417356 2026619 2008571 2391381 2980358 3511575 3916561 4225010 4295215 4026462
6458D026462l13284j99773k88068k90405k754K10417J33040o5377k03104j57444
6448B849710R5137K76551J77180j08286k25352j90097j87819j52146j08520k4066
6438B402292J74706L83874N13731M79973K24410r3708j99589j77869m5044L29801
6428C992577O78908N73997m4652o75011q82529p49980m52678k00423q0434K9326
6418B189101o5773l85932n65933m61352k01410L4495P1969J06719L16665O03673
6408A642222O94544M65188J26866j20587k91887l95897l61118l59931l76514k40713
6398G82173o4495J16852K41662J62986M8324J428p7213j83454j86998j2210K66714
6387A095769M07011K84670j5464j65138j15898n8766p9687l3852K2535p5781k90261
$$ plain form
6458 4026462 3713178 3513405 3225337 2934932 2932178 3142595 3275635 3210258 3007154 2849710
6448 2849710 2944847 3221398 3398578 3290292 3064940 2874843 2687024 2534878 2426358 2402292
6438 2402292 2576998 2960872 3474603 3954576 4178986 4085278 3885689 3707820 3662776 3992577
6428 3992577 4671485 5245482 5200830 4525819 3643290 2893310 2440632 2240209 2159775 2189101
6418 2189101 2123328 1737396 1171463 710111 508701 543196 615165 721884 1038549 1642222
6408 1642222 2336766 2801954 2928820 2808233 2516346 2120449 1759331 1399400 1022886 782173
6398 782173 717678 834530 1076192 1239178 1287502 1288930 1211717 1028263 841265 829055 1095769
6387 1095769 1502780 1787450 1771986 1606848 1490950 1432184 1352497 1318645 1341180 1265399 975138
6376I75138m54839n40233n86760m18685p7563J33979J29730P7467K35190L62861
6366a63715J52154l1735J7749J49384K96397L03957N8259k00491j86786k8773
6356C66400l8785J3544L40133N94186M10544j32214m58511l32666M0425L47946
6346A151002L00111J43154K00919L56350K50836j73137m93647m26825k39042q9125
6336I80596J59924M48373N95467M07716P2594j12424j07395L7592J12647q993
6326B586097l30433o91206p88590n54978k49867l6210R2132J73660K53619L23234
6316G77458L26851K97741J61250j26O046J08703K19999L03497L61028L96532M12868
6305C371847L88619K01491q8700k82370l32786l30694l03772k91585k97588k34348
$$ plain form
6376 975138 520299 -19934 -606694 -1025379 -1102942 -968963 -839233 -761766 -526576 -163715
6366 -163715 -11561 -43296 -25547 123837 420234 724191 782450 581959 395173 366400
6356 366400 327615 341159 681292 1275478 1686022 1553808 1095297 762631 803056 1151002
6346 1151002 1451113 1594267 1795186 2151536 2402372 2229235 1735588 1308763 1069721 980596
6336 980596 1140520 1588893 2184360 2592076 2664670 2552246 2444851 2482443 2595090 2586097
6326 2586097 2255664 1564458 775868 220890 -28977 -65187 26945 200605 454224 777458
6316 777458 1104309 1402050 1563300 1563174 1569220 1677923 1897922 2201419 2562447 2958979 3371847
6305 3371847 3760466 3961957 3873257 3590887 3258101 2927407 2623635 2332050 2034462 1800114
6295A800114o1601M8356K0331j03727j85869k33107l16767l19937k55316k77802
6285A14675l17021l99696m80008l64843N5228N51664P76850N88183J63801k64828
6275D24005n68454o01465m18136k45307j75737o8056N8842M0569q5824n2844J08025
6264a584382K51064K71299J72203J64927K74182L63667L86830M27172M73923M34305
6254A635190J35322l04159m76287k31885K39781N24173M35751K33673Q4993n0533
6244B226019k57561m53991m88923l73183l04187l25932k77604j05752J25831L50676
6234A15393N53012N50335L36600R7151n5025k3110K34762M59048K80468j9855
6224B528779J7646K48499J70387j44129k58305j41783l7961K0340J05933J11486
$$ plain form
6295 1800114 1738513 1786869 1807200 1703473 1517604 1284497 967730 647793 392477 114675
6285 114675 -202346 -602042 -1082050 -1446893 -1391665 -840001 -63151 525032 688833 424005
6275 424005 -144449 -745914 -1164050 -1409357 -1585094 -1653150 -1594308 -1553739 -1639563 -1692407 -1584382
6264 -1584382 -1333318 -1062019 -889816 -724889 -450707 -87040 299790 726962 1200885 1635190
6254 1635190 1770512 1466353 990066 758181 997962 1522135 1957886 2191559 2276552 2226019
6244 2226019 1968458 1514467 1025544 652361 348174 22242 -255362 -361114 -235283 115393
6234 115393 668405 1218740 1555340 1652491 1597466 1574356 1809118 2268166 2548634 2528779
6224 2528779 2546425 2794924 2965311 2821182 2562877 2421094 2383133 2403473 2509406 2620892
6214B620892n310q8730j45776k31129j49175O5378Q1109p4314j27578q1104l8919
6203A825344l854J49108L61283K82104K7878j11283k56615k85200j1306L28625
6193B306084M09681J53217k85292m91485l40780j4262J35637N4863M6111J42562
6183B116336R6033j03916l00439n73043q25879q31729o38541l36384o7149M2198
6173a422513J19045K05787K68882L41637L36582K18495K15870K88647K36711K35806
6163A044949L86629M40809K54098l1945k67702k94033j53132p472R0458K19939
6153A682598L84537M87727M09341K31697K07886L58176L97416J89676m0826k18596
6143D089632l28568l66464m06308m59655m85382m86028l56493l9501L00402L93496
$$ plain form
6214 2620892 2615582 2526852 2381076 2149947 2000772 2066150 2147259 2072945 1945367 1864263 1825344
6203 1825344 1821490 1970598 2331881 2613985 2641863 2530580 2273965 1988765 1977459 2306084
6193 2306084 2715765 2868982 2583690 2092205 1751425 1737163 1872800 1927663 1973774 2116336
6183 2116336 2212369 2108453 1808014 1234971 409092 -422637 -1061178 -1397562 -1464711 -1422513
6173 -1422513 -1303468 -1097681 -828799 -487162 -150580 67915 283785 572432 809143 1044949
6163 1044949 1431578 1872387 2126485 2094540 1826838 1532805 1379673 1372201 1462659 1682598
6153 1682598 2067135 2554862 2964203 3195900 3403786 3761962 4159378 4349054 4308228 4089632
6143 4089632 3761064 3394600 2988292 2528637 2043255 1557227 1200734 1161233 1461635 1855131
6133A855131K56496J11727m2103k55976m24539m31782k09485J91128M61414M51883
6123A963894K44510R2015Q9921J0568j67124j45889Q3061K89713L63302J35699
6113B959670k41600m81816o71976o97634l53966J27903M39318N38858L60074n791
6103A973040k08472j52835L4667K22449K96775J42444m9192j8351J60746L18473
6093B719744L31510O9783l55959n07553l86039k12442j07511j55496j61655n518
6083A228864J79247K37594L6673k27961k33328j51468n104J42221P8978j18907
6073A166809l24982m00853k84395o2598R5250K75735N13180N55487K94595J6595
6063A844823Q15K19959M58224N17485L21144M6297j33930k78497l81304l41763
$$ plain form
6133 1855131 2111627 2223354 2181251 1925275 1500736 1068954 859469 1050597 1512011 1963894
6123 1963894 2208404 2300419 2390340 2400908 2233784 2087895 2170956 2460669 2823971 2959670
6113 2959670 2718070 2236254 1564278 866644 512678 640581 1079899 1618757 1978831 1973040
6103 1973040 1764568 1611733 1646400 1868849 2165624 2308068 2258876 2240525 2401271 2719744
6093 2719744 3051254 3121037 2765078 2257525 1871486 1659044 1551533 1396037 1234382 1228864
6083 1228864 1408111 1645705 1682378 1454417 1221089 1069621 1064517 1206738 1285716 1166809
6073 1166809 841827 440974 156579 93981 189231 464966 978146 1533633 1828228 1844823
6063 1844823 1845638 2065597 2523821 3041306 3362450 3408747 3274817 2996320 2615016 2273253
6053B273253k31301j53392j85015k94772k75183o3421K10055L43828K36985p4351
6043A786686l51589m27089l91604l76993l96737l61843k68162k14956o2388K44574
6033h20101M91888N96172O61157O38977M86972L48022K47370M6453l61161o41680
6023A694069n41103l83046l63963m11362l85481k04133k7304J09358J60140Q5471
6013b67354k8622j24675p1868J78495L23514K47294J36565N5937K3043j45786
6003C26543m28095m76584k94583q2752J88336L44014K86409J72226Q0091N5245
5993A70850M8174L4893M0455J13001J96353K84605K69802J61059J83884K51582
5983A754658K81232L83157N54027N31368L67168K96433K02502P9286n4773l01841
$$ plain form
6053 2273253 2041952 1888560 1703545 1408773 1133590 1070169 1280224 1624052 1861037 1786686
6043 1786686 1435097 1008008 616404 239411 -157326 -519169 -787331 -1002287 -1064675 -820101
6033 -820101 -328213 267959 929116 1568093 2055065 2403087 2650457 2696910 2335749 1694069
6023 1694069 1152966 769920 405957 -5405 -390886 -595019 -622323 -512965 -352825 -267354
6013 -267354 -295976 -420651 -492519 -314024 9490 256784 393349 449286 472329 326543
6003 326543 -101552 -578136 -872719 -955471 -767135 -423121 -136712 35514 115605 170850
5993 170850 219024 253917 294372 407373 603726 888331 1158133 1319192 1503076 1754658
5983 1754658 2035890 2419047 2973074 3504442 3871610 4168043 4370545 4449831 4395058 4093217
5973D093217n02308m73987l83524k55406j21513r792J79563J83954j28418m45480
5963B136306n56820l85324j23991l8941k05323l82637k62980Q0215L04078L95526
5953I60109L84679J35697r0029l3537N1644k6766j93195l71143l47416K4865N40021
5942A034929N37558l2710m23158l92010k66222j40359n3237j30660k02958r0597
5932a59424Q5521K05360K04247O2346M855J87169M41585N49677N04729L57176
5922B443241J56987l0988j39701l5833K48135M25745K94422m0168l82275n59824
5912B379741o56405o96580n24427l79631m03376k75702j4320J20451O2093j41013
5902e29169k17812J04212N70944P82007P16938N54932M16251K87371J38889j0853
$$ plain form
5973 4093217 3590909 3116922 2733398 2477992 2356479 2346687 2526250 2710204 2581786 2136306
5963 2136306 1579486 1194162 1070171 1031230 825907 443270 180290 260505 564583 960109
5953 960109 1344788 1480485 1390456 1356919 1408563 1381797 1188602 817459 470043 494908 1034929
5942 1034929 1572487 1539777 1116619 724609 458387 318028 264791 134131 -68827 -159424
5932 -159424 -73903 131457 335704 398050 402905 590074 1031659 1581336 2086065 2443241
5922 2443241 2600228 2569240 2429539 2393706 2641841 3067586 3362008 3321840 2939565 2379741
5912 2379741 1723336 1026756 502329 122698 -280678 -556380 -570700 -450249 -388156 -529169
5902 -529169 -746981 -642769 -71825 710182 1427120 1982052 2398303 2685674 2824563 2813710
5892B813710q1988p0749o8386j73112l53934m88730o00266o13097l76173m4840
5882e7565N0375M3569R0822Q2990R799K2173J28555K81681L30039K31165Q7107
5871A300710m2592j74565k89640k10867p0948q3893k27371k52167r1202J3481
5861a29054m6131k4274K23964M36913L96491L02642L13622K93245K23487J40216
5851B131121J7054l8164j34615l09744m31964m58001l64687j66336J7382N2342
5841C14388K1694J32953K73221K64622J73778M4374r7993j59586m3699K24019
5831A147771L73127K75526P9885j88972l67805k89557j49411j39819k7042L14260
5821A027963M76298K76289j9907j88644l05834l69798k93178k84105l41681k57718
$$ plain form
5892 2813710 2731722 2660973 2592587 2419475 2065541 1576811 976545 363448 -12725 -57565
5882 -57565 -7190 36379 127201 210191 219990 242163 370718 652399 982438 1213603 1300710
5871 1300710 1258118 1083553 793913 583046 512098 428205 200834 -51333 -142535 -129054
5861 -129054 -175185 -199459 24505 461418 857909 1160551 1474173 1767418 1990905 2131121
5851 2131121 2148175 2110011 1975396 1665652 1233688 775687 411000 244664 262046 314388
5841 314388 336082 469035 742256 1006878 1180656 1225030 1127037 967451 923752 1147771
5831 1147771 1520898 1796424 1876309 1687337 1319532 1029975 880564 740745 713703 1027963
5821 1027963 1504261 1780550 1760643 1571999 1266165 896367 603189 319084 -22597 -280315
5811b80315n1269J88425L87266M05777L90355M10824M33445M65992K65902j21617
5801B494785k72956j68363j1195P485j25612j90675k19172l23429m50764n11495
5791B28609k39416L35596O45531M57988J88966R2651J5286p0164k5958J4046j01171
5780A541964p9957M3356J31596J56451J09906J92571L69650L66758K26828J21836
5770C180959j30931l95269m07930j55266O3760p6263m17356m30568k8712L42897
5760A545321M64810M55140M53058M35034L33811J68920j2628j74806l42995l48477
5750B977188j43046J2716L5575L9927m7661j52541j56230k17893k40786j89457
5740A917792o4337M2037l1450k15920k86850j06722K02490L54935L49347K32800
$$ plain form
5811 -280315 -331584 -143159 244107 649884 1040239 1451063 1884508 2350500 2616402 2494785
5801 2494785 2221829 2053466 2042271 2049756 1924144 1733469 1514297 1190868 740104 228609
5791 228609 -10807 324789 970320 1428308 1617274 1709925 1725211 1655047 1629089 1643135 1541964
5780 1541964 1462007 1505363 1636959 1793410 1903316 2095887 2465537 2832295 3059123 3180959
5770 3180959 3050028 2654759 2246829 2091563 2155323 2079060 1661704 1231136 1202424 1545321
5760 1545321 2010131 2465271 2918329 3353363 3687174 3856094 3843466 3668660 3325665 2977188
5750 2977188 2834142 2846858 2882433 2922360 2874699 2722158 2565928 2348035 2107249 1917792
5740 1917792 1853455 1895492 1864042 1648122 1361272 1254550 1457040 1811975 2161322 2394122
5730B394122M7161n7441j31600k48127l84947n50166o14661n31498m17719l11155
5720h06031q5723K56386M44151L74607K00923J12973K53921M87894N11640K82724
5710B033465N3882j0224r3410k67458l68355j90821J30552K84756K71074J92022
5700B035483P8607J02391K56773K76807J57072O3430M3664q37l6723m569n935
5689B966163j96155l96174k39954J30447L71586N49695P09959O52284K94987j45886
5679D696952l44658k54801j2887Q6094o3656l07877m01653k84212j00489M1438
5669C054251O0484r3533k73303m52136n84048n11226j91140J55374J56728o8007
5659A253444k04287j31684J8829n8512k69681l47024l10486k81492k92999k43911
$$ plain form
5730 2394122 2441283 2383842 2252242 2004115 1619168 1069002 454341 -77157 -494876 -806031
5720 -806031 -891754 -635368 -191217 183390 384313 497286 751207 1239101 1750741 2033465
5710 2033465 2087347 2077123 1983713 1716255 1347900 1157079 1287631 1572387 1843461 2035483
5700 2035483 2114090 2216481 2473254 2750061 2907133 2970563 3014227 3013390 2976667 2972098 2966163
5689 2966163 2770008 2373834 2133880 2264327 2635913 3185608 3895567 4547851 4842838 4696952
5679 4696952 4352294 4097493 4084606 4170700 4107044 3799167 3397514 3113302 3012813 3054251
5669 3054251 3114735 3021202 2747899 2295763 1711715 1200489 1009349 1164723 1321451 1253444
5659 1253444 1049157 917473 936302 877790 608109 261085 -49401 -330893 -623892 -867803
5649h67803m5158J64339K49848L00788K91921K66014L31438M59748N55500M88543
5639B195178K23439o9727k13844k15414k70501l13208j53303J46347L10722K45022
5629A884711l0906l43883m43738k31083o9377j80129k24886p8065J23880L66110
5619G72634N13880L38987J03058R4304J10219N3651L2971M2915O3363Q6376L4397
5608B246755o6184j17816j64223j84997k0462J92391K03733J9212k05638l90544
5598A512227m01828k27736N221J86125K50763J68508K7473N071K57479O31576
5588B414879P56824M80945J50473R4919Q9947N4r5844j95640k46819j67500j8653
5577C263585P1137m04j25695j57310j23214j71559k28877j60143n5095j92857
$$ plain form
5649 -867803 -912961 -748622 -498774 -197986 93935 359949 691387 1151135 1706635 2195178
5639 2195178 2418617 2348890 2135046 1919632 1649131 1335923 1182620 1328967 1639689 1884711
5629 1884711 1853805 1509922 1066184 835101 765724 585595 360709 282644 406524 772634
5619 772634 1286514 1625501 1728559 1822863 1933082 1986733 2019704 2062619 2125982 2212358 2246755
5608 2246755 2180571 2062755 1898532 1713535 1693073 1885464 2089197 2108409 1902771 1512227
5598 1512227 1110399 882663 887884 1074009 1324772 1493280 1520753 1525824 1783303 2414879
5588 2414879 3171703 3652648 3803121 3898040 3987987 3988041 3892197 3696557 3449738 3282238 3263585
5577 3263585 3334722 3334318 3208623 3051313 2928099 2756540 2527663 2367520 2312425 2119568
5567B119568m84630o11174m39111r2626K14099L70188M90113N97002M35445n6687
5557B542187o46042j049549j074739p92685l77705Q7479K91477K19693K03993
5548e95891K03363J08058L0539L7899J04229R7087Q6075J70869J42942j17066
5538B68104l67781l30743j20599P6499J92470K16981K29738L54763N32479O38985
5528A690896N67330L18330J07223l4739k72930m55307m73332l93418j37043K45959
5518A162969M10884L22076J99524R6220j00851k97268l82604l26280k12276j19549
5508G52845k15685m16812m11050j95350J45807L62695L17313J70624k1711j31316
5498C57360r3939j10269o0833J43611L18573M04581M27962J88474k98155o91477
$$ plain form
5567 2119568 1634938 1023764 584653 492027 706126 1076314 1566427 2163429 2598874 2542187
5557 2542187 1896145 846596 -228143 -1020828 -1398533 -1311054 -1019577 -799884 -595891
5548 -595891 -392528 -284470 -253931 -216032 -111803 -14716 71359 242228 385170 268104
5538 268104 -99677 -430420 -551019 -474520 -282050 -65069 164669 519432 1051911 1690896
5528 1690896 2258226 2576556 2683779 2649040 2376110 1920803 1447471 1054053 917010 1162969
5518 1162969 1573853 1895929 2095453 2191673 2090822 1793554 1410950 1084670 872394 752845
5508 752845 537160 120348 -290702 -486052 -340245 22450 339763 510387 488676 357360
5498 357360 263421 153152 92319 235930 554503 959084 1387046 1575520 1277365 585888
5488E85888p52250m96234r0327L71619N92447M26351K36725Q4293j12012k21632
5478F24868r1058J03798Q4862L3947L8468q5021q0388R7018P6589j40552k34792
5467D27739j69211M5327L64305N68503N84610M90105L12252j8969m65993p00187
5457A438481n97154m03017k48300r1259R8793K03922K65904K24797j7220j86015
5447F88932m0378K33612K96932J91546J23621R0931M6233j15686l62568m38475
5437G14700l39739k46058j76314j04251k1191Q0055J73444J98415J73624J21980
5427E74665J41869L06655L30823R6857j05987r8188k2929N3319J67962J77783
5417A622829J17014J54423K87406M21966L67633L4923k68454k18982l8654k6024
$$ plain form
5488 585888 -166362 -662596 -752923 -381304 211143 637494 874219 958512 846500 624868
5478 624868 533810 637608 722470 756417 794885 709864 629476 726494 803083 662531 427739
5467 427739 258528 303855 668160 1236663 1821273 2311378 2623630 2604661 2138668 1438481
5457 1438481 841327 438310 190010 98751 197544 401466 667370 892167 874947 688932
5447 688932 648554 882166 1179098 1370644 1494265 1585196 1631429 1515743 1153175 714700
5437 714700 374961 128903 -47411 -151662 -172853 -92798 80646 279061 452685 574665
5427 574665 716534 1023189 1354012 1450869 1344882 1246694 1223765 1277084 1445046 1622829
5417 1622829 1739843 1894266 2181672 2603638 2971271 3006194 2737740 2518758 2480104 2454080
5407B454080j09464p4829j1878k22731o78250r33419p31341k08197L57733O77840
5397E19544N84365K06627j14311k66368k29256o1511o183k30380m68437m10428
5387d76338o0138M23033O43166M83163J84824q7821k11077r9023J52693K68462
5377A220944K67562K54187J07418o5679n0948N0512o1559k70366m41502n13384
5367D97185l40028J8097L38706M57031L30925M7540j62218j31874j2135o9873
5357I73356k22755k25945j39276l7591J26710L29674N30992N39850K65586L2843
5347B173444L7536R0775L6467o0074r7008j00574j90111l30616l03938j89496
5337A066405j25151m9572N8138R8185N3930O3160J14056J47432K02572Q8567j46119
$$ plain form
5407 2454080 2344616 2269787 2257909 2035178 1356928 423509 -307832 -516029 -158296 519544
5397 519544 1103909 1310536 1196225 929857 700601 639090 632907 402527 -65910 -476338
5387 -476338 -536476 -113443 529723 1012886 1197710 1109889 898812 799789 952482 1220944
5377 1220944 1488506 1742693 1850111 1784432 1733484 1783996 1722437 1452071 1010569 497185
5367 497185 157157 175254 513960 970991 1301916 1349456 1187238 1055364 1043229 973356
5357 973356 750601 524656 385380 347789 474499 804173 1335165 1875015 2140601 2173444
5347 2173444 2210980 2301755 2338222 2278148 2181140 2080566 1890455 1559839 1255901 1066405
5337 1066405 941254 891682 949820 1048005 1101935 1165095 1279151 1426583 1629155 1717722 1571603
5326A571603m1203K48806L93825M42141L95431J80106j7425K1297Q9270n1316
5316C232535k45611l09972k20542M4565J59957K3203j14197j60802j18336n5693
5306B235107n580J5857R249P3671L0897j41569k24964k00787l8061J72468K02543
5295B128831j8233l85847o39340n54371k57170p7361p8606j92774l17315l72977
5285g65163l75993l32180j88959P607J71483L01345M53116N34644M70865K85068
5275E61833J38278J66841L12716M21346L77874J33570k11860m99338o24603l82836
5265C93821J10714M21242M70752M14094K46870O7442j49429k97615k96189j53296
5255A228406K6404K1777o8453r4252q3024j068P6118K04639L55354L89328L59538
$$ plain form
5326 1571603 1530400 1779206 2173031 2615172 3010603 3190709 3173284 3194581 3283851 3232535
5316 3232535 2986924 2676952 2456410 2500975 2660932 2684135 2569938 2409136 2290800 2235107
5306 2235107 2229527 2245384 2254633 2328304 2359201 2217632 1992668 1791881 1753820 1926288 2128831
5295 2128831 2110598 1724751 1085411 531040 273870 196509 117903 -74871 -392186 -765163
5285 -765163 -1141156 -1473336 -1662295 -1654688 -1483205 -1181860 -728744 -194100 276765 561833
5275 561833 700111 866952 1179668 1601014 1978888 2112458 1900598 1401260 776657 393821
5265 393821 504535 925777 1396529 1810623 2057493 2124935 1975506 1677891 1381702 1228406
5255 1228406 1254810 1276587 1208134 1113882 1030858 1029790 1105908 1310547 1665901 2055229 2414767
$$ [...]
##END NTUPLES=NMR SPECTRUM
##END=
