##TITLE=C13cpd
##JCAMPDX= 6.0         $$ Bruker NMR JCAMP-DX V2.0
##DATA TYPE= NMR SPECTRUM
##DATA CLASS= NTUPLES
##ORIGIN= UXNMR, Bruker Analytische Messtechnik GmbH
##OWNER= root
$$ XWIN-NMR		Version 3.5
$$ Sun Feb 16 14:19:02 2025 Russian Standard Time (UT+4h)  servis@DPX200
##.OBSERVE FREQUENCY= 50.3277607988526
##.OBSERVE NUCLEUS= ^13C
##.ACQUISITION MODE= SIMULTANEOUS
##.ACQUISITION SCHEME= undefined
##.AVERAGES= 3712
##.DIGITISER RES= 17
##SPECTROMETER/DATA SYSTEM= spect
##.PULSE SEQUENCE= zgpg30
##.SOLVENT NAME= DMSO
##.SHIFT REFERENCE= (INTERNAL, DMSO, 0, 219.126)
##AUDIT TRAIL= $$ (NUMBER, WHEN, WHO, WHERE, WHAT)
$$ ##TITLE= Audit trail, XWIN-NMR		Version 3.5
$$ ##JCAMPDX= 5.01
$$ ##ORIGIN= Bruker BioSpin GmbH
$$ ##OWNER= servis
$$ F:\spectra/data/av/nmr/C13cpd/1/pdata/1/auditp.txt
$$ ##AUDIT TRAIL=  $$ (NUMBER, WHEN, WHO, WHERE, WHAT)
(   1,<2025-02-16 14:18:33.42 +0400>,<servis>,<DPX200>,
      <created by zg, POWCHK disabled, PULCHK disabled
       terminated by command 'halt'
       configuration hash MD5:
       00 E9 B6 7A A2 85 ED C7 34 08 36 98 17 FE 4E 26
       data hash MD5: 32K
       BD D6 35 01 15 CF 19 50 46 BF 4F 6D DA A0 29 9C>)
(   2,<2025-02-16 14:18:35.23 +0400>,<servis>,<DPX200>,
      <Start of raw data processing
       efp BC_mod = 2 LB = 2 FT_mod = 6 PKNL = 1 PHC0 = -340.663 PHC1 = 25.66493 SI = 32K 
       data hash MD5: 32K
       CE BF EA 17 EE 58 5B 5D 2B AE 39 15 3E CF 40 0D>)
$$ ##END=
$$ 
$$ hash MD5
$$ 09 5B E9 F0 AB 63 51 32 CA 54 E4 85 A2 D5 66 08
##$RELAX= 
##$RELAX= 
##$RELAX= 
##$RELAX= 
##$RELAX= 
##$RELAX= 
##$RELAX= 
##$RELAX= 
$$ Bruker specific parameters
$$ --------------------------
##$DU= <F:\spectra>
##$EXPNO= 1
##$NAME= <C13cpd>
##$PROCNO= 1
##$TYPE= <nmr>
##$USER= <av>
##$AMP= (0..31)
100 100 100 100 100 100 100 100 100 100 100 100 100 100 100 100 100 100 
100 100 100 100 100 100 100 100 100 100 100 100 100 100 
##$AQSEQ= 0
##$AQ_mod= 1
##$AUNM= <au_zg>
##$AUTOPOS= <>
##$BF1= 50.322729
##$BF2= 200.13
##$BF3= 50.322729
##$BF4= 50.322729
##$BF5= 500.13
##$BF6= 500.13
##$BF7= 500.13
##$BF8= 500.13
##$BYTORDA= 1
##$CFDGTYP= 0
##$CFRGTYP= 5
##$CHEMSTR= <none>
##$CNST= (0..31)
1 1 145 1 1 1 1 1 1 1 1 1 1 1 1 1 1 1 1 1 1 1 1 1 1 1 1 1 1 1 1 1 
##$CPDPRG= <waltz16>
##$CPDPRG1= <>
##$CPDPRG2= <waltz16>
##$CPDPRG3= <>
##$CPDPRG4= <mlev>
##$CPDPRG5= <mlev>
##$CPDPRG6= <mlev>
##$CPDPRG7= <mlev>
##$CPDPRG8= <mlev>
##$CPDPRGB= <>
##$CPDPRGT= <>
##$D= (0..31)
0 2 0.00345 0 0 0 0 0 0 0.06 0 0.03 2e-05 3e-06 0 0 0.0002 0 0 0 0 0 0 
0 0 0 0 0 0 0 0 0 
##$DATE= 1739701113
##$DBL= (0..7)
120 120 120 120 120 120 120 120 
##$DBP= (0..7)
150 150 150 150 150 150 150 150 
##$DBP07= 0
##$DBPNAM0= <>
##$DBPNAM1= <>
##$DBPNAM2= <>
##$DBPNAM3= <>
##$DBPNAM4= <>
##$DBPNAM5= <>
##$DBPNAM6= <>
##$DBPNAM7= <>
##$DBPOAL= (0..7)
0.5 0.5 0.5 0.5 0.5 0.5 0.5 0.5 
##$DBPOFFS= (0..7)
0 0 0 0 0 0 0 0 
##$DE= 6
##$DECBNUC= <off>
##$DECIM= 12
##$DECNUC= <off>
##$DECSTAT= 4
##$DIGMOD= 1
##$DIGTYP= 9
##$DL= (0..7)
$$ [...]
##$SUBNAM2= <"">
##$SUBNAM3= <"">
##$SUBNAM4= <"">
##$SUBNAM5= <"">
##$SUBNAM6= <"">
##$SUBNAM7= <"">
##$SUBNAM8= <"">
##$SUBNAM9= <"">
##$SW= 238.246396889851
##$SWIBOX= (0..15)
0 1 3 0 0 0 0 0 0 0 0 0 0 0 0 0 
##$SW_h= 11990.4076738609
##$TD= 32768
##$TD0= 1
##$TE= 0
##$TE2= 300
##$TE3= 300
##$TEG= 300
##$TL= (0..7)
0 120 120 120 120 120 120 120 
##$TP= (0..7)
150 150 150 150 150 150 150 150 
##$TP07= 0
##$TPNAME0= <>
##$TPNAME1= <>
##$TPNAME2= <>
##$TPNAME3= <>
##$TPNAME4= <>
##$TPNAME5= <>
##$TPNAME6= <>
##$TPNAME7= <>
##$TPOAL= (0..7)
0.5 0.5 0.5 0.5 0.5 0.5 0.5 0.5 
##$TPOFFS= (0..7)
0 0 0 0 0 0 0 0 
##$TUNHIN= 0
##$TUNHOUT= 0
##$TUNXOUT= 0
##$USERA1= <user>
##$USERA2= <user>
##$USERA3= <user>
##$USERA4= <user>
##$USERA5= <user>
##$V9= 5
##$VALIST= <valist>
##$VCLIST= <CCCCCCCCCCCCCCC>
##$VD= 0
##$VDLIST= <DDDDDDDDDDDDDDD>
##$VPLIST= <PPPPPPPPPPPPPPP>
##$VTLIST= <TTTTTTTTTTTTTTT>
##$WBST= 1024
##$WBSW= 20
##$XGAIN= (0..3)
0 0 0 0 
##$XL= 0
##$YL= 0
##$YMAX_a= 55588029
##$YMIN_a= -40347680
##$ZGOPTNS= <>
##$ZL1= 120
##$ZL2= 120
##$ZL3= 120
##$ZL4= 120
##$ABSF1= 0
##$ABSF2= 0
##$ABSG= 0
##$ABSL= 0
##$ALPHA= 0
##$AQORDER= 0
##$ASSFAC= 0
##$ASSFACI= 0
##$ASSFACX= 0
##$ASSWID= 0
##$AUNMP= <proc_1d>
##$AZFE= 0.1
##$AZFW= 0.5
##$BCFW= 0
##$BC_mod= 2
##$BYTORDP= 0
##$COROFFS= 0
##$CY= 12.5
##$DATMOD= 1
##$DC= 0
##$DFILT= <>
##$DTYPP= 0
##$F1P= 99.9999945759776
##$F2P= -179.999992907048
##$FCOR= 0.5
##$FTSIZE= 32768
##$FT_mod= 6
##$GAMMA= 0
##$GB= 0
##$INTBC= 1
##$INTSCL= 0
##$ISEN= 30
##$LB= 2
##$LEV0= 0
##$LPBIN= 0
##$MAXI= 10000
##$MC2= 0
##$MEAN= 0
##$ME_mod= 0
##$MI= 0
##$NCOEF= 0
##$NC_proc= 3
##$NLEV= 6
##$NOISF1= 0
##$NOISF2= 0
##$NSP= 0
##$NTH_PI= 0
##$NZP= 0
##$OFFSET= 219.1257
##$PC= 1.4
##$PHC0= -340.663
##$PHC1= 25.66493
##$PH_mod= 1
##$PKNL= yes
##$PPARMOD= 0
##$PSCAL= 4
##$PSIGN= 0
##$REVERSE= no
##$SF= 50.322729
##$SI= 32768
##$SIGF1= 0
##$SIGF2= 0
##$SINO= 80
##$SIOLD= 32768
##$SREGLST= <13C.CDCl3>
##$SSB= 0
##$STSI= 32768
##$STSR= 0
##$SW_p= 11990.4076738609
##$SYMM= 0
##$S_DEV= 0
##$TDeff= 32768
##$TDoff= 0
##$TI= <>
##$TILT= no
##$TM1= 0
##$TM2= 0
##$TOPLEV= 0
##$USERP1= <user>
##$USERP2= <user>
##$USERP3= <user>
##$USERP4= <user>
##$USERP5= <user>
##$WDW= 1
##$XDIM= 32768
##$YMAX_p= 381032579
##$YMIN_p= -1325843
$$ End of Bruker specific parameters
$$ ---------------------------------
##NTUPLES= NMR SPECTRUM
##VAR_NAME=  FREQUENCY,     SPECTRUM/REAL,   SPECTRUM/IMAG
##SYMBOL=    X,             R,               I
##VAR_TYPE=  INDEPENDENT,   DEPENDENT,       DEPENDENT
##VAR_FORM=  AFFN,          ASDF,            ASDF
##VAR_DIM=   32768,         32768,           32768
##UNITS=     HZ,            ARBITRARY UNITS, ARBITRARY UNITS
##FACTOR=    0.365929370215793, 1,           1
##FIRST=     11027.0033138647, 0,            0
##LAST=      -963.404359996184, 0,           0
##MIN=       -963.404359996184, -1325843,    0
##MAX=       11027.0033138647, 381032579,    0
$$ Real data points
##PAGE= N=1
##DATA TABLE= (X++(R..R)), XYDATA
$$ [...]
11027B328417J68889j02687k58837k45799j40909o1514q1478j69482k32079k16372
11017I88149j37459m6025M920j9704j19699j53616p0782k3920k8405l7578q5375
11006B70506j35884r2432M7153K35240L50344K76108L8354j96246k56136j92112
10996C44895p2818Q4439K14778K57134J72227O9949j8398q6500p0728m7451j25095
10985G22432j55624o0648j265L3241Q0493J05341R1571J6496n8587m8390L4580
10974G59640Q5823P7084L7510J9093L5048R0248J53453J77590J14973k0190r8568
10963A431704j01365j56797k90879l79059l65106k27680k3095J56042L25179M27508
10953G96452L70458K12284J0574j25191j31583p8479R700J31433K00139J28408
$$ y = [2328417, 2497306, 2394619, 2135782, 1889983, 1749074, 1687560, 1606082, 1436600, 1204521, 988149, 850690, 804665, 809585, 789881, 670182, 516566, 445784, 421864, 393459, 355881, 270506, 134622, 42190, 89343, 324583, 674927, 951035, 989389, 793143, 537007, 344895, 272077, 356516, 571294, 828428, 1000655, 1070604, 1052206, 965706, 894978, 847527, 722432, 566808, 506160, 504895, 538136, 618629, 723970, 815541, 832037, 773450, 725060, 759640, 845463, 922547, 960057, 979150, 1014198, 1104446, 1257899, 1435489, 1550462, 1530272, 1431704, 1330339, 1173542, 882663, 503604, 138498, -89182, -112277, 43765, 368944, 796452, 1166910, 1379194, 1389768, 1264577, 1132994, 1054515, 1064215, 1195648, 1395787, 1524195]
10943A524195L5748N1029J13157J87971K55389J94864O3142L9180Q9127P9492
10933B633294k4029j69726l19542l91985k84707r8507K8068Q9052J01302N3038
10923A616258J4768M6802R1908N4750Q514M1876N1110R58o8930j07570j35231
10912A615213j39333j34432j91613k49731k22880j59374j10793j6047J04150J85766
10902F80926K36313K52223J80939M5089J0077J29459J88130M5550j45874j81662
10892A441170l856K25386K34326N5546j03483j11589l6704M4178R6435O5818K412
10881A909639j1632O551K3339j4547r2750r5711j2655R6760J50578K0741j96063
10870A784250k29019k8305J40619J04350N970k6028o1733j73135k05377j34100
$$ y = [1524195, 1559943, 1610972, 1724129, 1912100, 2167489, 2362353, 2425495, 2464675, 2553802, 2633294, 2609265, 2439539, 2119997, 1728012, 1443305, 1344798, 1372866, 1461918, 1563220, 1616258, 1631026, 1677828, 1769736, 1824486, 1833000, 1874876, 1925986, 1926944, 1858014, 1750444, 1615213, 1475880, 1341448, 1149835, 900104, 677224, 517850, 407057, 391010, 495160, 680926, 917239, 1169462, 1350401, 1395490, 1405567, 1535026, 1723156, 1768706, 1622832, 1441170, 1437314, 1662700, 1897026, 1952572, 1849089, 1737500, 1700796, 1744974, 1841409, 1907227, 1909639, 1898007, 1904558, 1927897, 1913350, 1820600, 1724889, 1712234, 1808994, 1959572, 1980313, 1784250, 1555231, 1526926, 1667545, 1771895, 1777865, 1751837, 1690104, 1516969, 1311592, 1177492]
10860A177492j15807j65495k13121j75319k507K26813L17572K32365J07545j3588
10850A375950j13270j52865o5657P7683Q5383k9249j14145n9886O5145J33734
10840A202823Q0415p9267j47751n9229k6827q8209j03381j7696J29115K60091
10830A150084L12647K62278J49490Q584j07666j22120m7529j6475m5865m1688
10820A501740M8296J43180J22037L3126L2939Q7235Q4702R084o4374p2193o0875
10809A864897l7282P1920J75383J82737R8754m2394j21167j49201j70119j37266
10799A736262r4169p3990o9490n9946l2439j2544k7246m2506k2233l8541o5137
10788A198021j0580O9369P9182M2236M1241R5965K05289K58343J58323n056n5500
$$ y = [1177492, 1061685, 896190, 683069, 507750, 505243, 732056, 1049628, 1281993, 1389538, 1375950, 1262680, 1109815, 1044158, 1121841, 1207224, 1177975, 1063830, 1003944, 1069089, 1202823, 1283238, 1203971, 1056220, 996991, 970164, 881955, 778574, 760878, 889993, 1150084, 1462731, 1725009, 1874499, 1883083, 1775417, 1653297, 1605768, 1589293, 1543428, 1501740, 1550036, 1693216, 1815253, 1848379, 1881318, 1968553, 2053255, 2062339, 1997965, 1925772, 1864897, 1827615, 1899535, 2074918, 2257655, 2356409, 2314015, 2192848, 2043647, 1873528, 1736262, 1642093, 1568103, 1498613, 1438667, 1406228, 1393684, 1366438, 1323932, 1301699, 1263158, 1198021, 1187441, 1256810, 1335992, 1378228, 1419469, 1515434, 1720723, 1979066, 2137389, 2132333, 2076833]
10777B076833l0052k2027l8192j00737j47925p0949M87k9467q9981o4853L4504
10766A517641J06155J19065J20500J37161J28526J02682M2454j14317l04787l64505
10756A490575k88108j73981q862J59107K00575J93885J53564M7343p4591j66936
10746A532571j51891q932J18768J10229M7153J1709l8340q9498n1241L1927L0932
10735A543387p5852k24670k85059j80367M6796K35120K61462K15422J85385J48037
10725A869661J38696J91651K32339J93505R7496p012j42029k28946k08511j53601
10715A983249j54536j84312j08013J2536J5658m1812k2808Q0096J61316J86244
10705A927618J21343k7411j05163o9633n8672r5387q3651L1068J47870J60318
$$ y = [2076833, 2046781, 2024754, 1986562, 1885825, 1737900, 1666951, 1667438, 1637971, 1547990, 1483137, 1517641, 1623796, 1742861, 1863361, 2000522, 2129048, 2231730, 2274184, 2159867, 1855080, 1490575, 1202467, 1028486, 1019624, 1178731, 1379306, 1573191, 1726755, 1774098, 1699507, 1532571, 1380680, 1371748, 1490516, 1600745, 1647898, 1659607, 1621267, 1531769, 1480528, 1512455, 1543387, 1467535, 1242865, 957806, 777439, 824235, 1059355, 1320817, 1536239, 1721624, 1869661, 2008357, 2200008, 2432347, 2625852, 2723348, 2716336, 2574307, 2345361, 2136850, 1983249, 1828713, 1644401, 1536388, 1548924, 1564582, 1522770, 1499962, 1580058, 1741374, 1927618, 2048961, 2021550, 1916387, 1846754, 1788082, 1692695, 1609044, 1640112, 1787982, 1948300]
10695A948300O7930l9883r8499j41462j67871q7278R8692J80867J04682J7135
10685A882613P63J3252M0637M6131M5639N7554M8426O1796Q5166K2825j14126
10674B190676k28043k68661k22546j16850M6977K16217L33113L59821K41898J10031
10664B662633R865j51152l26025l22651j29748K7176O9163K2657m3380j03894
10654A714644j88124k38086j30296J94164M51672M55533L89583L96371M42348
10645C487809M22004L57060L62694M55599N26188N64791O11311O33127O46388
10636H066971P36583R47940J279228J678683K101053K611158L125486L339034
10628B3886136K946506J819400K18547j264527k162529k449732k422199k340766
$$ y = [1948300, 2016230, 1976347, 1877848, 1736386, 1568515, 1481237, 1579929, 1760796, 1865478, 1882613, 1883376, 1896628, 1937265, 1983396, 2029035, 2086589, 2135015, 2196811, 2281977, 2304802, 2190676, 1962633, 1693972, 1471426, 1354576, 1401553, 1617770, 1950883, 2310704, 2552602, 2662633, 2672498, 2521346, 2195321, 1872670, 1742922, 1770098, 1839261, 1861918, 1818538, 1714644, 1526520, 1288434, 1158138, 1352302, 1803974, 2259507, 2649090, 3045461, 3487809, 3909813, 4266873, 4629567, 5085166, 5611354, 6176145, 6787456, 7420583, 8066971, 8803554, 9751494, 11030722, 12709405, 14810458, 17421616, 20547102, 23886136, 26832642, 28652042, 28870589, 27606062, 25443533, 22993801, 20571602, 18230836]
10620A8230836k166554j802102j444489j280946j239009j162706j043193r04685
10612G187152q11972q06442p33835m74707k05672l6946M6255J1353n4620j72047
10602C948519l01090l00306j91759j71588l50378m87010l60188r4209J08630K01425
10592B002046K58895K50005J08212j108L53O3778J18975J44859J74822J95929
10582C316766J48331N7152r164p4192j62479k28117k18567j94775j86298j58320
10572B290337j37686j20468n6816K2172k604j31155k40566k18674o3717P6805
10562A417628J20016L2209j53853k56876j64754N5246K22013K57602K00675J39239
10552A869145R5771M307j09776j46546j10482n7797q5528j76811k18749j84873
$$ y = [18230836, 16064282, 14262180, 12817691, 11536745, 10297736, 9135030, 8091837, 7187152, 6375180, 5568738, 4834903, 4360196, 4154524, 4117578, 4163833, 4175186, 4120566, 3948519, 3647429, 3347123, 3155364, 2983776, 2633398, 2146388, 1786200, 1691991, 1800621, 2002046, 2260941, 2510946, 2619158, 2618050, 2618403, 2682181, 2801156, 2946015, 3120837, 3316766, 3465097, 3522249, 3513085, 3438893, 3276414, 3048297, 2829730, 2634955, 2448657, 2290337, 2152651, 2032183, 1975367, 1997539, 1994935, 1863780, 1623214, 1404540, 1340823, 1417628, 1537644, 1569853, 1416000, 1159124, 994370, 1049616, 1271629, 1529231, 1729906, 1869145, 1964916, 1969223, 1859447, 1712901, 1602419, 1544622, 1459094, 1282283, 1063534, 878661]
10542H78661o8482O5649J47265J98747K14029J73772P6198r7897k91583l29728
10532I66631j93776l1352J6706n119k3783m9736n6092q425P1880J13547N3239
10521H53720q718M7699J54342K16175K69504L24906K58940N3919q6578j23228
10511A960681j54566j30150p8354n6123n4862r8751j21289n5085M5943J40232
10501A397676J65156N6103j45184k46317r6474J18663J87490J57817J28782J29364
10491A853076J32828J15054J19447K01796J89160N3798m6589p0342k7284j4393
10481B506551q8219j72679k26103k17057j42547r1447r5319r1047n1870L7773
10471A368036J31117J88191K05691J54185L4999q7424j47067j59636j18007l9641
$$ y = [878661, 810179, 875828, 1023093, 1221840, 1435869, 1609641, 1685839, 1587942, 1296359, 966631, 772855, 741503, 758209, 753090, 729307, 679571, 623479, 615054, 686934, 800481, 853720, 845002, 892701, 1047043, 1263218, 1532722, 1857628, 2116568, 2170487, 2083909, 1960681, 1806115, 1675965, 1597611, 1541488, 1486626, 1387875, 1266586, 1211501, 1257444, 1397676, 1562832, 1618935, 1473751, 1227434, 1130960, 1249623, 1437113, 1594930, 1723712, 1853076, 1985904, 2100958, 2220405, 2422201, 2611361, 2665159, 2618570, 2548228, 2520944, 2506551, 2418332, 2245653, 2019550, 1802493, 1659946, 1568499, 1473180, 1382133, 1330263, 1368036, 1499153, 1687344, 1893035, 2047220, 2082219, 1994795, 1847728, 1688092, 1570085, 1530444]
10461A530444J4795O4177J36715J51770R4970L4745k2192r0918j32176p2733R3821
10450A803418K14396K00228J49777J29253R204k05988k88133k49792k46153k48474
10440A267736j75987k5280J36437J88002J17834M8774k829r8772j75725j67590
10430A112600j02846n6232j0995O1439R9615P7317K7543L8878J17889J74085J72718
10419A712011Q6953j498l2719j08966k12747k73504k93084j96370m0335P3915
10409G13656J51433K38905K90286K80984L00282K52255N2306j35545k04412j50390
10399A789760l1191M5326K5920n1953r9071l4480L4632K9795J0491l2375p7108
10388A609746o4719m3276n3465n3290m3581o7239j19638j30143j24827j56293
$$ y = [1530444, 1545239, 1609416, 1746131, 1897901, 1992871, 2027616, 2005424, 1914506, 1782330, 1709597, 1803418, 2017814, 2218042, 2367819, 2497072, 2506276, 2300288, 2012155, 1762363, 1516210, 1267736, 1091749, 1066469, 1202906, 1390908, 1508742, 1557516, 1554687, 1455915, 1280190, 1112600, 1009754, 953522, 942527, 1003966, 1103581, 1180898, 1208441, 1247319, 1365208, 1539293, 1712011, 1798964, 1797466, 1764747, 1655781, 1443034, 1169530, 876446, 680076, 639741, 713656, 865089, 1103994, 1394280, 1675264, 1975546, 2227801, 2280107, 2144562, 1940150, 1789760, 1758569, 1803895, 1829815, 1777862, 1678791, 1644311, 1678943, 1708738, 1719229, 1686854, 1609746, 1545027, 1501751, 1448286, 1394996, 1351415, 1284176, 1164538, 1034395, 909568, 753275]
10378G53275j56683j16293r8603j33482j02385K6778O9733k5718q3940M413J40973
10367B78068K47352K75666K41692J83861O9141r2119j88470j26528L3119J67018
10357A088800K25869J83742P5263p6219k43485l47164k81133j14974K8401J17668
10347F56768J06443N7455N9621J27655J79702J03147n0430j02051k1802Q5079
10337A201587J29900R4085M0157K8064J9844L5817J21083J82014J08018K894m2935
10326A920528o8506m7459k5507n2648j03905j66569j63298n3853K6818K5145j6159
10315A274587n8323k6134j20k5325j4275M9239J01016Q9250N1022l242q9842j52455
10303A195398j45584p7172O699M6405M6665m435j05708j95187k45783j80238k789
$$ y = [753275, 596592, 480299, 381696, 248214, 145829, 172607, 242340, 216622, 132682, 137095, 278068, 525420, 801086, 1042778, 1226639, 1295780, 1203661, 1015191, 888663, 921782, 1088800, 1314669, 1498411, 1573674, 1497455, 1253970, 906806, 625673, 510699, 539100, 656768, 763211, 820666, 880287, 1007942, 1187644, 1290791, 1240361, 1138310, 1116508, 1201587, 1331487, 1425572, 1465729, 1493793, 1513637, 1549454, 1670537, 1852551, 1960569, 1963463, 1920528, 1852022, 1804563, 1779056, 1726408, 1622503, 1455934, 1292636, 1238783, 1265601, 1290746, 1274587, 1216264, 1190130, 1190010, 1164685, 1150410, 1199649, 1300665, 1389915, 1440937, 1437695, 1347853, 1195398, 1049814, 972642, 979341, 1025746, 1072411, 1067976, 962268, 767081, 521298, 341060, 338271]
10292C38271K09698L26875K80417J80611P9099o7175j63862q4666J24425L14995
10282A538688L34024K23757J68440J61090P8414m5826j69139k71203k41407r2935
10272A683903k863n4949j25064j09352m6634J7923M7158K6671k1494k7075l8406
10261A349818k777J42437K15860J67836J35565J38752R6689M7127K9124P1728
10251B392159J30614J03033J3581j1421p86l4684n2069L3038J53685J63080K0448
10240B910678j78185k50860j90771j18507r1117j46222k08296k36686k69585k29975
10230I90474j32593j07195j68063j91992j41113m3448R7837J57650O4895m2708
10220D83744n7052q259J03451J93890J88200J55567J22149J80897K87793K60814
$$ y = [338271, 547969, 874844, 1155261, 1335872, 1414971, 1347796, 1183934, 1099268, 1223693, 1538688, 1872712, 2096469, 2264909, 2425999, 2504413, 2458587, 2289448, 2018245, 1776838, 1683903, 1681040, 1626091, 1501027, 1391675, 1345041, 1362964, 1410122, 1436793, 1415299, 1388224, 1349818, 1347041, 1489478, 1705338, 1873174, 2008739, 2147491, 2244180, 2291307, 2320431, 2392159, 2522773, 2625806, 2639387, 2627966, 2627180, 2592496, 2540427, 2573465, 2727150, 2890230, 2910678, 2732493, 2481633, 2290862, 2172355, 2081238, 1935016, 1726720, 1490034, 1220449, 990474, 857881, 750686, 582623, 390631, 249518, 206070, 303907, 461557, 526452, 483744, 426692, 418433, 521884, 715774, 903974, 1059541, 1181690, 1362587, 1650380, 1911194]
10210A911194J45747Q1541R5941J24429P1011l3834j16177j79960j89273j75569
10200A735050k00848k17944k10778k25183k29861j07367J10781L15010M19048
10191A387908L15441J42625P3904N2792L025r7091k31653l76142m05752j93766
10181F71291J37253M05545N16300L89622J11160j46768k35042j05125j6092r0819
10171A637325j86337k24787k17263j77508j34999j26749q6872N5286K68440L97693
10161A204229L58109K17766M2145j56632l34261l60133j85258J9927J07183O5931
10151I79006K765k6549j7740O9875J66711J80708J22001j6478j55441j57878m7224
10140A099756N6815J02465R0363K2750j12733j74238j14873q2123p5217n4269
$$ y = [1911194, 2056941, 2138482, 2234423, 2358852, 2429863, 2396029, 2279852, 2099892, 1910619, 1735050, 1534202, 1316258, 1105480, 880297, 650436, 543069, 653850, 968860, 1387908, 1703349, 1845974, 1919878, 1972670, 1975695, 1878604, 1646951, 1270809, 865057, 671291, 808544, 1214089, 1730389, 2120011, 2231171, 2084403, 1849361, 1744236, 1728144, 1637325, 1450988, 1226201, 1008938, 831430, 696431, 569682, 482810, 538096, 806536, 1204229, 1562338, 1780104, 1822249, 1665617, 1331356, 971223, 785965, 805892, 913075, 979006, 981771, 955222, 937482, 1007357, 1174068, 1354776, 1476777, 1460299, 1304858, 1146980, 1099756, 1156571, 1259036, 1349399, 1372149, 1259416, 1085178, 970305, 888182, 812965, 758696]
10130G58696j0580L2027O5924N6712j5326o7355n2229J1911J00445J98208K54855
10119A333288K24635J65469J32615J07134Q1557N2208R461m0554o9323p6670q1679
10108A838141k5709M3145L561n9549n4952j8389J03937K65128K67916P8604j11103
10097B330730j40554j01249j06126j40340j14128k8090j0382o2491m6610N8635
10087A639395J34287J17692J27904J78519J63352P3555m1836j69242k12311p4688
10077A936627N4687O358r4621j46117j12189K5024J09798M097j65679k47027k25468
10066A145490j36785k1647J12398K01548J32932q1367j75307K126K48806L19938
10056A748132J70326K717m1102M0101J04425N8150l0772p8513p1677k1397K6838
$$ y = [758696, 748116, 780143, 846067, 902779, 887453, 820098, 767869, 779780, 880225, 1078433, 1333288, 1557923, 1723392, 1856007, 1963141, 2044698, 2096906, 2106367, 2065813, 1996490, 1919820, 1838141, 1812432, 1855577, 1859138, 1799589, 1744637, 1726248, 1830185, 2095313, 2363229, 2441833, 2330730, 2190176, 2088927, 1982801, 1842461, 1728333, 1700243, 1689861, 1627370, 1580760, 1639395, 1773682, 1891374, 2019278, 2197797, 2361149, 2434704, 2392868, 2223626, 2011315, 1936627, 1991314, 1997672, 1903051, 1756934, 1644745, 1669769, 1779567, 1783664, 1617985, 1370958, 1145490, 1008705, 987058, 1099456, 1301004, 1433936, 1352569, 1177262, 1179388, 1428194, 1748132, 1918458, 1921175, 1880073, 1920174, 2024599, 2082749, 2051977, 1973464, 1901787, 1880390, 1907228]
10045A907228J6746K1601L1789m7817j77095k62115k79756k71041k32821q6860
10035F19859J09083K17564J77493N7615k818k2179o0194n3806K8481J29994K10984
10024A412076K18115J05847l3662n8642L4986J49814K29517K36892J00638j71751
10014B223830k95480j93956j08738r4599j43255k00106j69806p7122O6487K44411
10004A251666L78586M02406L17876J98223J25038N7330m8075j71131k40287k65493
9994B006139k54447j76048o5968N9246J96080K59343K04236R0614q6144k55231
9984A977820k95930k11997r0788K3072J24449K31001K55755J60650K9561r6057
9974B107536j88291j87959j00506k5045K5545P1654N2343m7581j28659j51502
$$ y = [1907228, 1923974, 1945575, 1977364, 1929547, 1752452, 1490337, 1210581, 939540, 706719, 619859, 728942, 946506, 1123999, 1181614, 1178796, 1156617, 1096423, 1042617, 1071098, 1201092, 1412076, 1630191, 1736038, 1702376, 1643734, 1678720, 1828534, 2058051, 2294943, 2395581, 2223830, 1928350, 1734394, 1625656, 1531057, 1387802, 1187696, 1017890, 940768, 1007255, 1251666, 1630252, 2032658, 2350534, 2548757, 2673795, 2731125, 2683050, 2511919, 2271632, 2006139, 1751692, 1575644, 1509676, 1568922, 1765002, 2024345, 2228581, 2319195, 2233051, 1977820, 1681890, 1469893, 1379105, 1402177, 1526626, 1757627, 2013382, 2174032, 2203593, 2107536, 1919245, 1731286, 1630780, 1605735, 1631280, 1702934, 1755277, 1707696, 1579037, 1427535]
9964A427535j22129j0353J10112J52293J26432J03648J30287K10608K21559J15515
9954B465507J7137k6528m5251q3096j76289k74842k72432k32139k04430j18521
9944A049116L3251J34738J53801M0339j52665k27183j94430j86255j61513j02926
9934C86273j3941J45237K49127K33746J91197J78942J78895R8474O500j2482J8246
9923A660214P9961J33927J32900L5835j50206l13937k80544m5427J25847O5606
9913A444176j16231k63759k97407k69756k23411q8596Q2178J65108J83274K05262
9903H20838K32732K38527J73749L7102p9283j24257j12668k5383M6376O3409N2652
9892A323794n0392k01630k52856j59667k340J60191L14902L63904K65628J51962
$$ y = [1427535, 1305406, 1295053, 1405165, 1557458, 1683890, 1787538, 1917825, 2128433, 2349992, 2465507, 2482644, 2456116, 2410865, 2327769, 2151480, 1876638, 1604206, 1372067, 1167637, 1049116, 1082367, 1217105, 1370906, 1411245, 1258580, 1031397, 836967, 650712, 489199, 386273, 372332, 517569, 766696, 1000442, 1191639, 1370581, 1549476, 1647950, 1654450, 1641968, 1660214, 1740175, 1874102, 2007002, 2042837, 1892631, 1578694, 1298150, 1252723, 1378570, 1444176, 1327945, 1064186, 766779, 497023, 273612, 185016, 267194, 432302, 615576, 820838, 1053570, 1292097, 1465846, 1502948, 1423665, 1299408, 1186740, 1161357, 1207733, 1271142, 1323794, 1273402, 1071772, 818916, 659249, 656909, 817100, 1132002, 1495906, 1761534, 1913496]
9882A913496Q4528k188q0157q4239k0724J7362m4359r5685n0737N125M4993J05970
9870A793385R6000l6456j42860j41685j51419j54466m5556P3216N7438n9824j38101
9859A149672o6202Q1975R7826p6694j99049j53726r5554q3818j26263k22992k79148
9848B6027k21329r9492M6618J73222J99672J36173M0990n425O1698J59179J68227
9837F85560J07499O7271R5876K00141L20552L04695K08848J25602J4317j55140
9827A975221l11986l71385k70690o1971O9035P5365O707o4979r2986n7619L0341
9816I25053M0421j0817o7347j01696q0349o0285m7049O440N4885K6196L43L2565
9804G18360J4998k4893J6290Q2791N0184l3210j17003j59957j48223j39473j5878
$$ y = [1913496, 1998024, 1995836, 1915679, 1831440, 1810716, 1828078, 1783719, 1688034, 1637297, 1642422, 1687415, 1793385, 1889385, 1852929, 1710069, 1568384, 1416965, 1262499, 1216943, 1290159, 1347597, 1287773, 1149672, 1083470, 1165445, 1263271, 1186577, 987528, 833802, 738248, 654430, 528167, 305175, 26027, -195302, -294794, -248176, -74954, 124718, 260891, 301881, 296456, 358154, 517333, 685560, 793059, 860330, 956206, 1156347, 1476899, 1781594, 1990442, 2116044, 2130361, 1975221, 1663235, 1291850, 1021160, 959189, 1028224, 1103589, 1110296, 1045317, 952331, 894712, 925053, 965474, 954657, 887310, 785614, 705265, 644980, 597931, 604371, 659256, 685452, 685795, 718360, 733358, 708465, 724755, 807546, 857730, 824520, 707517, 547560, 399337, 259864, 243986]
9793B43986K03618L20761K25985L7890l0848P2187J85173J77150Q7543o8768k43537
9782A211140k86237k34561j90242j23213M52J42965J99305J56230J38051J98457
9772A212347K58333K33009J03939j3824l4787L7853J58580J88831K4903j94587
9762A974597k51888j24019N5941J87914J94423Q6439k268M613N8340J30475J70089
9751B484656J06110k4240j18362j01953m106O7631J02765J34123J38731N9997
9741B845352o8240j30766j06451n7813Q179J62270K12779j4696k68614l15060
9731B266940j54728P4476J89107J54875M4486j08987j65849j01789q7481j57829
9721A953221k14716j86841j00224l358P9597J25200Q9688J2906j5245K8750M9841
$$ y = [243986, 447604, 768365, 994350, 1032240, 1001392, 1073579, 1258752, 1435902, 1523445, 1454677, 1211140, 924903, 690342, 500100, 376887, 377339, 520304, 719609, 875839, 1013890, 1212347, 1470680, 1703689, 1807628, 1793804, 1759017, 1796870, 1955450, 2144281, 2169184, 1974597, 1722709, 1598690, 1654631, 1842545, 2036968, 2123407, 2121139, 2125752, 2184092, 2314567, 2484656, 2590766, 2566526, 2448164, 2346211, 2342105, 2409736, 2512501, 2646624, 2785355, 2845352, 2777112, 2646346, 2539895, 2482082, 2490261, 2652531, 2865310, 2850614, 2582000, 2266940, 2112212, 2186688, 2375795, 2530670, 2575156, 2466169, 2300320, 2198531, 2111050, 1953221, 1738505, 1551664, 1451440, 1448082, 1527679, 1652879, 1742567, 1755473, 1740228, 1768978, 1818819]
9710A818819m44r8901j36760m9152n091r3605j55180p5825M1116P1105P6630R8526
9698A491238O474k14510l27856k20348n5051P2221K50915L02522J75231K9760
9688A510596j24745k43247k42867j68967l9642J41463K37248J87168J08603P4462
9678A440072M2832n9728j40688r0809k5246j7411q0124j58932j04600P3015J98822
9667A077203J95101J70720K05822K13262J19518l0211j95120k95484k05862k2686
9657A232263Q5612Q2504J9175q676L0376O1320M0381p445l1518L5788J18405J27501
9645A785686R6997J13219K02402K30187J34700l1912j73946j55042M109J15371
9635B321771J18735P0556k6815j46597j52047m4678J7192J2858l3118l1100P4440
$$ y = [1818819, 1818375, 1719474, 1582714, 1533562, 1528471, 1434866, 1279686, 1203861, 1244977, 1316082, 1392712, 1491238, 1497712, 1283202, 955346, 734998, 679947, 752168, 1003083, 1305605, 1480836, 1510596, 1385851, 1142604, 899737, 730770, 691128, 832591, 1069839, 1257007, 1365610, 1440072, 1482904, 1423176, 1282488, 1191679, 1166433, 1149022, 1068898, 909966, 805366, 878381, 1077203, 1272304, 1443024, 1648846, 1862108, 1981626, 1951415, 1756295, 1460811, 1254949, 1232263, 1317875, 1400379, 1419554, 1410878, 1441254, 1502574, 1542955, 1535510, 1503992, 1539780, 1658185, 1785686, 1882683, 1995902, 2198304, 2428491, 2563191, 2531279, 2357333, 2202291, 2206400, 2321771, 2440506, 2511062, 2484247, 2337650, 2185603, 2140925, 2158117, 2170975, 2137857, 2106757, 2181197]
9624B181197J32850O1541o0288j15071o0666o421k7346n1896p0776j45253k17659
9613A620212j88548n2075J08267J78342J04676m0422r3173r3289j21612j48382
9603A273996j56070j01550L6136J07964l3867k43696k79648j38014Q5401K68557
9593H19209L51919L62029L11616K26296J55275J19748J38210J38353P1050k4363
9583B669342j36728j65159j38123j75193k36705k34482j62251r6524m1097j1005
9573A272075m2796j12774j07901j6954M4566Q7458J25067J39452J39918J06216
9563A634327L4134n401L7534R0688R4898K0701j24649j78270j50628k15580l19439
9552I18315k63160j24593r7895o1919O6566J45402J10676R1288J67368K26379
$$ y = [2181197, 2314047, 2375588, 2315300, 2200229, 2139563, 2133142, 2105796, 2053900, 1983124, 1837871, 1620212, 1431664, 1379589, 1487856, 1666198, 1770874, 1730452, 1637279, 1543990, 1422378, 1273996, 1117926, 1016376, 1052512, 1160476, 1126609, 882913, 603265, 465251, 550652, 819209, 1171128, 1533157, 1844773, 2071069, 2226344, 2346092, 2484302, 2622655, 2693705, 2669342, 2532614, 2367455, 2229332, 2054139, 1817434, 1582952, 1420701, 1324177, 1283080, 1272075, 1229279, 1116505, 1008604, 991650, 1036216, 1123674, 1248741, 1388193, 1528111, 1634327, 1668461, 1663060, 1700594, 1791282, 1886180, 1906881, 1782232, 1603962, 1453334, 1237754, 918315, 655155, 530562, 432667, 370748, 437314, 582716, 693392, 784680, 952048, 1178427]
9542A178427K12260J70602J38520Q5431j5706r0425j01091m2900L0467M2j02209
9531A463418j63120j49133p0885R1060K74018L55637K90680J30907J6948K0083
9521B259613P3895J16854J44903K14033K58599J88262M2057j3337R3529J93044
9511C571452J89980J70943J72758J60842J65422K89199M59005N40483N09209M23725
9501F653018L88002L97527L70551L82452M75650N61133O43039P84777R51437J087584
9491A2695170J202001J320694J381252J287377J046581P18092L43974j04467n83173
9482A9307501r81951j204321j237747j145332j054130r86380r15977q77059q35429
9473A0069175o89866m95716m26577m77233n82763o66196o48839n80624n31779
$$ y = [1178427, 1390687, 1561289, 1699809, 1785240, 1769534, 1679109, 1578018, 1535118, 1565585, 1565627, 1463418, 1300298, 1151165, 1080280, 1171340, 1445358, 1800995, 2091675, 2222582, 2239530, 2259613, 2333508, 2450362, 2595265, 2809298, 3067897, 3256159, 3298216, 3284879, 3378408, 3571452, 3761432, 3932375, 4105133, 4265975, 4431397, 4720596, 5179601, 5720084, 6229293, 6653018, 7041020, 7438547, 7809098, 8191550, 8667200, 9228333, 9871372, 10656149, 11607586, 12695170, 13897171, 15217865, 16599117, 17886494, 18933075, 19651167, 19995141, 19890674, 19307501, 18325550, 17121229, 15883482, 14738150, 13684020, 12697640, 11781663, 10904604, 10069175, 9379309, 8883593, 8457016, 7979783, 7397020, 6730824, 6081985, 5501361, 4969582]
9464D969582m83563l93030l31615l15241k15936l4580L3430o4520j33110j4320
9454C017097J56510J39419K580n7821o6276q2700p0584m4657k6371P615K3388
9443B998200p7041k39246l34395k77198r6667P0550J64946J24960k0421p6527
9433B237161j4659Q9915J09481M8797J274j7593p8994j76907j30774m2612n7865
9422A967224q3537o0982q601j4176j00868j53218j04783L9343J40115J31069J00323
9411A851909O2688M0046J10643J76844J13055k5380j30341j52867o9676M7964
9401B024885J28447J12669M9850N6857J22700J46638J08186L5500o6163j75138
9391B544431l05517m01199l40344j36916P7155J69459J96421K05855J07658o376
$$ y = [4969582, 4486019, 4092989, 3761374, 3446133, 3230197, 3195617, 3229047, 3164527, 3031417, 3017097, 3173607, 3313026, 3315606, 3257785, 3191509, 3108809, 3038225, 2993568, 2967197, 2974812, 2998200, 2921159, 2681913, 2347518, 2070320, 1973653, 2044203, 2209149, 2334109, 2313688, 2237161, 2222502, 2312417, 2421898, 2470695, 2471969, 2454376, 2375382, 2198475, 2067701, 2025089, 1967224, 1883687, 1822705, 1814104, 1799928, 1699060, 1545842, 1441059, 1480402, 1620517, 1751586, 1851909, 1914597, 1954643, 2065286, 2242130, 2355185, 2329805, 2199464, 2046597, 1976921, 2024885, 2153332, 2266001, 2315851, 2372708, 2495408, 2642046, 2750232, 2785732, 2719569, 2544431, 2238914, 1837715, 1497371, 1360455, 1437610, 1607069, 1803490, 2009345, 2117003, 2110627]
9381B110627p5808p3828L464l6193j55383j78724j31249o7306L118q696r2821
9370A297201j41042j17620m7460M6278K10443L34722K43359Q6946M1824P1791
9360B026442J01539O0033q5258k18350k42970k07826j43691l2726P5628P4557
9350A407378J4044r389J5479L3462K1030q589q8575k08183k42866j24340j1768
9339G97683o115l7838p5300n8654L2813R5997R5563N6810K4734N4245J22378J97685
9327A300001K66332K38851K8979j88312j67362L4871J91727K08715J38132Q3191
9317B135125R3684Q4637J1759j8839L9791P5135j0226j25292j88081k82369l34659
9306A480665k25715l4469J24991J11973m63J0801J41388K01851J10782l4759q9235
$$ y = [2110627, 2034819, 1960991, 1964455, 1928262, 1772879, 1594155, 1462906, 1395600, 1398718, 1390022, 1297201, 1156159, 1038539, 991079, 1037357, 1247800, 1582522, 1825881, 1912827, 1954651, 2026442, 2127981, 2188014, 2102756, 1884406, 1641436, 1433610, 1289919, 1257193, 1332821, 1407378, 1421422, 1412033, 1427512, 1460974, 1482004, 1473415, 1384840, 1176657, 933791, 809451, 797683, 791568, 753730, 678430, 619776, 652589, 748586, 844149, 900959, 925693, 979938, 1102316, 1300001, 1566333, 1805184, 1834163, 1645851, 1478489, 1513360, 1705087, 1913802, 2051934, 2135125, 2228809, 2313446, 2325205, 2306366, 2346157, 2421292, 2411066, 2285774, 2097693, 1815324, 1480665, 1254950, 1220481, 1345472, 1457445, 1456982, 1467783, 1609171, 1811022, 1921804, 1887045, 1797810]
9295A797810n0386P401L4261M9671P5086K6886r8690k04517j86261o9948Q978
9284A390291L7603J03732J55877Q9589l4429j42899j60149r4347k8422L1443O1589
9273A409878j5837q6428l6111R5621K06336J89737R7347J1989K0478Q4464Q1655
9262B059129J863r9397j68768j37475n7372m5494r1655r7368k7682L5655J6984
9251A388420o5685j16610q0023M74O8785R9269J21853J05143L1769o6396j39871
9240A347128j31061j01586j13303j04345k7209N5904N1873N6790J43423J12489
9230A290103p0509j67966j02001o9875j37032j48514k5885J69263L19042L29957
9220A386583K93290K86138K87637K55000J67336R6405N8769j2210q0442j36010
$$ y = [1797810, 1747424, 1754825, 1789086, 1838757, 1913843, 1940729, 1842039, 1637522, 1451261, 1381313, 1390291, 1427894, 1531626, 1687503, 1777092, 1742663, 1599764, 1439615, 1345268, 1316846, 1348289, 1409878, 1394041, 1307613, 1271502, 1367123, 1573459, 1763196, 1860543, 1872532, 1893010, 1977474, 2059129, 2060992, 1961595, 1792827, 1655352, 1597980, 1552486, 1460831, 1363463, 1335781, 1371436, 1388420, 1322735, 1206125, 1126102, 1126576, 1195361, 1294630, 1416483, 1521626, 1553395, 1486999, 1347128, 1216067, 1114481, 1001178, 896833, 869624, 925528, 977401, 1034191, 1177614, 1290103, 1219594, 1051628, 949627, 879752, 742720, 594206, 568321, 737584, 1056626, 1386583, 1679873, 1966011, 2253648, 2508648, 2675984, 2772389, 2831158, 2818948, 2738506, 2602496]
9210B602496k39450k81177j96961j07821m3466K2722N4120K1808j1201o3508j59573
9199A597989j80383p7010N3920J18694J70465K71392L23118K56037J53223J10247
9189B797692Q1316J2371r6201j93813j54208r85N2852j1372q0478j48875j24968
9178B133331l6647J8866L9089K4826j4305o3890l7973P7310J61361J94549J83319
9167B679836Q7884m3055p7756K185k619r0089j07171j09848j03595n4612p969
9156B173191o5968j56322j24742q3622j32380j87215j17167M0517J57019J57282
9146A660593J11548J43016K37099K46620J94336K11055K28890J41674L8805l5671
9136C177965j19759j89029k65609l55482l65297k24274n8408l1435j47082k80665
$$ y = [2602496, 2363046, 2081869, 1884908, 1777087, 1733621, 1756343, 1810463, 1832271, 1821070, 1757562, 1597989, 1417606, 1340596, 1394516, 1513210, 1683675, 1955067, 2278185, 2534222, 2687445, 2797692, 2879008, 2891379, 2795178, 2601365, 2447157, 2446172, 2499024, 2487652, 2407174, 2258299, 2133331, 2096684, 2115550, 2154639, 2179465, 2165160, 2101270, 2063297, 2140607, 2301968, 2496517, 2679836, 2767720, 2724665, 2646909, 2649094, 2646475, 2556386, 2449215, 2339367, 2235772, 2181160, 2173191, 2107223, 1950901, 1826159, 1742537, 1610157, 1422942, 1305775, 1346292, 1503311, 1660593, 1772141, 1915157, 2152256, 2398876, 2593212, 2804267, 3033157, 3174831, 3213636, 3177965, 3058206, 2869177, 2603568, 2248086, 1882789, 1658515, 1600107, 1568672, 1421590, 1140925]
9126A140925k98926j72267j3674P1587P8289P0254J01860J17700Q4982j902j10380
9115A068448j24648k1926J04492J57766J50799J08783N7140M6885Q8999O1399
9105A698137j00873k81344l43332l10478k39426j01490L7124R5240M0076n6925
9095D36709q7350p4606n1559K7982K00431K65800J28006P539j4821k2813l7731
9084G77587j0390Q4723J27689P0975L3502J9127j2876l5825q852O8200N3588k9214
9072A138234l6838q612j1995j7560J0988Q6713J26450P1761K573p7273j96929
9061A087512k24202o1374J15195J63664Q9203m0077j14452o2892K4153J2426l9864
9050I49292n0018q1250j14801o8903K4897J56510J93596J18190Q5661J08654J99943
$$ y = [1140925, 841999, 669732, 656058, 727645, 805934, 876188, 978048, 1095748, 1180730, 1178828, 1068448, 943800, 921874, 1026366, 1184132, 1334931, 1443714, 1500854, 1547739, 1636738, 1698137, 1597264, 1315920, 972588, 662110, 422684, 321194, 358318, 453558, 493634, 436709, 349359, 274753, 223194, 251176, 451607, 717407, 845413, 852952, 838131, 815318, 777587, 767197, 851920, 979609, 1050584, 1084086, 1103213, 1090337, 1054512, 1045660, 1113860, 1167448, 1138234, 1101396, 1092784, 1080789, 1063229, 1074217, 1160930, 1287380, 1359141, 1361714, 1284441, 1087512, 863310, 801936, 917131, 1080795, 1169998, 1129921, 1015469, 952577, 976730, 989156, 949292, 899274, 818024, 703223, 634320, 659217, 815727, 1009323, 1127513, 1213174, 1321828, 1521771]
9039A521771L17221K88082O1286j47472j87054j18107n9684l8598j1943k4468
9029A601034j04923j67407j79795j95005k15529j51906R757J19570Q3046j7325
9019G81517n4309n411J00099K30990K88969K42546J96019J97258J89221J91038
9009B357937J56900N5865l7689q9157r1455l6773P879j7702q1099p9302k3553
8998B121851l3663j70942l35883l62641k80480j76113p2054O2590J69992J64836
8988A087493J05439J18677K07759L29526L32128J99396J15253O8425o4261j91602
8978B308233j25961R6389K62612K54481O549k88375l43387k30931j27361j3485
8968A798764J19014J94889K26381K11680J54928R8581k0706j72667j86335l6128
$$ y = [1521771, 1838992, 2127074, 2188360, 2040888, 1853834, 1735727, 1676043, 1637445, 1625502, 1601034, 1496111, 1328704, 1148909, 953904, 738375, 586469, 596226, 715796, 798842, 781517, 727208, 721797, 821896, 1052886, 1341855, 1584401, 1780420, 1977678, 2166899, 2357937, 2514837, 2570702, 2533013, 2443856, 2352401, 2315628, 2323507, 2305805, 2224706, 2145404, 2121851, 2088188, 1917246, 1581363, 1218722, 938242, 762129, 690075, 752665, 922657, 1087493, 1192932, 1311609, 1519368, 1848894, 2181022, 2380418, 2495671, 2564096, 2499835, 2308233, 2182272, 2278661, 2541273, 2795754, 2802303, 2513928, 2170541, 1939610, 1812249, 1798764, 1917778, 2112667, 2339048, 2550728, 2705656, 2804237, 2783531, 2610864, 2424529, 2388401]
8958B388401M9852o1102k56821l69875k63779l0766M8238p7744j41359j1617P3733
8947A347161J3185n8174n4857n0744o7525p235Q1347R7367R2972J21831J16726
8936A632054J17868J50037J10415L7746M7631J03224J09364K5714j02268q4743
8926B147042M6588P9306j0065j27253k30974k87550k35346r3432P8853J70804
8916A537973J64426J42970J54288J36112J4966j93419k99684k14241m1647J32323
8906A534067J63728r127k44344l65885k61838k3700J46661J27697M6095N8445
8896A171799P7471N2894J8636P618L5201J46497L36273M13239K86056O0754p1600
8885B534838j4669P6366P1966j9800j00718r8236o8080q7147j82706k80833k18097
$$ y = [2388401, 2438253, 2377151, 2120330, 1750455, 1486676, 1455910, 1504148, 1426404, 1285045, 1273428, 1347161, 1360346, 1302172, 1247315, 1196571, 1129046, 1121811, 1203158, 1300525, 1393497, 1515328, 1632054, 1749922, 1899959, 2010374, 2048120, 2095751, 2198975, 2308339, 2334053, 2231785, 2147042, 2193630, 2272936, 2262871, 2135618, 1904644, 1617094, 1381748, 1288316, 1367169, 1537973, 1702399, 1845369, 1999657, 2135769, 2150735, 1957316, 1657632, 1443391, 1401744, 1534067, 1697795, 1688668, 1444324, 1078439, 816601, 792901, 939562, 1067259, 1113354, 1171799, 1249270, 1302164, 1320800, 1328418, 1363619, 1510116, 1846389, 2259628, 2545684, 2606438, 2534838, 2520169, 2596535, 2668501, 2648701, 2547983, 2449747, 2381667, 2294520, 2111814, 1830981, 1612884]
8874A612884M5254K91334L35601K36064J00420m700r7948j87658k41620k38094
8864A851537j38452L3878K22536K94309K27099J15297j194j12954j57485j17012
8854B217559m8163J02461K88181K79889P2348j11831j84778j07644N8721R0932
8844B657675k1814j42561j28196l3843N8100J22354R7402k7432j70975j73917
8834B236793o8747k1224K3047J42924J94798J29873M8316k1358l5145K2915L5438
8823B687630o2672j29628j06488j01879j38021j48356p8946L3633N5983J8070
8813B029326Q4699J94660J93527J35009J54693J83899O3015j63770l26553l40329
8803B208176k24010j8729J64730K41027J65340m3793k02070k18776j51066n2952
$$ y = [1612884, 1658138, 1949472, 2285073, 2521137, 2621557, 2616857, 2518909, 2331251, 2089631, 1851537, 1713085, 1746963, 1969499, 2263808, 2490907, 2606204, 2605010, 2492056, 2334571, 2217559, 2169396, 2271857, 2560038, 2839927, 2912275, 2800444, 2615666, 2508022, 2566743, 2657675, 2635861, 2493300, 2365104, 2331261, 2389361, 2511715, 2609117, 2581685, 2410710, 2236793, 2168046, 2146822, 2169869, 2312793, 2507591, 2637464, 2685780, 2664422, 2629277, 2652192, 2687630, 2624958, 2495330, 2388842, 2286963, 2148942, 2000586, 1921640, 1955273, 2011256, 2029326, 2114025, 2308685, 2502212, 2637221, 2791914, 2975813, 3038828, 2875058, 2548505, 2208176, 1984166, 1965437, 2130167, 2371194, 2536534, 2492741, 2290671, 2071895, 1920829, 1867877]
8793A867877N3388J12740Q4698O6146M7907l8577r3450n8984p4994j61218j07886
8782A697647O2006J48644N2529j41249k72226l54980l54425k30534m5813P6537
8772F38136Q0654M5453J2435l056Q9439K47395L26125L08885K26274J72778J51236
8761B295754J07916K2351j11513j83108q6597P0426J46114J38503O2987k1411
8751B441422o4236q0346j7210J19298K03799J49378N6000L4446Q0191J14977J57475
8740C195194J92346R8774j9708p3857j89789k86216k09722p8125j7877K305Q5332
8729B698657K23939K13072J6804j11487j08570m4746L7420M0726m3129j50190
8719B772496k07124k07459j82255q4271L4189R4495J01054P0634L7484J4788R521
$$ y = [1867877, 1921265, 2034005, 2118703, 2184849, 2232756, 2194179, 2100729, 2041745, 1966751, 1805533, 1697647, 1759653, 1908297, 1960826, 1819577, 1547351, 1192371, 837946, 607412, 561599, 638136, 718790, 764243, 776678, 773622, 863061, 1110456, 1436581, 1745466, 1971740, 2144518, 2295754, 2403670, 2426021, 2314508, 2131400, 2044803, 2115229, 2261343, 2399846, 2462833, 2441422, 2377186, 2296840, 2279630, 2398928, 2602727, 2752105, 2808105, 2842551, 2922742, 3037719, 3195194, 3387540, 3486314, 3466606, 3392749, 3202960, 2916744, 2707022, 2628897, 2611020, 2613325, 2698657, 2922596, 3135668, 3152472, 3040985, 2932415, 2887669, 2925089, 2965815, 2922686, 2772496, 2565372, 2357913, 2175658, 2091387, 2125576, 2220071, 2321125, 2391759, 2429243, 2444031, 2453552]
8708B453552K9182O4614N9496R2069J99343K17618J22062J5868l8877o3612p4189
8697C077126m6527m0228o9465j14308j66969j62937k0720J61500K11722J30217
8687B959411M5200O6733J52804J28948k4069q7593J2327J48929J86258J27717
8677C716665N8783j0850m0724O2037K23287K73848J87625J23042J33981J60947
8667D888641J83235J72988R8113N7634P8975P3407j8533j25310j41782r9537o7740
8656E100091L546J53702K73740L11046L00327L04927K72688K23287J81394J50463
8646G275211J84882J88455Q3752L9861J14778J59861J91709K83426M28861O19817
8636I570613P21720O63869O29888P41217P99437P55966P87107R34019J138200
$$ y = [2453552, 2482734, 2547348, 2606844, 2698913, 2898256, 3115874, 3237936, 3253804, 3214927, 3151315, 3077126, 3030599, 2990371, 2920906, 2806598, 2639629, 2476692, 2455972, 2617472, 2829194, 2959411, 3004611, 3071344, 3224148, 3353096, 3329027, 3241434, 3253761, 3402690, 3588948, 3716665, 3775448, 3764598, 3723874, 3785911, 4009198, 4283046, 4470671, 4593713, 4727694, 4888641, 5071876, 5244864, 5342977, 5400611, 5479586, 5552993, 5534460, 5409150, 5267368, 5167831, 5100091, 5103637, 5257339, 5531079, 5842125, 6142452, 6447379, 6720067, 6943354, 7124748, 7275211, 7460093, 7648548, 7732300, 7772161, 7886939, 8046800, 8238509, 8521935, 8950796, 9570613, 10292333, 10956202, 11586090, 12327307, 13126744, 13882710, 14669817, 15603836, 16742036]
8627A6742036J343327J453800J483665J591201J893945K276377K560493K655954
8619C2000798K521467K211798J784448J263440O05506j16586p62122j281738j645407
8610C6581604j787369j783953j798978j824877j772749j646853j538056j444170
8602B2984599j281366j071055q62406o60181m47970k66801k35124k54938k13339
8593A7691419j39415p7688k7344R3084K89734N44316Q19595R66053Q69322O42246
8583B1671322M83026L47870J39628p1103k52686m96206p25940q69772j021815
8574A9204324j101716j035515r16475p96141p17323p93142q83313q36490p41891
8565A1382318o58577n26657l92287l11024k59745k25737k19624k87383l89081
$$ y = [16742036, 18085363, 19539163, 21022828, 22614029, 24507974, 26784351, 29344844, 32000798, 34522265, 36734063, 38518511, 39781951, 40387457, 40270871, 39508749, 38227011, 36581604, 34794235, 33010282, 31211304, 29386427, 27613678, 25966825, 24428769, 22984599, 21703233, 20632178, 19769772, 19109591, 18661621, 18394820, 18159696, 17904758, 17691419, 17552004, 17474316, 17446972, 17540056, 17829790, 18374106, 19193701, 20159754, 21029076, 21671322, 22154348, 22502218, 22641846, 22570743, 22318057, 21821851, 21095911, 20226139, 19204324, 18102608, 17067093, 16150618, 15354477, 14637154, 13844012, 12960699, 12124209, 11382318, 10723741, 10197084, 9804797, 9493773, 9234028, 9008291, 8788667, 8501284, 8112203]
8556H112203l79310k81686k15921j95065j90297k13732l04656m22140m64686l68040
8546E076670j69230L4487J58266J76402J05323j8914j42097j86326j21118m7908
8536D865555m0526o4586o6799j8380N8550J12237O6784q8629k07966j84201l6318
8525D395721J58180K41219J67665L6500q3110j61602j85430j73517q6781O1492
8515D370337J75274K22689J61562Q5206J13732R1298n3665j14501o5869q3319
8505D902744j18599j17704j22691j00941j06232j32946j04895k5474J39235K76609
8495D489106K59029J22348l7412r9471l9542K5304M5646N1805N6107L8533l1039
8484D880414j28680j90962j98038j43999q7328n5497k2245j1576K109N4339L3753
$$ y = [8112203, 7732893, 7451207, 7235286, 7040221, 6849924, 6636192, 6331536, 5909396, 5444710, 5076670, 4907440, 4941927, 5100193, 5276595, 5381918, 5363004, 5220907, 5034581, 4913463, 4865555, 4825029, 4760443, 4693644, 4675264, 4733814, 4846051, 4912835, 4824206, 4616240, 4432039, 4395721, 4553901, 4795120, 4962785, 4999285, 4916175, 4754573, 4569143, 4395626, 4308845, 4370337, 4545611, 4768300, 4929862, 5015068, 5128800, 5220098, 5166433, 5051932, 4986063, 4902744, 4784145, 4666441, 4543750, 4442809, 4336577, 4203631, 4098736, 4073262, 4212497, 4489106, 4748135, 4870483, 4833071, 4733600, 4694058, 4719362, 4765008, 4816813, 4872920, 4911453, 4880414, 4751734, 4560772, 4362734, 4218735, 4131407, 4075910, 4053665, 4042089, 4044198, 4098537, 4132290]
8473D132290j0961M7197R2184P7190R2265J26804J03011M3556j1870r803J4481
8462D696344L3551R2657J50587J35760J3772q6390n5392P1718K25582L02615K44040
8451E824844R9328R330K0144L9620M3586P8445J27032J40758K12675L44237L54068
8440G294067K91429L05701K96880K07923P5814r2089k52017l03582j87158k8207
8430G608761J37735L05462L22783J93420J17418J48822J56595J21810R6035J15973
8420I324814J61183J86951K88207L64617L34572L42353M45251N94948P27895Q14845
8410A3585636Q62016R60643J111541J211174J321300J528380J743951J892477
8402B4217118K104493K384751K539641K463727K192349J848261J441510R11002
$$ y = [4132290, 4121329, 4168526, 4260710, 4337900, 4430165, 4556969, 4659980, 4703536, 4691666, 4681863, 4696344, 4729895, 4822552, 4973139, 5108899, 5122671, 5036281, 4980889, 5052607, 5278189, 5580804, 5824844, 5924172, 5933502, 5953646, 5993266, 6036852, 6115297, 6242329, 6383087, 6595762, 6939999, 7294067, 7585496, 7891197, 8188077, 8396000, 8471814, 8379725, 8127708, 7824126, 7636968, 7608761, 7746496, 8051958, 8374741, 8568161, 8685579, 8834401, 8990996, 9112806, 9208841, 9324814, 9485997, 9672948, 9961155, 10325772, 10660344, 11002697, 11447948, 12042896, 12770791, 13585636, 14447652, 15408295, 16519836, 17731010, 19052310, 20580690, 22324641, 24217118, 26321611, 28706362, 31246003, 33709730, 35902079, 37750340, 39191850, 40102852]
8394D0102852K05903n85810j234337j665839j924733k092533k160282k098238
8386B8546983j925352j732832j644011j628008j508451j300541j081471q91719
8378A6834598p81412p23036o25932m51068l39869l48616l71536l38239k82727
8369A2572163l12264k91666j48282o1325p0653j08094j19154r0306j42172k49671
8359A0978576k83207k37266j80181j87513j85652j17155o7644o0359l8944L1945
8349I652600O3446J932r248Q3558R7903O960J8948J32285J76161J16393J3428
8338A0354366n6651l2304j9222m7055R700J93909L89574M72859M37504L94732
8328A2097412M27141M62683M39972M14694M22689M64301N53455P15475Q65482
$$ y = [40102852, 40308755, 39722945, 38488608, 36822769, 34898036, 32805503, 30645221, 28546983, 26621631, 24888799, 23244788, 21616780, 20108329, 18807788, 17726317, 16834598, 16053186, 15330150, 14704218, 14253150, 13913281, 13564665, 13193129, 12854890, 12572163, 12259899, 11968233, 11819951, 11758626, 11687973, 11579879, 11460725, 11370419, 11228247, 10978576, 10695369, 10458103, 10277922, 10090409, 9904757, 9787602, 9719958, 9659599, 9620655, 9652600, 9716046, 9717978, 9708730, 9792288, 9890191, 9897151, 9916099, 10048384, 10224545, 10340938, 10354366, 10297715, 10265411, 10246189, 10199134, 10208834, 10402743, 10792317, 11265176, 11702680, 12097412, 12524553, 12987236, 13427208, 13841902, 14264591, 14728892, 15282347, 15997822, 16863304]
8319A6863304Q85963Q97946R79824J144310J366982J566072J785958K066120K429708
8310B9986187K832308L198776L540083L841456M019975L986176L651773L007779
8302E8064513K097334J023692j17212j202248k062105k670885l037670l150120
8294D8945299l089190k916762k631263k251656j902555j667631j474987j219546
8286C1791709r25055o89242n12736l12890j59402j55710k09597k16763k10839
8277B8399475k47015k46519r6057J45823L15803L84950M44926M71766M32525M92298
8267C0497975O83125Q27790R58270J162109J429375J749027K129765K582163L140539
8258D5160138L727096M327610N080998N991761O911017P816029Q905381J0197357
$$ y = [16863304, 17749267, 18647213, 19627037, 20771347, 22138329, 23704401, 25490359, 27556479, 29986187, 32818495, 36017271, 39557354, 43398810, 47418785, 51404961, 55056734, 58064513, 60161847, 61185539, 61068327, 59866079, 57803974, 55133089, 52095419, 48945299, 45856109, 42939347, 40308084, 38056428, 36153873, 34486242, 33011255, 31791709, 30866654, 30177412, 29664676, 29351786, 29192384, 29036674, 28827077, 28610314, 28399475, 28152460, 27905941, 27809884, 27955707, 28271510, 28656460, 29101386, 29573152, 30005677, 30497975, 31181100, 32008890, 32967160, 34129269, 35558644, 37307671, 39437436, 42019599, 45160138, 48887234, 53214844, 58295842, 64287603, 71198620, 79014649, 87920030, 98117387]
8250I8117387J1368755J2150129J2449065J1939158J0309045P787215M739021
8243A68859775J291128k314207n628100q190762r686474j0260339j0179018r633359
8235A14258644q793554p837515o950186o125731n309378m564514l939061l410840
8227F7327865k897786k398209j995826j687490j464104j264127j035081q51674
8219E3733568q06347q11494o53811l04162K6373K54783N43045Q66462J096334
8210E3944751J353514J693346K040798K405953K794015L295196L947542M682514
8202G6157629N509635O495718P654640R004437J0598113J2409591J4410033J6641031
8194A58880827J9048786K1385702K3341460K4498991K4327013K2301935J8203710
$$ y = [98117387, 109486142, 121636271, 134085336, 146024494, 156333539, 164120754, 168859775, 170150903, 167836696, 162208596, 154017834, 144331360, 134071021, 123892003, 114258644, 105465090, 97627575, 90677389, 84551658, 79242280, 74677766, 70738705, 67327865, 64430079, 62031870, 60036044, 58348554, 56884450, 55620323, 54585242, 53733568, 52927221, 52115727, 51461916, 51157754, 51184127, 51438910, 51981955, 52848417, 53944751, 55298265, 56991611, 59032409, 61438362, 64232377, 67527573, 71475115, 76157629, 81667264, 88162982, 95817622, 104822059, 115420172, 127829763, 142239796, 158880827, 177929613, 199315315, 222656775, 247155766, 271482779, 293784714, 311988424]
8187C11988424J2248431N071011k433552r408419j5047730j8785201k0615487
8180B63017477k0956046k0288083j8966183j7324484j5545122j3752990j2048704
8173A44135865j0454217r003897p668376o480038n568879m887735m320928l909205
8165I1842590l597113l216216k790650k419051k093245j739856j367097j047588
8157G3571774q55255o80086l10847J52421N90924J069261J592310K106236K651239
8148G9887977L296291L975578M715295N659951O805213Q085828R499329J1207787
8140A33133249J3248709J5507401J8000509K0716450K3524269K6118246K7993034
8133B78241867K8452906K6813359K2717825J6385042Q421580l40052q851405j6055711
$$ y = [311988424, 324236855, 329307866, 326874314, 317465895, 302418165, 283632964, 263017477, 242061431, 221773348, 202807165, 185482681, 169937559, 156184569, 144135865, 133681648, 124677751, 117009375, 110529337, 104960458, 100072723, 95751795, 91842590, 88245477, 85029261, 82238611, 79819560, 77726315, 75986459, 74619362, 73571774, 72716519, 72036433, 71725586, 71878007, 72468931, 73538192, 75130502, 77236738, 79887977, 83184268, 87159846, 91875141, 97535092, 104340305, 112426133, 121925462, 133133249, 146381958, 161889359, 179889868, 200606318, 224130587, 250248833, 278241867, 306694773, 333508132, 356225957, 372610999, 381032579, 380692527, 371841122, 355785411]
8125C55785411k1224374k4110606k5003209k4551659k3276174k1432808j9185896
8118A97000685j6893211j4856291j3041868j1419714j0017873q763182p648508
8111A14360038o682734n805667n020988m430960l990393l574991l196357k840121
8103G8817827k514934k234642j961071j612869j229769q46288m56501m7305M33769
8094F8348217R57271J465610J912954K346570K890497L567227M307803N132200
8086I0928349O133039P376816Q868731J0548256J2413157J4558983J6926593J9300688
8078A87054612K1469297K3054691K3669729K2915461K0350542J5788459R508193
8071C23810984K257543n045203j1495632j6498997j9833623k1478887k1664301
$$ y = [355785411, 334561037, 310450431, 285447222, 260895563, 237619389, 216186581, 197000685, 180107474, 165251183, 152209315, 140789601, 130771728, 122008546, 114360038, 107677304, 101871637, 96850649, 92419689, 88429296, 84854305, 81657948, 78817827, 76302893, 74068251, 72107180, 70494311, 69264542, 68418254, 67961753, 67914448, 68348217, 69305488, 70771098, 72684052, 75030622, 77921119, 81488346, 85796149, 90928349, 97061388, 104438204, 113306935, 123855191, 136268348, 150827331, 167753924, 187054612, 208523909, 231578600, 255248329, 278163790, 298514332, 314302791, 323810984, 326068527, 321023324, 309527692, 293028695, 273195072, 251716185, 230051884]
8064B30051884k0796664j9273888j7381028j5476857j3797656j2239900j0758397
8057A20327494r392355q166610p169063o389990n712468n045154m354691l754040
8049G0343123l287009k920999k646730k389289k106632j827753j527701j164055
8041E2472955p81882m48992j43630J57785M27503P45478J170602J692838K201162
8032E7493819K584363K956064L386905L854863M389662M917900N441921O013947
8024I1039444O636315P378787Q235000R139195R975465J0529739J0467833R523806
8016A62925584P621178M869874J554156k037982n569040q507895j0426396j1268397
8008A39161082j1335013j0998954j0485617r823078q968893q026976p096645o258266
$$ y = [230051884, 209255220, 189981332, 172600304, 157123447, 143325791, 131085891, 120327494, 110935139, 102768529, 95599466, 89209476, 83497008, 78451854, 74097163, 70343123, 67056114, 64135115, 61488385, 59099096, 56992464, 55164711, 53637010, 52472955, 51691073, 51242081, 51098451, 51256236, 51683739, 52429217, 53599819, 55292657, 57493819, 60078182, 63034246, 66421151, 70276014, 74665676, 79583576, 85025497, 91039444, 97675759, 105054546, 113289546, 122428741, 132404206, 142933945, 153401778, 162925584, 170546762, 175416636, 176970792, 174932810, 169363770, 160855875, 150429479, 139161082, 127826069, 116827115, 106341498, 96518420, 87549527, 79522551, 72425906, 66167640]
8000F6167640n535605m842564m230783l734060l281693k903642k585604k352648
7992C6701041k193102j988282j752715j532922j301565j083087r44144q56651
7984B5048573p47439o21604n01821m49402m29247l25016k16222j48627k876K72366
7974B1878685M70468N34534N74777O26047P59812J050340J438112J870474K359322
7965C1562571K819256L129490L324050L557661L746782L595260L023520K193515
7957E6952105J159292o9369j352216k410775l096350l464445l601768l554001
7949D0562473l405790l202425k944863k678193k399399k131813j902074j686096
7941B0211820j522846j446242j354869j160232r40548q08479p01190n71991m64435
$$ y = [66167640, 60632035, 55789471, 51558688, 47824628, 44542935, 41639293, 39053689, 36701041, 34507939, 32519657, 30766942, 29234020, 27932455, 26849368, 25905224, 25048573, 24301134, 23679530, 23177709, 22728307, 22299060, 21974044, 21757822, 21609195, 21606319, 21878685, 22349153, 22883687, 23458464, 24084511, 24844323, 25894663, 27332775, 29203249, 31562571, 34381827, 37511317, 40835367, 44393028, 48139810, 51735070, 54758590, 56952105, 58111397, 58042028, 56689812, 54279037, 51182687, 47718242, 44116474, 40562473, 37156683, 33954258, 31009395, 28331202, 25931803, 23799990, 21897916, 20211820, 18688974, 17242732, 15887863, 14727631, 13787083, 12978604, 12277414, 11705423, 11240988]
7932A1240988m08486m23354m40477m13893m11339m60740n33853n25816m30617
7923G192413l48912k36768j29141j64116k77215l58596l68670k70478j64112r9130
7913D775275J0431J48490J85589N0458j62864k93624k78398j69607k1515J08518
7903D352753J98979K26873J92347Q3334j24235l01723l55234l06995k05676j20899
7893C639524p7634n3098j2499O3123J61137K02882J86590J11384P102l4874o7288
7882D126349q6185n2516m2132m7328j3979r10n1075p5626p1576j08297j66462
7871C410263j57987j13874j32518j95124j91252j24034n9511J4442R9496J93977
7861B743878K98233L20285K83572K35635J85862J22136M5162m1447r2537q9060
$$ y = [11240988, 10832502, 10409148, 9968671, 9554778, 9143439, 8682699, 8148846, 7623030, 7192413, 6843501, 6606733, 6477592, 6313476, 6036261, 5677665, 5308995, 5038517, 4874405, 4775275, 4785706, 4934196, 5119785, 5170243, 5007379, 4713755, 4435357, 4265750, 4244235, 4352753, 4551732, 4778605, 4970952, 5054286, 4930051, 4628328, 4273094, 3966099, 3760423, 3639524, 3561890, 3508792, 3496293, 3559416, 3720553, 3923435, 4110025, 4221409, 4228511, 4193637, 4126349, 4040164, 3987648, 3945516, 3898188, 3884209, 3883299, 3832224, 3756598, 3685022, 3576725, 3410263, 3252276, 3138402, 3005884, 2810760, 2619508, 2495474, 2435963, 2450405, 2549901, 2743878, 3042111, 3362396, 3645968, 3881603, 4067465, 4189601, 4234763, 4193316, 4100779, 4011719]
7851D011719j25111j84956k02299j80703j75314j60850r2455k524K6629J7023
7841B931159l354q8097j67742j76018j52725j41050j28055j09306q6746l9354
7831A838712K5563R3185J35192J11749K0648j00713j35117m5969L4006N8807Q4594
7820B120657J66523K13003J70598M6267j31834k28576j54470j8364P1206J02198
7810B357208J04748L0687j00905j70083j18560J8190J10531J15313O5596J6255
7800B428980R244o554J6743J37546J95511J53006J85602K58100K69567J80399
7790C828144O2344l0371j51646k24957j41511o3268j34676j58454r8393r3120
7780B794092q7049k7460m2746j10528j36676j28932q4208k1406K7107L6055Q7132
$$ y = [4011719, 3886608, 3701652, 3499353, 3318650, 3143336, 2982486, 2890031, 2887507, 2914136, 2931159, 2927805, 2839708, 2671966, 2495948, 2343223, 2202173, 2074118, 1964812, 1878066, 1838712, 1864275, 1957460, 2092652, 2204401, 2225049, 2124336, 1989219, 1943250, 1977256, 2036063, 2120657, 2287180, 2500183, 2670781, 2717048, 2585214, 2356638, 2202168, 2183804, 2255010, 2357208, 2461956, 2492643, 2391738, 2221655, 2103095, 2121285, 2231816, 2347129, 2412725, 2428980, 2438224, 2431670, 2448413, 2585959, 2781470, 2934476, 3120078, 3378178, 3647745, 3828144, 3890488, 3860117, 3708471, 3483514, 3342003, 3278735, 3144059, 2985605, 2887212, 2794092, 2707043, 2679583, 2636837, 2526309, 2389633, 2260701, 2176493, 2155087, 2182194, 2218249, 2305381]
7769B305381J70498J86334J14731O4205R5315J03125L5426J0133N2119N7046K7207
7758C221520l6350j81465k97763k86836j65449l9235Q9842K23530K70486K26741
7748C025021J16103K0838O6575J59205J12439m9691j52838q2406P962M484l7393
7737C190299o0204o7639j08891j66512j50023p7237l6008l4520j13217k43869
7727B132179l18701l48107k93560j14117L5943J4396j15955j89714j53010p3884
7717E75470J6310J19641J78438J22230N6784R2356J54955J83981K04874K18521
7707A923560K44742K14017R1592m3190j67454k25569k01355j35085m9732K5978
7697A677504N2864L0918L7888M3242k072l1087j6876j0960J5573J09245J68355
$$ y = [2305381, 2475879, 2662213, 2776944, 2841149, 2936464, 3039589, 3075015, 3085148, 3137267, 3194313, 3221520, 3185170, 3003705, 2705942, 2419106, 2253657, 2214422, 2304264, 2527794, 2798280, 3025021, 3141124, 3161962, 3228537, 3387742, 3500181, 3450490, 3297652, 3215246, 3223208, 3227692, 3190299, 3130095, 3062456, 2953565, 2787053, 2637030, 2559793, 2523785, 2489265, 2376048, 2132179, 1813478, 1465371, 1171811, 1057694, 1093637, 1108033, 992078, 802364, 649354, 575470, 591780, 711421, 889859, 1012089, 1068873, 1161229, 1316184, 1500165, 1705039, 1923560, 2168302, 2382319, 2473911, 2430721, 2263267, 2037698, 1836343, 1701258, 1651526, 1677504, 1730368, 1761286, 1799174, 1842416, 1840344, 1809257, 1792381, 1781421, 1796994, 1906239, 2074594]
7686B074594J30962M1377j9929m2381m8574j314Q3150J65575K60493L20253K39082
7675C203288O1630m2622p1138j08800j27534j09687n6701l1677j10650k13472
7665B392637k43314j99009n3130J44517K52659K26944J49885J18490J87112K71080
7655C247871K70860K39695K62060L63201M01122L16158K25436J62426J49112K09153
7645E847094L27659M77853N65201N20272M28484M53888O09645Q14648J021952
7636A1066696J214595J311520J285068J225658J172312J118821R72276O64807
7628B0031753K42001j99341n41838q10851j006445j045546r75141r48549j016430
7619A3729613r88010q24103p11174o75894o75082p49280q07347o81893m49692
$$ y = [2074594, 2205556, 2246933, 2227004, 2184623, 2136049, 2134735, 2217885, 2383460, 2643953, 2964206, 3203288, 3264918, 3222296, 3151158, 3042358, 2914824, 2805137, 2748436, 2716759, 2606109, 2392637, 2149323, 1950314, 1897184, 2041701, 2294360, 2521304, 2671189, 2789679, 2976791, 3247871, 3518731, 3758426, 4020486, 4383687, 4784809, 5100967, 5326403, 5488829, 5637941, 5847094, 6174753, 6652606, 7217807, 7738079, 8166563, 8620451, 9230096, 10044744, 11066696, 12281291, 13592811, 14877879, 16103537, 17275849, 18394670, 19366946, 20031753, 20273754, 20074413, 19532575, 18721724, 17715279, 16669733, 15694592, 14746043, 13729613, 12741603, 11917500, 11206326, 10530432, 9855350, 9106070, 8298723, 7616830, 7167138]
7610G167138l21548l59178m94944o26251o76803n61777l06471j23889o6650K966
7600C632593Q4648R0427O585q3224j31630q6756M6493J72195J30077k7104j11720
7589C722584j21634p6368j0720M160M4091J44139K08954K32439J95681K9649j62275
7578D210700k04298j22534n7293n5717j12224k54580m68873n91705n23493l55817
7568A464166k31026j72516j08994k504J03090J77023K43002K58459K03699J26070
7558B060469J15459J74149J62253O9407J0908R335K77l0160q8634j60236k01054
7547B122173k02010k04703k12343j39684k4273M0792L3747n1424k03345l09843
7537H49087k87069k01013j23367k0097Q1851J24299J66721K24811K60445K43358
$$ y = [7167138, 6845590, 6486412, 5991468, 5365217, 4688414, 4126637, 3820166, 3696277, 3629627, 3632593, 3717241, 3807668, 3814253, 3731029, 3599399, 3512643, 3559136, 3731331, 3861408, 3834304, 3722584, 3600950, 3524582, 3513862, 3518022, 3562113, 3706252, 3915206, 4147645, 4343326, 4372975, 4210700, 4006402, 3883868, 3826575, 3770858, 3658634, 3404054, 2935181, 2343476, 1819983, 1464166, 1233140, 1060624, 951630, 949126, 1052216, 1229239, 1472241, 1730700, 1934399, 2060469, 2175928, 2350077, 2512330, 2581737, 2592645, 2601980, 2602257, 2572097, 2483463, 2323227, 2122173, 1920163, 1715460, 1503117, 1363433, 1339160, 1379952, 1413699, 1362275, 1158930, 849087, 562018, 361005, 237638, 217541, 299392, 423691, 590412, 815223, 1075668, 1319026]
7527A319026J34338J3180l9038L573P9758R6770Q9165Q0293L1867L890O6599J63025
7515B042446J92200J58686J46904J44828J11604O834j60337k64031k91787k59534
7505A827813k08619k21714k51833j92994j12637o5891p0313p6583K8447J16019
7495G71695N5547j4721J4795R0862J09962J8383q452J38557K45292K20683J88865
7484A831468K10320J86431L2690q8825j11677j09899n5898K1390L6819j5618j19940
7473A817261k18007k10083j42623r0731r3273j32364q1064N0108J29215J37983
7463A166422R5948L9717O2847R7000P3412K0707l1807q4720p5571J055K3990q158
7451A380842k5032j9880n476q1653k04824j58557L7166J56874J75580J93821K07943
$$ y = [1319026, 1453364, 1466544, 1427506, 1431079, 1510837, 1607607, 1696772, 1777065, 1808932, 1812822, 1879421, 2042446, 2234646, 2393332, 2540236, 2685064, 2796668, 2803502, 2643165, 2379134, 2087347, 1827813, 1619194, 1397480, 1145647, 952653, 840016, 774125, 703812, 627229, 655676, 771695, 827242, 812521, 827316, 918178, 1028140, 1046523, 1038071, 1176628, 1421920, 1642603, 1831468, 2041788, 2228219, 2260909, 2172084, 2060407, 1950508, 1894610, 1916000, 1952819, 1937201, 1817261, 1599254, 1389171, 1246548, 1155817, 1062544, 930180, 849116, 899224, 1028439, 1166422, 1262370, 1302087, 1364934, 1461934, 1535346, 1556053, 1524246, 1439526, 1363955, 1365010, 1389000, 1380842, 1355810, 1335930, 1330454, 1248801, 1043977, 885420, 922586, 1079460, 1255040, 1448861, 1656804]
7440A656804J28467m7395k42190l33556k96308j99743l8346J53262K44500J71037
7430A196532M3240m1651p8052p9244p4241o4244l8495M49l32P659R0420J67034
7418A129075J59493J21992J28214P6668o2954j93419k47318k05195k3506J65772
7408A048822J80156P9175L0083J09455K45749K54421J68583J38485J09660K7179
7398B391768k2998k7149q0754j52708j28152q3788n9253J366K9921n7792j80489
7387A629972k39331k36699j52959l0984L8689L6660j066k6784k3152j5523n6605
7376I22218r9460j66943l08282l59960j94602L0693J90964L00908K96103J96182
7366H07821J19934R8469J10569J56711K20303K46753K27516J51213K5357r5253
$$ y = [1656804, 1785271, 1737876, 1495686, 1162130, 865822, 666079, 627733, 780995, 1025495, 1196532, 1239772, 1198121, 1120069, 1040825, 966584, 902340, 863845, 864294, 863962, 871621, 962041, 1129075, 1288568, 1410560, 1538774, 1615442, 1552488, 1359069, 1111751, 906556, 883050, 1048822, 1228978, 1308153, 1338236, 1447691, 1693440, 1947861, 2116444, 2254929, 2364589, 2391768, 2368770, 2341621, 2260867, 2108159, 1980007, 1896219, 1836966, 1838332, 1868253, 1810461, 1629972, 1390641, 1153942, 1000983, 969999, 1008688, 1045348, 1044282, 1017498, 994346, 978823, 922218, 822758, 655815, 347533, -12427, -207029, -176336, 14628, 315536, 611639, 807821, 927755, 1026224, 1136793, 1293504, 1513807, 1760560, 1988076, 2139289, 2164646, 2069393]
7356B069393j63279j99122j76336m6262P9323J60292K26014K13472J08546j9286
7346B252755j36382j73276q1726K6177P6323R0531P9095N0365k0773r6197j53075
7335A913817j24838j746J14778J91542K37908K23146J33183M6950j1796p2210
7325B650734p7051n8344o0597r6014j66125j85243j83891j83692j51771j11816
7315A376190o1018O6521J21960Q326m5325K6062O0019J058j8052J07815K70521
7304A914077L10123J77941k052o7205k3961K6280j0467m7166l3755K3145Q6857
7293B353817N9057n3960j77952k59711k45093j90639j85171k46226k99193k07875
7283E47054j1136J19522J12110O4884P1550J15889J64505K33713L18289L18614
$$ y = [2069393, 1906114, 1706992, 1530656, 1484394, 1563717, 1724009, 1950023, 2163495, 2272041, 2252755, 2116373, 1943097, 1861371, 1887548, 1963871, 2054402, 2133497, 2183862, 2163089, 2066892, 1913817, 1788979, 1787233, 1902011, 2093553, 2331461, 2554607, 2687790, 2734740, 2722944, 2650734, 2573683, 2515339, 2454742, 2358728, 2192603, 2007360, 1823469, 1639777, 1488006, 1376190, 1315172, 1381693, 1503653, 1511979, 1466654, 1492716, 1552735, 1553793, 1535741, 1643556, 1914077, 2224200, 2402141, 2400089, 2332884, 2308923, 2335203, 2324736, 2277570, 2243815, 2266960, 2353817, 2412874, 2358914, 2180962, 1921251, 1676158, 1485519, 1300348, 1054122, 754929, 547054, 535918, 655440, 767550, 832434, 903984, 1019873, 1184378, 1418091, 1736380, 2054994]
7273B054994K16347J48607J69010J51740O9811j1061q5477q9730r6706j94207
7263B333328k03286o1543L1199N074q0978k05800l24633k99892j27817M8399J03356
7252A217407L5068j2738L6675J20707J99465K28541K58156K96490K24776Q5193
7242B689740m0879j51078j85105j70528k06329k25920j67707r3059k6664L5613
7232A458084J20883K02799K08547J51546J23176J20647L3174j39344k74930k97872
7222A706710k33612j34038n6593k0342L5185J13522J13367O0434O1021J06448
7212A752102P8226k8989j05845j21379j03401q3313n0417L6457J14390J46627
7202A634458J70268J58890Q5177J6839K3488Q5047J00410K2513j23332k34229
$$ y = [2054994, 2271341, 2419948, 2588958, 2740698, 2810509, 2799448, 2713971, 2624241, 2527535, 2333328, 2130042, 2068499, 2099698, 2104772, 2023794, 1817994, 1493361, 1193469, 1065652, 1114051, 1217407, 1252475, 1239737, 1276412, 1397119, 1596584, 1825125, 2083281, 2379771, 2604547, 2689740, 2648861, 2497783, 2312678, 2142150, 1935821, 1709901, 1542194, 1449135, 1422471, 1458084, 1578967, 1781766, 1990313, 2141859, 2265035, 2385682, 2418856, 2279512, 2004582, 1706710, 1473098, 1339060, 1282467, 1262125, 1297310, 1410832, 1524199, 1584633, 1645654, 1752102, 1830328, 1801339, 1695494, 1574115, 1470714, 1387401, 1336984, 1373441, 1487831, 1634458, 1804726, 1963616, 2048793, 2065632, 2089120, 2174167, 2274577, 2297090, 2173758, 1939529]
7192A939529k44886j55065o2516l4882l5681o7914q2721n7544k821J12852K66767
7181A575118L37167K24744N7134n3208j25413j21311o3497J5550J10708J81442
7171B138434K14930J74491P9298K6963o17l8802o4958o7050r254L5493q998q3184
7159B396746q7739k7166J986m0177m3324J37649L59840L74361K08747L8485q46
7148C318562L1739J868k3877M3547J56750J38912j754p1897m9981L2436J63833
7137C740138J77889N6827j0378j2587n7336j50211k14564k14251j06103J10782
7127C320206K47641J64499J8445n8439p927J34116K18697K94248L51472K74354
7117D957312J51254J39585K24073L50587M96826O89666R23503J036220R84965
$$ y = [1939529, 1694643, 1539578, 1477062, 1442180, 1406499, 1338585, 1255864, 1198320, 1195499, 1308351, 1575118, 1912285, 2137029, 2194163, 2140955, 2015542, 1894231, 1830734, 1846284, 1956992, 2138434, 2353364, 2527855, 2607153, 2634116, 2633499, 2594697, 2529739, 2462689, 2453435, 2488928, 2479930, 2396746, 2309007, 2281841, 2283827, 2243650, 2200326, 2337975, 2697815, 3072176, 3280923, 3319408, 3318562, 3350301, 3352169, 3328292, 3371839, 3528589, 3667501, 3665747, 3593850, 3543869, 3576305, 3740138, 3918027, 3974854, 3964476, 3951889, 3894553, 3744342, 3529778, 3315527, 3209424, 3320206, 3567847, 3732346, 3750791, 3692352, 3684425, 3818541, 4037238, 4331486, 4682958, 4957312, 5108566, 5248151, 5472224, 5822811, 6319637, 7009303, 7932806, 8969026, 9953991]
7108I953991R02556Q96901R73373J172500J526121J952758K427217K991502L756573
7099B6553492M788431N928475O955038P429403O460152L458691q39706m551389
7091E6182587o363454o462388n736461m885591m182650l581891l021301k525307
7083A9423544k137739j831465j580513j345940j113360q90735p11873o04967n41248
7074H665704n44592o10490o02821m90848l77650l44212l44042k99594j89960m6785
7064D814710M8198O0156N8108J221j49135k26774j89000j18475o1251k9408j582
7053D206768j9073j21125k62408l68710l27200j42089L8576R0889K7295j25073
7043B997850k73512l43621l52069k54812m2634J37381K05024J65486O3086m1515
$$ y = [9953991, 10856547, 11753448, 12726821, 13899321, 15425442, 17378200, 19805417, 22796919, 26553492, 31341923, 37270398, 44225436, 51654839, 58114991, 61573682, 60733976, 56182587, 49819133, 43356745, 37620284, 32734693, 28552043, 24970152, 21948851, 19423544, 17285805, 15454340, 13873827, 12527887, 11414527, 10523792, 9811919, 9206952, 8665704, 8121112, 7510622, 6907801, 6416953, 6039303, 5695091, 5351049, 5051455, 4861495, 4814710, 4862908, 4923064, 4981172, 4982393, 4833258, 4606484, 4417484, 4299009, 4237758, 4208350, 4206768, 4187695, 4066570, 3804162, 3435452, 3108252, 2966163, 3004739, 3095628, 3122923, 2997850, 2724338, 2380717, 2028648, 1773836, 1731202, 1868583, 2073607, 2239093, 2302179, 2260664]
7033B260664j58397k54861k45527r6167J14167J72333M8751m1179J0544J0306
7023A820634j54330l09021k86792j16628O4544J48708J29686Q0587J37659K07430
7013A722477J58152J18246J06184P3967J4688r0654k04910k81148k15960k6937
7003A374105J07078J10477M5507K3002Q7977Q9706k3283l5984N4089J51406K60239
6992B244319L19575K54632J82530J92690J40894l9602k45080l43930l45441k87887
6982B072700j77419o6362k3054k0838j5693j10624k97100m05712l27744n3695
6972E74459K43726L53324K43231J03822M9298k2287p1146n4866n7793j07169j12459
6961A142140K310J40793K27067K62894K07195P9284k6572p7328l5822M4430N0116
$$ y = [2260664, 2102267, 1847406, 1601879, 1505712, 1619879, 1792212, 1840963, 1799784, 1810328, 1820634, 1666304, 1357283, 1070491, 953863, 1018407, 1167115, 1296801, 1377388, 1515047, 1722477, 1880629, 1998875, 2105059, 2179026, 2193714, 2103060, 1898150, 1617002, 1401042, 1374105, 1481183, 1591660, 1637167, 1660169, 1748146, 1837852, 1814569, 1778585, 1832674, 1984080, 2244319, 2563894, 2818526, 3001056, 3193746, 3334640, 3295038, 3049958, 2706028, 2360587, 2072700, 1895281, 1828919, 1805865, 1785027, 1769334, 1658710, 1361610, 955898, 628154, 574459, 818185, 1171509, 1414740, 1518562, 1567860, 1545573, 1474427, 1419561, 1361768, 1254599, 1142140, 1144450, 1285243, 1512310, 1775204, 1982399, 2061683, 2035111, 1957783, 1921961, 1966391, 2016507]
6950B016507l1212j34095j67075m7836J15008J36748O0855Q529m779n5844j43052
6939A753754j60741p2368O6592K16341K55198K03445J82361K23842K87090K81212
6929C236726J99499J75014K95449M87940O25358N53477K26162k09756m77187m17242
6919D695440k46454k33034k80482k57158k71443l22084l14666k23221p5615K9912
6909B501195N5412N0015L3435l550o5150j10256j82235l18597l80989k78603j19880
6898A180797N169J40476K20701J59286N9030Q137m4407m6763J5331L2306L0801
6887A760864O5086P2342P30m7335m9956o7373o6401k7678n5000j10322j20863
6876A354094p5637N5187J82466K70924L18420K82202J14661q6089j10147N1936
$$ y = [2016507, 1985295, 1851200, 1684125, 1636289, 1751297, 1888045, 1948900, 1957429, 1952650, 1896806, 1753754, 1593013, 1520645, 1587237, 1803578, 2058776, 2262221, 2444582, 2668424, 2955514, 3236726, 3436225, 3611239, 3906688, 4394628, 5019986, 5573463, 5799625, 5589869, 5112682, 4695440, 4448986, 4215952, 3935470, 3678312, 3406869, 3084785, 2770119, 2546898, 2471283, 2501195, 2556607, 2606622, 2640057, 2636507, 2571357, 2461101, 2278866, 1960269, 1579280, 1300677, 1180797, 1185966, 1326442, 1547143, 1706429, 1765459, 1773596, 1729189, 1682426, 1697757, 1730063, 1760864, 1825950, 1898292, 1899022, 1851687, 1801731, 1734358, 1667957, 1640279, 1585279, 1474957, 1354094, 1278457, 1333644, 1516110, 1787034, 2105454, 2387656, 2502317, 2416228, 2306081, 2358017]
6866B358017K16339J95560K19j83403j87964r7099m2952K2178J51148K56298K00762
6855B889103L5266j02414k20989l55813m17789l47936k71457k51369j38552R6920
6845I14970K66372K19210R3384K0134m1470n8422Q481R4758O4502m1784q1755
6834A458380n8281J5446N8670L7430M3910J41350K81895L35391L15230L54635
6824B984056M47098M67385L72320K21564J4227j73970j72783j9321J13840J38209
6814D392625R8959P4181J00522P3201p3061k05303j70725K8149K76188M30651
6804E025387M52406M18878L49038K15020J21952J50051K37400L04347K94125L07712
6794G876316M35565N83354O32046O58536P87622R28183J002804J072828J301423
$$ y = [2358017, 2574356, 2769916, 2770135, 2586732, 2398768, 2301669, 2258717, 2280895, 2432043, 2688341, 2889103, 2924369, 2821955, 2600966, 2245153, 1827364, 1479428, 1207971, 956602, 818050, 914970, 1181342, 1400552, 1493936, 1514070, 1472600, 1414178, 1422659, 1517417, 1581919, 1540135, 1458380, 1400099, 1415545, 1474215, 1511645, 1555555, 1696905, 1978800, 2314191, 2629421, 2984056, 3431154, 3898539, 4270859, 4492423, 4506650, 4332680, 4159897, 4140576, 4254416, 4392625, 4491584, 4565765, 4666287, 4739488, 4666427, 4461124, 4290399, 4318548, 4594736, 5025387, 5477793, 5896671, 6245709, 6460729, 6582681, 6732732, 6970132, 7274479, 7568604, 7876316, 8311881, 8895235, 9527281, 10185817, 10973439, 11901622, 12904426, 13977254, 15278677]
6785A5278677J662237J991596K301974K709333L253855L761704M211151M604811
6777C9775338M752569M410801L406948J768588k64324k158934l434328m064747
6769D4191911m229595m043318l610040l087375k612100k281137k077626j898810
6761B0351910j758457j661699j464021j216948j110954j104452j046315r01186
6753A0087878o92361m74301l83407m34049m61421m14856l48030k30331o7827Q5206
6743F666501J65787J39466L0036o5354p9169q9872j81546k32427j37058M9633
6733F265997K31554K87269J82473k1409k14631k91544k26009j07958k3477L7764
6723F120029J14948J53908L8026j58209k82236k49513o3554J35744K46167L35697
$$ y = [15278677, 16940914, 18932510, 21234484, 23943817, 27197672, 30959376, 35170527, 39775338, 44527907, 48938708, 52345656, 54114244, 53849920, 51690986, 48256658, 44191911, 39962316, 35918998, 32308958, 29221583, 26609483, 24328346, 22250720, 20351910, 18593453, 16931754, 15467733, 14250785, 13139831, 12035379, 10989064, 10087878, 9395517, 8921216, 8537809, 8103760, 7642339, 7227483, 6879453, 6649122, 6581295, 6666501, 6832288, 6971754, 7001790, 6936436, 6857267, 6767395, 6585849, 6353422, 6216364, 6265997, 6497551, 6784820, 6967293, 6945884, 6731253, 6439709, 6213700, 6105742, 6082265, 6120029, 6234977, 6388885, 6426911, 6268702, 5986466, 5736953, 5673399, 5809143, 6055310, 6391007]
6713F391007M76022N54882N68475O36412P74452Q73839R10867R76917J154407
6704A3317280J382236J531273J637492J855629K071180J922233J299394N05766
6696B5522483k28715q79921j421710j727692j730795j571851j381639j287110
6688A5293050j297952j195845r77615q68986q73172q48387p78773o85962n68850
6679G197508m52217l59291k87479j81129j46850k53411l48020k97128j38575m9522
6669D683886j07633r8447K8099P0219l2539j52157k07101k62522l41552l47009
6659C233244k10488l9246N8768J49088J86947P1826q9190j60042j73730j73404
6649B853773r2287J7612O1957k309j41070k18909j92814j73288j30271n9662m2521
$$ y = [6391007, 6867029, 7421911, 7990386, 8626798, 9401250, 10275089, 11185956, 12162873, 13317280, 14699516, 16230789, 17868281, 19723910, 21795090, 23717323, 25016717, 25522483, 25293768, 24413847, 22992137, 21264445, 19533650, 17961799, 16580160, 15293050, 13995098, 12799253, 11821638, 10952652, 10079480, 9231093, 8452320, 7766358, 7197508, 6745291, 6386000, 6098521, 5917392, 5770542, 5517131, 5169111, 4871983, 4733408, 4683886, 4576253, 4477806, 4505905, 4576124, 4543585, 4391428, 4184327, 3921805, 3580253, 3233244, 3022756, 2983510, 3042278, 3191366, 3378313, 3450139, 3360949, 3200907, 3027177, 2853773, 2761486, 2779098, 2841055, 2838746, 2697676, 2478767, 2285953, 2112665, 1982394, 1922732, 1880211]
6638A880211m0804j8666L9828J55322K32412J67234N0062j5321j8315J7970L0400
6627B480333m7978j52987k01622k05153j24801M0550J35009N0842j09587j56238
6617A708368q3274J2196Q5810J19248J35152J34268P0561M4587O5784J1904j9126
6606B285478l7755j09090j36814n7276J20317K27005J61948N0620m6290k03416
6596B254727l53319l65410k50759m3443J67544L19291L58420K41966O3403n1378
6586B341042j38338j99583j42392m7839r1590k84813m29025l44827j13589L8552
6576E87598R583j06259j76774r0381O4747J16720J63190K37295K30329J65286
6566A201334J22369J53185K14858K07186J50732O6868l8014j20042j86206k30126
$$ y = [1880211, 1839407, 1820741, 1860569, 2015891, 2248303, 2415537, 2465599, 2450278, 2431963, 2449933, 2480333, 2432355, 2279368, 2077746, 1872593, 1747792, 1788342, 1923351, 1974193, 1864606, 1708368, 1625094, 1637290, 1723100, 1842348, 1977500, 2111768, 2182329, 2226916, 2292700, 2304604, 2285478, 2247723, 2138633, 2001819, 1944543, 2064860, 2291865, 2453813, 2504433, 2458143, 2254727, 1901408, 1535998, 1285239, 1241796, 1409340, 1728631, 2087051, 2329017, 2392420, 2341042, 2202704, 2003121, 1860729, 1812890, 1721300, 1436487, 1007462, 662635, 549046, 587598, 597181, 490922, 314148, 223767, 288514, 405234, 568424, 805719, 1036048, 1201334, 1323703, 1476888, 1691746, 1898932, 2049664, 2116532, 2078518, 1958476, 1772270, 1542144]
6556A542144j94873j5452J79975J98502P3998J7398Q6123J56511P3378j13499
6546B004205j57583k2784J25480J83179K07032K48431K10198P3192r7697k21182
6536B552471k41271k18164j79835j32684j20834j55883j43230r5768k8826M1957
6526A277933J0342n0649p924J10270K03034J96110J06359N6198O7285Q7386P5903
6515B132247k8362j56768j70792j27728j19122j18304j22312j53854k17360k08593
6505G09052j51240j14557j3593R5662P6512M5771J07625K16684K61663K35299
6495A468878J84705J11205M469j07400j63777p6373P6012J37139J30421J55381
6485A920660J67729N7156k2779j6549q3924k37348l05446j42258P5405J56573
$$ y = [1542144, 1347271, 1331819, 1511794, 1710296, 1784294, 1801692, 1887815, 2044326, 2117704, 2004205, 1846622, 1823838, 1949318, 2132497, 2339529, 2587960, 2798158, 2871350, 2773653, 2552471, 2311200, 2093036, 1913201, 1780517, 1659683, 1503800, 1360570, 1264802, 1235976, 1277933, 1288275, 1237626, 1229702, 1339972, 1543006, 1739116, 1845475, 1901673, 1968958, 2056344, 2132247, 2103885, 1947117, 1776325, 1648597, 1529475, 1411171, 1288859, 1135005, 917645, 709052, 557812, 443255, 429662, 525324, 601836, 647607, 755232, 971916, 1233579, 1468878, 1653583, 1764788, 1769257, 1661857, 1498080, 1421707, 1497719, 1634858, 1765279, 1920660, 2088389, 2145545, 2122766, 2106217, 2022293, 1784945, 1479499, 1337241, 1412646, 1569219]
6475A569219J07094M9561N6241O9430M1782M2248Q4563R3786J05010J37585M4729
6464B401248r1648q4546N9352K02489J81969P8794j630l4945j5863k6688r2703
6453B575829j61610j80449j80507k13719k02429j03897m8899m5030k9430j29219
6443A280640k18488j31874M2780K06315L07509L14190K07416P0339l0950j15864
6433A932013j33005r1151r3991j54636j95238j51014n4254O1241J57899J70059
6423A447923J14671L1023n0197r4867o5766K229K1265r088j0153O0021J81721
6412A628782K92993L45992K33134m34j80099j82483j05556j21566j54699j71630
6402A584434j61665q2807L5019P8816K5812j7001j6326K6937N8754N6700J04713
$$ y = [1569219, 1676313, 1725874, 1782115, 1851545, 1893327, 1935575, 2020138, 2113924, 2218934, 2356519, 2401248, 2309600, 2225054, 2284406, 2486895, 2668864, 2747658, 2746028, 2711083, 2695220, 2668532, 2575829, 2414219, 2233770, 2053263, 1839544, 1637115, 1533218, 1484319, 1439289, 1409859, 1280640, 1062152, 930278, 973058, 1179373, 1486882, 1801072, 2008488, 2078827, 2047877, 1932013, 1799008, 1707857, 1613866, 1459230, 1263992, 1112978, 1058724, 1119965, 1277864, 1447923, 1562594, 1593617, 1543420, 1448553, 1382787, 1385016, 1406281, 1397193, 1387040, 1447061, 1628782, 1921775, 2267767, 2500901, 2500467, 2320368, 2137885, 2032329, 1910763, 1756064, 1584434, 1422769, 1339962, 1374981, 1453797, 1479609, 1462608, 1446282, 1473219, 1531973, 1588673, 1693386]
6391A693386J50059O9996K3099J28173K37860J96021J1423j37631j68462j66945
6381B036979j90228j73094j08292r5733q9778J565R2568L7308q4490o5418P6862
6370A438249J55396J46979R0274o4373k23574k29468j09799L6313J24408J00494
6360A464899K7516N3014J42225J78376J49230O6850j4029r861P1730R4177O4412
6349B288539O4521R579m9660K567R8559J25062O9662k7346j31211j70896j39183
6338B140193j69619k68163l43404l36965k73350j48742l8503j6150P159O7800
6328F20256J13314J25713J03905L4088K9874R8935R2264j0697j21144j63475j01807
6317H21226J3200N9614P5985J66412J79266R3159P62l4380J3465Q9523J32921
$$ y = [1693386, 1843445, 1913441, 1936540, 2064713, 2302573, 2498594, 2510017, 2372386, 2203924, 2036979, 1846751, 1673657, 1565365, 1469632, 1379854, 1381419, 1473987, 1511295, 1426805, 1361387, 1438249, 1593645, 1740624, 1830898, 1766525, 1542951, 1313483, 1203684, 1239997, 1364405, 1464899, 1492415, 1545429, 1687654, 1866030, 2015260, 2082110, 2068081, 2058220, 2129950, 2224127, 2288539, 2353060, 2362639, 2312979, 2315546, 2414105, 2539167, 2608829, 2581483, 2450272, 2279376, 2140193, 1970574, 1702411, 1359007, 1022042, 748692, 599950, 561447, 545297, 552456, 620256, 733570, 859283, 963188, 997276, 1027150, 1126085, 1218349, 1207652, 1086508, 923033, 821226, 834426, 894040, 970025, 1136437, 1315703, 1408862, 1409624, 1375244, 1388709, 1478232, 1611153]
6306A611153J29964L8468j43915l06384l54650l22986k30065m8448J49591K75170
6296G97898L09791K47237J53180J18441J55953K18235L08951L56128K77289J47799
6286C090902K347j76301l26486k89035j40224q5281j20366j32006j11400p4092
6276A638058m204K9375j1681p0474j14871n8045j9019j25081k22986j70032J7590
6265H88630J37639J48085J62184J77000J44474J18546J04003M9811m9686j68501
6255A712185j91960p5980L3083L9062K3518o490n1725o5358n4714j9272K6749
6244A369098J1149j6836j2206q5576k14373k58014j33959R6085K45141K55400
6234A255909J78361J36854J37913N6510j07903k36977k28153j55490n7851J28511
$$ y = [1611153, 1741117, 1779585, 1635670, 1329286, 974636, 651650, 421585, 373137, 522728, 797898, 1107689, 1354926, 1508106, 1626547, 1782500, 2000735, 2309686, 2665814, 2943103, 3090902, 3093249, 2916948, 2590462, 2301427, 2161203, 2075922, 1955556, 1823550, 1712150, 1638058, 1633854, 1663229, 1651548, 1581074, 1466203, 1408158, 1389139, 1264058, 1041072, 871040, 888630, 1026269, 1174354, 1336538, 1513538, 1658012, 1776558, 1880561, 1930372, 1880686, 1712185, 1520225, 1444245, 1477328, 1516390, 1539908, 1533418, 1481693, 1416335, 1361621, 1342349, 1369098, 1380247, 1363411, 1351205, 1265629, 1051256, 793242, 659283, 755368, 1000509, 1255909, 1434270, 1571124, 1709037, 1765547, 1657644, 1420667, 1192514, 1037024, 979173, 1107684]
6224A107684L48572L98793K37348J7021j29405j67488j35098j43386j70593q6490
6214A276958m225J1643l187o4160j26576r2471N2161K12553K76109K12362M6500
6203A797667r8146j09701o374J64755K31662J42388L6798m0932j18718j39196
6193A860203k9250J13461J38290R2527Q1030J04840J18840J3684j79228k53111
6183B061286j86885r9749k6120K5697L990j3423L7902P2116Q717j00185j93765
6172A589581k66030k38866j17122r988L5176L278r2514j33561m4720N9301Q8459
6161H72994O3425J2216m8780l8374N7092J26229J50858J49044R1072l2823j72777
6150A230176k10521j14850j3738P1366J19553R2324M6593K5890L4487O1253J37223
$$ y = [1107684, 1456256, 1855049, 2092397, 2109418, 1980013, 1812525, 1677427, 1534041, 1363448, 1276958, 1272733, 1284376, 1281189, 1217029, 1090453, 997982, 1050143, 1262696, 1538805, 1751167, 1797667, 1699521, 1589820, 1583446, 1748201, 1979863, 2122251, 2159049, 2118117, 1999399, 1860203, 1830953, 1944414, 2082704, 2175231, 2256261, 2361101, 2479941, 2493625, 2314397, 2061286, 1874401, 1774652, 1748532, 1774229, 1778219, 1764796, 1802698, 1874814, 1883531, 1783346, 1589581, 1323551, 1084685, 967563, 957575, 992751, 996029, 903515, 769954, 725234, 784535, 872994, 936419, 948635, 899855, 861481, 918573, 1044802, 1195660, 1344704, 1435776, 1402953, 1230176, 1019655, 904805, 891067, 962433, 1081986, 1174310, 1220903, 1246793, 1281280, 1342533, 1479756]
6139A479756K02623Q7364j12621j71516j06530j3142O0880Q7483N9207N190m7804
6128A530890p1079m8070q8190k16535k32763j36536M19J60246K09742J30427M9708
6117A288259J2429j5955p8590j52134j53549j46005j34094p8232l5938k5231l2316
6106D48644K0225J26359K00633J88583J51902J69987J68763Q2472k0674n8739
6096A478155j7545Q3065J79439K04339J22168r80j00588j84458k79256l35969
6086A148370l51300l11947j71659j911J67332K81041K84285K23372J22743L5445
6076A425771o5299j28275j08148r8445j32091j56957r2345N460M7193R7892J62843
6065I57599J38296O6212P316k4522l3908r1844j89701j81566o0076N3772P9534
$$ y = [1479756, 1682379, 1769743, 1657122, 1485606, 1379076, 1365934, 1426814, 1514297, 1573504, 1578694, 1530890, 1459811, 1411741, 1323551, 1107016, 874253, 737717, 738136, 898382, 1108124, 1238551, 1288259, 1300688, 1284733, 1206143, 1054009, 900460, 754455, 620361, 542129, 506191, 480960, 448644, 468869, 595228, 795861, 984444, 1136346, 1306333, 1475096, 1557568, 1536894, 1478155, 1460610, 1543675, 1723114, 1927453, 2049621, 2048641, 1948053, 1763595, 1484339, 1148370, 797070, 485123, 313464, 311553, 478885, 759926, 1044211, 1267583, 1390326, 1425771, 1360472, 1232197, 1124049, 1025604, 893513, 736556, 644211, 649671, 696864, 794756, 957599, 1095895, 1162107, 1169423, 1144901, 1110993, 1019149, 829448, 647882, 587806, 641578, 721112]
6054G21112M7079J235m6103q8136q1762J5425O4487J6912m1679q4128p8025K999
6042D49416J04218J61642K19290L09227L57605L15694J81779N8277Q9715J63358
6032B410221J08859p1523k70200l15660j77866J0283Q3076J4983m3720o9497j83484
6021A495472l07104l05912k46869j70391j01180r3017q0538l639O5629J44737
6011C97188K45462L09040K82784K00522J07622j220j10104j55127p6738K3316
6001A222745J8846l7438q1513j52050j83964j43548q9269K3162J73975J99064
5991I50010Q0021m3038r4299r7760o2526J8041O5110L0664j3664L1900J16919
5980I81378J75833K09334J74880N0535j13618k20002k26153j68669q0206O6777
$$ y = [721112, 768191, 769426, 723323, 635187, 553425, 568850, 633337, 650249, 608570, 524442, 446417, 449416, 553634, 715276, 934566, 1243793, 1601398, 1917092, 2098871, 2157148, 2246863, 2410221, 2519080, 2447557, 2177357, 1861697, 1683831, 1694114, 1777190, 1792173, 1748453, 1678956, 1495472, 1188368, 882456, 635587, 465196, 364016, 270999, 190461, 186822, 252451, 397188, 642650, 951690, 1234474, 1434996, 1542618, 1541398, 1431294, 1276167, 1199429, 1222745, 1241591, 1204153, 1122640, 970590, 786626, 643078, 553809, 576971, 750946, 950010, 1030031, 986993, 892694, 794934, 732408, 750449, 815559, 846223, 832559, 864459, 981378, 1157211, 1366545, 1541425, 1591960, 1478342, 1258340, 1032187, 863518, 783312, 850089]
5970H50089J77719J63950J06767L2343o4978j23420j52995j73050j25651n060
5960F85714P1904O8786N2734N9884J17915J28464l9527k67870l21216j84173k2918
5949C49697P2445J71793K31464J39545K2782K9431R8409J16152O8777N071m3092
5938A262474r0743j15391p0499l5580q3725j48117j39986j03736p6425l6223K2398
5927C84447Q7828J29454J49699J70239J61468P8161l6901j30849j94583j44726
5917F54237l9975r679J7423M3076M4306P6769J10532J32529J78376J86158N7094
5906A450846p4440j12697j50797j67653j73939j90831j38640L5625K17849K48778
5896I44101J59737R2999R9676Q1970m0907k00474k74851k53090j29841O6409J53821
$$ y = [850089, 1027808, 1191758, 1298525, 1330868, 1265890, 1142470, 989475, 816425, 690774, 685714, 757618, 826404, 879138, 939022, 1056937, 1185401, 1145874, 878004, 556788, 372615, 349697, 422142, 593935, 825399, 964944, 987726, 1017157, 1115566, 1231718, 1300495, 1305566, 1262474, 1171731, 1056340, 985841, 950261, 866536, 718419, 578433, 474697, 398272, 362049, 384447, 472275, 601729, 751428, 921667, 1083135, 1161296, 1124395, 993546, 798963, 654237, 614262, 604583, 622006, 665082, 709388, 786157, 896689, 1029218, 1207594, 1393752, 1450846, 1376406, 1263709, 1112912, 945259, 771320, 580489, 441849, 477474, 695323, 944101, 1103838, 1196837, 1296513, 1378483, 1337576, 1137102, 862251, 609161, 479320, 545729, 699550]
5885F99550J05044N923l3709N3939J86283K64681K38220J19965o5482j97001j51893
5874A225520k4706O3298O4315K5650n969o1742j43167j43954k4983P6199J06015
5863A156476J77870K69679K89207K28529P6167m9543j9194J7874l0502r0789r0546
5852A935228n6240r7230j90806k04396j21267m6754k8467k9546q765k7955j22390
5841A001412k57631l44760k36070j807J68565K64814K81598J90512N2563q8127
5831A031069j02041r479N1071P7243L1464n8023p9813l5325m0626r6223j07616
5820F61701j03175j06607m2671J00486K27670K15408R0086p9535k40275k93552
5810D29536k03885p3399r940m765J5890N8355J20268K04036K49293K46669K27477
$$ y = [699550, 804594, 810517, 776808, 830747, 1017030, 1281711, 1519931, 1639896, 1574414, 1377413, 1225520, 1200814, 1264112, 1328427, 1354077, 1348108, 1286366, 1143199, 999245, 974262, 1050461, 1156476, 1334346, 1604025, 1893232, 2121761, 2197928, 2148385, 2129191, 2147065, 2116563, 2025774, 1935228, 1878988, 1781758, 1590952, 1386556, 1265289, 1218535, 1190068, 1160522, 1151757, 1123802, 1001412, 743781, 399021, 162951, 161144, 329709, 594523, 876121, 1066633, 1119196, 1031069, 929028, 919549, 970620, 1047863, 1079327, 1021304, 941491, 906166, 865540, 769317, 661701, 558526, 451919, 409248, 509734, 737404, 952812, 1042898, 963363, 723088, 429536, 225651, 152252, 142312, 137547, 153437, 211792, 332060, 536096, 785389, 1032058, 1259535]
5799A259535J87708R6120k9092j53571j95684j05580N5841J12621K3030q0200
5789A170728j44456j84066j46603p4358o0039m4093M8488J22212J23791J40295
5779I51899K23362K15710p695k44452l07663k94109k77287k23502j31863k3213
5769a18813O4287P8434O4209R4712J48835K25025K97987L14308K83421K57016
5759A709421K16844J35428P174q0599j68411k88424l36509l00571j98137q8650
5749F07566P937J10933K04998K30930J37256M1029M0272Q7550P4127q446q6946
5738A447206j65514k35043k26160j10136L1805P1050L1671J5531M3696Q3815J63507
5727A151428K51186L06443L47951K71772L0202k16893k75081j88254j25487j18774
$$ y = [1259535, 1447243, 1543363, 1514271, 1360700, 1165016, 1059436, 1115277, 1227898, 1250928, 1170728, 1026272, 842206, 695603, 621245, 561206, 517113, 565601, 687813, 811604, 951899, 1175261, 1390971, 1383276, 1138824, 831161, 537052, 259765, 36263, -95600, -118813, -54526, 23908, 88117, 182829, 331664, 556689, 854676, 1168984, 1452405, 1709421, 1926265, 2061693, 2068867, 1988268, 1819857, 1531433, 1194924, 894353, 696216, 607566, 615503, 726436, 931434, 1162364, 1299620, 1340649, 1380921, 1468471, 1542598, 1534152, 1447206, 1281692, 1046649, 820489, 710353, 742158, 813208, 844879, 860410, 904106, 987921, 1151428, 1402614, 1709057, 2057008, 2328780, 2358982, 2142089, 1867008, 1678754, 1553267, 1434493]
5717A434493j08576j04383j54925j72364j87704j99992j12392N084Q3116J23388
5707F05745J76569K78455L89656M62611M68014L66877K50138J08182m5094q7049
5697B974104q5214p0232j17493k29947k59907j50649R301J18232J41186M8983
5687B378364j28183k52343k62157k49372k51203k16005j60752j11787o7602l9257
5677F39703N68Q1108J31881J36435J12656K9284p5388j13428l3398J12205J95147
5666A216773J61161Q2470k3560j30226r9761M860Q7297P5896o8101j83802j95179
5655I27828k00269j75928p9313L1705J24965J58929J02184j0640p2619l8018K7162
5644G95986K2175m2342m2105O1969K10519K77341J99080K2592j49346j76785j12084
$$ y = [1434493, 1325917, 1221534, 1066609, 894245, 706541, 506549, 394157, 399241, 482357, 605745, 782314, 1060769, 1450425, 1913036, 2381050, 2747927, 2998065, 3106247, 3061153, 2974104, 2888890, 2818658, 2701165, 2471218, 2211311, 2060662, 2069963, 2188195, 2329381, 2378364, 2250181, 1997838, 1735681, 1486309, 1235106, 1019101, 858349, 746562, 678960, 639703, 640271, 721379, 853260, 989695, 1102351, 1131635, 1056247, 942819, 909421, 1021626, 1216773, 1377934, 1460404, 1436844, 1306618, 1206857, 1211717, 1299014, 1374910, 1306809, 1123007, 927828, 727559, 551631, 472318, 504023, 628988, 787917, 890101, 879461, 806842, 768824, 795986, 818161, 775819, 733714, 795683, 1006202, 1283543, 1482623, 1505215, 1355869, 1179084, 1067000]
5633A067000j27167k02483j59149k3856P2197J16560J53993J59628Q7602l7333
5623A106992j09165q7035K1832J41432K03980J83951O6801m8330n7085k954L8534
5612A458953J14409K19297K14961R2605j2741J6466J53841K00244Q0281n562K9112
5601B561866R965p4042r5446n4309L1432J16905J38685J65760J74774M9810o7853
5590B957547j9083Q3088Q7540j09268l65731m12492k98479k92782l99725l62760
5580H67855j53868K0721J00340K10224K90803K35222J51839J40216J32870O5992
5570B062214r251o4930j05914p6194j0605J9428J8551M7745M5486o8028j22580
5559A735922m4158M0925O6358P4184R1247J05503M1561q1371j53918j19973J6007
$$ y = [1067000, 939833, 737350, 578201, 554345, 626542, 743102, 897095, 1056723, 1144325, 1106992, 997827, 910792, 932624, 1074056, 1278036, 1461987, 1528788, 1480458, 1423373, 1420419, 1458953, 1573362, 1792659, 2007620, 2100225, 2087484, 2103950, 2257791, 2458035, 2538316, 2532754, 2561866, 2571831, 2497789, 2402343, 2348034, 2379466, 2496371, 2635056, 2800816, 2975590, 3025400, 2957547, 2938464, 3021552, 3109092, 2999824, 2634093, 2221601, 1923122, 1630340, 1230615, 867855, 713987, 734708, 835048, 1045272, 1336075, 1571297, 1723136, 1863352, 1996222, 2062214, 2052963, 1988033, 1882119, 1805925, 1795320, 1814748, 1833299, 1881044, 1926530, 1858502, 1735922, 1691764, 1732689, 1799047, 1873231, 1964478, 2069981, 2111542, 2030171, 1876253, 1756280, 1772287]
5548A772287J40423J31398M9936k5333o2163p6571m4641N819k8262r8428o7940
5537A696525P3798J59063R6805L3996J03273J38407L9992n5082m1951J8781L1532
5526B295139j9996j28442j72816n0572Q9381R0116L2109K070j8133j4773k3706
5515B080377q5119j26334j20479o8172J754N4694Q8581P2620P982o9983j07590
5504A728331r2026o0497J1186Q8820J30795J28349L5350n3924o0892k9158n3150
5493A773184j53207k34737k09798j35275p3780p1521j69380j90506p9124p4417
5483C81439k10984k34331q5025J22294L54896N19807M68541J92674j08082k10606
5473A190623j49352o6953n2998p5610o8291m6003l2570k3088O2165J70193K29195
$$ y = [1772287, 1912710, 2044108, 2094044, 2068711, 2006548, 1929977, 1885336, 1891155, 1862893, 1764465, 1696525, 1770323, 1929386, 2026191, 2060187, 2163460, 2301867, 2341859, 2286777, 2244826, 2263607, 2295139, 2275143, 2146701, 1973885, 1923313, 2012694, 2102810, 2134919, 2136989, 2118856, 2104083, 2080377, 1995258, 1868924, 1748445, 1680273, 1682027, 1736721, 1825302, 1897922, 1905904, 1835921, 1728331, 1636305, 1575808, 1586994, 1675814, 1806609, 1934958, 1970308, 1916384, 1855492, 1826334, 1773184, 1619977, 1385240, 1175442, 1040167, 966387, 894866, 725486, 534980, 455856, 381439, 170455, -63876, -148901, -26607, 328289, 848096, 1316637, 1509311, 1401229, 1190623, 1041271, 974318, 921320, 845710, 777419, 731416, 698846, 675758, 737923, 908116, 1137311]
5462A137311J89233L5249j86549l58601l36619k06342r5438N0246J06353k981
5452C31862p8438l4620J3574l418j5591P7742K01903K51036K66142K55257J70483
5441A435932J06903J52870J99700J03555l54J8896Q6557J62771K06596J43293
5431B616719N5715N0053N6376l2430j68183k36322k52611k27126j70953j27405
5421A563833n7188L7039Q2863P3831L6170J3025L4808Q8699J26182O5545k484
5410B062323j5799l6582n4618j05653j35145q2389K8683J78301K74868K08378
5400B322367K8532j72875k88046k19415p7027p6670j30848k7426Q9997O8051n1216
5389A465424j75890k38973k04426j02845J2013J46208K34375K46337K29016J58924
$$ y = [1137311, 1326544, 1361793, 1175244, 816643, 480024, 273682, 178244, 228490, 334843, 331862, 253424, 218804, 232378, 228960, 213369, 291111, 493014, 744050, 1010192, 1265449, 1435932, 1542835, 1695705, 1895405, 1998960, 1998606, 2017502, 2104059, 2266830, 2473426, 2616719, 2672434, 2722487, 2778863, 2746433, 2578250, 2341928, 2089317, 1862191, 1691238, 1563833, 1506645, 1543684, 1626547, 1700378, 1736548, 1749573, 1784381, 1873080, 1999262, 2064807, 2062323, 2046524, 2009942, 1955324, 1849671, 1714526, 1632137, 1660820, 1839121, 2113989, 2322367, 2350899, 2178024, 1889978, 1670563, 1593536, 1516866, 1386018, 1358592, 1448589, 1516640, 1465424, 1289534, 1050561, 846135, 743290, 755303, 901511, 1135886, 1382223, 1611239, 1770163]
5379A770163L1153q6213j38287o3582K9056K5132J3515O6114J10397L5507j28373
5368A664582j82013j44163j48630j98219k16727k02677j42387L773J12748P5373
5358F21660m8326n9191J48295L78392M46662L36208O9100k30429l03831j07914
5348A250626R2248J14774P4632J10943J42152Q1259j685j09935j75711j64255
5338A415048j76240j69710j11154k0077M8031J02996J72837J88668J76989K11360
5328A838748K46891K49066K33628K52613K85449J53001p1650j76505j60484j50018
5318B700739j92202k95142l65786l23915k16410q1737l6963l5371m6942m6846
5308A059425M6498J24328J22228O3534J0352j6473q8309k08972k38476j28396
$$ y = [1770163, 1801316, 1715103, 1576816, 1513234, 1542290, 1567422, 1580937, 1647051, 1757448, 1792955, 1664582, 1482569, 1338406, 1189776, 991557, 774830, 572153, 429766, 433539, 546287, 621660, 573334, 514143, 662438, 1040830, 1487492, 1823700, 1892800, 1662371, 1358540, 1250626, 1342874, 1457648, 1532280, 1643223, 1785375, 1866634, 1864949, 1755014, 1579303, 1415048, 1238808, 1069098, 957944, 937867, 985898, 1088894, 1261731, 1450399, 1627388, 1838748, 2085639, 2334705, 2568333, 2820946, 3106395, 3259396, 3187746, 3011241, 2850757, 2700739, 2508537, 2213395, 1847609, 1523694, 1307284, 1225547, 1188584, 1153213, 1106271, 1059425, 1105923, 1230251, 1352479, 1416013, 1426365, 1409892, 1321583, 1112611, 874135, 745739]
5298G45739j356N1598J5764O752Q5866J79634J69330R3043J5371m3952l0677L2769
5286A319881N4498M6931Q7876O0771n1665o9552K3255Q9810O3479K7333J6351
5275A668968l4592m6887K061O5025R5456Q8969K4844p3368n5254M2615O0453q657
5263A829633k0964k9077j70752l44858l73326k61353q2086P4444N4546J665M6010
5252G23882N3792J348q6438j52847j28258j33577k28737k19456n9911M6715R9944
5241h3543J72865J81645J24681J23432J20966N2133N8827J39292K29550K60878
5231A380726K17259J68778J01503J6948p5563j92072j72377l074J74816K86439
5221A903383K85827K08549P9201p1855j40906j35144j52963j97567j92920j17096
$$ y = [745739, 744383, 795981, 811745, 818497, 904363, 1083997, 1253327, 1346370, 1361741, 1317789, 1287112, 1319881, 1374379, 1421310, 1509186, 1569957, 1518292, 1448740, 1471995, 1561805, 1625284, 1652617, 1668968, 1634376, 1587489, 1589550, 1654575, 1750031, 1839000, 1863844, 1790476, 1735222, 1777837, 1838290, 1829633, 1808669, 1779592, 1608840, 1263982, 890656, 629303, 547217, 621661, 676207, 677872, 723882, 777674, 779022, 692584, 539737, 411479, 277902, 49165, -170291, -230202, -183487, -83543, 89322, 270967, 395648, 519080, 640046, 692179, 751006, 890298, 1119848, 1380726, 1597985, 1766763, 1868266, 1885214, 1809651, 1617579, 1445202, 1442128, 1616944, 1903383, 2189210, 2397759, 2476960, 2405105, 2264199, 2129055, 1976092, 1778525, 1585605, 1468509]
5211A468509n3802k6458q1738k26622l18789k20338o879R8359Q5017J21984K28886
$$ y = [1468509, 1414707, 1388249, 1306511, 1079889, 761100, 540762, 533883, 632242, 717259, 839243, 1068129]
$$ [...]
##END NTUPLES=NMR SPECTRUM
##END=
