##TITLE=C13cpd
##JCAMPDX= 6.0         $$ Bruker NMR JCAMP-DX V2.0
##DATA TYPE= NMR SPECTRUM
##DATA CLASS= NTUPLES
##ORIGIN= UXNMR, Bruker Analytische Messtechnik GmbH
##OWNER= root
$$ XWIN-NMR		Version 3.5
$$ Sat Feb 22 16:58:30 2025 Russian Standard Time (UT+4h)  servis@DPX200
##.OBSERVE FREQUENCY= 50.3277607988526
##.OBSERVE NUCLEUS= ^13C
##.ACQUISITION MODE= SIMULTANEOUS
##.ACQUISITION SCHEME= undefined
##.AVERAGES= 1438
##.DIGITISER RES= 17
##SPECTROMETER/DATA SYSTEM= spect
##.PULSE SEQUENCE= zgpg30
##.SOLVENT NAME= DMSO
##.SHIFT REFERENCE= (INTERNAL, DMSO, 0, 219.126)
##AUDIT TRAIL= $$ (NUMBER, WHEN, WHO, WHERE, WHAT)
$$ ##TITLE= Audit trail, XWIN-NMR		Version 3.5
$$ ##JCAMPDX= 5.01
$$ ##ORIGIN= Bruker BioSpin GmbH
$$ ##OWNER= servis
$$ F:\spectra/data/av/nmr/C13cpd/1/pdata/1/auditp.txt
$$ ##AUDIT TRAIL=  $$ (NUMBER, WHEN, WHO, WHERE, WHAT)
(   1,<2025-02-22 16:58:05.06 +0400>,<servis>,<DPX200>,
      <created by zg, POWCHK disabled, PULCHK disabled
       terminated by command 'halt'
       configuration hash MD5:
       00 E9 B6 7A A2 85 ED C7 34 08 36 98 17 FE 4E 26
       data hash MD5: 32K
       2A 0E 0F 1D 4B 6B E8 3E 13 D7 B3 01 55 4F 3B 8F>)
(   2,<2025-02-22 16:58:06.89 +0400>,<servis>,<DPX200>,
      <Start of raw data processing
       efp BC_mod = 2 LB = 2 FT_mod = 6 PKNL = 1 PHC0 = -340.663 PHC1 = 25.66493 SI = 32K 
       data hash MD5: 32K
       37 33 27 41 D0 16 FF C7 E4 C1 AD 22 F6 2D 7F 2E>)
$$ ##END=
$$ 
$$ hash MD5
$$ 53 7F 85 50 D1 4A 73 E0 5C 79 33 F9 98 CA EC 78
##$RELAX= 
##$RELAX= 
##$RELAX= 
##$RELAX= 
##$RELAX= 
##$RELAX= 
##$RELAX= 
##$RELAX= 
$$ Bruker specific parameters
$$ --------------------------
##$DU= <F:\spectra>
##$EXPNO= 1
##$NAME= <C13cpd>
##$PROCNO= 1
##$TYPE= <nmr>
##$USER= <av>
##$AMP= (0..31)
100 100 100 100 100 100 100 100 100 100 100 100 100 100 100 100 100 100 
100 100 100 100 100 100 100 100 100 100 100 100 100 100 
##$AQSEQ= 0
##$AQ_mod= 1
##$AUNM= <au_zg>
##$AUTOPOS= <>
##$BF1= 50.322729
##$BF2= 200.13
##$BF3= 50.322729
##$BF4= 50.322729
##$BF5= 500.13
##$BF6= 500.13
##$BF7= 500.13
##$BF8= 500.13
##$BYTORDA= 1
##$CFDGTYP= 0
##$CFRGTYP= 5
##$CHEMSTR= <none>
##$CNST= (0..31)
1 1 145 1 1 1 1 1 1 1 1 1 1 1 1 1 1 1 1 1 1 1 1 1 1 1 1 1 1 1 1 1 
##$CPDPRG= <waltz16>
##$CPDPRG1= <>
##$CPDPRG2= <waltz16>
##$CPDPRG3= <>
##$CPDPRG4= <mlev>
##$CPDPRG5= <mlev>
##$CPDPRG6= <mlev>
##$CPDPRG7= <mlev>
##$CPDPRG8= <mlev>
##$CPDPRGB= <>
##$CPDPRGT= <>
##$D= (0..31)
0 2 0.00345 0 0 0 0 0 0 0.06 0 0.03 2e-05 3e-06 0 0 0.0002 0 0 0 0 0 0 
0 0 0 0 0 0 0 0 0 
##$DATE= 1740229084
##$DBL= (0..7)
120 120 120 120 120 120 120 120 
##$DBP= (0..7)
150 150 150 150 150 150 150 150 
##$DBP07= 0
##$DBPNAM0= <>
##$DBPNAM1= <>
##$DBPNAM2= <>
##$DBPNAM3= <>
##$DBPNAM4= <>
##$DBPNAM5= <>
##$DBPNAM6= <>
##$DBPNAM7= <>
##$DBPOAL= (0..7)
0.5 0.5 0.5 0.5 0.5 0.5 0.5 0.5 
##$DBPOFFS= (0..7)
0 0 0 0 0 0 0 0 
##$DE= 6
##$DECBNUC= <off>
##$DECIM= 12
##$DECNUC= <off>
##$DECSTAT= 4
##$DIGMOD= 1
##$DIGTYP= 9
##$DL= (0..7)
$$ [...]
##$SUBNAM2= <"">
##$SUBNAM3= <"">
##$SUBNAM4= <"">
##$SUBNAM5= <"">
##$SUBNAM6= <"">
##$SUBNAM7= <"">
##$SUBNAM8= <"">
##$SUBNAM9= <"">
##$SW= 238.246396889851
##$SWIBOX= (0..15)
0 1 3 0 0 0 0 0 0 0 0 0 0 0 0 0 
##$SW_h= 11990.4076738609
##$TD= 32768
##$TD0= 1
##$TE= 0
##$TE2= 300
##$TE3= 300
##$TEG= 300
##$TL= (0..7)
0 120 120 120 120 120 120 120 
##$TP= (0..7)
150 150 150 150 150 150 150 150 
##$TP07= 0
##$TPNAME0= <>
##$TPNAME1= <>
##$TPNAME2= <>
##$TPNAME3= <>
##$TPNAME4= <>
##$TPNAME5= <>
##$TPNAME6= <>
##$TPNAME7= <>
##$TPOAL= (0..7)
0.5 0.5 0.5 0.5 0.5 0.5 0.5 0.5 
##$TPOFFS= (0..7)
0 0 0 0 0 0 0 0 
##$TUNHIN= 0
##$TUNHOUT= 0
##$TUNXOUT= 0
##$USERA1= <user>
##$USERA2= <user>
##$USERA3= <user>
##$USERA4= <user>
##$USERA5= <user>
##$V9= 5
##$VALIST= <valist>
##$VCLIST= <CCCCCCCCCCCCCCC>
##$VD= 0
##$VDLIST= <DDDDDDDDDDDDDDD>
##$VPLIST= <PPPPPPPPPPPPPPP>
##$VTLIST= <TTTTTTTTTTTTTTT>
##$WBST= 1024
##$WBSW= 20
##$XGAIN= (0..3)
0 0 0 0 
##$XL= 0
##$YL= 0
##$YMAX_a= 19118713
##$YMIN_a= -13803075
##$ZGOPTNS= <>
##$ZL1= 120
##$ZL2= 120
##$ZL3= 120
##$ZL4= 120
##$ABSF1= 0
##$ABSF2= 0
##$ABSG= 0
##$ABSL= 0
##$ALPHA= 0
##$AQORDER= 0
##$ASSFAC= 0
##$ASSFACI= 0
##$ASSFACX= 0
##$ASSWID= 0
##$AUNMP= <proc_1d>
##$AZFE= 0.1
##$AZFW= 0.5
##$BCFW= 0
##$BC_mod= 2
##$BYTORDP= 0
##$COROFFS= 0
##$CY= 12.5
##$DATMOD= 1
##$DC= 0
##$DFILT= <>
##$DTYPP= 0
##$F1P= 99.9999945759776
##$F2P= -179.999992907048
##$FCOR= 0.5
##$FTSIZE= 32768
##$FT_mod= 6
##$GAMMA= 0
##$GB= 0
##$INTBC= 1
##$INTSCL= 0
##$ISEN= 30
##$LB= 2
##$LEV0= 0
##$LPBIN= 0
##$MAXI= 10000
##$MC2= 0
##$MEAN= 0
##$ME_mod= 0
##$MI= 0
##$NCOEF= 0
##$NC_proc= 2
##$NLEV= 6
##$NOISF1= 0
##$NOISF2= 0
##$NSP= 0
##$NTH_PI= 0
##$NZP= 0
##$OFFSET= 219.1257
##$PC= 1.4
##$PHC0= -340.663
##$PHC1= 25.66493
##$PH_mod= 1
##$PKNL= yes
##$PPARMOD= 0
##$PSCAL= 4
##$PSIGN= 0
##$REVERSE= no
##$SF= 50.322729
##$SI= 32768
##$SIGF1= 0
##$SIGF2= 0
##$SINO= 80
##$SIOLD= 32768
##$SREGLST= <13C.CDCl3>
##$SSB= 0
##$STSI= 32768
##$STSR= 0
##$SW_p= 11990.4076738609
##$SYMM= 0
##$S_DEV= 0
##$TDeff= 32768
##$TDoff= 0
##$TI= <>
##$TILT= no
##$TM1= 0
##$TM2= 0
##$TOPLEV= 0
##$USERP1= <user>
##$USERP2= <user>
##$USERP3= <user>
##$USERP4= <user>
##$USERP5= <user>
##$WDW= 1
##$XDIM= 32768
##$YMAX_p= 308676808
##$YMIN_p= -1939047
$$ End of Bruker specific parameters
$$ ---------------------------------
##NTUPLES= NMR SPECTRUM
##VAR_NAME=  FREQUENCY,     SPECTRUM/REAL,   SPECTRUM/IMAG
##SYMBOL=    X,             R,               I
##VAR_TYPE=  INDEPENDENT,   DEPENDENT,       DEPENDENT
##VAR_FORM=  AFFN,          ASDF,            ASDF
##VAR_DIM=   32768,         32768,           32768
##UNITS=     HZ,            ARBITRARY UNITS, ARBITRARY UNITS
##FACTOR=    0.365929370215793, 1,           1
##FIRST=     11027.0033138647, 0,            0
##LAST=      -963.404359996184, 0,           0
##MIN=       -963.404359996184, -1939047,    0
##MAX=       11027.0033138647, 308676808,    0
$$ Real data points
##PAGE= N=1
##DATA TABLE= (X++(R..R)), XYDATA
$$ [...]
11073A496094j67838j59252j36248j68252l04254l61836k79260j63284m3065J34780
11063a52415K93118K48598P9386l0665j7874O5927J95962L05750L17355K02783
11053A507925K064j30708o5278J11610K23271K62851K92888K29733N2657j51556
11043B335457k76191k74844k47177k01825j71006j84660k52076l59302l22458
11034D5918j24634L8622J27204J59341J10024O6660J46814K66555J74829q8861
11024I22472k08052j03020m611J8258R1945J72354J68568J20717J23506J47031
11014A449168J04028J4572j346L1066L1790P2144P8444j2015p2274o3358m7088
11003A585131k7080J7041N6871K4918m8630p1617p3199o6946k8762J6474R1150
$$ plain form
11073 1496094 1328256 1169004 1032756 864504 560250 198414 -80846 -244130 -287195 -152415
11063 -152415 140703 389301 468687 438022 420148 486075 682037 987787 1305142 1507925
11053 1507925 1509989 1379281 1314003 1425613 1648884 1911735 2204623 2434356 2487013 2335457
11043 2335457 2059266 1784422 1537245 1335420 1164414 979754 727678 368376 45918
11034 45918 -78716 -40094 87110 246451 356475 423135 569949 836504 1011333 922472
11024 922472 714420 611400 606789 625047 716992 889346 1057914 1178631 1302137 1449168
11014 1449168 1553196 1567768 1566422 1597488 1629278 1701422 1779866 1767851 1695577 1632219 1585131
11003 1585131 1558051 1575092 1631963 1656881 1608251 1536634 1463435 1396489 1367727 1384201 1475351
10992A475351K11456K53961J49765Q0791J93020L00319K20175M9199q5727k03842
10982B644468k84506j56855Q1482J77731J31898O5088l1338j34516k04973k27675
10972B060804k20828k72246l15070k56829j23922j5292K0629k2506l9541O8818
10962H84017J94058K37046J70829P2136O41l8537m1595q5059k15111k41801j47623
10951G89001j09307r3089o448J05769J79127J99045J79820K00119J89875J29194
10941A763106L3345j38900l09990l71498l46317k69271p6688J17435K38010K51067
10931H90299J47114J28930J70052R6430k6036p2949o4473p9790j36133j80177
10921H73267j56042r6057M922J56069K74205K75934K36044K00249J11124j09403
$$ plain form
10992 1475351 1686807 1940768 2090533 2171324 2364344 2664663 2884838 2934037 2848310 2644468
10982 2644468 2359962 2203107 2284589 2462320 2594218 2659306 2627968 2493452 2288479 2060804
10972 2060804 1839976 1567730 1252660 995831 871909 856617 877246 854740 815199 884017
10962 884017 1078075 1315121 1485950 1558086 1558727 1520190 1478595 1393536 1178425 936624 789001
10951 789001 679694 586605 580157 685926 865053 1064098 1243918 1444037 1633912 1763106
10941 1763106 1796451 1657551 1347561 976063 629746 360475 283787 401222 639232 890299
10931 890299 1037413 1166343 1336395 1432825 1406789 1333840 1269367 1189577 1053444 873267
10921 873267 717225 621168 626090 782159 1056364 1332298 1568342 1768591 1879715 1770312
10911A770312l70813m56195l08139o0525J25017K53760K74078J34711k8884j39273
10901A194049j93699k04204j88197j57736j40624k7622J67594K14035K9442k10557
10891D82481l38169l36267k46330j09701J8190J12529J82867L24370M09774K84098
10881G83842Q2507m7135r2961j10533j61176k07145k11608j86383j06891j6398
10871b73881k0484j50849k20756j07526M3586J69254K85547L11016K34616J67365
10861D37888J15848O0047M0206K409q0258j61383j50935p5098k4152J44790L74553
10850F83915L65093J62556J2008j2883N8068J63754J51199J6580j16277k57565
10840A226448l97585m49739l94541l02694r4469K48034N08588N46326M30002K06141
$$ plain form
10911 1770312 1399499 943304 635165 574640 699657 953417 1227495 1362206 1333322 1194049
10901 1194049 1000350 796146 607949 450213 309589 281967 449561 663596 693038 482481
10891 482481 144312 -191955 -438285 -547986 -529796 -417267 -234400 89970 499744 783842
10881 783842 866349 819214 726253 615720 454544 247399 35791 -150592 -257483 -273881
10871 -273881 -294365 -445214 -665970 -773496 -729910 -560656 -275109 35907 270523 437888
10861 437888 553736 613783 653989 656398 576140 414757 263822 188724 164572 309362 683915
10850 683915 1049008 1211564 1223572 1210689 1268757 1432511 1583710 1600290 1484013 1226448
10840 1226448 828863 379124 -15417 -318111 -412580 -164546 344042 890368 1320370 1526511
10830A526511q8798k92360l54973l57351k70905q1822N2918M9026M6292J11442
10820C39980J38425J43073K15887J88924R4275P5416L9824m9713j41025k26512
10810H18554k42459j65824o3021N9757J44350J30721J18668J41682J01874K4367
10800A068669M1020O7766k8246j13534o8219j9653l7641P729M9865k293j4502
10789I50961N1315J04012J37236J83732J79982J6593k03138k82262j84799r3582
10779H60050j24769j84348j86654l8573K12800K61649J06937O0950J67866K41577
10769A377485J54110L7536l6095o1892K8961Q8979J02579J45495J07120r5808
10759A848470l19800m28822m62024m34574k60467R475J91056K51450J68281M2300
$$ plain form
10830 1526511 1437713 1145353 790380 433029 162124 80302 133220 182246 228538 339980
10820 339980 478405 621478 837365 1026289 1120564 1195980 1235804 1186091 1045066 818554
10810 818554 576095 410271 347250 407007 551357 682078 800746 942428 1044302 1068669
10800 1068669 1109689 1177455 1149209 1035675 967456 947803 910162 917891 967756 965463 950961
10789 950961 1002276 1106288 1243524 1427256 1607238 1623831 1420693 1138431 953632 860050
10779 860050 735281 550933 364279 325706 538506 800155 907092 968042 1135908 1377485
10769 1377485 1531595 1569131 1533036 1471144 1500105 1589084 1691663 1837158 1944278 1848470
10759 1848470 1528670 1099848 637824 203250 -57217 -47742 143314 394764 563045 605345
10749F05345n3957j62104j62121o0502J5866M0861O9365Q0741K1432p4716j24246
10738A95964j02197k3851J08218K79284L61681K99128J91710O9489P0592J93175
10728A643193K35607K07046J89664J49528P7916j1845q2558j6879Q9031L5138
10718B515841j26129k08958k18640k44744k14663r5260l406p792j00062j87732
10708A108455k03557j51998o8519J8446J37874K85971L25942J78421k3591j34140
10698A473304k10907k90875l69405l85968k10669O1627J96659J81126J16177Q5595
10688F46664J01136R0054K2492j3987J9660P2404N2359K03J952N9237J29024J42472
10676A323670J50114J07419j04600k50991j23093K1258L5172R7327K00425J71627
$$ plain form
10749 605345 551388 389284 227163 166661 182527 223388 292753 373494 394926 320210 195964
10738 195964 93767 69916 178134 457418 819099 1118227 1309937 1379426 1450018 1643193
10728 1643193 1878800 2085846 2275510 2425038 2502954 2491109 2408551 2391672 2480703 2515841
10718 2515841 2389712 2180754 1962114 1717370 1502707 1407447 1404041 1396249 1296187 1108455
10708 1108455 904898 752900 684381 702827 840701 1126672 1452614 1631035 1607444 1473304
10698 1473304 1262397 971522 602117 216149 5480 67107 263766 444892 561069 646664
10688 646664 747800 837854 860346 846359 866019 938423 990782 990985 992937 1052174 1181198 1323670
10676 1323670 1473784 1581203 1476603 1225612 1102519 1123777 1158949 1256276 1456701 1628328
10666A628328N2918J322N612n3766j91056l06853k62188n4289J16963J91537K31677
10655A360205K16276J63836J05335Q6746Q4289j8109k12770k93913j68180j2329
10645A311386J20224K60434K97245J92449J9781n7950q3577j20992j08140j09119
10635A721741j89677k81469l00526k48737r7074J45977L69380L67556J84442N9881
10625A731494K9899k6044j20514j82150k51847k47073n9767P9439K5251q2301
10615H96387j31062q1770K1095J02219J71085K67025J91643m874o8854p4357j53166
10604A135371k51877k81678j85772l8506m6429j95678k34500j56464o329J46849
10594a15013J41160N5395K9246Q3464R8508O7325J28827K83836K83069J43632
$$ plain form
10666 1628328 1681246 1682568 1688180 1634414 1443358 1136505 874317 820028 936991 1128528 1360205
10655 1360205 1576481 1740317 1845652 1932398 2016687 1998578 1785808 1491895 1323715 1311386
10645 1311386 1431610 1692044 1989289 2181738 2201519 2143569 2059992 1939000 1830860 1721741
10635 1721741 1532064 1250595 950069 701332 604258 750235 1119615 1487171 1671613 1731494
10625 1731494 1761393 1735349 1614835 1432685 1180838 933765 873998 953437 978688 896387
10615 896387 765325 683555 704650 806869 977954 1244979 1436622 1431748 1362894 1288537 1135371
10604 1135371 883494 601816 416044 377538 331109 135431 -99069 -255533 -261862 -115013
10594 -115013 26147 81542 110788 194252 292760 360085 488912 772748 1055817 1199449
10584A199449N5530j5013p2894p1851q867J22221K52301K37588M3146k14001l01539
10573A226070j97025j07239j2380J40462K71968L34952K20708n9258k87221l84011
10563A147026l69527k47867l9944K19216M84538N34617K95396m836j07215K8705
10553A940109J37045Q5989m9259k27883l99682m63571l99586k20166P3847L07631
10543G84474K49079M7427q6476j56308j18246N3841K22375K56701J15574j21372
10533A247069k36016j92666r3391R971o156j59858k61677j84856m1863O7064J21727
10522B69348Q1636j0540m7300L1817J30397J45264J08020M2755k6767l4848J2325
10511G02107O9300J31753K00216K71555K84291J62544j6359j24562j78861j39901
$$ plain form
10584 1199449 1254979 1239966 1167072 1095221 1086354 1208575 1460876 1698464 1741610 1527609 1226070
10573 1226070 1029045 921806 909426 1049888 1321856 1656808 1877516 1818258 1531037 1147026
10563 1147026 777499 529632 489688 708904 1193442 1728059 2023455 2018619 1911404 1940109
10553 1940109 2077154 2163143 2113884 1886001 1486319 1022748 623162 402996 476843 784474
10543 784474 1033553 1080980 994504 838196 719950 773791 996166 1252867 1368441 1247069
10533 1247069 1011053 818387 724996 734967 728811 568953 307276 122420 80557 147621 269348
10522 269348 350984 340444 293144 324961 455358 600622 708642 751397 724630 689782 702107
10511 702107 771407 903160 1103376 1374931 1659222 1821766 1805407 1680845 1501984 1362083
10501A362083o9468o788J42679K38941K74505L98806M53901K74626M4633m0957
10491C072961j15869k28043k40836k38405k53672k17553j73756k05255k59529
10482A140043k65052k11613p0160R5523K41459L39298K86687P0627j72154k90906
10472A163752k37399j63198j32933n3938O1365J88912K99477L01474J69828N9345
10462A656685L2186K1865K1822j095j896O4526J46518J72535J13323o473j54200
10451B065796k41890j24682K2976L0063P1353J89787K61694K79479K81497K56602
10441C092675J44116k9805k44214l65536k66055l3493J98493K77663K53499L02635
10431C329978L12002K14895K76625N24080P33222R24653J302992J890328K595206
$$ plain form
10501 1362083 1292615 1285827 1428506 1667447 1941952 2340758 2794659 3069285 3113918 3072961
10491 3072961 2957092 2729049 2488213 2249808 1996136 1778583 1604827 1399572 1140043
10482 1140043 874991 663378 593218 688741 930200 1269498 1556185 1626812 1454658 1163752
10472 1163752 926353 763155 630222 576284 637649 826561 1126038 1427512 1597340 1656685
10462 1656685 1688871 1710736 1732558 1731463 1729567 1794093 1940611 2113146 2226469 2219996 2065796
10451 2065796 1823906 1699224 1722200 1752263 1823616 2013403 2275097 2554576 2836073 3092675
10441 3092675 3236791 3206986 2962772 2597236 2331181 2297688 2496181 2773844 3027343 3329978
10431 3329978 3641980 3856875 4133500 4657580 5390802 6315455 7618447 9508775 12103981
10422A2103981L300367L908923M296317M199764L157517Q34646k019986m009272
10414B5772257m552838m090282l331513k665149k214984j774397j192207p80550
10406E170337p27658p88162p64303p04508n66165l70544k38430j26220k1677K2401
10396H85071R8947K12760K20104J27306P0879J26217J59666P2431r4097k07387
10386A671897k30939k86989l17664k16580j00149r8985j98998k43251j14348J07863
10376b8143K80732L15210K59854J71768P3843q1909k39595k06921l1336P4877
10366E88380O8404l2937q7815j908J07207J82826J60233M7700j4521j6985o0292
10355I40292r8960j14443j73146k06839j48968j8244J06011K22064L31927L09228
$$ plain form
10422 12103981 15404348 19313271 23609588 27809352 30966869 31801515 29781529 25772257
10414 25772257 21219419 17129137 13797624 11132475 8917491 7143094 5950887 5170337
10406 5170337 4442679 3654517 2890214 2185706 1619541 1248997 1010567 884347 862670 885071
10396 885071 984018 1196778 1416882 1544188 1615067 1741284 1900950 1973381 1879284 1671897
10386 1671897 1440958 1153969 836305 619725 519576 420591 221593 -21658 -136006 -28143
10376 -28143 252589 567799 827653 999421 1073264 991355 751760 544839 513503 588380
10366 588380 656784 623847 536032 534124 641331 824157 984390 1032090 1017569 1000584 940292
10355 940292 841332 726889 553743 346904 197936 179692 285703 507767 839694 1148922
10345A148922J15406j34108k47050k06441j77454j38789o7297r4643j84854j71995
10335a58303m1590J36988K53486K39098K00219K61046L88491M42697L11646J36173
10325B169951O5857n0297j56385j03800m3459j53174k43387j87001l7738J73099
10315A433666K94092K62924J77675J11909J02751J38026K33879K80123J24949
10306C159994j46045l39874l99648l17035j82551j49335j57347j43855j85064
10297A139240k95252l04268j35997J00767K86928L17793J43868r2409j76244m2830
10287I41596L4570j16523l09366m40000m41940j80058J78605M20528M73904L66591
10277I27907L23109L39460K95100K32139J54788R2877O0950j1406j03408j40071
$$ plain form
10345 1148922 1264328 1130220 883170 676729 499275 360486 293189 198546 13692 -158303
10335 -158303 -199893 -62905 190581 429679 629898 890944 1279435 1722132 2033778 2169951
10325 2169951 2235808 2185511 2029126 1925326 1881867 1728693 1485306 1298305 1260567 1433666
10315 1433666 1727758 1990682 2168357 2280266 2383017 2521043 2754922 3035045 3159994
10306 3159994 3013949 2674075 2274427 1957392 1774841 1625506 1468159 1324304 1139240
10297 1139240 843988 539720 403723 504490 791418 1109211 1253079 1160670 984426 941596
10287 941596 976166 859643 550277 110277 -331663 -511721 -333116 87412 561316 927907
10277 927907 1251016 1590476 1885576 2117715 2272503 2365380 2426330 2414924 2311516 2171445
10267B171445j40651j40416q0889K9095K5704q8154j97063k85290k75190j19573
10257H99018n0903j39616j09052M2884Q4447p690j11468j14255l4359q749l1686
10246D18571K7936J86817L19990L38714K19114L4526j75044k55710j22930K6828
10236A018812M2757k3496k7469L5613J07020J08044P1166Q9121O1799j3866j2332
10225A457169K2079m6628j12502p7052m1015j8476O4659J57113J29952L3045K9699
10214A598043O2888K1359l2601m8905m6328o8213j37346j97800j92173j06819
10204H52105K3351O4600N7273J03261J71698K40728K32897J70895J62655J32989
10194B212452l0186j45742j19705r2102l0951J04565K10090K05953N8010r4292
$$ plain form
10267 2171445 2030794 1890378 1809489 1838584 1864288 1776134 1579071 1293781 1018591 899018
10257 899018 848115 708499 599447 642331 726778 719088 607620 493365 459006 450257 418571
10246 418571 446507 633324 953314 1292028 1511142 1545668 1370624 1114914 991984 1018812
10236 1018812 1061569 1038073 1010604 1046217 1153237 1261281 1332447 1421568 1483367 1469501 1457169
10225 1457169 1479248 1432620 1320118 1243066 1202051 1183575 1248234 1405347 1535299 1568344 1598043
10214 1598043 1660931 1682290 1649689 1600784 1554456 1486243 1348897 1151097 958924 852105
10204 852105 875456 940056 997329 1100590 1272288 1513016 1745913 1916808 2079463 2212452
10194 2212452 2182266 2036524 1916819 1824717 1793766 1898331 2108421 2314374 2372384 2278092
10184B278092k04695k18173o0831J64112K62243J60746k0290j72059k28448k51991
10174A708706k55985k28991k15992k41834k84827k31126N019K73949L24675J36810
10164I90404o5486j53010j25299m1111K9414J07834J02229K9506m6050j18984
10154G09447j93658k69723k81123k14468j18220q5558n6007J6490J52651L30660
10144i509M25875L75613J56407m4543k0088J20750J30206L7138j2691P283K8602
10133A195043o128r8319j51001p2876J6070J18283K28743K85476K66822J64429
10123A946542J17164J88379K27990J46901N0686K5034M6637N4633j16873l69742
10113B317351m21394l46271k53277j13361j2820o594k8254L8344Q5363l0936j96417
$$ plain form
10184 2278092 2073397 1855224 1794393 1958505 2220748 2381494 2361204 2189145 1960697 1708706
10174 1708706 1452721 1223730 1007738 765904 481077 249951 254970 528919 853594 990404
10164 990404 924918 771908 646609 605498 634912 742746 844975 874481 828431 709447
10154 709447 515789 246066 -35057 -249525 -367745 -453303 -509310 -492820 -340169 -9509
10144 -9509 416366 791979 948386 903843 883755 1004505 1134711 1171849 1159158 1166441 1195043
10133 1195043 1188915 1090596 939595 866719 882789 1001072 1229815 1515291 1782113 1946542
10123 1946542 2063706 2252085 2480075 2626976 2677662 2702696 2749333 2803966 2687093 2317351
10113 2317351 1895957 1549686 1296409 1183048 1170228 1163634 1135380 1173724 1259087 1228151 1031734
10102A031734k18808m4065J50929J80671P3816k3338q3386j24393j28800p5809
10092G38551R6084K72364K85570J45190l2602r4624K839J24421J85768Q9197j24125
10081A688633k09654r7187J7926J6789l8786m4086l1434o1932j25010j95268k17931
10070G02060j68135M7096K47835J37814n7594j12049p4797q1337j62360j77154
10060C01379n6639J43179K18649J40934J07630J35388J90032L00692M17629M47051
10050B345924L60641J87958l2705j80923j91709j17352j13242j80401k01577j10353
10040A766261N0076J45909J31539J5742j27690k69010m25091m34920k48795p4686
10030E29335M4483J40469J90368K39312K86596K18522J0045j77293j69908M7918
$$ plain form
10102 1031734 812926 768861 919790 1100461 1174277 1150939 1067553 943160 814360 738551
10092 738551 834635 1106999 1392569 1537759 1505157 1410533 1413372 1537793 1723561 1812758 1688633
10081 1688633 1478979 1381792 1399718 1416507 1377721 1333635 1302201 1240269 1115259 919991 702060
10070 702060 533925 581021 828856 966670 909076 797027 722230 640893 478533 301379
10060 301379 244740 387919 606568 747502 855132 990520 1180552 1481244 1898873 2345924
10050 2345924 2706565 2894523 2861818 2680895 2489186 2371834 2258592 2078191 1876614 1766261
10040 1766261 1816337 1962246 2093785 2109527 1981837 1712827 1287736 852816 604021 529335
10030 529335 573818 714287 904655 1143967 1430563 1649085 1659130 1481837 1311929 1359847
10020A359847K34672K78739K86384K36076Q6946p6088j08468n9271K4909J59311
10010B423057K66255L00413L10616K29344l177k60336m07624l76270k39728j44389
10000B098161j18281m9809M6537R1789Q0501p764j75065l70877m64690l67626
9990G62876j66599n8962p5806n2365K7305Q0857Q8272R2374N2530j54727l18331
9979B77424j93237k4810L88K2955N5008N1182Q9635J84730K21674J40804K0931
9968H46684o1214r4697o8634q971l6278j95395l11366k76720j71794p0128J13949
9957c34564L17354L67051K59165R0476j23625l14321l36347j35377N6692P6855
9947g6641M1778k2163q4023r8397N562K70627M54281L48100J41326L7621L3678
$$ plain form
10020 1359847 1594519 1873258 2159642 2395718 2482664 2406576 2298108 2238837 2263746 2423057
10010 2423057 2689312 2989725 3300341 3529685 3526508 3266172 2858548 2482278 2242550 2098161
10000 2098161 1979880 1930071 1976608 2068397 2148898 2141134 1966069 1595192 1130502 762876
9990 762876 596277 537315 461509 409144 436449 517306 605578 697952 750482 595755 277424
9979 277424 84187 59377 59765 82720 137728 188910 278545 463275 684949 825753 846684
9968 846684 785470 690773 622139 613168 576890 381495 70129 -206591 -378385 -448513 -334564
9957 -334564 -17210 349841 609006 699482 575857 261536 -74811 -210188 -153496 -76641
9947 -76641 -34863 -57026 -141049 -239446 -233884 36743 491024 839124 980450 1018071 1051749
9936A051749N8895L6907j21477k85788k97908j50270J34843L46179K94028J77395
9926A244553J44665P3173l8817p3934k2624J8546M4825J89313L59486L53367J60895
9915B453448j9518q4260q6805r3623j06588j43232j65785j79544k11768k44539
9905A117786k13068p4804L6555K727j24928j75915o6547M4851j2380r1606o0467
9894C82204r549J5557N5109J17715J80535J26484J330k1707o877o6929j45500
9883F28372j57438q2947L5515J08834J23498J15484J28194Q9869k5186j26406
9873H37789j40595l4447J36129K88250L73627L29769R7223k18150l87619m03232
9863H78744l59293k34408p6650O8778J38400P6061K5926J01389K33359L18991
$$ plain form
9936 1051749 1110644 1147551 1026074 740286 442378 292108 426951 773130 1067158 1244553
9926 1244553 1389218 1462391 1423574 1349640 1327016 1345562 1390387 1579700 1939186 2292553 2453448
9915 2453448 2433930 2349670 2262865 2169242 2062654 1919422 1753637 1574093 1362325 1117786
9905 1117786 904718 829914 866469 869196 744268 568353 501806 546657 534277 442671 382204
9894 382204 372655 388212 443321 561036 741571 868055 869385 847678 840801 773872 628372
9883 628372 470934 387987 423502 532336 655834 771318 899512 989381 964195 837789
9873 837789 697194 662747 798876 1087126 1460753 1790522 1887745 1669595 1281976 878744
9863 878744 519451 285043 208393 277171 415571 491632 517558 618947 852306 1171297
9853A171297L53502L17828J82155R5050M0001p9244j44496m3637O6995o390r9184
9842A853877j34393j52836j46661k43154l92307m05033k98305j43407M0814K56255
9832B34850L30197J63007l5992l6423Q5886J52695O0195r6700r9173n2773j59660
9821E46109k98251k72895j46503j0682R4815J19987L9184k8052m978K9839N9766
9810A28339Q0225Q7940Q0873J49646K35410K12750J93271J67692J7396j67163
9800A186379k30364j27193O4755K28719K63397J77480J66814K07430J33442m8828
9790B022031k20685k79781k14106k32686l09246k49904n5176J36564K63518L28718
9780A189247K73900J47172J1899j40267k42877j63569o3698j38970j93539j18506
$$ plain form
9853 1171297 1524799 1842627 2024782 2119832 2159833 2080589 1936093 1892456 1959451 1953061 1853877
9842 1853877 1719484 1566648 1419987 1176833 784526 379493 81188 -62219 -21405 234850
9832 234850 565047 728054 692062 655639 741525 894220 954415 857715 758542 705769 546109
9821 546109 247858 -25037 -171540 -182222 -87407 32580 71764 43712 38734 68573 128339
9810 128339 208564 296504 377377 527023 762433 975183 1168454 1336146 1353542 1186379
9800 1186379 956015 828822 893577 1122296 1385693 1563173 1729987 1937417 2070859 2022031
9790 2022031 1801346 1521565 1307459 1074773 765527 515623 460447 597011 860529 1189247
9780 1189247 1463147 1610319 1622218 1481951 1239074 1075505 1011807 872837 679298 560792
9770E60792o4846j21086j36814M6273K94947L91981K20729n0186k05937l12964
9760F22889m09301l99263k93350j35244M1959K02509K48503K23865L07367L57639
9750G67573J27916k07667l57049k66138m9440P0339J03597J56323K00770K06980
9740G53204J66757J40663J84853J73334j5344k57704l76067k66333K1668K29679
9730G54710K91279L40582K93238Q3191j46664k90394k76108j13134N4264J25840
9720A116804Q0951k2945o4762n4441j18856j71363r9555n3764l5133M0108P1561
9709F88605M2186J8713M8450J21429Q7927k8591p8296o1152l7781l1866J268M3235
9697H14127L6600l8416j64787k14994j40393p755Q4004J38907K73301M43133M12786
$$ plain form
9770 560792 495946 374860 238046 284319 579266 971247 1191976 1141790 935853 622889
9760 622889 213588 -185675 -479025 -614269 -572310 -369801 -121298 102567 409934 767573
9750 767573 895489 687822 330773 64635 15195 85534 189131 345454 546224 753204
9740 753204 919961 1060624 1245477 1418811 1403467 1145763 769696 503363 525031 754710
9730 754710 1045989 1386571 1679809 1763000 1616336 1325942 1049834 936700 990964 1116804
9720 1116804 1197755 1174810 1110048 1055607 936751 765388 665833 612069 576936 617044 688605
9709 688605 730791 749504 797954 919383 1007310 978719 900423 839271 801490 769624 770892 814127
9697 814127 850727 812311 647524 432530 292137 284382 368386 507293 780594 1223727 1636513
9686A636513K16880Q6188P952q3577r5143J1426J19614R8360R780J4692L7465
9675B060150j1724j39077k82446k62593j26040o7963q5700r5093r3447k1252R3835
9664I68650J20333R3086N4767L0698R8094K61039L48857J80798o4801j75345j83200
9653A732976j60686j28692r2425m5254J3493M3845k8920j91854l19554l31494
9643D91435k30327o8453N8871J17258J72463K38072K33059J52250N6921l2877
9633A188672q8755r2494m8920j7193k144J19593K69112K25732P0416o8755j89593
9622A365671k14793j08330k4642k3259k4679m3620j14692q0370O5607J37189J20769
9611A054851Q3894j4199j35471r3430N4143K9997j01283m1682J38654K31004J36605
$$ plain form
9686 1636513 1853393 1939581 1947533 1863956 1768813 1780239 1899853 1998213 2007993 2022685 2060150
9675 2060150 2048426 1909349 1626903 1364310 1238270 1170307 1084607 989514 896067 874815 968650
9664 968650 1088983 1182069 1236836 1267534 1365628 1626667 1975524 2156322 2091521 1916176 1732976
9653 1732976 1572290 1443598 1351173 1305919 1319412 1363257 1334337 1142483 822929 491435
9643 491435 261108 192655 251526 368784 541247 779319 1012378 1164628 1221549 1188672
9633 1188672 1099917 1007423 958503 941310 939166 1058759 1327871 1553603 1624019 1555264 1365671
9622 1365671 1150878 1042548 1017906 994647 969968 926348 811656 731286 796893 934082 1054851
9611 1054851 1138745 1124546 989075 895645 949788 979785 878502 836820 975474 1206478 1343083
9600A343083j00358l02553l31620k13615q0573l4994k1050P0057J89908K62753
9590G81038K47343J70040J66834K04552J31101j4693r5651q8619k5029j3131j2894
9579A450891M006j06897k03413p8791J24593K14539J68739J9662j97345k82561
9569A113423r7145J61235K50282J33751j04754k74697k04157j7456R4512J55110
9559A210104J08526r2817k44443k23255r1040R377m9944k00573k33444j35613
9549E6878p8013m3811Q1132K45957L23407K86617K41081J93439J49640J07706
9539A564033L9200o4357k08921k97476j66178J17442K57724K05919O6684o7032
9529A447038p2770j2026M2581K8392j08998k44729k66593j50337P0231K21976
$$ plain form
9600 1343083 1242725 940172 608552 394937 314364 279370 258320 328377 518285 781038
9590 781038 1028381 1198421 1365255 1569807 1700908 1686215 1590564 1501945 1476916 1463785 1450891
9579 1450891 1454897 1348000 1144587 1065796 1190389 1404928 1573667 1593329 1395984 1113423
9569 1113423 1016278 1177513 1427795 1561546 1456792 1182095 977938 960482 1054994 1210104
9559 1210104 1318630 1225813 981370 758115 667075 676452 626508 425935 192491 56878
9549 56878 -21135 -64946 16186 262143 585550 872167 1113248 1306687 1456327 1564033
9539 1564033 1603233 1538876 1329955 1032479 866301 983743 1241467 1447386 1514070 1447038
9529 1447038 1374268 1362242 1404823 1433215 1324217 1079488 812895 662558 732789 954765
9519I54765K43990J60793O6182L8337L8798l058j97923m04993l89326k88048k44890
9508b5373j47603K87P2423L9470j4904p149M3299Q0595L4296O916J02614K52897
9496D37768L00772J56931k9226j02450j21820j47724j67702j70159j05191Q9147
9486A40346L30502M10488K97038J69716L5538j32906j93011j54456p6978O0705
9476H86982J79537J15794k1801j7017P6989L3828j62130k83367k53477k49423
9466C05915k82488j98655J6864K06673J62681q1816j84195l6268J68543K88423
9456C65677K32381O3046n9208q2086j02022j46883j49947j21718o720J49503K26145
9445C68168K95227L54049K62665R8898j0109j12097j64538j87054k31432j69089
$$ plain form
9519 954765 1198755 1359548 1425730 1464067 1502865 1499807 1301884 896891 507565 219517 -25373
9508 -25373 -172976 -172689 -100266 -60796 -75700 -82849 -39550 41045 75341 82257 184871 437768
9496 437768 738540 895471 866245 763795 641975 494251 326549 156390 51199 140346
9486 140346 470848 881336 1178374 1348090 1383628 1250722 1057711 903255 826277 886982
9476 886982 1066519 1182313 1160512 1143495 1220484 1254312 1092182 808815 555338 305915
9466 305915 23427 -175228 -158364 48309 210990 129174 -55021 -91289 77254 365677
9456 365677 598058 661104 601896 519810 417788 270905 120958 -760 -7480 142023 368168
9445 368168 663395 1017444 1280109 1379007 1368898 1256801 1092263 905209 673777 504688
9435E04688J7170K61466M04037K64297n3997j91234L5177L57314N15558M30940
9425B545416J74678q4160k50790k65058j60195o9737j13978k34794l32533l40351
9415H68498k35613j36651q2547L1875J52825K25443K95544K96895J62373n3501
9405A525141j46502j7977P7314m8575j98833j72596j9690J21089J86065J73254
9395A478690J60879J57584O9889m0547l2256R3287J82640Q2271q3182j30715j10259
9384A828281j17160p0722P1045K03131K80674L03973L09711K65956J36449k7993
9374C183345j84456k51002j75759j3678J48566J98806J27648k7585k17601k59526
9364B528758j32833K8063J23018J02410j523j52441k56474l16151l51408l48310
$$ plain form
9435 504688 521858 783324 1187361 1451658 1397661 1206427 1241604 1598918 2114476 2545416
9425 2545416 2720094 2635934 2385144 2120086 1959891 1890154 1776176 1541382 1208849 868498
9415 868498 632885 496234 413687 445562 598387 823830 1119374 1416269 1578642 1525141
9405 1525141 1378639 1360662 1437976 1389401 1190568 1017972 998282 1119371 1305436 1478690
9395 1478690 1639569 1797153 1867042 1826495 1794239 1887526 2070166 2152437 2069255 1938540 1828281
9384 1828281 1711121 1640399 1711444 1914575 2195249 2499222 2808933 3074889 3211338 3183345
9374 3183345 2998889 2747887 2572128 2558450 2707016 2905822 3033470 3005885 2788284 2528758
9364 2528758 2395925 2423988 2547006 2649416 2647893 2495452 2238978 1922827 1571419 1223109
9354A223109k86800k25329j85558j38151l6661J12930J46873R7768J17485J90125
9344A015791J98281J02919p7041k04310j59275j6099J57938L04557K98674J28281
9334A749716n0494j66817k65984k23788p5535n034n9002q0763J3190Q8106J15145
9323A038740J36511O6961j13448k56867k64198j70764l9786O0331K5875m6515
9313D36840M6501K22379K34466J13922J00723K08176K58660R8570j04921j32661
9303A482655o9818N299K7417r0558k20263k02914r8402n338J60852L36739L84749
9292A710418K72928O5075j32048k99681l82043k68034l4275J25450K45406L30978
9282A634174K56381Q086k46941l51967k78248j35713o6053o4281o1377J431P9098
$$ plain form
9354 1223109 936309 710980 525422 387271 350610 463540 610413 708181 825666 1015791
9344 1015791 1214072 1316991 1239950 1035640 876365 860266 1018204 1322761 1621435 1749716
9334 1749716 1699222 1532405 1266421 1042633 967098 962064 903062 822299 835489 923595 1038740
9323 1038740 1175251 1242212 1128764 871897 607699 436935 397149 457480 483355 436840
9313 436840 483341 705720 940186 1054108 1154831 1363007 1621667 1720237 1615316 1482655
9303 1482655 1412837 1418136 1445553 1354995 1134732 931818 833416 828078 988930 1325669 1710418
9292 1710418 1983346 2048421 1916373 1616692 1234649 966615 932340 1057790 1303196 1634174
9282 1634174 1890555 1898641 1651700 1299733 1021485 885772 819719 755438 694061 695492 774590
9271G74590Q8820L5585p371j5937K0442J01388J06835O524o5986k6244L2188P8332
9259A129166R5284J21189K26657L13447K98585K27392J51030Q7516k1578j35986
9249B492702j67817q2303K3221J00540J28283O6132p515l3374k3590m0729n6662
9238B398888n7206n1348n8306j29012j88314j56710j23538j48788j65557q7548
9228A232561J4105Q2337P0132j9493k5921M3679P1729P4416J24814J46581P3453
9217A888393j9854l5810O1351J51251J26362J852j23618j03859K7407J04756J17711
9206B195942J45026J94390J71559R0915l2j14508j67950j89291k29327k32611
9196A864113k44812k94654k43280l0915K22979M00790M46425L12816M1777j95207
$$ plain form
9271 774590 863410 898995 891624 875687 896129 997517 1104352 1110876 1044890 1018646 1050834 1129166
9259 1129166 1224450 1345639 1572296 1885743 2184328 2411720 2562750 2650266 2628688 2492702
9249 2492702 2324885 2242582 2265803 2366343 2494626 2560758 2553243 2519869 2496279 2455550 2398888
9238 2398888 2341682 2290334 2232028 2103016 1914702 1757992 1634454 1485666 1320109 1232561
9228 1232561 1246666 1329003 1399135 1379642 1353721 1397400 1469129 1543545 1668359 1814940 1888393
9217 1888393 1868539 1832729 1894080 2045331 2171693 2173545 2049927 1946068 1973475 2078231 2195942
9206 2195942 2340968 2535358 2706917 2797832 2797800 2683292 2515342 2326051 2096724 1864113
9196 1864113 1619301 1324647 1081367 1050452 1273431 1674221 2120646 2433462 2475239 2280032
9186B280032l25120l47350k86476j85155p1422M4229J31288K01494J65542M565
9176A611627n3556P236L8028p7728l21192n17348n09603l30748q2388J63990L47839
9165B76157L33970K11360J73743J66728J45435J46225J37950J00679J05497J77351
9155A975095K01954J32807j3303j18971j03061j4131P9838J16799J13069O1735
9145B431831L7680K5413o5370j90801l38803l37400j18176Q0647J04232Q4999
9135A714252J13088Q3068m0743j75421j83381m5135J68891L08514K51388R6972
9125B291493o4578k28988l04360l16986l27339l06776j95442m4064R7105J82634
9115G82699K09305K21089K49803K32087J41327O8716M8849J6235p6416j35524
$$ plain form
9186 2280032 1954912 1607562 1321086 1135931 1064509 1108738 1240026 1441520 1607062 1611627
9176 1611627 1558071 1565307 1603335 1525607 1204415 687067 177464 -153284 -235672 -71682 276157
9165 276157 610127 821487 995230 1161958 1307393 1453618 1591568 1692247 1797744 1975095
9155 1975095 2177049 2309856 2296553 2177582 2074521 2060390 2140228 2257027 2370096 2431831
9145 2431831 2469511 2494924 2429554 2238753 1899950 1562550 1444374 1525021 1629253 1714252
9135 1714252 1827340 1910408 1869665 1694244 1510863 1465728 1634619 1943133 2194521 2291493
9125 2291493 2226915 1997927 1693567 1376581 1049242 742466 547024 502960 600065 782699
9115 782699 992004 1213093 1462896 1694983 1836310 1905026 1953875 1970110 1893694 1758170
9105A758170j39772j93196k09011j68958j68766k50855k59300j29478L1106J64477
9095D34417K35862K39141J79480J12867R0906O6945m8747j94216k42033j85678
9085F88944j17473j22873j71243j48701r6665J3651K03495L14140K68432J52304
9075I84011j2603o4854M2988J14519R8843O3633K6444M6508M3581p2237r7885
9064A172948J4614K1493l9516r52N9881R0233J53182Q5162j53672k73467k07291
9053I22615j23370o1954o3624n8890N8898J72984J37743R4990J45283J58151J21133
9042A503959O3949r2216k52231j67735J12897K82926K12617N0094j07058j98463
9032A408739j90507j90099k09326j33253j7445K6137k7250r6903p3012k5916n0616
$$ plain form
9105 1758170 1618398 1425202 1216191 1047233 878467 627612 368312 238834 269940 434417
9095 434417 670279 909420 1088900 1201767 1292673 1359618 1310871 1116655 874622 688944
9085 688944 571471 448598 277355 128654 31989 45640 249135 563275 831707 984011
9075 984011 971408 906554 949542 1064061 1162904 1226537 1252981 1299489 1343070 1270833 1172948
9064 1172948 1187562 1209055 1169539 1168587 1228468 1318701 1471883 1557045 1403373 1129906 922615
9053 922615 799245 737291 673667 614777 673675 846659 984402 1079392 1224675 1382826 1503959
9042 1503959 1567908 1475692 1223461 1055726 1168623 1451549 1664166 1714260 1607202 1408739
9032 1408739 1218232 1028133 818807 685554 668109 694246 666996 570093 497081 471165 420549
9021D20549j25084j54632p7119j010N1925J64519K76316K32936O1063o6118q5016
9010F98329o2307m0874n9013o8900k7760P1822K03874K35616M4588k19884l08993
8999D66498j34549R8210J35922P9732K7410K8739N4600k3614j05977j39775j34068
8988C53128j02988m9176L4679J53691L10834M10871L47745J36438o8609p9538
8978A447075P5769J93175J30130o470p6177j12105j16999j16820o8319Q9756K33084
8967A672099J86311L1485p9791j40302j60767j18808j43329k23494j83826j4318
8957H25260J73296K17064P5530q1246j70571j74918r1770l3719n3582q7627j33499
8946D64218j76180j93193j24033j8976k1854j01365j34897j9654J12039J47721
$$ plain form
9021 420549 295465 140833 63714 62704 114629 279148 555464 788400 849463 783345 698329
9010 698329 636022 595148 536135 467235 439475 511297 715171 950787 995375 775491 466498
8999 466498 331949 430159 566081 645813 673223 701962 756562 732948 626971 487196 353128
8988 353128 250140 200964 235643 389334 700168 1111039 1458784 1595222 1526613 1447075
8978 1447075 1522844 1716019 1846149 1839679 1763502 1651397 1534398 1417578 1349259 1439015 1672099
8967 1672099 1858410 1889895 1810104 1669802 1509035 1390227 1246898 1023404 839578 825260
8957 825260 998556 1215620 1291150 1209904 1039333 864415 772645 738926 685344 597717 464218
8946 464218 288038 94845 -29188 -48164 -70018 -171383 -306280 -325934 -213895 -66174
8936f6174K11291L54345L98589K61949J09177L205r9548k05476k48142j43736
8926E75480J9776Q6065k4236k18728l17282k25554m8349K7492m053p0737j56991
8915c57117k00578j20575N2545K93262N66940O48745M48016J16473k03306l33455
8905I10950l52557m00482l69894k42824j40615j42015j93660k32778j99863n8126
8895a421864P1104J89249L04962L67419M13351M38591L60681K58384K60651K73350
8885A515878J55901q4284k02700j32452m4267J7960L1558K2937L5702L4115P2537
8874A422885K22709L21388J81253K3355Q0403J90188J90867K13150K23864Q1714
8864C151776j57823k76390k11752j08035r0032j03385k3372P4880N6188k7240
$$ plain form
8936 -66174 145117 499462 898051 1160000 1269177 1272382 1172834 967358 719216 575480
8926 575480 595256 681321 657085 438357 121075 -104479 -152828 -125336 -129389 -200126 -357117
8915 -357117 -557695 -678270 -625725 -332463 234477 883222 1331238 1447711 1244405 910950
8905 910950 558393 157911 -211983 -454807 -595422 -737437 -931097 -1163875 -1363738 -1421864
8895 -1421864 -1350760 -1161511 -856549 -489130 -75779 362812 723493 981877 1242528 1515878
8885 1515878 1671779 1587495 1384795 1252343 1208076 1226036 1257594 1280531 1316233 1350348 1422885
8874 1422885 1645594 1966982 2148235 2171590 2251993 2442181 2633048 2846198 3070062 3151776
8864 3151776 2993953 2717563 2505811 2397776 2307744 2204359 2180987 2255867 2312055 2284815
8854B284815o2358n0712j9460l6452m2425j9839j59991l01397k43056j03527q5368
8843A160230k12904l04719j82238P718k9549j84673j63396K6907J43821K27900
8833D89097M05222M55310L21075K23979J11089j24341k81026j80925K4384Q2983
8823A526847r5021l17951l54462k46689j30860j09607j50650q3786N9380J47668
8813B44869K19350K27747J25568N2634q163j18063r5102J34201L82041M38862
8803A603944K57161N797j33122k02230k34766k72421k69198j98482r4790L2061
8793D93954Q9300K4015l0468P9103K61440L65295L67850K94859K27543K23957
8783B396848J73127k8275k17004k81740k66373j93834j03620j6803J00365J50310
$$ plain form
8854 2284815 2222457 2171745 2152285 2115833 2073408 2053569 1893578 1592181 1349125 1245598 1160230
8843 1160230 947326 642607 460369 468087 438538 253865 90469 117376 261197 489097
8833 489097 894319 1349629 1670704 1894683 2005772 1881431 1600405 1419480 1443864 1526847
8823 1526847 1431826 1113875 759413 512724 381864 272257 121607 37821 97201 244869
8813 244869 464219 691966 817534 870168 862005 743942 648840 783041 1165082 1603944
8803 1603944 1861105 1866902 1733780 1531550 1296784 1024363 755165 556683 461893 493954
8793 493954 583254 607269 576801 655904 917344 1282639 1650489 1945348 2172891 2396848
8783 2396848 2569975 2541700 2324696 2042956 1776583 1582749 1479129 1462326 1562691 1713001
8773A713001M2742j03086j74423q5732J03752K06721J79144J08027N6485N6450
8763B103081R5775Q1748J4498j03119j95198j15848P875l091j12628r0428O3335
8752A746000J16198J3989j03055j51366j47339j63306j63216l0258J23324J97204
8742A438175J74685K7107q9309q4565l9480J0285N2676P9803J16386O4531m9472
8731A700822q9291n9506J6763J21065J94149J59868N865j53586j78852j59559
8721A557738j86184j44645o0077L5979J45423J58952O2173k9128j02417j47935
8711A289879j43185j51376j21848M7793J53601M7216q7248o4125j0946q062p131
8700I44568k37k6862m3976n4220q2080m1428Q3230K35863K93261J62647j08017
$$ plain form
8773 1713001 1755743 1652657 1478234 1392502 1496254 1702975 1882119 1990146 2046631 2103081
8763 2103081 2198856 2280604 2295102 2191983 1996785 1880937 1888812 1885721 1773093 1682665 1746000
8752 1746000 1862198 1876187 1773132 1621766 1474427 1311121 1147905 1117647 1240971 1438175
8742 1438175 1612860 1639967 1550658 1466093 1426613 1436898 1489574 1569377 1685763 1750294 1700822
8731 1700822 1611531 1552025 1568788 1689853 1884002 2043870 2049735 1896149 1717297 1557738
8721 1557738 1371554 1226909 1166832 1202811 1348234 1507186 1569359 1540231 1437814 1289879
8711 1289879 1146694 995318 873470 921263 1074864 1122080 1034832 970707 959761 951699 944568
8700 944568 944331 917469 873493 819273 737193 695765 778995 1014858 1308119 1470766 1362749
8689A362749k63848j32944J39808K88533K29246R8146M2500k1768j26852q8326
8679A527244P4688J76582J48389l2229j92953j46449m6860j9052k18K9048N8856
8668A577046Q2771J60998K60794L16119K65595R0855l5798n7259m5892m6898l8092
8657B530239k8087k4984O95K7244N0533N6525J087p9248j61593k24229k05587
8646A942595j42625p0277N5504J93359J96130P6033j8594o2231q7452j45228k31347
8635A705867j95638K4673K46006K24036P4229l9759r8105p1935R333N0904j2472
8624A917139j06008j60858j32189j8352P6973J51173K99837M15999M13063K78749
8614C135526P1140p9109r1859o3998r1026l5480N3634P3875J23004K00008K50235
$$ plain form
8689 1362749 1098901 965957 1105765 1394298 1623544 1721690 1764190 1742422 1615570 1527244
8679 1527244 1601932 1778514 1926903 1894674 1701721 1555272 1508412 1489360 1489142 1518190 1577046
8668 1577046 1659817 1820815 2081609 2397728 2663323 2754178 2718380 2661121 2615229 2568331 2530239
8657 2530239 2502152 2477168 2477863 2505107 2555640 2612165 2613252 2534004 2372411 2148182 1942595
8646 1942595 1799970 1729693 1785197 1978556 2174686 2250719 2232125 2169894 2082442 1937214 1705867
8635 1705867 1510229 1534902 1780908 2004944 2079173 2039414 1941309 1869374 1878707 1929611 1917139
8624 1917139 1811131 1650273 1518084 1499732 1576705 1727878 2027715 2443714 2856777 3135526
8614 3135526 3206666 3127557 3035698 2971700 2880674 2845194 2898828 2972703 3095707 3295715 3545950
8603C545950K27839Q6144m5755k6211J03133K33631L05159K94251K33433J17410
8593E074984m940m2701o2695o4067O5273L02137M87654N16113M67165L75913K85642
8582G400478M10898P42416R73845J083077J164259J173541J149979J127987J057656
8573A6284136Q35357M75660J02862l22058q45157j204435j287201j240433j187828
8564A1610903j126279j022652r29651q64643p78311o41924n12845m87471m68411
8555D778716l27022j80891j56879j93938j40791L514O0692j4140j04743j28793
8545C595725j06190o3263l6503l6267o5324r2399q6411j45783j86539q8115K9573
8534B718504L3505l6389q5949n8101k6849n6793q3104o0184K3669J39918J59445
$$ plain form
8603 3545950 3773789 3859933 3814178 3787967 3891100 4124731 4429890 4724141 4957574 5074984
8593 5074984 5070044 5027343 4964648 4900581 4965854 5267991 5755645 6271758 6738923 7114836 7400478
8582 7400478 7811376 8553792 9527637 10610714 11774973 12948514 14098493 15226480 16284136
8573 16284136 17119493 17595153 17698015 17375957 16530800 15326365 14039164 12798731 11610903
8564 11610903 10484624 9461972 8532321 7667678 6889367 6247443 5734598 5247127 4778716
8555 4778716 4451694 4270803 4113924 3919986 3779195 3782709 3843401 3829261 3724518 3595725
8545 3595725 3489535 3426272 3389769 3353502 3288178 3195779 3109368 2963585 2777046 2688931 2718504
8534 2718504 2752009 2715620 2629671 2571570 2544721 2487928 2404824 2344640 2368309 2508227 2667672
8523B667672M1617q6669l2958O7674N5101K454m7717o5725n9109j08870j75646
8512B257824j64960j28367Q14J58786J26796K7924O4571J09258M5344q9730j52796
8501B255464p4715J2028M3940M6993J5704n2235j21873j36616n9445J0185K1326
8490A960756K4011L5243L7473K2281k4481m3474j0849m5006p2212K4811R3137
8479B001690L0051M428J08964K95588M86980M91239K97882K3443k51421m59478
8469C029366m94635l08684q3628l4878p5125n2061l1667q1911j08576l533J83240
8458A937908L46004L75425K83177J48040J6871q8860j41587q7557M2561O2344
8448B894326r2711k03126j35958j3578Q9710J38255J17833M2334P048Q2217J75868
$$ plain form
8523 2667672 2709289 2622620 2589662 2657336 2712437 2714891 2667174 2601449 2542340 2433470 2257824
8512 2257824 2092864 1964497 1965311 2124097 2250893 2278817 2343388 2452646 2497990 2408260 2255464
8501 2255464 2180749 2192777 2236717 2283710 2299414 2247179 2125306 1988690 1929245 1939430 1960756
8490 1960756 1984767 2020010 2057483 2079764 2055283 2011809 2000960 1955954 1883742 1908553 2001690
8479 2001690 2031741 2036169 2145133 2440721 2927701 3418940 3716822 3740265 3488844 3029366
8469 3029366 2534731 2226047 2142419 2107541 2032416 1980355 1948688 1866777 1758201 1754668 1937908
8458 1937908 2283912 2659337 2942514 3090554 3107425 3018565 2876978 2789421 2831982 2894326
8448 2894326 2801615 2598489 2462531 2448953 2538663 2676918 2794751 2837085 2844133 2926350 3102218
8437C102218J62697K3745j33385k31953k81557k04527M6377K79077L04575J41054
8427C208321l5748q8622o6610o4401r085J01423J61149J56620R8511J00212K03370
8416C765140K31569J28109L3852M4124O8883j0932r9282m1226J1143l7072n6247
8405D038061j0764O6909J09209J75634K00655K6667k58528m13852l64762j91833
8395C377396m8253j3984K4271M1301l9491j09108K601J96602K54020J78728Q7109
8384C951192J17944J95008K13628K02579J01276j54108m63388o11471n62880m29009
8374B560771l12156k14289o6671J52598L98796N21852M47958J87777p1295j37499
8364C467842j11758o3510N4023J72382J55634P743j13433j32656j19399j38409
$$ plain form
8437 3102218 3264915 3288660 3155275 2923322 2641765 2437238 2483615 2762692 3067267 3208321
8427 3208321 3172573 3083951 3017341 2952940 2943855 3045278 3206427 3363047 3461558 3561770 3765140
8416 3765140 3996709 4124818 4158670 4202794 4271677 4260745 4161463 4120237 4131380 4094308 4038061
8405 4038061 4027297 4094206 4203415 4379049 4579704 4606371 4347843 3933991 3569229 3377396
8395 3377396 3329143 3315159 3339430 3380731 3341240 3232132 3234733 3431335 3685355 3864083 3951192
8384 3951192 4069136 4264144 4477772 4680351 4781627 4627519 4164131 3552660 2989780 2560771
8374 2560771 2248615 2034326 1967655 2120253 2519049 3040901 3488859 3676636 3605341 3467842
8364 3467842 3356084 3292574 3346597 3518979 3674613 3682356 3568923 3436267 3316868 3178459
8354C178459j13148L1885J68698K27110K66800L72398M25014L68497K44117Q9879
8344E259709p355o5688p3134l3407J9598O8604J11313J04076Q965m9263m919J22843
8332E461342K46665K11081Q6945P8919J65111K51504K82156J90133J7182p2830
8322F918208N659J85499L29177L82713M07934M33040M39332N15504P56768J043284
8312A1417118J283758J495223J667198J860412K164659K658624L229618L744875
8304B9521485M038328L945574L538930K763736J603855K51251j026345k096855
8296D2539959k896229l268067l283239l176120l042797k767800k318195j849553
8288A9937959j460806j115193p89061n41271m01387l35085k17454j09283o5304
$$ plain form
8354 3178459 3065311 3097196 3265894 3493004 3759804 4132202 4557216 4925713 5169830 5259709
8344 5259709 5252354 5186666 5113532 5080125 5099723 5168327 5279640 5383716 5392681 5343418 5338499 5461342
8332 5461342 5708007 5919088 6006033 6084952 6250063 6501567 6783723 6973856 6991038 6918208
8322 6918208 6923867 7109366 7438543 7821256 8229190 8662230 9101562 9617066 10373834 11417118
8312 11417118 12700876 14196099 15863297 17723709 19888368 22546992 25776610 29521485
8304 29521485 33559813 37505387 41044317 43808053 45411908 45663159 44636814 42539959
8296 42539959 39643730 36375663 33092424 29916304 26873507 24105707 21787512 19937959
8288 19937959 18477153 17361960 16572899 16031628 15630241 15295156 15077702 14968419 14903115
8279A4903115l4668o4718j59375k23836j71332j4842M7320K3422K9126k9802j11072
8268A4193338r3606k1466M9628J70533L72981O24713Q34234J019385J231362J469257
8258A9850359J784617K282139K845687L365511L912032M576966N326206O219865
8250E0163382P365141Q773253J0349099J1782780J2516619J2094973J0349686
8243A23394933P404599L640204n51550m688672q233605j0637931j1610897j1365831
8235H7351250j0380274r098663p754388o481456n429398m543166l732104k977858
8227C6953943k300836j743737j305460r26270o17370m28337m15859n22787o71465
8218B8021822q85945r98178q87773p06158n38300l01742J2181L28525N17983O49654
$$ plain form
8279 14903115 14868447 14803729 14644354 14420518 14249186 14234344 14281664 14305086 14334212 14304410 14193338
8268 14193338 14099732 14078266 14127894 14298427 14671408 15296121 16130355 17149740 18381102 19850359
8258 19850359 21634976 23917115 26762802 30128313 34040345 38617311 43943517 50163382
8250 50163382 57528523 66301776 76650875 88433655 100950274 113045247 123394933
8243 123394933 130799532 134439736 133888186 129199514 120965909 110327978 98717081 87351250
8235 87351250 76970976 67872313 60117925 53636469 48207071 43663905 39931801 36953943
8227 36953943 34653107 32909370 31603910 30677640 30060270 29631933 29216074 28693287 28021822
8218 28021822 27135877 26137699 25249926 24543768 24005468 23703726 23715907 24044432 24562415 25212069
8208B5212069P66125Q24205R66650J309320J786710K226058K521765K835630L388199
8199D1836731M152233N084065O287750P928057R980904J2268123J4800703J7591436
8191A19930002K0397946K2788304K4191025K3956365K1618422J6947581J0011676
8184B59841321J549171p060471j4488410j9806402k2635292k3172795k1900834
8177A52326288j9575495j6889098j4270586j1944939r958556q163481o492930
8170F5031203n060863l925318k943846k095305j584674j396942j440400j577669
8162D5006186j600081j566278j611001j603226j429817j217154j032041q33830
8154C4112758n86196k66091J05133M08729O03044Q22754J144748J546820J978168
$$ plain form
8208 25212069 25978194 26802399 27769049 29078369 30865079 33091137 35612902 38448532 41836731
8199 41836731 45988964 51073029 57360779 65288836 75269740 87537863 102338566 119930002
8191 119930002 140327948 163116252 187307277 211263642 232882064 249829645 259841321
8184 259841321 261390492 254330021 239841611 220035209 197399917 174227122 152326288
8177 152326288 132750793 115861695 101591109 89646170 79687614 71524133 65031203
8170 65031203 59970340 56045022 53101176 51005871 49421197 48024255 46583855 45006186
8162 45006186 43406105 41839827 40228826 38625600 37195783 35978629 34946588 34112758
8154 34112758 33526562 33260471 33365604 33774333 34377377 35200131 36344879 37891699 39869867
8145C9869867K417067K977890L717250M581651N664042P050884Q666933J0560099
8137H5505683J2947225J5782382J8880033K2225201K5478646K7913324K8713175
8130B37445669K7218992K2847568J5424904N739675m739257j4431755k1850229
8123B67655567k6175873k7606907k6859698k4643280k1594092j8442090j5524426
8116A06809201j2868310j0576709q611085o894752n514853m516446l758488l128119
8108E0940439k610751k293463k163189k058584j939848j842407j772032j587411
8100C4672754j262665q86261n68282l01015R640K05185J66878L8850J66517N85381
8090C2826982J036896J427978J878800K474083L125436L780909M504183N364428
$$ plain form
8145 39869867 42286934 45264824 48982074 53563725 59227767 66278651 74945584 85505683
8137 85505683 98452908 114235290 133115323 155340524 180819170 208732494 237445669
8130 237445669 264664661 287512229 302937133 308676808 303937551 289505796 267655567
8123 267655567 241479694 213872787 187013089 162369809 140775717 122333627 106809201
8116 106809201 93940891 83364182 74753097 67858345 62343492 57827046 54068558 50940439
8108 50940439 48329688 46036225 43873036 41814452 39874604 38032197 36260165 34672754
8100 34672754 33410089 32523828 31955546 31654531 31664171 31869356 32036234 32075084 32241601 32826982
8090 32826982 33863878 35291856 37170656 39644739 42770175 46551084 51055267 56419695
8082E6419695O499966Q118339J0135645J2369041J4910891J7699722K0483301
8075A46636600K2938641K4372709K3955326K1115761J5661109P981303j004933
8068B61656516r780425j6885522k1549415k3608149k3533667k2024355j9643102
8061A24631881j6928006j4240423j1734926r648779q113662o908388n782513m696835
8053D6578349l782605l201577k758063k195167j690965j398133j265107j304108
8045B8982624j393146j315336j065176q80859p99770p00399n67794m13623l32795
8036B1513726k48356r0057O6069K07409L64158O26660J029753J459604J758841
8027B6687807J981968K268284K745377L571438M702456N935149P182921Q432456
$$ plain form
8082 56419695 62919661 71038000 81173645 93542686 108453577 126153299 146636600
8075 146636600 169575241 193947950 217903276 239019037 254680146 262661449 261656516
8068 261656516 251876091 234990569 213441154 189833005 166299338 144274983 124631881
8061 124631881 107703875 93463452 81728526 72079747 63966085 57057697 51275184 46578349
8053 46578349 42795744 39594167 36836104 34640937 32949972 31551839 30286732 28982624
8045 28982624 27589478 26274142 25208966 24328107 23528337 22827938 22260144 21846521 21513726
8036 21513726 21265370 21175313 21241382 21448791 21812949 22439609 23469362 24928966 26687807
8027 26687807 28669775 30938059 33683436 37254874 41957330 47892479 55075400 63507856
8019F3507856R710545J0870280J1608160J1690480J0834190Q744534N361155J088763
8011A33415963l360670p242631r907372j1164435j1366942j0822991r619669q107195
8003F1824058o721251n597376m581828l609557k751316k027145j444569r88667
7995C4102349o25832j55913L11322M08974R9062m97261j131641j615586j846682
7986B9048792j822783j719391j679140j666281j600338j445814j265740j097213
7978A6752092q72767o37374m53332l40264k35875j08235K8452K60832M98574N41931
7968A5434034N48247O67901Q19656J147736J714542K274153K668417L011237L410976
7959C1696899L659165L549267L051412K149113R16604m13373j709079k898166
$$ plain form
8019 63507856 73218401 84088681 95696841 107387321 118221511 126966045 132327200 133415963
8011 133415963 130055293 122812662 112905290 101740855 90373913 79550922 69931253 61824058
8003 61824058 55102807 49505431 44923603 41314046 38562730 36535585 35091016 34102349
7995 34102349 33476517 33320604 33631926 34040900 34139962 33642701 32511060 30895474 29048792
7986 29048792 27226009 25506618 23827478 22161197 20560859 19115045 17849305 16752092
7978 16752092 15879325 15241951 14788619 14448355 14212480 14104245 14132697 14393529 14892103 15434034
7968 15434034 15982281 16650182 17469838 18617574 20332116 22606269 25274686 28285923 31696899
7959 31696899 35356064 38905331 41956743 44105856 45022460 44609087 42900008 40001842
7951D0001842l739204m061377l986374l682034l273247k838094k417844k027906
7943A3975762j638854j269443q93374n17721l79762m97148n88549m48559j66335
7934G576017j4373m4491j27115k14062k95808l85398m53792m52898l56158j98212
7924E033710j59275k53845l01029j88747l4783N84o9954j36176j26491p8925j3039
7913C672030M5649l448j32020k63783k78132j21022P1078Q5473j12066k63968
7903B699791k62516j88135r1425o152J26928K85529L57253K29051k4707j68034
7893B957583j52351j23025j39271j24842n1766J06345L00269K87106J09975l831
7883C166192n8842j19516j04340k6057j7397o4975j27089k41866l04559j78351
$$ plain form
7951 40001842 36262638 32201261 28214887 24532853 21259606 18421512 16003668 13975762
7943 13975762 12336908 11067465 10174091 9656370 9276608 8779460 8190911 7742352 7576017
7934 7576017 7561644 7517153 7390038 7175976 6880168 6494770 6040978 5588080 5231922 5033710
7924 5033710 4874435 4620590 4319561 4130814 4096031 4096615 4026661 3890485 3763994 3685069 3672030
7913 3672030 3717679 3714231 3582211 3318428 3040296 2919274 2990352 3075825 2963759 2699791
7903 2699791 2437275 2249140 2157715 2151563 2278491 2564020 2921273 3150324 3125617 2957583
7893 2957583 2805232 2682207 2542936 2418094 2366328 2472673 2772942 3060048 3170023 3166192
7883 3166192 3107350 2987834 2883494 2857437 2840040 2775065 2647976 2406110 2101551 1923200
7873A923200O0465J56510O7158l745J3193J26607L30784M99686N15428L94754
7863D084040K55042J02393j06736k02276q3015L1473l4751j71442k66215k58743
7853C349770r0543J14552K27741K39269K08650J54598J00415Q5568K7994n7926
7843D360088j26426j49542j260K39691K96290J39734J24389L70128O56563P66672
7833F676327O68387M80653L68917M14905N32232O71053R01786J258811J645252
7824A3618323J991381K275079K536976K822140L141047L511535L973955M451550
7816C8321986M830281N058288M939588M217467K673284M05322j854975l460675
7808E5130566m469092m991131m931462m536834m140496l756004l275672k773179
$$ plain form
7873 1923200 1983665 2140175 2207333 2203588 2216781 2343388 2674172 3173858 3689286 4084040
7863 4084040 4339082 4441475 4334739 4132463 4049448 4080921 4046170 3874728 3608513 3349770
7853 3349770 3259227 3373779 3601520 3840789 4049439 4204037 4304452 4390020 4418014 4360088
7843 4360088 4233662 4084120 4082860 4322551 4618841 4758575 4882964 5253092 5909655 6676327
7833 6676327 7344714 7825367 8194284 8609189 9141421 9812474 10714260 11973071 13618323
7824 13618323 15609704 17884783 20421759 23243899 26384946 29896481 33870436 38321986
7816 38321986 43152267 48210555 53150143 57367610 60040894 60446216 58591241 55130566
7808 55130566 50661474 45670343 40738881 36202047 32061551 28305547 25029875 22256696
7800B2256696k351792k044936j755108j418307j216782j126891j021177r03265
7792A0418438q58554r11006q99054p70208o70914o28413m98364k49312p2466q5531
7782D774616j88743k90908l05294k11065j61297j86772k35523k18247k8721J92341
7772C140387K29724J61057J46549N3489j00189j46025j33017j12970n3841m534
7762C180630N5098N1949p5942j24899l0853O6688J13126J47765J62747M8329j24314
7751C470324j58301q1693K0960P7798J901j33996j31023j0543Q1942J35193J70301
7740C442863J36302o0750l52668m91032l35795l2619J58653J37223o527j87830
7730B407820l31279l79180l13164j13523J19541K02661J86025J58421J09761P587
$$ plain form
7800 22256696 19904904 17859968 16104860 14686553 13469771 12342880 11321703 10418438
7792 10418438 9559884 8648878 7749824 6979616 6308702 5680289 5181925 4932613 4860147 4774616
7782 4774616 4585873 4294965 3989671 3778606 3617309 3430537 3195014 2976767 2948046 3140387
7772 3140387 3370111 3531168 3677717 3731206 3631017 3484992 3351975 3239005 3185164 3180630
7762 3180630 3235728 3287677 3211735 3086836 3055983 3122671 3235797 3383562 3546309 3594638 3470324
7751 3470324 3312023 3230330 3251290 3329088 3330989 3196993 3065970 3055427 3137369 3272562 3442863
7740 3442863 3579165 3518415 3165747 2674715 2338920 2306301 2464954 2602177 2595650 2407820
7730 2407820 2076541 1697361 1384197 1270674 1390215 1592876 1778901 1937322 2047083 2054670
7720B054670q6287j35963k39286l51475k64756j4948J00771M3602P75J7772M1801
7709A166676J19423K60442L04783J54278l9044j23085r2577n9343q1775q1571
7699A528207k8733k8432j61410l64595m75748m55662l36178k07323j37565n0160
7689g17599J40791L27414L23858K16600J13513O1683M8139Q9520J82973K21598
7679A008490J25214O544K2140O2164p5977k51284j95011j8943R6839K06555L57567
7668A344298M38654L38799J45757L8942l9353j21492j09415p2439n3464q5340
7658A824947j71887j87459l1292J95271L12106K56489J88914J80019J49852P8774
7648B795734L8004J02935J52123O9656k4649m7322j27040k69120l34836k50576
$$ plain form
7720 2054670 1968383 1832420 1593134 1241659 976903 961955 1062726 1106328 1107103 1124875 1166676
7709 1166676 1286099 1546541 1851324 2005602 1966558 1843473 1750896 1691553 1609778 1528207
7699 1528207 1499474 1471042 1309632 945037 469289 13627 -322551 -529874 -667439 -717599
7689 -717599 -576808 -249394 74464 291064 404577 466260 514399 603919 786892 1008490
7679 1008490 1133704 1140248 1162388 1224552 1148575 897291 702280 683337 780176 986731 1344298
7668 1344298 1782952 2121751 2267508 2306450 2267097 2145605 2036190 1963751 1910287 1824947
7658 1824947 1653060 1465601 1434309 1629580 1941686 2198175 2387089 2567108 2716960 2795734
7648 2795734 2833738 2936673 3088796 3158452 3133803 3086481 2959441 2690321 2355485 2104909
7638B104909j22349r888Q4001O8698j27503l08431k82944j98187j30622k6123
7628A051561J08709J59296J10630O7550j5379j60392k42317k48554k25046j00936
7618E05122Q1461K08466K90050L48860L73672L86534L64419K76291K23943J97222
7608C256040J05684k181q3463k01937l13708l50454l17106k11006l6074J53184
7598A998979K83989K97580J94181J04104Q209j07375k06622k48143k09508j26922
7588A988472j658Q3068O6374N567L6408K02023L44105K62070j3086k01289j80886
7577B591168j73612j56876l8958O9288J46591J47840P7137M3383Q5172J29694
7567B920827J67767K49517K93379K28009K37333L47261L19419J39711P2450J74094
$$ plain form
7638 2104909 1982560 1972672 2056673 2125371 1997868 1689437 1406493 1208306 1077684 1051561
7628 1051561 1160270 1319566 1430196 1497746 1482367 1321975 1079658 831104 606058 505122
7618 505122 586583 795049 1085099 1433959 1807631 2194165 2558584 2834875 3058818 3256040
7608 3256040 3361724 3359543 3276080 3074143 2760435 2409981 2092875 1881869 1845795 1998979
7598 1998979 2282968 2580548 2774729 2878833 2887042 2779667 2573045 2324902 2115394 1988472
7588 1988472 1986814 2069882 2136256 2141823 2178231 2380254 2724359 2986429 2973343 2772054 2591168
7577 2591168 2417556 2260680 2221722 2291010 2437601 2585441 2662578 2705961 2791133 2920827
7567 2920827 3088594 3338111 3631490 3859499 4096832 4444093 4763512 4903223 4975673 5149767
7557E149767K97337M01522M26420M13189M42995N03865N15883M70500N02179O04787
7547I728444P00172Q09731R87890J213505J471654J724998J936561K214013K604080
7538B3391048L129938L816468M470789M957398N136871M845464M010802K695521
7530E6454299J033097q36752k548300l765286m487029m753351m580762m148453
7522C2367463l689790l294079k901547k442911k018221j740525j513895j327102
7514A3439393j225158j082020q25135o33115o44757p72391p73661o24328n00757
7505F358071m81248n29229n09034l71818j97033p4237n9931o1873M4308K15140
7495D333116L48887L58203K37493K9343k01168k95553k83214k74983l05970l66551
$$ plain form
7557 5149767 5447104 5848626 6275046 6688235 7131230 7635095 8150978 8621478 9123657 9728444
7547 9728444 10428616 11238347 12226237 13439742 14911396 16636394 18572955 20786968 23391048
7538 23391048 26520986 30337454 34808243 39765641 44902512 49747976 53758778 56454299
7530 56454299 57487396 56650644 54102344 50337058 45850029 41096678 36515916 32367463
7522 32367463 28677673 25383594 22482047 20039136 18020915 16280390 14766495 13439393
7514 13439393 12214235 11132215 10307080 9673965 9029208 8256817 7483156 6858828 6358071
7505 6358071 5876823 5347594 4838560 4466742 4269709 4195472 4135541 4073668 4117976 4333116
7495 4333116 4682003 5040206 5277699 5307042 5105874 4810321 4527107 4252124 3946154 3579603
7485C579603l32547j57955L3784J61286J75065R1530K0475m5003j83571k82813
7475C059854k17181r0714p2252j27590p2517Q0251J71673J00566m3558j05431
7465B683101j22738j89186k14120j68277j05509K1132J53583J66644J04446J08904
7455B437980J51775N5680j16459k22243k25963j85636j09160K1623Q2255P2620
7445A962472L1572M5711J54223K25908K28859K38293J95891l2947l38534m87489
7435B223959l87382r8982K14229K95504J42214p446P034J7127j41020l37003m17281
7424A510953m20067l40122j37916J20755K80487K20592N1638p851P5376J71165
7414A525010J91559J36619M4806N93O2699J33814R9471M5946K0108p5664j87548
$$ plain form
7485 3579603 3247056 3089101 3122885 3284171 3459236 3550766 3571241 3526238 3342667 3059854
7475 3059854 2842673 2751959 2679707 2552117 2479600 2559851 2731524 2832090 2788532 2683101
7465 2683101 2560363 2371177 2157057 1988780 1883271 1904403 2057986 2224630 2329076 2437980
7455 2437980 2589755 2645435 2528976 2306733 2080770 1895134 1785974 1807597 1889852 1962472
7445 1962472 1994044 2039755 2193978 2419886 2648745 2887038 3082929 3049982 2711448 2223959
7435 2223959 1836577 1737595 1951824 2247328 2389542 2382096 2389130 2406257 2265237 1928234 1510953
7424 1510953 1090886 750764 612848 733603 1014090 1234682 1286320 1278469 1353845 1525010
7414 1525010 1716569 1853188 1897994 1898587 1961286 2095100 2194571 2240517 2260625 2184961 1997413
7403A997413j69742q8132r5528k23715l52803k86861j27807k9651k015P5766K92565
7392I89490M04307K54054K4330j00843m0582J72111K76715J71431R8753J05612
7382B355378L8327q5322j34652j12437q0956n5151p5475j46522j97740j76082
7372A329368k5729J31927Q4611j05255j54345m228J78057L00263L51960K39867
7362B326496l0684j98368j85533p6083Q3991L29954N26463M74629K31010o2466
7352C419409k99070m05547l90028l41587l61919m17731l90887k87161j79732j35948
7342B09799p3635J12490K94925K28110p6927k85748k41484q8159J0947O0786J12509
7331B63613K01739L25436L95047L72408K54983Q4028m3048j16243j79788j99351
$$ plain form
7403 1997413 1827671 1739539 1644011 1420296 1067493 780632 652825 623174 621159 696925 989490
7392 989490 1393797 1647851 1672181 1571338 1530756 1702867 1979582 2151013 2249766 2355378
7382 2355378 2393705 2308383 2173731 2061294 1980338 1925187 1849712 1703190 1505450 1329368
7372 1329368 1303639 1435566 1520177 1414922 1260577 1256349 1434406 1734669 2086629 2326496
7362 2326496 2295812 2097444 1911911 1835828 1919819 2249773 2776236 3250865 3481875 3419409
7352 3419409 3120339 2714792 2324764 1983177 1621258 1203527 812640 525479 345747 209799
7342 209799 136164 248654 543579 771689 694762 409014 167530 79371 90318 151104 263613
7331 263613 465352 790788 1185835 1558243 1813226 1897254 1854206 1737963 1558175 1358824
7321A358824j36283o5705q2038r9487j44523k72872l47928k91865j33365L1933
7311a83309J85761K96206L12324K18578J20971J48881J71777J24653J48423K52768
7301A797033K56048J66511J05271M5335l1095o5100l5102K2410q435j01545j53601
7290A997730j57516o4977J09689K46807K47606R3135j7316k3306k1366n9380j83718
7279B167388l02505k26696j08842j03948j22272k02906l63024n11074n28665k81461
7269e84005J30318M20700M86553M25139L23057J90494O3529m1507j02924p5837
7259A235517k1357p5020k52315m10546l52522j11489L9529N2184J4074n7956j49056
7248h8957j16454L6502Q2923K5363K9648J08558J38936Q9476L0311K6824O6341
$$ plain form
7321 1358824 1222541 1156836 1074798 975311 830788 557916 209988 -81877 -215242 -183309
7311 -183309 2452 298658 610982 829560 950531 1099412 1271189 1395842 1544265 1797033
7301 1797033 2053081 2219592 2324863 2370198 2339103 2274003 2238901 2261311 2252876 2151331 1997730
7290 1997730 1840214 1775237 1884926 2131733 2379339 2472474 2455158 2431852 2410486 2351106 2167388
7279 2167388 1864883 1638187 1529345 1425397 1303125 1100219 737195 226121 -302544 -584005
7269 -584005 -453687 -32987 453566 878705 1201762 1392256 1455785 1414278 1311354 1235517
7259 1235517 1214160 1139140 886825 476279 123757 12268 51797 103981 118055 60099 -88957
7248 -88957 -205411 -168909 -85986 -60623 -30975 77583 216519 305995 336306 363130 429471
7237D29471R0581R4634J28984J85264J37648m3103j85388k07640j82004j01575
7227C46872L8556J63208K01494J01628k2048M797J30069J74303Q9914j22060k60775
7216H45958j03401M3575k2461r4455m6343N8872J38850J11904O596r9644j84211
7205F55240j85254j86291k52179k24815o4204J29875K74165L25311L13982K68922
7195A054752K19456J08024P124M5315J42160J83574J31368J1039n3222p8419j28191
7184A642980j05203J3784J39383K08461K06325P9858j48805l43770l94223l00114
7174I98676j73567n9716m7231l9643K2428P0844J62965K68392K75266J77132O4479
7163A720025Q1528P7706L0530J33120K55767L12059K83554J48629q1070l44956
$$ plain form
7237 429471 520052 614686 743670 928934 1066582 1023479 838091 630451 448447 346872
7227 346872 385428 548636 750130 851758 829710 834507 964576 1138879 1228793 1106733 845958
7216 845958 742557 786132 763671 669216 622873 681745 820595 932499 939095 839451 655240
7205 655240 469986 283695 31516 -193299 -257503 -127628 146537 471848 785830 1054752
7195 1054752 1274208 1382232 1389356 1434671 1576831 1760405 1891773 1902812 1849590 1771171 1642980
7184 1642980 1537777 1551561 1690944 1899405 2105730 2185588 2036783 1693013 1298790 998676
7174 998676 825109 765393 718162 678519 700947 771791 934756 1203148 1478414 1655546 1720025
7163 1720025 1801553 1879259 1909789 2042909 2298676 2610735 2894289 3042918 2961848 2616892
7153B616892m17809k76424j36474r2742q8643n1520J03638L23035M22528L60711
7143B763192K70851R0578k12073l93787m20201l92034l36219k24646q5025l2558
7133A028078q7318j76161k06150j32316n669P1464J24612K56193L43140K92732
7123A508605J79969Q2926P0385P5911O8518O6144L6601p8756k35248k47285j33497
7112A394273o3392r1345j22694o6912L2621J38210K21252K43921J97389J34669
7102B017992J05389L1724r3236j71329j59677j41452k30874l70868l89941l08113
7092B89615k18629p1499J08907K04638K36570K34929J99669J48074J44874J49245
7082A426393O8886j00922k39458k22048q9724O6643J79138K01505J32327N2476
$$ plain form
7153 2616892 2199083 1922659 1786185 1693443 1604800 1553280 1656918 1979953 2402481 2763192
7143 2763192 3034043 3124621 2912548 2518761 2098560 1706526 1370307 1145661 1060636 1028078
7133 1028078 940760 764599 558449 426133 420464 491928 616540 872733 1215873 1508605
7123 1508605 1688574 1771500 1841885 1917796 1986314 2052458 2089059 2010303 1775055 1527770 1394273
7112 1394273 1330881 1239536 1116842 1049930 1082551 1220761 1442013 1685934 1883323 2017992
7102 2017992 2123381 2155105 2061869 1890540 1730863 1589411 1358537 987669 597728 289615
7092 289615 70986 -513 108394 313032 549602 784531 984200 1132274 1277148 1426393
7082 1426393 1495279 1394357 1154899 932851 843127 909770 1088908 1290413 1422740 1475216
7072A475216K9110J0252j5033o3732j16258n6662R1049K04050K43500J72946k7326
7061A947112k25417k96383j78334L1380Q3086l7229j25964j14461m4202Q2430
7051A122018J61990J19353J3336n9276m7053Q884P1881Q1501R127j14569k72507
7040A094685l21560j77243Q8777K96104L21659J92031M7110r7497k04277j44321
7030A095468J9375J50575J07910q7347k21506k33971j71039l3431N0959K3162
7020G00155p559k3032k3840Q5128K60241L04317J65662l4016j33449j30230j81627
7009I81750j87320l2523J35332K15771K09142K34540K51518K00181J11455k6242
6999B093604j63737k68950l38980l39354k87735k30288j15695N0660Q8776P3425
$$ plain form
7072 1475216 1504326 1514578 1499545 1435813 1319555 1262893 1353942 1557992 1801492 1974438 1947112
7061 1947112 1721695 1425312 1246978 1278358 1361444 1324215 1198251 1083790 1039588 1122018
7051 1122018 1284008 1403361 1416697 1357421 1310368 1319252 1391133 1472634 1481761 1367192 1094685
7040 1094685 773125 595882 684659 980763 1302422 1494453 1541563 1444066 1239789 1095468
7030 1095468 1114843 1265418 1373328 1285981 1064475 830504 659465 626034 676993 700155
7020 700155 692596 669564 645724 730852 991093 1295410 1461072 1427056 1293607 1163377 981750
7009 981750 794430 761907 897239 1113010 1322152 1556692 1808210 2008391 2119846 2093604
6999 2093604 1929867 1660917 1321937 982583 694848 464560 348865 399525 488301 561726
6989E61726J14618J57486K21701K46901J40524K3702o209L9126R9731J12003Q7628
6978A798937N2154m633j14623k64157l37752k88031k82704k94201j94540n0776
6968A9674L7886N6556K8316J7427O6632J21782J63935J95619J83624J54807J16496
6957A162754Q025j33536r5079Q6259J05969m048j25883k79399l32358k22402p9946
6946I0356Q2455K52141L23064L09384K31051J65415J77588K51383K63317J40497
6936B286651k0664j97298k07835p2061l6535k3546J3337j3687L4836K44513M58538
6925B466249N49401M65519K57540N9191j08415k77887l75026n03092o10838n07768
6915A414874k73251j60728k09090k45960j51450N3273K82483L08991Q7566j42264
$$ plain form
6989 561726 676344 833830 1055531 1302432 1442956 1466658 1460449 1499575 1599306 1711309 1798937
6978 1798937 1851091 1846458 1731835 1467678 1129926 841895 559191 264990 70450 19674
6968 19674 57560 114116 142432 159859 226491 348273 512208 707827 891451 1046258 1162754
6957 1162754 1170779 1037243 942164 1028423 1134392 1130344 1004461 725062 392704 170302 90356
6946 90356 172811 424952 748016 1057400 1288451 1453866 1631454 1882837 2146154 2286651
6936 2286651 2265987 2068689 1860854 1788793 1752258 1728712 1742049 1728362 1763198 2007711 2466249
6925 2466249 3015650 3481169 3738709 3797900 3689485 3411598 3036572 2533480 1922642 1414874
6915 1414874 1141623 980895 771805 525845 374395 427668 710151 1019142 1106708 964444
6905I64444j94216j21932p4361p9431n3757O0921J67847K31490K43137J96492
6895A340634J49350M8051p3885r6621m6065K8255J68661J78675j196j62078l16483
6884A217298m52265l64514j19890K4418N9348j6276j56204k07246j59307n3019
6874b27657J51134K95188K09130Q9942J03540J23869R8042M9760O0546J12348
6864A065842O0419J0183J16769K44821J29063j56762l60128l26255j21746N1387
6854G13593Q6823M8326j3126m2117k9384m1118j38704k36541k06951n4192Q9755
6843A76364R3560l3967j61828j43522k2946P8905J43703J99011K41765J92030
6833G63075N1013q2464j24402r5596J4068J65214K59258L12473K48267O8689q6630
$$ plain form
6905 964444 770228 648296 573935 494504 440747 501668 669515 901005 1144142 1340634
6895 1340634 1489984 1538035 1464150 1367529 1321464 1349719 1518380 1697055 1695859 1533781 1217298
6884 1217298 765033 400519 280629 305047 364395 348119 191915 -15331 -174638 -227657
6874 -227657 -76523 218665 427795 517737 621277 745146 843188 892948 953494 1065842
6864 1065842 1126261 1136444 1253213 1498034 1627097 1470335 1110207 783952 662206 713593
6854 713593 800416 848742 835616 793499 764115 722997 584293 347752 140801 86609 176364
6843 176364 269924 235957 74129 -69393 -92339 -13434 130269 329280 571045 763075
6833 763075 814088 731624 607222 511626 525694 690908 950166 1262639 1510906 1579595 1492965
6822A492965j64838j42474R620J59996J42868O7878P7243P9143K7583o3551j61523
6811A524910j40739m1001o115O5359J47809P6498l7272o4734r5090j57602k34799
6800A037224k87607l15084k78577j23974L0671Q0617J04094P8593j1639J8315
6790C32633J81993K78335K40909J19797P4669J14436J55792J80497P9941j40309
6780A618693l37289l54580k01801j3018J48081K42824K13574J5356j50342p0138
6770A111360O2699R9389N7030J3239J1643K8070R685j04278j81094j22405p3329
6759I12009n9580K966N6786Q0295J17646J37042P2340q359r679J1491R247L102
6747A325306J5535j0503r2900o5455N4667J88567K13433Q5949p0544j48961j11381
$$ plain form
6822 1492965 1328127 1185653 1195273 1355269 1498137 1566015 1643258 1722401 1749984 1686433 1524910
6811 1524910 1384171 1343170 1337055 1402414 1550223 1626721 1589449 1524715 1429625 1272023 1037224
6800 1037224 749617 434533 155956 31982 62653 143270 247364 325957 314318 332633
6790 332633 514626 792961 1033870 1153667 1228336 1342772 1498564 1679061 1759002 1618693
6780 1618693 1281404 926824 725023 712005 860086 1102910 1316484 1331840 1181498 1111360
6770 1111360 1174059 1273448 1330478 1343717 1355360 1383430 1393115 1288837 1107743 985338 912009
6759 912009 852429 855395 912181 992476 1110122 1247164 1319504 1311145 1301466 1312957 1322204 1325306
6747 1325306 1340841 1330338 1237438 1171983 1226650 1415217 1628650 1714599 1644055 1495094 1383713
6736A383713o6135p2046n7096L9080J00241J35564J83795J98326J67244R7526
6726B110212k1888j35841k03892k97762l21597k32073j04392M197P8662J60796
6716A036422K07221J72466R0506L7993R377p0531j81319k22390j56244n5149K2259
6705H90611Q4632J27904J22897Q9153O4047N4999N9346P1513Q5309R8319M0233
6694A788963J3857J01838J51038J14334K8628q9212j19532q9633p5025j2242R2326
6683A905340J93573K27014Q9465j86579l95284m06117j95580L3899N5568q1863
6673A239436j70238q7100J01876K94066L92974L16477J77619J12150M6017L903
6663B427180P3778N4349j24427j49796K5539J67578J11341l8159r2145l2121K3341
$$ plain form
6736 1383713 1317578 1245532 1188436 1227516 1327757 1463321 1647116 1845442 2012686 2110212
6726 2110212 2088324 1952483 1748591 1450829 1129232 897159 792767 796964 875626 1036422
6716 1036422 1243643 1416109 1506615 1544608 1553985 1483454 1302135 1079745 923501 868352 890611
6705 890611 975243 1103147 1226044 1315197 1379244 1434243 1493589 1565102 1650411 1748730 1788963
6694 1788963 1802820 1904658 2055696 2170030 2198658 2109446 1989914 1900281 1825256 1813014 1905340
6683 1905340 2098913 2325927 2415392 2228813 1833529 1427412 1231832 1265731 1321299 1239436
6673 1239436 1069198 982098 1083974 1378040 1771014 2087491 2265110 2377260 2423277 2427180
6663 2427180 2500958 2555307 2430880 2281084 2306623 2474201 2585542 2547383 2455238 2423117 2446458
6652B446458k1453j18645k11103k54622k37657j36803O5561K28160K54836K73338
6642B288070K58477J42783M703j01621j56851p5290J62422L47677L15121K04930
6632C390421J70554J41832J26128J29386J34471K25099L44506L50195L05617L75849
6622E694058N24031O44281P38546Q09838Q24929Q73708J062210J304626J537570
6613A4013797J864642K276887K794349L533402M497547N694514O993189Q091427
6605D9759754Q689286Q438871O780206L292991j356914n464879p823859q380004
6597E3935452p863162o968497o007149n111752m214125l321634k574919k054599
6589A5819615j719000j408422j115416r37321q51633p98111q15989q93286q63262
$$ plain form
6652 2446458 2425005 2306360 2095257 1840635 1602978 1466175 1531736 1759896 2014732 2288070
6642 2288070 2546547 2689330 2694033 2592412 2435561 2360271 2522693 2870370 3185491 3390421
6632 3390421 3560975 3702807 3828935 3958321 4092792 4317891 4662397 5012592 5318209 5694058
6622 5694058 6218089 6862370 7600916 8410754 9235683 10109391 11171601 12476227 14013797
6613 14013797 15878439 18155326 20949675 24483077 28980624 34675138 41668327 49759754
6605 49759754 58449040 66887911 73668117 76961108 75604194 70139315 62315456 53935452
6597 53935452 46072290 39103793 33096644 27984892 23770767 20449133 17874214 15819615
6589 15819615 14100615 12692193 11576777 10639456 9787823 8989712 8173723 7280437 6417175
6580F417175o33163l30514j33577j38004k64232l08656k00673q2363O140j5607
6570D316526j88123l03136l20174l75998l64450k07302p3110N3334K26780L16231
6560C080578K61953J79567J44579J39966K8047k68519n18047m49613k48746j35708
6550B214057j24592j88714k38258k48239j76748o2771o1244j84949k88116k63680
6540C76746r9343O5193J38649K02074K87476L26309K43773J50867J00530K0081
6530A812355j10610k62262l04328k22331o7057M9620l5689k23774k91192k05039
6520A39693r1661p5603r4478o4669l0256M4389J98794K44137J73551J25522Q3485
6509F52904L8086O1048Q8328M5282J236j17442k91117l68480k56959n2765Q9074
$$ plain form
6580 6417175 5784012 5453498 5319921 5181917 4917685 4609029 4408356 4325993 4332133 4316526
6570 4316526 4128403 3825267 3505093 3129095 2764645 2557343 2484233 2537567 2764347 3080578
6560 3080578 3342531 3522098 3666677 3806643 3834690 3566171 3048124 2598511 2349765 2214057
6550 2214057 2089465 1900751 1662493 1414254 1237506 1174735 1113491 928542 640426 376746
6540 376746 277403 342596 481245 683319 970795 1297104 1540877 1691744 1792274 1812355
6530 1812355 1701745 1439483 1135155 912824 845767 895387 859698 635924 344732 139693
6520 139693 48032 -27571 -122049 -186718 -216974 -172585 26209 270346 443897 569419 652904
6509 652904 690990 752038 840366 885648 886884 769442 478325 109845 -147114 -199879 -110805
6498a10805P5786k248O7869K14947K82227K64155K16990J83138J50752J15572
6488A458383L6367q0587j41307q6465K44O4232J42898K47434K59467N4411j76301
6477A778776k65492k50684j41810p986O9938J76466L33454L71640K56195N3650
6467B374147j87737l69214l74050k48182j10833j1754L8819Q8963J34968J55011
6457A490138J47109L7161r8429o2557J05151K26094J93088R495j89594l03035
6447A554621k85335p0128J59057J59029K9767m4956K9579J30333J3084k69140
6437A405911l81172k67455r5180J0640P770P3621K17502K03362R3203L4572K460
6426A305234k9781j4741K7075j2856j49787k19760j46480K5115J69065J41736
$$ plain form
6498 -110805 -35019 -37267 30602 245549 527776 791931 1008921 1192059 1342811 1458383
6488 1458383 1494750 1414163 1272856 1186391 1186635 1250867 1393765 1641199 1900666 1955077 1778776
6477 1778776 1513284 1262600 1120790 1112804 1182742 1359208 1692662 2064302 2320497 2374147
6467 2374147 2186410 1817196 1443146 1194964 1084131 1072377 1111196 1200159 1335127 1490138
6457 1490138 1637247 1674408 1575979 1513422 1618573 1844667 2037755 2047250 1857656 1554621
6447 1554621 1269286 1199158 1358215 1517244 1547011 1502055 1531634 1661967 1675051 1405911
6437 1405911 1024739 757284 662104 672744 680514 754135 971637 1174999 1268202 1302774 1305234
6426 1305234 1275453 1260712 1287787 1274931 1125144 905384 758904 784019 953084 1094820
6416A094820R6157J10829Q3320j5101p5031j843J45675K08770J07260j6804L907
6405A741959N4186O0556R4468J07739R2550L7303l5840n2363R046P5574J03838
6394B289016N6442p7644j40857m8839O5839R5504p2043l65047n13075m47157l37066
6383E05073k58719r2514Q8415J75050K03226J64052Q0003J9089l1933o6203q8754
6372F96785q1854L0829K09003K86746K24982J84666J51769M9412n7381j21946
6362A573011j58910j48533j04189n8996K0122J59264K72332J84496l7937j36644
6352A564016j09158r0601r0067p7075k3366Q2357R7193n1254j49636j06996k8769
6341A016644n3414j25942j32342p6800R8733K21955J62585Q3107M6868m908j3958
$$ plain form
6416 1094820 1190977 1301806 1385126 1370025 1294994 1293151 1438826 1647596 1754856 1738052 1741959
6405 1741959 1796145 1856701 1951169 2058908 2151458 2188761 2152921 2100558 2109604 2185178 2289016
6394 2289016 2345458 2267814 2126957 2078118 2143957 2239461 2167418 1802371 1289296 842139 505073
6383 505073 246354 153840 242255 417305 620531 784583 864586 883675 851742 785539 696785
6372 696785 614931 645760 854763 1141509 1366491 1551157 1702926 1752338 1694957 1573011
6362 1573011 1414101 1265568 1161379 1102383 1122505 1281769 1554101 1738597 1700660 1564016
6352 1564016 1454858 1364257 1274190 1197115 1173749 1256106 1353299 1302045 1152409 1045413 1016644
6341 1016644 963230 837288 704946 628146 726879 948834 1111419 1194526 1241394 1236486 1222528
6330A222528J236N7108R2133J15255K09954J75064l5654l39046o38574o58994
6320B01010l56489j06164n8625j00179j08767m6862Q216N0766P6920M6958K8980
6309c64236P5367J31843R3933n5252j63437q4654J16846J53878L1370j6448m9932
6298a30722n8026O8720K90845M36049M25867L42391J75566q0086k98193l21499
6288H50912k16636j39008j01403n8797n4359j09332j06208k4509L2978P8760J25563
6277B77961L6577j11751j19087K8353J36035Q8558J9844J061n7344j07213j08366
6266H4628j37100j96814j90319j00914N0660K13170K70723K40462K01180J30352
6256E66028L7206k6204p830R4706J82626K32493K28615J08465o1698k07779k46367
$$ plain form
6330 1222528 1223764 1280872 1373005 1488260 1698214 1873278 1837624 1498578 860004 201010
6320 201010 -155479 -261643 -320268 -420447 -529214 -576076 -567860 -517094 -440174 -393216 -364236
6309 -364236 -288869 -157026 -63093 -118345 -281782 -366436 -249590 -95712 -64342 -80790 -130722
6298 -130722 -188748 -120028 170817 606866 1032733 1375124 1550690 1470604 1172411 850912
6288 850912 634276 495268 393865 335068 280709 171377 65169 40660 73638 152398 277961
6277 277961 314538 202787 83700 112053 248088 336646 356490 357551 300207 192994 84628
6266 84628 -52472 -249286 -439605 -540519 -489859 -276689 -5966 234496 435676 566028
6256 566028 603234 577030 569200 663906 846532 1079025 1307640 1416105 1354407 1146628 900261
6245I00261j73564j13955j13947j01091p1838n3021j6960N2811R8167J30258J30578
6234F67699J7247r0692k4050J93739L64166L48519K26172J25353Q6648N911o6974
6223A853738p3021j06799j61668j57725n1780M4317K2886o4445o2582L3015J09731
6212A385667J14887J15020R5732n8859k01177j62770o3945m1451l8952L2100J63188
6201A339440J92297R0977m6273j16754l8828J14442J22171p7204k49449k21369
6191A109450n9990M9974R6479Q1263o2265k10708k43617j85391j33439j57261
6181B84495j73738j41879n3367P8775K19169L71337N01867M69353K28393o0939
6171A723466k32946k51557j39518M2762J46966Q1732o5779j79228j57308k9036
$$ plain form
6245 900261 726697 612742 498795 397704 325866 272845 255885 308696 406863 537121 667699
6234 667699 684946 594254 570204 763943 1128109 1476628 1702800 1828153 1914801 1920712 1853738
6223 1853738 1780717 1673918 1512250 1354525 1302745 1347062 1369948 1305503 1242921 1275936 1385667
6212 1385667 1500554 1615574 1711306 1652447 1451270 1288500 1224555 1183104 1144152 1176252 1339440
6201 1339440 1531737 1622714 1576441 1459687 1420859 1535301 1657472 1580268 1330819 1109450
6191 1109450 1049460 1099434 1195913 1277176 1214911 1004203 760586 575195 441756 284495
6181 284495 110757 -31122 -84489 -5714 213455 584792 1086659 1556012 1784405 1723466
6171 1723466 1490520 1238963 1099445 1142207 1289173 1370905 1305126 1125898 968590 939554
6161I39554P3010K29883M24244M22344K72264N1786j22939j73933j70769k36498
6151A708946l89825l91448k24978l1517J83560L39759L68871K85616J45369N1507
6141B045860K428l0011n3191j9680J35677K42018J07269q5567j32273p9891r4530
6130B038109j91884j63220m9538o6289j30451j66735j57393o6895M4595J32288
6120A222587K45505L15690K52457J79958J68974J53242k5773l19900m80446m11382
6110A300912k66718k04431j23740K4394J97362L06037K96723J63154m0678k33819
6100A419196l87594m43471m34521l77739k01874M6480J93306J53854P4820O2986
6090A05443P9486P5549N5568Q2342J29511J16494J14837K04694K83996K52964
$$ plain form
6161 939554 1012564 1242447 1666691 2089035 2361299 2413085 2290146 2116213 1945444 1708946
6151 1708946 1319121 927673 702695 671178 854738 1194497 1563368 1848984 1994353 2045860
6141 2045860 2048288 2018277 1965086 1945406 2081083 2323101 2430370 2344803 2212530 2132639 2038109
6130 2038109 1846225 1683005 1633467 1567178 1436727 1269992 1112599 1045704 1090299 1222587
6120 1222587 1468092 1783782 2036239 2216197 2385171 2538413 2512640 2192740 1712294 1300912
6110 1300912 1034194 829763 706023 730417 927779 1233816 1530539 1693693 1653015 1419196
6100 1419196 1031602 588131 153610 -224129 -426003 -379523 -186217 -32363 42457 105443
6090 105443 184929 260478 316046 398388 527899 644393 759230 963924 1247920 1500884
6080A500884R0664n6461p9598q9028j84994k70748k39498j30950o229J08218J32579
6069G74839M7693o0427o4642m86J5048J7471K5931J3454o2703j74569j72291o7200
6057B92118J1024O7076R5892J63208K90285L14048J94739K2783j66171l25347
6047I59655l22880k02516j38551j20146n2396J05716K71277K87166J44457k9629
6037I02153j38697r4806L9900J52218K45577K44567J84202R5269j2362j00106
6027A517915j51748j24167r3728l7844J08508J71939O4385n6688p1592n8896r9325
6016A168759j52349j83083j34207j5160N7534J19403J43052O4189m0435m5664
6006I82039R5321K55986K59457R1892m4689n6042n6883o7804j1329L2372Q856
$$ plain form
6080 1500884 1591548 1535087 1455489 1366461 1181467 910719 671221 540271 534042 642260 774839
6069 774839 822532 762105 697463 696977 712025 729496 755427 768881 706178 531609 359318 292118
6057 292118 303142 370218 466110 629318 919603 1233651 1428390 1451173 1285002 959655
6047 959655 636775 434259 295708 175562 123166 228882 500159 787325 931782 902153
6037 902153 763456 668650 708550 860768 1106345 1350912 1535114 1630383 1618021 1517915
6027 1517915 1366167 1242000 1148272 1110428 1218936 1390875 1455260 1398572 1326980 1268084 1168759
6016 1168759 1016410 833327 699120 683960 741494 860897 1003949 1068138 1027703 982039
6006 982039 1077360 1333346 1592803 1684695 1640006 1583964 1527081 1459277 1447948 1480320 1489176
5995A489176K3823P4153J46510P9529k31543m64360l29976P3063M36401N19985
5985A816761K69758j19367l22306k32379q8797n7668n7350k4416J2453j6964j17452
5974A062273k65195m61718n12062k42547J02071K19415J74928J29773R2624P7225
5964C76787M1109l2314k8463N3527J55222K58304L59216M49457L96443J26381
5954B155669j61497l09495l32679k79966j14648J45314L01913K57144J39669N1233
5944A852657Q8417K06859J39032q3608j76673o9171J03394J34623L7768k6644
5934B206654q1352j54853k65453l45833l19283k76142k62090j92061n2961O3471
5924C20097J13078J07421P6299L2787l8324j17223j80632j40097N3963K09516
$$ plain form
5995 1489176 1512999 1587152 1733662 1813191 1581648 1117288 787312 860375 1296776 1816761
5985 1816761 2086519 1967152 1644846 1412467 1323670 1266002 1208652 1184236 1196689 1179725 1062273
5974 1062273 797078 335360 -176702 -419249 -317178 -97763 77165 206938 299562 376787
5964 376787 417896 385582 357119 410646 565868 824172 1183388 1632845 2029288 2155669
5954 2155669 1994172 1684677 1351998 1072032 957384 1102698 1404611 1661755 1801424 1852657
5944 1852657 1941074 2147933 2286965 2203357 2026684 1957513 2060907 2195530 2233298 2206654
5934 2206654 2125302 1970449 1704996 1359163 1039880 763738 501648 309587 256626 320097
5924 320097 433175 540596 616895 649682 611358 494135 313503 173406 227369 436885
5914D36885J72046K8196j08309r3845R4123K55416L48464L39228J58739p3303
5904A557640j95615j45053q7921q9729J2247J89344L16271L19110K51951J55448
5894B283693J0286o7759n1024J7836P0429k4663j63946j98364j19094M4846K23051
5883B025291K10629o21j88487l10381l85545l33551k14490r6814P3857J94041
5873I73929J97840J00104o9699k82053m03205l64311k37994j41316j34416j23518
5863d84639k0964R5496O2920p9628j05475K4396J36267J40828N1493k6655j4133
5852b20094J02387K34649K13048L1670k09072l97791m62243l72739n7661L37680
5842h00166N67269N99312N06099L69122J44986r1387j44690l0583J47733L08126
$$ plain form
5914 436885 608931 637127 528818 434973 529096 784512 1132976 1472204 1630943 1557640
5904 1557640 1362025 1216972 1129051 1039322 1051569 1240913 1557184 1876294 2128245 2283693
5894 2283693 2293979 2226220 2175196 2193032 2263461 2238798 2074852 1876488 1757394 1802240 2025291
5883 2025291 2235920 2235299 2046812 1736431 1350886 1017335 802845 706031 779888 973929
5873 973929 1171769 1271873 1202174 920121 516916 152605 -85389 -226705 -361121 -484639
5863 -484639 -505603 -410107 -347187 -426815 -532290 -507894 -371627 -230799 -179306 -205961 -220094
5852 -220094 -117707 116942 329990 361660 152588 -245203 -707446 -1080185 -1137846 -800166
5842 -800166 -232897 366415 872514 1241636 1386622 1295235 1150545 1119962 1267695 1575821
5832A575821L17031J22929j40242l36217m28905l45619r2813J43727J76241Q384
5822A000337j19787q9584j2535j7688l6724K145O4144J49099K60134K92256J97602
5811A689399J903k08489k87257k08321m9978Q7756J15412L8636q129j3922j3469
5800A143541m5156j02833j38700j36231o0531q510r352M1827Q1290n774j96229
5789E63342l77023l91883k57353j07457J04681L50530N00167M13402K11686J78930
5779A189022J37640L8572l223j4600J1446j1311j20065j87941p7791J08570J56667
5768A226986J0233j31251r4798K0236M7878o156l6838n1087j12331k87199m32180
5757A53493l56516m6133K49063L12947K07965Q9012L1154K2449L0273L74p3193
$$ plain form
5832 1575821 1892852 2015781 1875539 1539322 1110417 764798 671985 815712 991953 1000337
5822 1000337 880550 790966 778431 760743 724019 726164 790308 939407 1199541 1491797 1689399
5811 1689399 1691302 1482813 1195556 987235 937257 1025013 1140425 1179061 1170932 1157010 1143541
5800 1143541 1098385 995552 856852 720621 660090 651580 642228 684055 765345 759571 563342
5789 563342 186319 -205564 -462917 -570374 -465693 -115163 385004 798406 1010092 1189022
5779 1189022 1326662 1365234 1362011 1347411 1358857 1347546 1227481 1039540 961749 1070319 1226986
5768 1226986 1237219 1105968 1011170 1031406 1079284 1073128 1036290 985203 872872 585673 153493
5757 153493 -203023 -249156 -93 312854 520819 609831 640985 663434 693707 694081 620888
5746F20888j85385k72126k87736k08480k0252J80236K77153L01872K89086K26485
5736I21741J19671p141j24776k21131k08245r9227J1648R5057J46261J44765M2411
5725H21034q7170q8500j2982l2410j41645k00054j86878j90402j88944r6517L4232
5714c70236J85515L07883K31765o318j12982j432J93360K64349J24608j9109j8960
5703G78443L4179N6482M9547P6549J54808J96642K20045K71112K19035R4128j5642
5692B135328j40354k22403k06391j50033j34659j30679j53647j99396j48254o5623
5682E83889m1463l2159j1678L9590J15889J34813K9097j54416k57353k57054k48559
5671i9404k44261k08578j02367J48176M01826M04064K61646J95773J49074L9813
$$ plain form
5746 620888 435503 163377 -124359 -332839 -353091 -172855 104298 406170 695256 921741
5736 921741 1041412 1034271 909495 688364 480119 380892 392540 487597 633858 778623 821034
5725 821034 733864 645364 632382 599972 458327 258273 71395 -119007 -307951 -404468 -370236
5714 -370236 -184721 123162 354927 348609 235627 234195 427555 691904 816512 797403 778443
5703 778443 812622 869104 918651 995200 1150008 1346650 1566695 1837807 2056842 2150970 2135328
5692 2135328 1994974 1772571 1566180 1416147 1281488 1150809 997162 797766 649512 583889
5682 583889 542426 510267 498589 538179 654068 788881 817978 663562 406209 149155 -99404
5671 -99404 -343665 -552243 -654610 -506434 -104608 299456 561102 756875 905949 945762
5661I45762n2279k9652L0925j9122j10400j79187k55787k52696j35926m8931l5652
5650a42945q458J03953K50697L35175K44041M0300j1096P9166K8120j62454k46241
5639E10258k53583l04430l27751k06917l748J03467Q0614N533k58O9941J75076
5628a51798J95104J14869N2075N5561P0034N5641M7976J9755n5190j70497k72587
5617c9057j65600J17751L60082M62799M18553K87277J48312O7286N8784L2853
5607A749040j01684k27761j47135N2249J13531R5444L5350r7195j98058k28607
5597A045174k08527j67683p9198M7140J08090L6797m3217k9127K740r587m3244
5586F59358j10818j81310k05722q0582J92362M20565M96456M26546K50746Q0408
$$ plain form
5661 945762 893483 863831 894756 875634 765234 586047 330260 77564 -58362 -107293 -142945
5650 -142945 -151403 -47450 203247 538422 782463 822763 811667 890833 918953 756499 510258
5639 510258 256675 -47755 -375506 -582423 -586171 -482704 -402090 -396557 -396815 -326874 -151798
5628 -151798 43306 158175 210250 265811 335845 391486 439462 459217 404027 233530 -39057
5617 -39057 -204657 -86906 273176 735975 1154528 1441805 1590117 1657403 1716187 1749040
5607 1749040 1647356 1419595 1272460 1324709 1438240 1533684 1569034 1471839 1273781 1045174
5597 1045174 836647 668964 589766 636906 744996 781793 738576 709449 712189 702602 659358
5586 659358 548540 367230 161508 80926 273288 693853 1190309 1616855 1867601 1948009
5576A948009p9138j82509j81242j54061j09039l8616k3357L153J09460K12862
5566A505522J70062k2470k14258l05812k36669l2572J48075J67738N4058n8192
5556A175482o2277o0132j42684j74311j09319l2156j264p8030j95185j43658K5023
5545B01489J88882L39890L30377O2855k55716l59711k04894M6670K21726K99301
5535H70869L08434K36389N8342m2848k7415N734M3924J68670L08816L46422K78691
5524B556028R8358j05256k36001k17687q2528P6694K15027K93908J72972o6466
5514B705049j16101j8492k9960j28053j93788k82464l70241l34894k04451j79330
5504H47275k17717j43274k7758O9981J28360J22345K8820j40401k39312j35727
$$ plain form
5576 1948009 1868871 1686362 1505120 1351059 1242020 1203404 1180047 1183200 1292660 1505522
5566 1505522 1675584 1653114 1438856 1133044 896375 863803 1011878 1179616 1233674 1175482
5556 1175482 1113205 1053073 910389 736078 626759 594603 593339 515309 320124 176466 201489
5545 201489 390371 730261 1060638 1123493 867777 508066 303172 349842 571568 870869
5535 870869 1179303 1415692 1474034 1431186 1403771 1409505 1453429 1622099 1930915 2277337 2556028
5524 2556028 2654386 2549130 2313129 2095442 2012914 2089608 2304635 2598543 2771515 2705049
5514 2705049 2588948 2570456 2540496 2412443 2218655 1936191 1565950 1231056 1026605 847275
5504 847275 629558 486284 458526 528507 656867 779212 808032 667631 428319 292592
5494B92592J19431L06773L06493J66313J4921j10916k12690k52218k65342k41342
5484A24015j11983M8874J24534J02599N8778Q1438K07704L87068M75632L14397
5474A813056M3054j06612j94402k63203k05676q6638m2788k4643L8023O3140K9213
5463A062524N1866J07045J25753P2587l4647q1312q3042j03134o7127N6621J24291
5452A231425K1713j92365l19131k06825L5500K09934K94041L27094K68693J09563
5442A779642n1110j20209j11664M595J63718K26853J23912K2415K3528R813j41813
5431A929680l23051k99312j41916p9761j08229p7545K7919J14701J29450O0697
5421A232633k6158q0338j05202m2486L8759R0000J48116J40127M0374n9903j64674
$$ plain form
5494 292592 412023 718796 1025289 1191602 1206523 1095607 882917 630699 365357 124015
5484 124015 12032 60906 185440 288039 346817 428255 635959 1023027 1498659 1813056
5474 1813056 1856110 1749498 1555096 1291893 1086217 999579 956791 932148 970171 1033311 1062524
5463 1062524 1114390 1221435 1347188 1419775 1385128 1303816 1220774 1117640 1050513 1107134 1231425
5452 1231425 1253138 1060773 741642 534817 570317 780251 1074292 1401386 1670079 1779642
5442 1779642 1728532 1608323 1496659 1501254 1664972 1891825 2015737 2038152 2061680 2071493 1929680
5431 1929680 1606629 1307317 1165401 1085640 977411 899866 927785 1042486 1171936 1232633
5421 1232633 1206475 1126137 1020935 978449 1017208 1107208 1255324 1395451 1435825 1375922 1211248
5410A211248k11655r0877O9249J15370J35349J92266K83060L46002L11680J54082
5400B515774r0087k38820j71627l1309Q770o2679j14839o8107l4412o4489j10970
5389A537205j07694n0194N3613J51741J37734N2123l5890j47515k32062j23214
5379A235847O9117J40110J65237K00357J17032k4138o5971K2068J04012M2183
5369B005854m1633m4355o3825q5054n8435m5240l5860K400L2282N0600k1973j31137
5357A563624j36327j25080j55900j26505n999J7855q6517q5748L2201J07146J24585
5346A123335R1562m3022j67218j92297j53478r7837p924O8012J02534K08063L55804
5335A287534L37041K01084J54388J87904J69954K9683j81372l43958l33198j80388
$$ plain form
5410 1211248 999593 908716 977965 1093335 1228684 1420950 1704010 2050012 2361692 2515774
5400 2515774 2425687 2186867 2015240 1983931 1992701 1930022 1815183 1747076 1712664 1648175 1537205
5389 1537205 1429511 1379317 1432930 1584671 1722405 1774528 1738638 1591123 1359061 1235847
5379 1235847 1304964 1445074 1610311 1810668 1927700 1903562 1837591 1859659 1963671 2005854
5369 2005854 1964221 1919866 1856041 1770987 1712552 1667312 1631452 1633852 1666134 1716734 1694761 1563624
5357 1563624 1427297 1302217 1146317 1019812 1013813 1031668 945151 859403 891604 998750 1123335
5346 1123335 1214897 1171875 1004657 812360 658882 561045 553121 621133 723667 931730 1287534
5335 1287534 1624575 1825659 1980047 2167951 2337905 2367588 2186216 1842258 1509060 1328672
5325A328672k0084o502j26076k41019k84436k41305j55536k8397R9926R2188L3537
5314D50968j9424p6554j42385j66380m6261Q5045N2797q1522j73611j46762J6765
5303b47324J19758O9822O4849J39648K09030J55782n6266j63117l1111J03431
5293C64502J40151J54090Q3232o705J8242P4924P1834O9494J16065K06670L25409
5282A617908K57497Q249j90770k18330j32342q0148p5758r9652j49320j39645
5272G97689k7839M4410K6822K1918M4606M2962P5536J55866J61190K8251j16880
5261A254531j77307k48060k99095k16954n7302O2113J85001L69705M06939K56633
5251A536204Q6417j9011j06803k45541l28587k90555k81871k62733r9632N6738
$$ plain form
5325 1328672 1308588 1302086 1176010 934991 650555 409250 253714 225317 325243 417431 450968
5314 450968 431544 354990 212605 46225 -36 85009 137806 56284 -117327 -264089 -247324
5303 -247324 -127566 -57744 7105 146753 355783 511565 455299 292182 261071 364502
5293 364502 504653 658743 741975 735270 753512 828436 900270 969764 1085829 1292499 1617908
5282 1617908 1875405 1883654 1692884 1474554 1342212 1262064 1186306 1086654 937334 797689
5272 797689 769850 814260 841082 863000 907606 950568 1026104 1181970 1343160 1371411 1254531
5261 1254531 1077224 829164 530069 313115 255813 317926 502927 872632 1279571 1536204
5251 1536204 1622621 1603610 1496807 1251266 922679 632124 350253 87520 -12112 44626
5241D4626J37756J72198J33399O0904L4964k9657j67471k75451k69790j72411
5231c30933Q3596L39077L34548J90282J07984J02276J31801J07425j7236j02023
5221I46797r6430j46996k38300j79069L2810J42513P2504L6181K2170j12176k04681
5210B75323j72473j91038k22354j34707J8576J61460K66866K56982J42632Q5134
5200D86401J87393K56203J92243J75211K26495K00230J06718K4431K1562R6500
5190A973387N1159j21079k52550k51736j70507j60502j66227j28366j24696j16540
5180E32343j5662K3311o5611p5313j5095m6999r6175q4452m5436K7763J05389
5169B44063P3410o332n1563q5493p2849L6594K29138M11733L79804J63721L6055
$$ plain form
5241 44626 182382 354580 487979 548883 583847 554190 386719 111268 -158522 -330933
5231 -330933 -247337 91740 426288 616570 724554 826830 958631 1066056 1048820 946797
5221 946797 850367 703371 465071 286002 318812 461325 533829 570010 592180 480004 275323
5210 275323 102850 -88188 -310542 -445249 -426673 -265213 1653 258635 401267 486401
5200 486401 673794 929997 1122240 1297451 1523946 1724176 1830894 1855325 1876887 1973387
5190 1973387 2024546 1903467 1650917 1399181 1228674 1068172 901945 773579 648883 532343
5180 532343 516681 539992 474381 399068 383973 336974 240799 156347 110911 138674 244063
5169 244063 317473 311141 259578 174085 101236 137830 366968 778701 1158505 1322226 1358281
$$ [...]
##END NTUPLES=NMR SPECTRUM
##END=
