##TITLE=C13cpd
##JCAMPDX= 6.0         $$ Bruker NMR JCAMP-DX V2.0
##DATA TYPE= NMR SPECTRUM
##DATA CLASS= NTUPLES
##ORIGIN= UXNMR, Bruker Analytische Messtechnik GmbH
##OWNER= root
$$ XWIN-NMR		Version 3.5
$$ Sat Feb 22 14:06:52 2025 Russian Standard Time (UT+4h)  servis@DPX200
##.OBSERVE FREQUENCY= 50.3277607988526
##.OBSERVE NUCLEUS= ^13C
##.ACQUISITION MODE= SIMULTANEOUS
##.ACQUISITION SCHEME= undefined
##.AVERAGES= 1109
##.DIGITISER RES= 17
##SPECTROMETER/DATA SYSTEM= spect
##.PULSE SEQUENCE= zgpg30
##.SOLVENT NAME= DMSO
##.SHIFT REFERENCE= (INTERNAL, DMSO, 0, 219.126)
##AUDIT TRAIL= $$ (NUMBER, WHEN, WHO, WHERE, WHAT)
$$ ##TITLE= Audit trail, XWIN-NMR		Version 3.5
$$ ##JCAMPDX= 5.01
$$ ##ORIGIN= Bruker BioSpin GmbH
$$ ##OWNER= servis
$$ F:\spectra/data/av/nmr/C13cpd/1/pdata/1/auditp.txt
$$ ##AUDIT TRAIL=  $$ (NUMBER, WHEN, WHO, WHERE, WHAT)
(   1,<2025-02-22 14:06:28.17 +0400>,<servis>,<DPX200>,
      <created by zg, POWCHK disabled, PULCHK disabled
       terminated by command 'halt'
       configuration hash MD5:
       00 E9 B6 7A A2 85 ED C7 34 08 36 98 17 FE 4E 26
       data hash MD5: 32K
       F3 7D 33 54 94 92 F2 5F 87 41 5B 9D 7C 0B 93 09>)
(   2,<2025-02-22 14:06:29.89 +0400>,<servis>,<DPX200>,
      <Start of raw data processing
       efp BC_mod = 2 LB = 2 FT_mod = 6 PKNL = 1 PHC0 = -340.663 PHC1 = 25.66493 SI = 32K 
       data hash MD5: 32K
       9F 5B 4B AF 07 55 D0 B7 88 4E 56 A2 3C ED 9C 37>)
$$ ##END=
$$ 
$$ hash MD5
$$ BC 91 BE 7C 60 6E 42 B1 6C A0 D7 F1 49 17 D8 99
##$RELAX= 
##$RELAX= 
##$RELAX= 
##$RELAX= 
##$RELAX= 
##$RELAX= 
##$RELAX= 
##$RELAX= 
$$ Bruker specific parameters
$$ --------------------------
##$DU= <F:\spectra>
##$EXPNO= 1
##$NAME= <C13cpd>
##$PROCNO= 1
##$TYPE= <nmr>
##$USER= <av>
##$AMP= (0..31)
100 100 100 100 100 100 100 100 100 100 100 100 100 100 100 100 100 100 
100 100 100 100 100 100 100 100 100 100 100 100 100 100 
##$AQSEQ= 0
##$AQ_mod= 1
##$AUNM= <au_zg>
##$AUTOPOS= <>
##$BF1= 50.322729
##$BF2= 200.13
##$BF3= 50.322729
##$BF4= 50.322729
##$BF5= 500.13
##$BF6= 500.13
##$BF7= 500.13
##$BF8= 500.13
##$BYTORDA= 1
##$CFDGTYP= 0
##$CFRGTYP= 5
##$CHEMSTR= <none>
##$CNST= (0..31)
1 1 145 1 1 1 1 1 1 1 1 1 1 1 1 1 1 1 1 1 1 1 1 1 1 1 1 1 1 1 1 1 
##$CPDPRG= <waltz16>
##$CPDPRG1= <>
##$CPDPRG2= <waltz16>
##$CPDPRG3= <>
##$CPDPRG4= <mlev>
##$CPDPRG5= <mlev>
##$CPDPRG6= <mlev>
##$CPDPRG7= <mlev>
##$CPDPRG8= <mlev>
##$CPDPRGB= <>
##$CPDPRGT= <>
##$D= (0..31)
0 2 0.00345 0 0 0 0 0 0 0.06 0 0.03 2e-05 3e-06 0 0 0.0002 0 0 0 0 0 0 
0 0 0 0 0 0 0 0 0 
##$DATE= 1740218787
##$DBL= (0..7)
120 120 120 120 120 120 120 120 
##$DBP= (0..7)
150 150 150 150 150 150 150 150 
##$DBP07= 0
##$DBPNAM0= <>
##$DBPNAM1= <>
##$DBPNAM2= <>
##$DBPNAM3= <>
##$DBPNAM4= <>
##$DBPNAM5= <>
##$DBPNAM6= <>
##$DBPNAM7= <>
##$DBPOAL= (0..7)
0.5 0.5 0.5 0.5 0.5 0.5 0.5 0.5 
##$DBPOFFS= (0..7)
0 0 0 0 0 0 0 0 
##$DE= 6
##$DECBNUC= <off>
##$DECIM= 12
##$DECNUC= <off>
##$DECSTAT= 4
##$DIGMOD= 1
##$DIGTYP= 9
##$DL= (0..7)
$$ [...]
##$SUBNAM2= <"">
##$SUBNAM3= <"">
##$SUBNAM4= <"">
##$SUBNAM5= <"">
##$SUBNAM6= <"">
##$SUBNAM7= <"">
##$SUBNAM8= <"">
##$SUBNAM9= <"">
##$SW= 238.246396889851
##$SWIBOX= (0..15)
0 1 3 0 0 0 0 0 0 0 0 0 0 0 0 0 
##$SW_h= 11990.4076738609
##$TD= 32768
##$TD0= 1
##$TE= 0
##$TE2= 300
##$TE3= 300
##$TEG= 300
##$TL= (0..7)
0 120 120 120 120 120 120 120 
##$TP= (0..7)
150 150 150 150 150 150 150 150 
##$TP07= 0
##$TPNAME0= <>
##$TPNAME1= <>
##$TPNAME2= <>
##$TPNAME3= <>
##$TPNAME4= <>
##$TPNAME5= <>
##$TPNAME6= <>
##$TPNAME7= <>
##$TPOAL= (0..7)
0.5 0.5 0.5 0.5 0.5 0.5 0.5 0.5 
##$TPOFFS= (0..7)
0 0 0 0 0 0 0 0 
##$TUNHIN= 0
##$TUNHOUT= 0
##$TUNXOUT= 0
##$USERA1= <user>
##$USERA2= <user>
##$USERA3= <user>
##$USERA4= <user>
##$USERA5= <user>
##$V9= 5
##$VALIST= <valist>
##$VCLIST= <CCCCCCCCCCCCCCC>
##$VD= 0
##$VDLIST= <DDDDDDDDDDDDDDD>
##$VPLIST= <PPPPPPPPPPPPPPP>
##$VTLIST= <TTTTTTTTTTTTTTT>
##$WBST= 1024
##$WBSW= 20
##$XGAIN= (0..3)
0 0 0 0 
##$XL= 0
##$YL= 0
##$YMAX_a= 17462760
##$YMIN_a= -13726840
##$ZGOPTNS= <>
##$ZL1= 120
##$ZL2= 120
##$ZL3= 120
##$ZL4= 120
##$ABSF1= 0
##$ABSF2= 0
##$ABSG= 0
##$ABSL= 0
##$ALPHA= 0
##$AQORDER= 0
##$ASSFAC= 0
##$ASSFACI= 0
##$ASSFACX= 0
##$ASSWID= 0
##$AUNMP= <proc_1d>
##$AZFE= 0.1
##$AZFW= 0.5
##$BCFW= 0
##$BC_mod= 2
##$BYTORDP= 0
##$COROFFS= 0
##$CY= 12.5
##$DATMOD= 1
##$DC= 0
##$DFILT= <>
##$DTYPP= 0
##$F1P= 99.9999945759776
##$F2P= -179.999992907048
##$FCOR= 0.5
##$FTSIZE= 32768
##$FT_mod= 6
##$GAMMA= 0
##$GB= 0
##$INTBC= 1
##$INTSCL= 0
##$ISEN= 30
##$LB= 2
##$LEV0= 0
##$LPBIN= 0
##$MAXI= 10000
##$MC2= 0
##$MEAN= 0
##$ME_mod= 0
##$MI= 0
##$NCOEF= 0
##$NC_proc= 1
##$NLEV= 6
##$NOISF1= 0
##$NOISF2= 0
##$NSP= 0
##$NTH_PI= 0
##$NZP= 0
##$OFFSET= 219.1257
##$PC= 1.4
##$PHC0= -340.663
##$PHC1= 25.66493
##$PH_mod= 1
##$PKNL= yes
##$PPARMOD= 0
##$PSCAL= 4
##$PSIGN= 0
##$REVERSE= no
##$SF= 50.322729
##$SI= 32768
##$SIGF1= 0
##$SIGF2= 0
##$SINO= 80
##$SIOLD= 32768
##$SREGLST= <13C.CDCl3>
##$SSB= 0
##$STSI= 32768
##$STSR= 0
##$SW_p= 11990.4076738609
##$SYMM= 0
##$S_DEV= 0
##$TDeff= 32768
##$TDoff= 0
##$TI= <>
##$TILT= no
##$TM1= 0
##$TM2= 0
##$TOPLEV= 0
##$USERP1= <user>
##$USERP2= <user>
##$USERP3= <user>
##$USERP4= <user>
##$USERP5= <user>
##$WDW= 1
##$XDIM= 32768
##$YMAX_p= 355737654
##$YMIN_p= -3388679
$$ End of Bruker specific parameters
$$ ---------------------------------
##NTUPLES= NMR SPECTRUM
##VAR_NAME=  FREQUENCY,     SPECTRUM/REAL,   SPECTRUM/IMAG
##SYMBOL=    X,             R,               I
##VAR_TYPE=  INDEPENDENT,   DEPENDENT,       DEPENDENT
##VAR_FORM=  AFFN,          ASDF,            ASDF
##VAR_DIM=   32768,         32768,           32768
##UNITS=     HZ,            ARBITRARY UNITS, ARBITRARY UNITS
##FACTOR=    0.365929370215793, 1,           1
##FIRST=     11027.0033138647, 0,            0
##LAST=      -963.404359996184, 0,           0
##MIN=       -963.404359996184, -3388679,    0
##MAX=       11027.0033138647, 355737654,    0
$$ Real data points
##PAGE= N=1
##DATA TABLE= (X++(R..R)), XYDATA
$$ [...]
10988C208328n25378n33612l55824j87164k38489m02634m11980p5189M25415O13092
$$ 3208328 2682950 2149338 1793514 1606350 1367861 965227 553247 478058 903473 1516565
10978A516565L63600k2997l14553m72591n20031l46460O1824K79955m2726m60200
$$ 1516565 1880165 1857168 1542615 1070024 549993 203533 265357 545312 502586 42386
10968D2386m86348k05049J59565L91939M08949L40312K34052K80930M08696L52722
$$ 42386 -443962 -649011 -489446 -97507 311442 651754 885806 1166736 1575432 1928154
10958A928154J62636l986J3046J48435J37139K2246J7066K31926M66105M53671
$$ 1928154 2090790 2086804 2099850 2248285 2385424 2407670 2424736 2656662 3122767 3576438
10948C576438J95103k08348l49297j29257J4157j22720l29364m02783k83972m8539
$$ 3576438 3771541 3563193 3213896 3084639 3098796 2976076 2646712 2243929 1959957 1911418
10938A911418Q9602r618j17299r5325p8787q6735m1443n030M1549J74449K61798
$$ 1911418 2001020 1991402 1874103 1778778 1699991 1613256 1571813 1566783 1608332 1782781 2044579
10927B044579J94468K47117L61794K63236R4766k5903j15674r7681J94516M75512
$$ 2044579 2239047 2486164 2847958 3111194 3205960 3180057 3064383 2966702 3161218 3636730
10917C636730M25978J37941k77053n36320n69057o46363o94376n41571l02765
$$ 3636730 4062708 4200649 3923596 3387276 2818219 2171856 1477480 935909 633144
10908F33144l257L28491N55380M90132J97866o355k7734j8128j42537l05170k50836
$$ 633144 629887 958378 1513758 2003890 2201756 2195401 2167667 2149539 2007002 1701832 1450996
10897A450996r2246l4952j57484m24818n66285l69976M2284J91139P6700J78305
$$ 1450996 1358750 1323798 1166314 741496 175211 -194765 -152481 38658 115358 293663
10887B93663L37266J64869j62295k32992m2617N0211r0944k70992l38292k08644
$$ 293663 630929 795798 633503 400511 357894 408105 317161 46169 -292123 -500767
10877e00767N5165L44744N24382M90514L34338J97977J52108R2368r5212j33585
$$ -500767 -445602 -100858 423524 914038 1248376 1446353 1598461 1690829 1595617 1462032
10867A462032m880R9170Q0446q8764l05541m90896o08524m46393J8645L39950
$$ 1462032 1457152 1556322 1636768 1548004 1242463 751567 143043 -303350 -284705 55245
10857E5245L88576K44617M969K9832L53968M52476K74810R5326q232k6091J14134
$$ 55245 443821 688438 693407 723239 1077207 1529683 1804493 1899819 1891587 1865496 1979630
10846A979630L95162M50629J14385l04157n88962o36218m11576l6230L06418N69799
$$ 1979630 2374792 2825421 2939806 2635649 2046687 1410469 998893 962663 1269081 1838880
10836A838880O12349M86431K91975P9946j18934l67090n31333l57427o4183n0833
$$ 1838880 2451229 2937660 3229635 3309581 3190647 2823557 2292224 1934797 1870614 1819781
10826A819781m8739K36604O99289R03593O22733K33360p2863l15828m63939n12708
$$ 1819781 1771042 2007646 2706935 3610528 4233261 4466621 4393758 4077930 3613991 3101283
10816C101283n17084m08381j55454N7858K40744M60144N90019N42838K90838q6065
$$ 3101283 2584199 2175818 2020364 2078222 2318966 2779110 3369129 3911967 4202805 4116740
10806D116740l25265m02328l54182j93045p7015j62310l20834j44009K42798L38947
$$ 4116740 3791475 3389147 3034965 2841920 2764905 2602595 2281761 2137752 2380550 2719497
10796B719497J46559r933O3835L12572L32838q4707n77255o37696k44381K27497
$$ 2719497 2866056 2856123 2919958 3232530 3565368 3480661 2903406 2265710 2021329 2248826
10786B248826N12054M45592O9027j08043M1825N5372j21057j66005r1194J1412
$$ 2248826 2760880 3206472 3275499 3167456 3209281 3264653 3143596 2977591 2886397 2897809
10776B897809O0974J97492L76808K95329Q8985J34055K57693N1506k73515m39345
$$ 2897809 2958783 3156275 3533083 3828412 3917397 4051452 4309145 4360651 4087136 3647791
10766C647791m21137l22043k23649q8288j9883k5793P4310L04855M26678K41293
$$ 3647791 3226654 2904611 2680962 2592674 2572791 2546998 2621308 2926163 3352841 3594134
10756C594134p1905j75158p7019p5669k92406n12336m77005l38577l69824m02050
$$ 3594134 3522229 3347071 3270052 3194383 2901977 2389641 1912636 1574059 1204235 802185
10746H02185j67890K05916M50128N56595M99800K89666J24279J5464L9607J08981
$$ 802185 634295 840211 1290339 1846934 2346734 2636400 2760679 2776143 2815750 2924731
10736B924731n1352k74013k85243k22464q1344K55907N27622M50941J56005n6974
$$ 2924731 2873379 2599366 2314123 2091659 2010315 2266222 2793844 3244785 3400790 3343816
10726C343816j79217l72001n37237m51736j76482P5962J30898Q0818Q1530N4281
$$ 3343816 3164599 2792598 2255361 1803625 1627143 1703105 1834003 1914821 1996351 2050632
10716B050632k2538j5445J48390K20970J27305O3854R5867O215k23602k80945
$$ 2050632 2028094 2012649 2161039 2382009 2509314 2573168 2669035 2675250 2451648 2170703
10706B170703k57920l32390m00287l95380k88561m5641K51693M58397M89651L89225
$$ 2170703 1912783 1580393 1180106 784726 496165 450524 702217 1160614 1650265 2039490
10696B039490J93233r9616k19202n691L00405L72148P5636m13633o96815n91495
$$ 2039490 2232723 2133107 1913905 1908214 2208619 2580767 2656403 2242770 1545955 954460
10686I54460k63919J31157L43046K68083J50560P6088j10959k89423k47080r5542
$$ 954460 690541 821698 1164744 1432827 1583387 1659475 1548516 1259093 1012013 916471
10676I16471r9706n9545J75413K44049P2089j49657k97861k29932L1707L71631
$$ 916471 816765 757220 932633 1176682 1248771 1099114 801253 571321 603028 974659
10666I74659N73994L40216o0737j19986N7888J74453K27366J72306j26878n19414
$$ 974659 1548653 1888869 1828132 1708146 1766034 1940487 2167853 2340159 2213281 1693867
10656A693867p24669o66224n29485l27362L3331M36993O63584O43763M54366K47811
$$ 1693867 969198 302974 -226511 -553873 -520542 -83549 580035 1223798 1678164 1925975
10646A925975J96536J80005J6558q5354j19369j69645j17224M9527J95843J15157
$$ 1925975 2122511 2302516 2319074 2233720 2114351 1944706 1827482 1877009 2072852 2188009
10636B188009n8268j60857r8820Q3513J95747J63519m8335l36008n06777l98793
$$ 2188009 2129741 1968884 1870064 1953577 2149324 2312843 2264508 1928500 1421723 1022930
10626A022930k28L62847L88803Q3123j37579o971K42698J95524q3014k27003k29246
$$ 1022930 1022702 1385549 1774352 1857475 1719896 1712925 1955623 2151147 2068133 1841130 1611884
10615A611884j93882j14648L9794J09525M458n4389p086K7237M3604J48814L60100
$$ 1611884 1418002 1303354 1343148 1452673 1457131 1402742 1395656 1422893 1466497 1615311 1975411
10604A975411N36147N34853L19562L8478k20949m10502m50180l21715j50247q3672
$$ 1975411 2511558 3046411 3365973 3404451 3183502 2773000 2322820 2001105 1850858 1767186
10594A767186o1072M3409J31486J91694L08056L54586L24362L80502N60107P82389
$$ 1767186 1706114 1749523 1881009 2072703 2380759 2735345 3059707 3440209 4000316 4782705
10584D782705P41859K19711m41524q42103q44926o70331m83891k34599J41106
$$ 4782705 5524564 5744275 5302751 4460648 3615722 2945391 2461500 2226901 2368007
10575B368007L51530K61396L6798q4479j26887j59553k13664l51148o34566q19455
$$ 2368007 2719537 2980933 3017731 2933252 2806365 2646812 2433148 2082000 1447434 627979
10565F27979n71073o4092M28392P38834O82725L07187J0638L3402J03342P4965
$$ 627979 56906 -7186 421206 1160040 1842765 2149952 2160590 2193992 2297334 2372299
10555B372299J12039J18401P1318J78814L70105L16841L2944k49835k04078N1701
$$ 2372299 2484338 2602739 2674057 2852871 3222976 3539817 3572761 3322926 3118848 3170549
10545C170549O5392j66793n27464q12017o63444j85848K05239L56248L90708M74877
$$ 3170549 3235941 3069148 2541684 1729667 1066223 880375 1085614 1441862 1832570 2307447
10535B307447O56538O86942K50933l74641p16216p27077o59385n06805k35982
$$ 2307447 2963985 3650927 3901860 3527219 2811003 2083926 1424541 917736 681754
10526F81754j79523k95128l26100k09558n991K37320M01770N22084N90447N46090
$$ 681754 502231 207103 -118997 -328555 -334546 -97226 304544 826628 1417075 1963165
10516A963165M44945K39828j61210m66979m00990k63859k20614j84360j17266
$$ 1963165 2408110 2647938 2486728 2019749 1618759 1354900 1134286 949926 832660
10507H32660m1491j6090l1978l1554o7423k42635m75796m55977r9369J70078J95917
$$ 832660 791169 775079 743101 711547 644124 401489 -74307 -530284 -629653 -459575 -263658
10496b63658K71406L18897Q0842r5725O3811K64920K83833J29058J6411M5290
$$ -263658 7748 326645 407487 311762 375573 640493 924326 1053384 1069795 1115085
10486A115085O0517P5207M7585n7723m9315J01366J47543Q9437P8864J27982L02044
$$ 1115085 1175602 1250809 1298394 1240671 1191356 1292722 1440265 1529702 1608566 1736548 2038592
10475B038592N67980P94697P29907L40204p2048k95354k46277M0313M09756N90498
$$ 2038592 2606572 3401269 4131176 4471380 4399332 4103978 3857701 3898014 4307770 4898268
10465D898268N66512L52966r694k57986l04045l76082m49566l72916k40638k48560
$$ 4898268 5464780 5817746 5808052 5550066 5246021 4869939 4420373 4047457 3806819 3558259
10455C558259l70191m34832j86330L10534N89075M15386K34633L66743L97314
$$ 3558259 3188068 2753236 2566906 2877440 3466515 3881901 4116534 4483277 4880591
10446D880591K09979J25324K39355M68298O38799M83623J64308k1214o8084k3808
$$ 4880591 5090570 5215894 5455249 5923547 6562346 7045969 7210277 7189063 7120979 7097171
10436G097171J47881M70330P23113Q16142J072436J453143J619317J583212J686489
$$ 7097171 7245052 7715382 8438495 9254637 10327073 11780216 13399533 14982745 16669234
10427A6669234K009091K419621K830077L291033L776549L967830L807905L309286
$$ 16669234 18678325 21097946 23928023 27219056 30995605 34963435 38771340 42080626
10419D2080626K365966J116487j71176j311053k136627k576619k766023k728394
$$ 42080626 44446592 45563079 45391903 44080850 41944223 39367604 36601581 33873187
10411C3873187k558838k504643k588169k632484k549153k329603j915718j400648
$$ 33873187 31314349 28809706 26221537 23589053 21039900 18710297 16794579 15393931
10403A5393931j025520r94080j233127j431725j408728j133862p91261n27397
$$ 15393931 14368411 13374331 12141204 10709479 9300751 8166889 7375628 6848231
10395F848231k78837j42710j32182j80457l71299o25937o76630m48971j69511
$$ 6848231 6569394 6426684 6294502 6114045 5742746 5116809 4440179 3991208 3821697
10386C821697N4715L27565O78002Q62177O54697L51926Q9794l10737o46632p34973
$$ 3821697 3876412 4203977 4881979 5744156 6398853 6750779 6840573 6529836 5883204 5148231
10376E148231o39877l58386O2457K69166k450m46397o40322n42081l87918k01350
$$ 5148231 4508354 4149968 4212425 4481591 4479141 4032744 3392422 2850341 2462423 2261073
10366B261073j2314m9822j83303j91999k7354K15325L40131L34840K88349J51050
$$ 2261073 2248759 2198937 2015634 1823635 1796281 2011606 2351737 2686577 2974926 3125976
10356C125976j03077l67388n36972p01456p27861m83767j44676K55258O43128
$$ 3125976 3022899 2655511 2118539 1417083 689222 205455 60779 316037 959165
10347I59165P28232M40553R0417o1219o1554K313j5375k01555l21534k51887o2102
$$ 959165 1687397 2127950 2218367 2157148 2095594 2097907 2082532 1880977 1559443 1307556 1245454
10336A245454J26364J71155J34546M8310k11122n10035m14848L710L92582N51098
$$ 1245454 1371818 1542973 1677519 1725829 1514707 1004672 589824 593534 986116 1537214
10326A537214M91699K63491j9902m9242K5799k25912n01284k89776J93442M61004
$$ 1537214 2028913 2292404 2272502 2223260 2249059 2023147 1521863 1232087 1425529 1886533
10316A886533L42495J103l22807n13767n99409n80652m94816m52353l67536p0976
$$ 1886533 2229028 2230131 1907324 1393557 794148 213496 -281320 -733673 -1101209 -1172185
10306a172185J58466K65162M64147N93951M90063L70669L69357L23700J92207
$$ -1172185 -1013719 -748557 -284410 309541 799604 1170273 1539630 1863330 2055537
10297B055537K57238M75732M25233J86560K1238k2093n6687j70072j96217O7768
$$ 2055537 2312775 2788507 3213740 3400300 3421538 3399445 3342758 3172686 2976469 3044237
10287C044237K81941J51887o7963j95162k51942k59500k92020l73450l24992j98965
$$ 3044237 3326178 3478065 3410102 3214940 2962998 2703498 2411478 2038028 1713036 1514071
10277A514071j00775q5716k40419m07060m35762k88852l6435K33426L51926L81893
$$ 1514071 1413296 1327580 1087161 680101 244339 -44513 -80948 152478 504404 886297
10267H86297L63246K36538J21033R8257J27657N6373j06975m7566K50826M72981
$$ 886297 1249543 1486081 1607114 1705371 1833028 1889401 1782426 1734860 1985686 2458667
10257B458667M43150J62341k91837n70876n07414l95397m23118m97775m24795
$$ 2458667 2901817 3064158 2772321 2201445 1694031 1298634 875516 377741 -47054
10248d7054j46459N0055p784O8170L54658N69298O77880N91018L71815J58682
$$ -47054 -193513 -143458 -151242 -83072 271586 840884 1518764 2109782 2481597 2640279
10238B640279p3762k21389k21679j66853k08059l49340n88225q10320p73789l72355
$$ 2640279 2566517 2345128 2123449 1956596 1748537 1399197 810972 652 -773137 -1145492
10228a145492O2204J45609m501j01735k1191J61440K96802M13512M39082L70456
$$ -1145492 -1083288 -937679 -942180 -1043915 -1065106 -903666 -606864 -193352 245730 616186
10218F16186K21485K8196j21471j55537j9452K46916M59060L17272r4947l13379
$$ 616186 837671 865867 744396 588859 569407 816323 1275383 1592655 1497708 1184329
10208A184329l07235l26346m89199o38666n88317m96118n60992n37946k24673
$$ 1184329 877094 550748 61549 -577117 -1165434 -1661552 -2222544 -2760490 -2985163
10199b985163K72270P03890Q76545Q34999N59745J37515j90536l13736j79817
$$ -2985163 -2712893 -2009003 -1132458 -297459 262286 399801 209265 -104471 -284288
10190b84288L722J34107L13472N22940P27746P45264M84616K15803k4864l73730
$$ -284288 -280566 -146459 167013 689953 1417699 2162963 2647579 2863382 2838518 2464788
10180B464788o55988o30234k70887J94209M94092N50200M34430K01979J133j14106
$$ 2464788 1808800 1178566 907679 1101888 1595980 2146180 2580610 2782589 2783722 2669616
10170B669616k36539l45369l49264k32990j03123q6481j12441j15186k1844J78809
$$ 2669616 2433077 2087708 1738444 1505454 1402331 1315850 1203409 1088223 1066379 1245188
10160A245188J89735L5154k7378O9588K90702M18098L02191k3369k27408K6607
$$ 1245188 1434923 1470077 1442699 1512287 1802989 2221087 2523278 2499909 2272501 2299108
10150B299108M38098N73892M04426N8089m25015p51433p07403n81476n07424l76202
$$ 2299108 2737206 3311098 3715524 3773613 3348598 2597165 1889762 1308286 800862 424660
10140D24660j13683R5679K25490L74600L33859K04364K78212L35137K34724J49608
$$ 424660 310977 406656 632146 1006746 1340605 1544969 1823181 2158318 2393042 2542650
10130B542650M9904p7800k38692m04777l31825p608K13013J56967j07895l95796
$$ 2542650 2592554 2514754 2276062 1871285 1539460 1531852 1744865 1901832 1793937 1398141
10120A398141l39709M5851M53706M85348K03556N1972J23904J90331Q694j97408
$$ 1398141 1058432 1104283 1557989 2043337 2246893 2298865 2422769 2613100 2621794 2424386
10110B424386j81636j05841p9715j10629j67676j91712j41211p5247l7349J52973
$$ 2424386 2242750 2136909 2057194 1946565 1778889 1587177 1445966 1370719 1333370 1486343
10100A486343M90100P54072O79216J55010m42847n06477j52388P3315M2945q3930
$$ 1486343 1976443 2730515 3409731 3564741 3121894 2615417 2463029 2536344 2579289 2495359
10090B495359m6429J30568K50515J84536m9338j81374m0492K11756L83508L13365
$$ 2495359 2448930 2579498 2830013 3014549 2965211 2783837 2743345 2955101 3338609 3651974
10080C651974m846l09597l80166k97852p0442K81754L59276K16752K41121K80171
$$ 3651974 3647128 3337531 2957365 2659513 2589071 2870825 3230101 3446853 3687974 3968145
10070C968145K44238K19014J21632R1207K3307k19981n87190r97234j107564p80392
$$ 3968145 4212383 4431397 4553029 4644236 4667543 4447562 3860372 2863138 1755574 975182
10060I75182k57192M1668J16408L02625M73304M27908K54313J04867P0704l1691
$$ 975182 717990 759658 876066 1178691 1651995 2079903 2334216 2439083 2509787 2478096
10050B478096l12591m90765l04868Q3158L89748M49658L24027K21296k5331m00781
$$ 2478096 2165505 1674740 1369872 1453030 1842778 2292436 2616463 2837759 2812428 2411647
10040B411647p12014q70878p93604m61551j09473J11988K74438K99345R9891k98456
$$ 2411647 1699633 828755 35151 -426400 -535873 -423885 -149447 149898 249789 -48667
10030d8667o31489n14095j4496L95096N91155O07399M75511K61967J04427o6585
$$ -48667 -680156 -1194251 -1208747 -813651 -222496 384903 860414 1122381 1226808 1160223
10020A160223l42463l90593j61734o9294j86393p0259J78982K22313R9014K445
$$ 1160223 817760 427167 265433 196139 9746 -60513 118469 340782 439796 442241
10010D42241Q3342L48979O37856N58159J1720m51837m63069l36429j90210O3551
$$ 442241 525583 874562 1512418 2070577 2082297 1630460 1167391 830962 640752 704303
10000G04303J16135j41066k32837J1705K52444K82878J51202J7948J50757L92581
$$ 704303 820438 679372 446535 458240 710684 993562 1144764 1162712 1313469 1706050
9990A706050N21273M24744K1302l29265l19592j22556J9990J651j2879K20060
$$ 1706050 2227323 2652067 2673369 2344104 2024512 1901956 1921946 1923597 1910718 2130778
9980B130778M62208L65455J49995J82420K65400K38768J27809j15069n01963r15856
$$ 2130778 2592986 2958441 3108436 3290856 3556256 3795024 3922833 3807764 3305801 2389945
9970B389945j102644r45361n59011k11161K9035K13283L53506L78307L34117L87947
$$ 2389945 1287301 341940 -217071 -428232 -399197 -185914 167592 545899 880016 1267963
9960A267963L25334k0181l16148k61418q7377j264k9841n7869o9688j81285k14715
$$ 1267963 1593297 1573116 1256968 995550 908173 906909 877068 819199 749511 568226 353511
9949C53511j02083O1534L26738O35147O51609L64461R9223L1320L8036j01327
$$ 353511 251428 312962 639700 1274847 1926456 2290917 2390140 2421460 2459496 2358169
9939B358169l12450m07442l99858l39275j50188K40365N26944O35931P86415P79610
$$ 2358169 2045719 1638277 1238419 899144 748956 989321 1516265 2152196 2938611 3718221
9929C718221L83129q3365l17960n69167p89427p20822m38330j20830J78730L35417
$$ 3718221 4101350 4017985 3700025 3130858 2341431 1620609 1182279 1061449 1240179 1575596
9919A575596K01469q9345l73845m41192k65011n531J78935J12979k25943m28300
$$ 1575596 1777065 1687720 1313875 872683 607672 602141 781076 894055 668112 239812
9909B39812k28809P7702M10072P67833R18456P62037M20231J56652N0903j30575
$$ 239812 11003 88705 498777 1266610 2185066 2947103 3367334 3523986 3574889 3444314
9899C444314m10594m56051k28045n7095l5439k13335l81116l62420j46377O0880
$$ 3444314 3033720 2577669 2349624 2292529 2257090 2043755 1662639 1300219 1153842 1214722
9889A214722q06k48477l01036k8014J46992J28627J67019L11155L85115J32377
$$ 1214722 1213916 965439 664403 636389 783381 912008 1079027 1390182 1775297 1907674
9879A907674k93317l84616j33097p5108k29677j88914o0483o2838p0994r3197
$$ 1907674 1614357 1229741 1096644 1021536 791859 602945 542462 479624 408630 315433
9869C15433j04270j27725k23356k76381j19982K87079M03176o63m99761n34075
$$ 315433 211163 83438 -139918 -416299 -536281 -249202 153974 153311 -346450 -880525
9859h80525j6819N40078Q20505R65727R97048P37368K40185j35089k72244l35844
$$ -880525 -897344 -357266 463239 1428966 2426014 3163382 3403567 3268478 2996234 2660390
9849B660390l92074l12499o4485k1781j51017q9335J35278L43992L66030L13340
$$ 2660390 2268316 1955817 1891332 1869551 1718534 1629199 1764477 2108469 2474499 2787839
9839B787839L42292L72678K14090q0993j08965O8623J26570J15184J32887N7152
$$ 2787839 3130131 3502809 3716899 3635906 3526941 3595564 3722134 3837318 3970205 4027357
9829D027357j96407l97920k62452J909J44144M5560j88025k94454m48759o72693
$$ 4027357 3830950 3433030 3170578 3172487 3316631 3362191 3174166 2879712 2430953 1758260
9819A758260o72101l59065n1507J33068L14703L16985K26727J62259k3033k78373
$$ 1758260 1086159 727094 675587 808655 1123358 1440343 1667070 1829329 1806296 1527923
9809A527923l91557k55915L7426K38971K24455Q4615j71720n53858p43944m65227
$$ 1527923 1136366 880451 917877 1156848 1381303 1465918 1294198 740340 -3604 -468831
9799d68831m8290J91124L33477N11221O74332N71341K90644M7455J506J78404
$$ -468831 -517121 -325997 7480 518701 1193033 1764374 2055018 2102473 2103979 2282383
9789B282383K74655K19014R0495m7791k4560J2233j88635k35564K06737N66845
$$ 2282383 2557038 2776052 2866547 2818756 2794196 2806429 2617794 2382230 2588967 3155812
9779C155812N76819N02890K94308j7532j80620j26654p0648j31114j71220j58389
$$ 3155812 3732631 4235521 4529829 4512297 4331677 4205023 4134375 4003261 3832041 3673652
9769C673652j01791j05012l11161m93253n54337l89267j57231j40470k60753l47878
$$ 3673652 3571861 3466849 3155688 2662435 2108098 1718831 1561600 1421130 1160377 812499
9759H12499j91477J94997M92861O16481O25463M50948J72880m8873j08652j00627
$$ 812499 621022 816019 1308880 1925361 2550824 3001772 3174652 3125779 3017127 2916500
9749B916500j89622l04427l59474k35115P0997K26344J63162J71371K89503K84790
$$ 2916500 2726878 2422451 2062977 1827862 1898859 2125203 2288365 2459736 2749239 3034029
9739C034029K38555K26737M7181j37222j40782n6943q7045j60957m13K60003J91629
$$ 3034029 3272584 3499321 3546502 3409280 3268498 3211555 3124510 2963553 2963140 3223143 3414772
9728C414772m6976m6125J83777M03174M36747L26560Q2310k58305l76533k46818
$$ 3414772 3367796 3321671 3505448 3908622 4345369 4671929 4754239 4495934 4119401 3872583
9718C872583k05942l95704o83790r10817q37053n30787j52526K02958L34812L02931
$$ 3872583 3666641 3270937 2587147 1676330 839277 308490 155964 358922 693734 996665
9708I96665M06258O77916Q47429P03550K48621k41665n23449o18272n37433k88521
$$ 996665 1402923 2080839 2928268 3631818 3880439 3638774 3115325 2497053 1959620 1671099
9698A671099m3322k555q5363j26092j83066l28460m26084l07048k5373J33121
$$ 1671099 1627777 1625222 1539859 1413767 1230701 902241 476157 169109 143736 276857
9688B76857q147k04759k19308k10301k34543j10097R5186K56085L52210L51329
$$ 276857 268710 63951 -155357 -365658 -600201 -710298 -615112 -359027 -6817 344512
9678C44512K98551K49241J35557P3973J18565K14764K83258K87021L11709K85423
$$ 344512 643063 892304 1027861 1101834 1220399 1435163 1718421 2005442 2317151 2602574
9668B602574M9062j44264m8200J61969Q9376l01097o53525q11491r33007r11703
$$ 2602574 2651636 2507372 2459172 2621141 2710517 2409420 1755895 944404 11397 -900306
9658i00306o92026m29758k15324j00310j25560j52551M0K21227N36687Q32066
$$ -900306 -1592332 -2022090 -2237414 -2337724 -2463284 -2615835 -2615795 -2394568 -1857881 -1025815
9648a025815Q54894O77086N20847M71336L62536J27885j42131k64717k64729j84045
$$ -1025815 -170921 506165 1027012 1498348 1860884 1988769 1846638 1581921 1317192 1133147
9638A133147j9098J78532L05211K90747Q8798j46935j59863n0387J5960J45904
$$ 1133147 1114049 1292581 1597792 1888539 1977337 1830402 1670539 1620152 1636112 1782016
9628A782016L78533N97095N62614L26466J81393N2751j35296k78456l06138k77009
$$ 1782016 2160549 2757644 3320258 3646724 3828117 3880868 3745572 3467116 3160978 2883969
9618B883969k28618j77225j24995K3163L47240O27549N14341J07279k56495l54670
$$ 2883969 2655351 2478126 2353131 2376294 2723534 3351083 3865424 3972703 3716208 3361538
9608C361538k78348k20076j80139j13225p8550o4578j05734l13225n18923n77241
$$ 3361538 3083190 2863114 2682975 2569750 2491200 2426622 2320888 2007663 1488740 911499
9598I11499n67424m61811l76795l47419l08938j56809J22730M44430N88074M35540
$$ 911499 344075 -117736 -494531 -841950 -1150888 -1307697 -1184967 -740537 -152463 283077
9588B83077K40713J21923J29130K00605L61678P53105J122078J037882N26913
$$ 283077 523790 645713 774843 975448 1337126 2090231 3212309 4250191 4777104
9579D777104k0099l69230o90405r54727q94301n10002j21973r6175l12132k66551
$$ 4777104 4757005 4387775 3697370 2742643 1848342 1338340 1216367 1120192 808060 541509
9569E41509L1514K40070J76485J521j36511j36975N955J7646l0698j9085m4090
$$ 541509 573023 813093 989578 991099 854588 717613 723568 741214 710516 691431 647341
9558F47341k1219J20790K38090J53456M5351J98054M87293O54236N50644K55243
$$ 647341 626122 746912 985002 1138458 1183809 1381863 1869156 2523392 3074036 3329279
9548C329279l688j23802m0923M5614l8109j33601n1874R6295J13155j82186o04730
$$ 3329279 3325591 3201789 3160866 3206480 3168371 3034770 2982896 3079191 3192346 3010160 2405430
9537B405430o57576l82262r9851J4073o346l1479P4431L10217M97126N77163M65914
$$ 2405430 1747854 1365592 1265741 1279814 1273468 1241989 1316420 1626637 2123763 2700926 3166840
9526C166840J09616l00436m84616k83830J12818L92436N05183L76371j6275l57707
$$ 3166840 3276456 2976020 2491404 2207574 2320392 2712828 3218011 3594382 3578107 3220400
9516C220400m85415m22474l34724k25068l0190N9982r4126k66124j57881J8772
$$ 3220400 2734985 2312511 1977787 1752719 1722529 1782511 1688385 1422261 1264380 1283152
9506A283152O1851n8064j50590J19534N19131O07861L97553J14345j48269l84810
$$ 1283152 1345003 1286939 1136349 1255883 1775014 2382875 2780428 2894773 2746504 2361694
9496B361694n76480o56250n02981k55256j18703J84493O53307P76365M41589Q4400
$$ 2361694 1785214 1128964 625983 370727 252024 436517 1089824 1866189 2307778 2392178
9486B392178j1785j21125l28088l01466j22438n1740L9889K15475K73899K45215
$$ 2392178 2380393 2259268 1931180 1629714 1507276 1455536 1495425 1710900 1984799 2230014
9476B230014K30199J80423m0846l50746o06919q35028r53554p54761l71838j37804
$$ 2230014 2460213 2640636 2599790 2249044 1642125 807097 -146457 -901218 -1273056 -1410860
9466a410860j45997j89896j02577m725O3367K47537O09046Q88974P82426L39464
$$ -1410860 -1556857 -1746753 -1849330 -1854055 -1790688 -1543151 -934105 -45131 737295 1076759
9456A076759l7162k74593n73046p86666p04459l23398J50376M56729M37531J49588
$$ 1076759 1039597 765004 191958 -594708 -1299167 -1622565 -1472189 -1015460 -577929 -428341
9446d28341q8435m8075J07224J14581L9026J6366p419k9793l3198j5271R1803
$$ -428341 -516776 -564851 -457627 -343046 -304020 -287654 -295073 -324866 -358064 -373335 -281532
9435b81532K48280M08293N24054L96919N7909j10348n141m7709k36029j07701
$$ -281532 -33252 375041 899095 1296014 1353923 1243575 1238434 1190725 954696 846995
9425H46995L52821O98208N49130K6169l75656m37519l22532k62785k87485k51753
$$ 846995 1199816 1898024 2447154 2473323 2097667 1660148 1337616 1074831 787346 535593
9415E35593r8070J24195K15408R2500m9673m7402p1622j56007o2203J50856L14781
$$ 535593 437523 561718 777126 869626 819953 772551 700929 544922 482719 633575 948356
9404I48356L36732K23325K02960J63059k4536P2123L48037M00694L78896L87697
$$ 948356 1285088 1508413 1711373 1874432 1849896 1922019 2270056 2670750 3049646 3437343
9394C437343L75198L30079J41169k51094n25460o18916o08268m84313k69176J2896
$$ 3437343 3812541 4142620 4283789 4032695 3507235 2888319 2280051 1795738 1526562 1539458
9384A539458K86242L58607K84857J36419k9321j34732k90035n34048p00591o57205
$$ 1539458 1825700 2184307 2469164 2605583 2576262 2441530 2151495 1617447 916856 259651
9374B59651m15920j04783J16436K78411M77167O14744O48394M65818P8028j73214
$$ 259651 -156269 -261052 -144616 133795 610962 1225706 1874100 2339918 2417946 2244732
9364B244732j14213K5942m9549k79925m74018m43373k18524l9610J00451K55548
$$ 2244732 2130519 2156461 2106912 1826987 1352969 909596 691072 651462 751913 1007461
9354A007461K88473J93345J49968J98791K32383J50337K2967k7043M4849P946
$$ 1007461 1295934 1489279 1639247 1838038 2070421 2220758 2243725 2216682 2261531 2269477
9344B269477j88873k28007m0118K92094N44416N01794K52990n6644k50715j91872
$$ 2269477 2080604 1852597 1812479 2104573 2648989 3150783 3403773 3347129 3096414 2904542
9334B904542j15450k38582l18826k79638l46049m52914l52900m7530J47581R6252
$$ 2904542 2789092 2550510 2231684 1952046 1605997 1153083 800183 752653 900234 996486
9324I96486p8724j48659p6013O1183J30170K8863m3446O4614J77460J49741K21015
$$ 996486 917762 769103 693090 754273 884443 913306 869860 934474 1111934 1261675 1482690
9313A482690L36193K57423J46018J25124N5415L2343J95761M98552P62524O44581
$$ 1482690 1818883 2076306 2222324 2347448 2402863 2435206 2630967 3129519 3892043 4536624
9303D536624p503p82180r10373l10921K72760K70408j66219n89527p19193n94107
$$ 4536624 4529121 3746941 2836568 2525647 2798407 3068815 2902596 2313069 1593876 999769
9293I99769k72562K48729O15435O72511O07390K86489l23144o79511o35293m78899
$$ 999769 727207 975936 1591371 2263882 2871272 3157761 2834617 2155106 1519813 1040914
9283A040914k16405J48712M16744M36665J86452j49604l12738k60898p7573N6951
$$ 1040914 824509 973221 1389965 1826630 2013082 1863478 1550740 1289842 1212269 1269220
9273A269220m1283l99467n94499m54534k36899o4382R6013K46754M99830P45044
$$ 1269220 1227937 828470 233971 -220563 -457462 -521844 -425831 -179077 320753 1065797
9263A065797P48515M99668J81992n1225n8835Q6194R7994q397o4602j23458k08901
$$ 1065797 1814312 2313980 2495972 2444747 2385912 2472106 2570100 2561703 2497101 2373643 2164742
9252B164742j81591L2923J92260L370l78120n94263m90487j23349K90355N20606
$$ 2164742 1983151 2016074 2208334 2211704 1833584 1239321 748834 625485 915840 1436446
9242A436446M48421J59586j9888L9323K22321N15647P54516N77685J08949j86395
$$ 1436446 1884867 2044453 2024565 2063888 2286209 2801856 3556372 4134057 4243006 4056611
9232D056611k36773o2200M4797r1819k33019l59163m08475l25586r8237O6408
$$ 4056611 3819838 3757638 3802435 3710616 3477597 3118434 2709959 2384373 2286136 2352544
9222B352544M6879p0301j92122j17666J20092L03873K35018m1335k15480j93390
$$ 2352544 2399423 2329122 2137000 2019334 2139426 2443299 2678317 2636982 2421502 2228112
9212B228112l05722n62147n66328l77483k83265j61213K10678N81876O68764M17059
$$ 2228112 1922390 1360243 793915 416432 133167 -28046 182632 764508 1433272 1850331
9202A850331J25441j3098k464j7258k85257o75534q27129o55998l96946r6841
$$ 1850331 1975772 1962674 1960210 1942952 1657695 982161 155032 -500966 -897912 -994753
9192i94753K45051M51948L88721J12654j38553o4504L89483Q42027J018820Q87371
$$ -994753 -749702 -297754 90967 203621 65068 564 390047 1232074 2250894 3138265
9182C138265O53048M58293O4005l53212n40758n69468m78580l47271k80478k35690
$$ 3138265 3791313 4249606 4313611 3960399 3419641 2850173 2371593 2024322 1743844 1508154
9172A508154j18874M0431J93176L14343K80149P8185J5691J02924K08568L43575
$$ 1508154 1389280 1429711 1622887 1937230 2217379 2295564 2311255 2414179 2622747 2966322
9162B966322L47752J60693M0100M3787M0156p6536k62417l85499l16162O7277
$$ 2966322 3314074 3474767 3514867 3558654 3598810 3522274 3259857 2874358 2558196 2625473
9152B625473M57149N05395L37495J76649m456j48270k99789m61798n39661o76821
$$ 2625473 3082622 3588017 3925512 4102161 4097705 3949435 3649646 3187848 2648187 1971366
9142A971366q25931p32190l62944R0308M69397O66309N02984Q1853k70245l81477
$$ 1971366 1145435 413245 50301 140609 610006 1276315 1779299 1861152 1590907 1209430
9132A209430k78185m6840O6449K103j09944j23917m2682N7745J48501K1569k20552
$$ 1209430 931245 884405 950854 952957 843013 719096 676414 734159 882660 904229 683677
9121F83677l36397k96000k5644K15619K62271L08467K60000J81144J60712P9050
$$ 683677 347280 51280 25636 241255 503526 811993 1071993 1253137 1413849 1492899
9111A492899L7460K2168Q213R8192L34381N65349O67787P57368O79059J82776
$$ 1492899 1530359 1552527 1560740 1658932 1993313 2558662 3226449 3983817 4662876 4845652
9101D845652l36920m58799k71512k30589n01792o35191l87741K7895J80849O3069
$$ 4845652 4508732 4049933 3778421 3547832 3046040 2410849 2023108 2051003 2231852 2294921
9091B294921M1364K71807N19910N61860M86594M09774J16262l47031m47269j17895
$$ 2294921 2336285 2608092 3128002 3689862 4176456 4586230 4702492 4355461 3908192 3790297
9081C790297K05618L07114L27041L50501L11783K64547N1984l04563n14771n13592
$$ 3790297 3995915 4303029 4630070 4980571 5292354 5556901 5608885 5304322 4789551 4275959
9071D275959m29901m20109m97012m53820k65628p0038J37542J70873q5001m24005
$$ 4275959 3846058 3425949 2928937 2475117 2209489 2139451 2276993 2447866 2362865 1938860
9061A938860m88237j62398P5500j44082m88991m27420o4970J07648M9934O7347
$$ 1938860 1450623 1288225 1363725 1219643 730652 303232 238262 345910 395844 463191
9051D63191L35047N08610L64839J34140J06887J73722P7054j41499l53214m26766
$$ 463191 798238 1306848 1671687 1805827 1912714 2086436 2163490 2021991 1668777 1242011
9041A242011m29205l91811k35725L8422J59067M0300J68667N28920N72283O0220
$$ 1242011 812806 420995 185270 223692 382759 423059 591726 1120646 1692929 1753149
9031A753149n71845p26561l60728O0439J95335J08497O8538J54915K16294J09668
$$ 1753149 1181304 454743 94015 154454 349789 458286 526824 681739 898033 1007701
9021A007701l5787j59051l03867j47489L20211O69666P48385N49269J46216j79579
$$ 1007701 971914 812863 508996 361507 681718 1351384 2099769 2649038 2795254 2615675
9011B615675k43592j67736j89895k28212m4130K37791K85480K70268L96850N21877
$$ 2615675 2372083 2204347 2014452 1786240 1742110 1979901 2265381 2535649 2932499 3454376
9001C454376M85094K94306l147k83667k83436j80054j84834j54998j32081l54997
$$ 3454376 3939470 4233776 4230629 3946962 3663526 3483472 3298638 3143640 3011559 2656562
8991B656562o11165n48064l06212k64157m23177m82764l22538j67335r5239O8761
$$ 2656562 2045397 1497333 1191121 926964 503787 21023 -301515 -468850 -564089 -495328
8981d95328K23790K05451K3761j46062k09865k00159k8206L31209M41731K39420
$$ -495328 -271538 -66087 -42326 -188388 -398253 -598412 -626618 -295409 146322 385742
8971C85742P5549J3470O0709J27269J30539m41j78589k31700j40223r653J21365
$$ 385742 461291 474761 535470 662739 793278 792837 614248 382548 242325 232672 354037
8960C54037J61859N2829j66909l38516k24997J55721O06382P73036N44456K72690
$$ 354037 515896 568725 401816 63300 -161697 -5976 600406 1373442 1917898 2190588
8950B190588K07219J09394k45323m82624l49142j51016r2898j13822j78482j92395
$$ 2190588 2397807 2507201 2261878 1779254 1430112 1279096 1186198 1072376 893894 701499
8940G01499m6633J43780J29423j56791l11824j27682Q2749l0299k07662M736M76707
$$ 701499 654866 798646 928069 771278 459454 331772 414521 384222 176560 181296 658003
8929F58003P49633N61509J39298j1638J40868J57617N1928O9195K48228M59096
$$ 658003 1407636 1969145 2108443 2096805 2237673 2395290 2447218 2516413 2764641 3223737
8919C223737N41891M50748K32834J14496J30005R6017K7804J8281N9296N8610
$$ 3223737 3765628 4216376 4449210 4563706 4693711 4789728 4817532 4835813 4895109 4953719
8909D953719j40765l96281n32280o10564n64556l91944j40051O4159J10774J08961
$$ 4953719 4812954 4416673 3884393 3273829 2709273 2317329 2177278 2241437 2352211 2461172
8899B461172K33351L39247K07035q4944k58072o4648L32801N73403L91740p7824
$$ 2461172 2694523 3033770 3240805 3155861 2897789 2833141 3165942 3739345 4131085 4053261
8889D053261n11542q93554j199792j266060j056654o80740k79006J49497O83579
$$ 4053261 3541719 2648165 1448373 182313 -874341 -1555081 -1834087 -1684590 -1001011
8880a001011J138499J295847J172110P60684K86527M93j95132l95580o23842q20179
$$ -1001011 137488 1433335 2605445 3366129 3652656 3653149 3458017 3062437 2438595 1618416
8870A618416p37282l76901K4570J85674N4329p1717o4510j01834j73903q1369
$$ 1618416 881134 504233 528803 714477 768806 697089 632579 530745 356842 275473
8860B75473J09819L04821M41290M86712M77751K56542j01423j52538J15152K73862
$$ 275473 385292 690113 1131403 1618115 2095866 2352408 2250985 2098447 2213599 2487461
8850B487461J17656l7139n3181j54049l93984n76206m82495l22923l44608k86869
$$ 2487461 2605117 2567978 2514797 2360748 1966764 1390558 908063 585140 240532 -46337
8840d6337K7901M07392O42741O48567L69150j2898j53668O1465L52008L28823
$$ -46337 -18436 388956 1031697 1680264 2049414 2036516 1882848 1944313 2296321 2625144
8830B625144M1572j38541k07956k59229j21115j5793j40744l47203m70317l54790
$$ 2625144 2666716 2528175 2320219 2060990 1939875 1924082 1783338 1436135 965818 611028
8820F11028r6951L1569p092J40619L83734K64362m0911p6770Q441P5384K06771
$$ 611028 514077 545646 538554 679173 1062907 1327269 1286358 1209588 1218029 1293413 1500184
8809A500184M23562O08474N80739M60425M75591N06463M09753K92761O1733l30570
$$ 1500184 1923746 2532220 3112959 3573384 4048975 4555438 4965191 5257952 5319685 4989115
8799D989115o80890p62318n91417l84090k71668k13734k17290j67679j4295K40
$$ 4989115 4308225 3545907 2954490 2570400 2298732 2084998 1867708 1700029 1685734 1685974
8789A685974P56J05211N6750r4052k28006k86696k07983n3537J1676K3423Q9241
$$ 1685974 1686730 1791941 1848691 1754639 1526633 1239937 1031954 978417 990093 1013516 1102757
8778A102757K22645K58978J57392J40635J64052L3054k1453l9472j35370j18027
$$ 1102757 1325402 1584380 1741772 1882407 2046459 2079513 2058060 2018588 1883218 1765191
8768A765191N0726K37582L02484K13971L8781q1331k7099J72331L22575K57650
$$ 1765191 1815917 2053499 2355983 2569954 2608735 2527404 2500305 2672636 2995211 3252861
8758C252861O6996j82894n00007p03820n89665m11490k80566j13555m693P2337
$$ 3252861 3319857 3136963 2636956 1933136 1343471 931981 651415 537860 533167 605504
8748F05504K41659M04123M07778L13339J32487L6371Q2632n5581l93322o50955
$$ 605504 847163 1251286 1659064 1972403 2104890 2141261 2223893 2168312 1774990 1124035
8738A124035o40819m35824j84429K1239J21468J08793J86290M17085N64611N27970
$$ 1124035 483216 47392 -137037 -115798 5670 114463 300753 717838 1282449 1810419
8728A810419M31054L51380J36362k16330n17122n88434l47337P0436M55783O72140
$$ 1810419 2241473 2592853 2729215 2512885 1995763 1407329 1059992 1130428 1586211 2258351
8718B258351N84082K30360j03254j75658j59099l33322m12543j71110K61853O81128
$$ 2258351 2842433 3072793 2969539 2793881 2634782 2301460 1888917 1717807 1979660 2660788
8708B660788N87389J5040l78229l63009j48166M2472R4510p4949k69512l17767
$$ 2660788 3248177 3263217 2884988 2521979 2373813 2416285 2510795 2435846 2166334 1848567
8698A848567l48811l39581j48387k7007r9538j75955j71260J01344N19895N86954
$$ 1848567 1499756 1160175 1011788 984781 885243 709288 538028 639372 1159267 1746221
8688A746221K57624M8835O3786J13024M08133P04100N27894R7909j64431m8675
$$ 1746221 2003845 2052680 2116466 2229490 2637623 3341723 3869617 3967526 3803095 3754420
8678C754420K93730M48733K95739p825k69889l68728m41896m64882j95139K82358
$$ 3754420 4048150 4496883 4792622 4784797 4514908 4146180 3704284 3239402 3044263 3326621
8668C326621M36670J41139j45513j99455l28974m46063l35659j79402k25600l29677
$$ 3326621 3763291 3904430 3758917 3559462 3230488 2784425 2448766 2269364 2043764 1714087
8658A714087k28070k4796J74727L63646M30136M58249M41848Q6998m86732r36868
$$ 1714087 1486017 1461221 1635948 1999594 2429730 2887979 3329827 3416825 2930093 1993225
8648A993225r61047n55478o2128K95903M02492K74703J85568J40062n857j03815
$$ 1993225 1032178 476700 414572 710475 1112967 1387670 1573238 1713300 1707443 1603628
8638A603628j12154j25674j58914o5076K21468N32296N60943L37957J59220Q9066
$$ 1603628 1491474 1365800 1206886 1141810 1363278 1895574 2456517 2794474 2953694 3042760
8628C042760j9138k84357n52908n09403j87749J18827L27265M37975N32700N39569
$$ 3042760 3023622 2739265 2186357 1676954 1489205 1608032 1935297 2373272 2905972 3445541
8618C445541K25718k05880m54005m75153l94434l12804j50242M8696J46628O7395
$$ 3445541 3671259 3465379 3011374 2536221 2141787 1828983 1678741 1727437 1874065 1941460
8608A941460j12433j79806j85795j71357o7138Q1853L09814N03768N29504L83932
$$ 1941460 1829027 1649221 1463426 1292069 1224931 1306784 1616598 2120366 2649870 3033802
8598C033802J42516k392o3156j24099j65522j38953j78107k88657k51601m8751
$$ 3033802 3176318 3173926 3110770 2986671 2821149 2682196 2504089 2215432 1963831 1915080
8588A915080J66818K65624K18807J10909j49319m20860m34646l18632l43609m62866
$$ 1915080 2081898 2347522 2566329 2677238 2527919 2107059 1672413 1353781 1010172 547306
8578E47306l79166n7132Q6142o7139j92630q6395N6625Q0083J79976N44058R06949
$$ 547306 168140 111008 197150 130011 -62619 -149014 -92389 -12306 167670 711728 1618677
8567A618677R27753P81686O42740N48639N08096L71038K69999K41919J75233J43954
$$ 1618677 2546430 3328116 3970856 4519495 5027591 5398629 5668628 5910547 6085780 6229734
8557F229734K70693M50385N05394M09486K59552J67481N8730L3243J36667K86394
$$ 6229734 6500427 6950812 7456206 7865692 8125244 8292725 8351455 8384698 8521365 8807759
8547H807759M77426O13908N87727M68629K91033J9760k69361m34861l96758r4686
$$ 8807759 9285185 9899093 10486820 10955449 11246482 11266242 10996881 10562020 10165262 10070576
8537A0070576L69348O27849N92793O77851J043515J344695J504729J566449J381592
$$ 10070576 10439924 11067773 11660566 12338417 13381932 14726627 16231356 17797805 19179397
8528A9179397J129607J171195J319330J435372J719652K042105K229657K259976
$$ 19179397 20309004 21480199 22799529 24234901 25954553 27996658 30226315 32486291
8520C2486291K183348J918256J370662P20105Q7281o09810j335355j850410j907167
$$ 32486291 34669639 36587895 37958557 38678662 38765943 38156133 36820778 34970368 33063201
8511C3063201j671525j432641j327913j386047j381588j415438j677943j866445
$$ 33063201 31391676 29959035 28631122 27245075 25863487 24448049 22770106 20903661
8503B0903661j739687j554730j479634j417444j202549q12408m15994l07047m42106
$$ 20903661 19163974 17609244 16129610 14712166 13509617 12697209 12281215 11974168 11532062
8494A1532062n87040o05112l26981L3676P3717j81151m34995m04830k58547j71052
$$ 11532062 10945022 10339910 10012929 10046605 10120322 9939171 9504176 9099346 8840799 8669747
8484H669747J880K29410K34215J7648j22691j90164k98074l30773j95006l8876
$$ 8669747 8671627 8901037 9135252 9152900 9030209 8840045 8541971 8211198 8016192 7977316
8474G977316L01n7847j96326m45651o36641p06169o38763k68264J78293K80612
$$ 7977316 7977617 7919770 7723444 7277793 6641152 5934983 5296220 5027956 5206249 5486861
8464E486861J28860J4901N4965J01040O5523j92165o21421r00031q10636m15581
$$ 5486861 5615721 5630622 5685587 5786627 5852150 5659985 5038564 4138533 3327897 2912316
8454B912316q4103Q0758K31153L87559N10755M99806L01683J03236J39078K71506
$$ 2912316 2828213 2908971 3140124 3527683 4038438 4538244 4839927 4943163 5082241 5353747
8444E353747K15420m8625k04373J9980L72658K74305k07682n41803n02759j95922
$$ 5353747 5569167 5520542 5316169 5336149 5708807 5983112 5775430 5233627 4730868 4534946
8434D534946N4235q8684m67111o00803l82179p9508J06610M7377j58694j78351
$$ 4534946 4589181 4500497 4033386 3432583 3050404 2970896 3077506 3124883 2966189 2787838
8424B787838j09163K5133L02880O03538Q18492P96741M83774J17088j74160k99470
$$ 2787838 2678675 2703808 3006688 3610226 4428718 5225459 5709233 5826321 5652161 5352691
8414E352691k55373k22515j95106k60494m08522l07664o2117j04447k64374k98421
$$ 5352691 5097318 4874803 4679697 4419203 4010681 3703017 3640900 3536453 3272079 2973658
8404B973658j91460l8195M8420P5686J37976K11861J83654J88645L27487L25055
$$ 2973658 2782198 2744003 2792423 2868109 3006085 3217946 3401600 3590245 3917732 4242787
8394D242787K86863L82180M31415K59668P0733k4660j32219j82733R373K19630
$$ 4242787 4529650 4911830 5343245 5602913 5673646 5648986 5516767 5334034 5343407 5563037
8384E563037J40076q1294j96094j53594L1493L25972L94563l6661m51898n19624
$$ 5563037 5703113 5621819 5425725 5272131 5303624 5629596 6024159 5987498 5535600 5015976
8374E015976m71353m41579m30318k46185K54469O92141N91917L19954J68598J26398
$$ 5015976 4544623 4103044 3672726 3426541 3681010 4373151 4965068 5285022 5453620 5580018
8364E580018P7214l1890o4019q9895j59570j42840j63051k62078k91136j32102
$$ 5580018 5657232 5625342 5561323 5471428 5311858 5169018 5005967 4743889 4452753 4320651
8354D320651Q0564J59841J79046J75700J63229K76297N84458Q16905P30396M91821
$$ 4320651 4401215 4561056 4740102 4915802 5079031 5355328 5939786 6756691 7487087 7978908
8344G978908L23746Q3318j71927k73886k58476j15720R137L4212l4621n5514J76009
$$ 7978908 8302654 8385972 8214045 7940159 7681683 7565963 7575100 7609312 7574691 7519177 7695186
8333G695186L55212L28516L01195L13119L17781K02638J51164L93005O25953N96408
$$ 7695186 8050398 8378914 8680109 8993228 9311009 9513647 9664811 10057816 10683769 11280177
8323A1280177L77163J50693J73416M58821Q57139J125814J210166J257955J360468
$$ 11280177 11657340 11808033 11981449 12440270 13297409 14423223 15633389 16891344 18251812
8314A8251812J559049J764371J923892K049369K324951K800258L207826L269681
$$ 18251812 19810861 21575232 23499124 25548493 27873444 30673702 33881528 37151209
8306C7151209L060597K926519L011348K943486K476612J891099J394416Q11362
$$ 37151209 40211806 43138325 46149673 49093159 51569771 53460870 54855286 55666648
8298E5666648J32653l36152n86363j053483j741928k299074k533034k543274k377568
$$ 55666648 55799301 55463149 54876786 53823303 52081375 49782301 47249267 44705993 42328425
8289D2328425k194423k205387k205754j958835j455396r66483o49534n41035n57645
$$ 42328425 40134002 37928615 35722861 33764026 32308630 31342147 30692613 30151578 29593933
8280B9593933m75691m04449l70729q0822L05302L08976l0305l58398m08426k02495
$$ 29593933 29118242 28713793 28343064 28262242 28567544 28876520 28846215 28487817 28079391 27876896
8270B7876896l4706J37026N45262J105881J584683J885481K030903K042010J831811
$$ 27876896 27842190 27979216 28524478 29630359 31215042 33100523 35131426 37173436 39005247
8261C9005247J621136J710888J971589K170208K533404L392369M546011N554762
$$ 39005247 40626383 42337271 44308860 46479068 49012472 52404841 56950852 62505614
8253F2505614O384306P222048Q092336Q738588R111569R296983R238722R026864
$$ 62505614 68889920 76111968 84204304 92942892 102054461 111351444 120590166 129617030
8245A29617030Q643926P758459O172802L999455J539055r39709l144690m907212
$$ 129617030 138260956 146019415 152192217 156191672 157730727 156791018 153646328 148739116
8237A48739116o175901o940164p368573p597979p666032p663860p430770o701306
$$ 148739116 142563215 135623051 128254478 120656499 112990467 105326607 97895837 91194531
8229I1194531n617479m549455l805152l356650k978998k625050k408535k247021
$$ 91194531 85577052 81027597 77222445 73865795 70886797 68261747 65853212 63606191
8221F3606191j940442j480206j044902p59927n64527l50022j88485j73042j03076
$$ 63606191 61665749 60185543 59140641 58380714 57816187 57466165 57277680 57104638 57001562
8212E7001562N9410K53028M96948Q59744J253491J561616J982794K602183L224430
$$ 57001562 57060972 57314000 57810948 58670692 59924183 61485799 63468593 66070776 69295206
8203F9295206L908592M759387N719024O699454P661720Q592084R635617J1056435
$$ 69295206 73203798 77963185 83682209 90381663 98043383 106635467 116271084 127327519
8195A27327519J2812114J4613247J6126402J7343496J8236832J8716526J8631033
$$ 127327519 140139633 154752880 170879282 188222778 206459610 225176136 243807169
8188B43807169J7655825J5815127J3150295R513773M910092j6638m594901q770238
$$ 243807169 261462994 277278121 290428416 299942189 304852281 304835643 300240742 291470504
8180B91470504j2225989j4740172j6474495j7286402j7103280j6187136j4848731
$$ 291470504 279244515 264504343 248029848 230743446 213640166 197453030 182604299
8173A82604299j3339709j1989830j0932421r836074q546093p178554n999231n039175
$$ 182604299 169264590 157274760 146342339 136506265 127960172 120781618 114782387 109743212
8165A09743212m278611l865247l780661l804713l603339l061511k335586j625262
$$ 109743212 105464601 101599354 97818693 94013980 90410641 87349130 85013544 83388282
8157H3388282j150845r00694o34069l05593n6241K00319M81333R69975J713248
$$ 83388282 82237437 81336743 80702674 80397081 80340840 80541159 81022492 81992467 83705715
8148H3705715K428645L154575L940750M765681N680724O674586P792117R066520
$$ 83705715 86134360 89288935 93229685 97995366 103676090 110350676 118142793 127209313
8140A27209313J0342218J1714754J3404941J5375352J7481965J9506825K0997360
$$ 127209313 137551531 149266285 162671226 178046578 195528543 215035368 236032728
8133B36032728K1725266K1886573K1278201J9348789J6085619J1772309O608880
$$ 236032728 257757994 279644567 300922768 320271557 336357176 348129485 354738365
8126C54738365R99289m539221r510119j3577608j6718691j8906032j9898734j9985213
$$ 354738365 355737654 351198433 341688314 328110706 311392015 292485983 272587249 252602036
8118B52602036j9571856j8609225j7065816j5258124j3613783j2274261j0863055
$$ 252602036 233030180 214420955 197355139 182097015 168483232 156208971 145345916
8111A45345916r343914q071713p113112o365986n739165n202114m624777l960802
$$ 145345916 136002002 127930289 120817177 114451191 108712026 103509912 98885135 94924333
8103I4924333l399036l109939k981413k727628k243491j706616j203572o68784
$$ 94924333 91525297 88415358 85433945 82706317 80462826 78756210 77552638 76883854
8095G6883854m5301N19048Q67854J145528J620512K287713K925888L427965M017654
$$ 76883854 76838553 77357601 78225455 79370983 80991495 83279208 86205096 89633061 93650715
8086I3650715M816792N841497P034293Q229613R420495J0636540J1933758J3482449
$$ 93650715 98467507 104309004 111343297 119572910 128993405 139629945 151563703 165046152
8078A65046152J5311224J7043915J8209842J8568269J8171901J6995019J4698118
$$ 165046152 180357376 197401291 215611133 234179402 252351303 269346322 284044440
8071B84044440J1155688O933063K497560k170966o819745j0956003j4047632j5865721
$$ 284044440 295200128 302133191 304630751 302459785 295640040 284684037 270636405 254770684
8063B54770684j6762741j7176872j7174416j6614005j5590837j4385028j2962111
$$ 254770684 238007943 220831071 203656655 187042650 171451813 157066785 144104674
8056A44104674j1335190r846529q666087p677612o901073o320165n692631m728233
$$ 144104674 132769484 122922955 114256868 106579256 99678183 93358018 87665387 82937154
8048H2937154l729162l205362l211992l338263l156742k649626k050172j645589
$$ 82937154 79207992 76002630 72790638 69452375 66295633 63646007 61595835 59950246
8040E9950246j374799j103454j124546j273859j127384o36602J0056N54223R25151
$$ 59950246 58575447 57471993 56347447 55073588 53946204 53309602 53319658 53873881 54799032
8031E4799032J262861J677777K103224K646882L335104L870461M310842M829741
$$ 54799032 56061893 57739670 59842894 62489776 65824880 69695341 74006183 78835924
8023G8835924N554838O609747P592304Q139788Q430039Q653339Q823822Q820476
$$ 78835924 84390762 91000509 98592813 106732601 115162640 123815979 132639801 141460277
8015A41460277Q269367O832609M471348J609474j129232l475114n361849o698212
$$ 141460277 149729644 156562253 161033601 162643075 161513843 158038729 152676880 145978668
8007A45978668p585578q147020q331586q142038p732594p419964p289089o935044
$$ 145978668 138393090 130246070 121914484 113772446 106039852 98619888 91330799 84395755
7999H4395755n989008m841489l991747l468995l121075k856916k441135j766448
$$ 84395755 78406747 73565258 69573511 66104516 62983441 60126525 57685390 55918942
7991E5918942r89616l04102J35825L41906L51778L25399N42110Q60123J032377
$$ 55918942 54929326 54625224 54761049 55102955 55454733 55780132 56322242 57182365 58214742
7982E8214742J150127J111694Q15025L97370n1062n02759q62531j088714j227614
$$ 58214742 59364869 60476563 61291588 61688958 61637896 61135137 60272606 59183892 57956278
7973E7956278j314412j282231j124205j060276r77404n15285R0763N06289P80495
$$ 57956278 56641866 55359635 54235430 53175154 52197750 51682465 51773228 52279517 53060012
7964E3060012J014166J210710J404626J722649J989200J891740J446276J021245
$$ 53060012 54074178 55284888 56689514 58412163 60401363 62293103 63739379 64760624
7956F4760624O02405j01137q25032j292612j766213k315341k814594l356591l878412
$$ 64760624 65363029 65261892 64436860 63144248 61378035 59062694 56248100 52891509 49013097
7947D9013097m076256l789847l316646l002181k729430k339100k000726j903111
$$ 49013097 44936841 41146994 37830348 34828167 32098737 29759637 27758911 25855800
7939B5855800j786237j479260j280744j216296j033176q40313r21888j038130
$$ 25855800 24069563 22590303 21309559 20093263 19060087 18219774 17297886 16259756
7931A6259756p87513l43712k86140m87578m14662j71577j78996m68828o38274
$$ 16259756 15472243 15128531 14842391 14354813 13940151 13768574 13589578 13120750 12482476
7922A2482476m91429j95446j3139k4711j20808j68015o2748J9281n0441k00371
$$ 12482476 11991047 11795601 11782462 11757751 11636943 11468928 11406180 11425461 11375020 11174649
7912A1174649l57784m46894n25257n29211l10065j10837j66873l85707n12611
$$ 11174649 10816865 10369971 9844714 9315503 9005438 8894601 8727728 8342021 7829410
7903G829410n86195m92512r9722K53254L80483M94237N85272N66029N57738M77982
$$ 7829410 7243215 6750703 6650981 6904235 7284718 7778955 8364227 8930256 9487994 9965976
7893I965976K76968J54125J47098R0011j69560m57510m98806l18795p5710J39477
$$ 9965976 10242944 10397069 10544167 10634178 10464618 10007108 9508302 9189507 9113797 9253274
7883I253274K04153Q6412j77240l26840j56816K8014k8909l70182p32530o77964
$$ 9253274 9457427 9543839 9366599 9039759 8882943 8910957 8882048 8511866 7779336 7101372
7873G101372l93325j92142j18326q3703j01025j94542j93846J07347N57479Q20458
$$ 7101372 6708047 6515905 6397579 6313876 6212851 6018309 5824463 5931810 6489289 7309747
7863G309747Q06618N58485K67423J15015J41314K26705K39580J77054R9199P8425
$$ 7309747 8116365 8674850 8942273 9057288 9198602 9425307 9664887 9841941 9941140 10019565
7853A0019565J06161J86041K71618K92863J92982J58044L30901L63361K14312
$$ 10019565 10125726 10311767 10583385 10876248 11069230 11227274 11558175 11921536 12135848
7844A2135848J20504K54606M87376N61121L97950J39484J07754M57604Q71301
$$ 12135848 12256352 12510958 12998334 13559455 13957405 14096889 14204643 14662247 15533548
7835A5533548R42131P40244O15125Q00684J151125J433907J696836J822248J819011
$$ 15533548 16475679 17215923 17831048 18631732 19782857 21216764 22913600 24735848 26554859
7826B6554859K027848K320930K478613K564279K664539K862946L244910L820687
$$ 26554859 28582707 30903637 33382250 35946529 38611068 41474014 44718924 48539611
7818D8539611M463746M949129N268495N688266O274317O777562P036272O715463
$$ 48539611 53003357 57952486 63220981 68909247 75183564 81961126 88997398 95712861
7810I5712861N717503M368189K966860J589048J18904j389665k813138m211495
$$ 95712861 101430364 105798553 108765413 110354461 110473365 109083700 106270562 102059067
7802A02059067n377611o051963o163365n920593n725050n477189n032379m668803
$$ 102059067 96681456 90629493 84466128 78545535 72820485 67343296 62310917 57642114
7794E7642114m422154m140084l809767l363581k822653k426698k145633j950892
$$ 57642114 53219960 49079876 45270109 41906528 39083875 36657177 34511544 32560652
7786C2560652k038068k119626j946731j722090j525674j357357j263986j134352
$$ 32560652 30522584 28402958 26456227 24734137 23208463 21851106 20587120 19452768
7778A9452768r57531r85174j281472j439217j091034m55786k0535J89750L06561
$$ 19452768 18495237 17510063 16228591 14789374 13698340 13242554 13222019 13411769 13718330
7769A3718330K31121Q2129l4352k56315n36598p91926j032683j002602p50734
$$ 13718330 13949451 14031580 13997228 13740913 13204315 12412389 11379706 10377104 9626370
7760I626370m12956j51484j52497k35673l34164l22516j39415J29691K10753j21386
$$ 9626370 9213414 9061930 8909433 8673760 8339596 8017080 7877665 8007356 8218109 8096723
7750H096723n81086q16962q79132q07098m32384N8521L55913M00775K46964M9730
$$ 8096723 7515637 6698675 5819543 5012445 4580061 4638582 4994495 5395270 5642234 5691964
7740E691964o091J75542L62932L56636M12385M99065K21738l44154o52473n83527
$$ 5691964 5685873 5861415 6224347 6580983 6993368 7492433 7714171 7370017 6717544 6134017
7730F134017m32091l07964p5578J97948J33936j52348l13935l18440k82714l31323
$$ 6134017 5701926 5393962 5318384 5516332 5650268 5497920 5183985 4865545 4582831 4251508
7720D251508l43259k2369M17266M88560K39650O5219k8535k16732l95336l61004
$$ 4251508 3908249 3885880 4303146 4791706 5031356 5096575 5068040 4851308 4455972 4094968
7710D094968k77863k81690k31572j45451q8406k4027m3013r1412k5394k5506k25768
$$ 4094968 3817105 3535415 3303843 3158392 3069986 3045959 3002946 2911534 2886140 2860634 2634866
7699B634866l47471k37320m6188R5153J94493K34721K9052l11581m27085k88392
$$ 2634866 2287395 2050075 2003887 2099040 2293533 2528254 2557306 2245725 1818640 1530248
7689A530248n8131J98276M97115O64814N79693L82226L01775L26736K11567j02891
$$ 1530248 1472117 1670393 2167508 2832322 3412015 3794241 4096016 4422752 4634319 4531428
7679D531428l74914m02089l31843k92413j53646J93014N80586P19149O37083M57251
$$ 4531428 4156514 3754425 3422582 3130169 2976523 3169537 3750123 4469272 5106355 5563606
7669E563606K7260m80161p21979o65105m71095l35477j58154K5097K4823P88M2650
$$ 5563606 5590866 5110705 4388726 3723621 3252526 2917049 2758895 2783992 2808815 2809603 2852253
7658B852253K6521L2685J36333J65939N8296j82245l72951l44917k47224j68904
$$ 2852253 2878774 2911459 3047792 3213731 3272027 3089782 2716831 2371914 2124690 1955786
7648A955786q4543R2277M70477P61033O15179K21518j13859k40628r2002K34320
$$ 1955786 1871243 1963520 2433997 3195030 3810209 4031727 3917868 3677240 3585238 3819558
7638C819558M53488M27547K01688r7604l61908n25013m80716j62231L11429O19607
$$ 3819558 4273046 4700593 4902281 4804677 4442769 3917756 3437040 3274809 3586238 4205845
7628D205845O12947L85693J63631N723k5069R5013J51891J77856K02783J24364
$$ 4205845 4818792 5204485 5368116 5373839 5348770 5443783 5595674 5773530 5976313 6100677
7618F100677o9391j63557r550K31764K65046O6929j40782l83181o04806n88359
$$ 6100677 6031286 5867729 5858179 6089943 6354989 6421918 6281136 5897955 5293149 4704790
7608D704790m52990k59843M6141K04025K24969L32847L98658K40772L7077j0655
$$ 4704790 4251800 3991957 4038098 4242123 4467092 4799939 5198597 5439369 5476446 5465791
7598E465791K31914N76916N88105K08845l04234m37441k24316r2211j39767k20919
$$ 5465791 5697705 6274621 6862726 7071571 6767337 6329896 6105580 6013369 5873602 5652683
7588E652683p4907J41937L9874j07218j14949m0911Q6670J65988J70139R5423
$$ 5652683 5577776 5719713 5759587 5652369 5537420 5496509 5583179 5749167 5919306 6014729
7578F014729J10491K96589N33220P32074P20178N02326K63694O2914l2161M6318
$$ 6014729 6125220 6421809 6955029 7687103 8407281 8909607 9173301 9236215 9204054 9250372
7568I250372J63143L55263Q26768J248656J229540R34753O38636N61848P27471
$$ 9250372 9413515 9768778 10595546 11844202 13073742 14008495 14647131 15208979 15936450
7559A5936450Q88401R12644R14439R39943Q58580Q66414J134476J402863J595692
$$ 15936450 16824851 17737495 18651934 19591877 20450457 21316871 22451347 23854210 25449902
7550B5449902J753647J893886K130774K542893K916536L157007L436197L896731
$$ 25449902 27203549 29097435 31228209 33771102 36687638 39844645 43280842 47177573
7542D7177573M468140N018386N562364O067373O400986O397104O283694O164337
$$ 47177573 51645713 56664099 62226463 68293836 74694822 81091926 87375620 93539957
7534I3539957N770014M827621L264958J439708k65939j803562l190867m445332
$$ 93539957 99309971 104137592 107402550 108842258 108576319 106772757 103581890 99136558
7526I9136558n472455o037167o184241n984649n447555m895954m571796m392306
$$ 99136558 93664103 87626936 81442695 75458046 70010491 65114537 60542741 56150435
7518E6150435m196955l832597l393696l052594k839112k758405k602972k308645
$$ 56150435 51953480 48120883 44727187 41674593 38835481 36077076 33474104 31165459
7510C1165459k020843j878227j797723j587738j356412j241702j231736j105391
$$ 31165459 29144616 27266389 25468666 23880928 22524516 21282814 20051078 18945687
7502A8945687q29610o72951o77110o96461p02127p70075q57525q60473p63208
$$ 18945687 18116077 17443126 16766016 16069555 15367428 14597353 13739828 12879355 12116147
7493A2116147n50693l06832j45791m1072r8070k45690l81443m88771m69459k66746
$$ 12116147 11565454 11258622 11112831 11071759 10973689 10727999 10346556 9857785 9388326 9121580
7483I121580o2106r8226j85659l8158K75658N30133K56938o03484j276308j271304
$$ 9121580 9059474 8961248 8775589 8737431 9013089 9543222 9800160 9196676 7920368 6649064
7473F649064q69397n30817m28727k90457K6553L25558M59071L02139M1500l0913
$$ 6649064 5779667 5248850 4820123 4529666 4556219 4881777 5340848 5642987 5684487 5653574
7463E653574K467K3953Q7103J53665J05896k5211j97735k77334j45164k7729n3701
$$ 5653574 5656041 5679994 5767097 5920762 6026658 6001447 5803712 5526378 5381214 5353485 5299784
7452E299784l7783o1167k60089m70262m73894l56068k39043o5256K07861L82706
$$ 5299784 5262001 5200834 4940745 4470483 3996589 3640521 3401478 3336222 3544083 3926789
7442C926789L42268K08860J3201o8331J5433l9728j61727j76310j23514p0078
$$ 3926789 4269057 4477917 4491118 4422787 4438220 4398492 4236765 4060455 3936941 3866863
7432C866863l5219P8431Q9514j27123l68647l59028j43345N1020K06415L83434
$$ 3866863 3831644 3910075 3999589 3872466 3503819 3144791 3001446 3052466 3258881 3642315
7422C642315M12807K07411k4306j29368j24693j00505j44948k34487m32367n53210
$$ 3642315 4055122 4262533 4238227 4108859 3984166 3883661 3738713 3504226 3071859 2518649
7412B518649l70445r5955J37298L75616N10222M04842J93861j9603j49879m9677
$$ 2518649 2148204 2052249 2189547 2565163 3075385 3480227 3674088 3654485 3504606 3454929
7402C454929k914q8325j42236j63816r5296J20919M12035N20851L44308J22690
$$ 3454929 3452015 3363690 3221454 3057638 2962342 3083261 3495296 4016147 4360455 4483145
7392D483145o1957k07381r7555J57363J96918J12118J94249L48527M42682M29140
$$ 4483145 4421188 4213807 4116252 4273615 4470533 4582651 4776900 5125427 5568109 5997249
7382E997249K68640q6565n06021o16905m08542j31049M2665n308k74096n60112
$$ 5997249 6265889 6179324 5673303 5056398 4647856 4516807 4559472 4554164 4280068 3719956
7372C719956n00321j63092O4743M6970j17586j60287N0331K89688K41219j0196
$$ 3719956 3219635 3056543 3121286 3168256 3050670 2890383 2940714 3230402 3471621 3461425
7362C461425j68515o8946J47904K19345J13927m2976k45239m26136l58712l8109
$$ 3461425 3292910 3223964 3371868 3591213 3705140 3662164 3416925 2990789 2632077 2593968
7352B593968J47550J17891m385j23919k99248n99851q01469p30095l92804J2678
$$ 2593968 2741518 2859409 2855024 2731105 2431857 1832006 1030537 300442 -92362 -79684
7342g9684K70053K34189p0780l72200n14461n19961l34468j17308l5077O9644
$$ -79684 190369 424558 353778 -18422 -532883 -1052844 -1387312 -1504620 -1539697 -1470053
7332a470053L34791N11798N00309L56970J63867N6801J7748j11552k63791j31791
$$ -1470053 -1135262 -623464 -123155 233815 397682 454483 472231 360679 96888 -34903
7322c4903K89440N14136L92146K18142J13135q0431k01468N4431M90455P62695
$$ -34903 254537 768673 1160819 1378961 1492096 1411665 1210197 1264628 1755083 2517778
7312B517778P32068M53683J18840N950J05788J51625M8425j32046j80697o8801
$$ 2517778 3249846 3703529 3822369 3828319 3934107 4085732 4134157 4002111 3821414 3752613
7302C752613k9240j14510j95760j78633o1602l7556j86338k65143j24948J34374
$$ 3752613 3723373 3608863 3413103 3234470 3172868 3135312 2948974 2683831 2558883 2693257
7292B693257L47538L58003K15399K45478M29596L37786k4448l10299l43502k17197
$$ 2693257 3040795 3398798 3614197 3859675 4289271 4627057 4602609 4292310 3948808 3731611
7282C731611r3732j65480k02915j41970r6256K8912J37511J14624Q4746J70362
$$ 3731611 3637879 3472399 3269484 3127514 3031258 3060170 3197681 3312305 3397051 3567413
7272C567413J92903p5197m16608m59779k01202J43155L88423M48944L00718o9183
$$ 3567413 3760316 3685119 3268511 2808732 2607530 2750685 3139108 3588052 3888770 3819587
7262C819587m75299o42020m46437p6776M3569k12741l68255k27102r7106q3753
$$ 3819587 3344288 2702268 2255831 2179055 2222624 2009883 1641628 1414526 1317420 1233667
7252A233667q815P2264R4873J00110J34760K14001J40555j02492l12710l68539
$$ 1233667 1224852 1297116 1391989 1492099 1626859 1840860 1981415 1878923 1566213 1197674
7242A197674j24763M08350P68569P61285N22929L24733J97975M11j86773k54766
$$ 1197674 1072911 1481261 2249830 3011115 3534044 3858777 4056752 4057163 3870390 3615624
7232C615624l27702m52461m41424l02971k30231r6303J71319M26813M61935L21401
$$ 3615624 3287922 2835461 2394037 2091066 1860835 1764532 1935851 2362664 2824599 3146000
7222C146000K08182O8286o1306r5264p0870J8517Q4673P4391p1057l09630l69063
$$ 3146000 3354182 3422468 3361162 3265898 3195028 3213545 3298218 3372609 3301552 2991922 2622859
7211B622859j86637l1524o6325q7568L7871J77203K73358L81230L73543K05836
$$ 2622859 2436222 2404698 2338373 2250805 2288676 2465879 2739237 3120467 3494010 3699846
7201C699846p0950k25225j07860O1470M4876j34681l55946l79527k33827j21538
$$ 3699846 3628896 3403671 3295811 3357281 3402157 3267476 2911530 2532003 2298176 2176638
7191B176638J1561Q5253J34332J12850p3727k58116j71308J40526M95019O20002
$$ 2176638 2188199 2273452 2407784 2520634 2446907 2188791 2017483 2158009 2653028 3273030
7181C273030M12502J25607j59546l99631m31020l47160l51884l33720j92397m8031
$$ 3273030 3685532 3811139 3651593 3251962 2820942 2473782 2121898 1788178 1595781 1547750
7171A547750J67342L07881J95584J16660K76632M20542L16009Q3734j94313m99027
$$ 1547750 1715092 2022973 2218557 2335217 2611849 3032391 3348400 3432134 3237821 2738794
7161B738794n34457k43393N6172K96907L31576R506l29389l87773k15794p6138
$$ 2738794 2204337 1960944 2017116 2314023 2645599 2655105 2325716 1937943 1722149 1646011
7151A646011p6512j67149k41785j39090Q1609K63575L84008L65596J34822j62632
$$ 1646011 1569499 1402350 1160565 1021475 1103084 1366659 1750667 2116263 2251085 2088453
7141B088453l46922k93078l02414m39567l85445j49018O2491J77751M13336P51453
$$ 2088453 1741531 1448453 1146039 706472 321027 172009 234500 412251 825587 1577040
7131A577040P29728L92000J20387J2551k2991K6638K17682K85866J95384K08439
$$ 1577040 2306768 2698768 2819155 2831706 2808715 2835353 3053035 3338901 3534285 3742724
7121C742724J79934K5949q0326j98150k80180l55770l72846k99632l73454o09815
$$ 3742724 3922658 3948607 3868281 3670131 3389951 3034181 2661335 2361703 1988249 1378434
7111A378434p59141o07893l43717j97728K3824L86941N28022L32061N1471o0939
$$ 1378434 619293 11400 -332317 -530045 -506221 -119280 408742 740803 792274 731335
7101G31335k620P0969J65450J16901j27402j75749J0753M3889M9382J58800L35162
$$ 731335 728715 799684 965134 1082035 954633 778884 789637 833526 882908 1041708 1376870
7090A376870M43959K61607p886j19984n345J72850K73664M50199N90799L79666
$$ 1376870 1820829 2082436 2074550 1954566 1949221 2122071 2395735 2845934 3436733 3816399
7080C816399l1866k72979l78964o17933p78580m60738J85113O54698O51846L17481
$$ 3816399 3784533 3511554 3132590 2514657 1736077 1275339 1460452 2115150 2766996 3084477
7070C084477j06068m65000o53123o36854n07696m07634k52137j06868r2623j25208
$$ 3084477 2978409 2513409 1860286 1223432 715736 308102 55965 -50903 -143526 -268734
7060b68734j36082j42083r2070O7474J85641L92917P14592P03512K60973j72218
$$ -268734 -404816 -546899 -638969 -571495 -385854 7063 721655 1425167 1686140 1513922
7050A513922m32388o26862o01335k52411J08869J98869L17958O72628Q76010P43517
$$ 1513922 1081534 454672 -146663 -399074 -290205 -91336 226622 899250 1775260 2518777
7040B518777M34909J43613m9986j54244j35356J0914J16888K3455j36308r8098
$$ 2518777 2953686 3097299 3047313 2893069 2757713 2768627 2885515 2908970 2772662 2674564
7030B674564J1840K0174M9794J84590J11177k33954m31229l80538k77994n7485
$$ 2674564 2686404 2706578 2756372 2940962 3052139 2818185 2386956 2006418 1728424 1670939
7020A670939J77601J66468m2338k07550j15885m088K3726J56452L88740O24220
$$ 1670939 1848540 2015008 1972670 1765120 1649235 1645147 1668873 1825325 2214065 2838285
7010B838285P28671N39196K16210O7622O4341k787p6220J0543J27985L4627r3762
$$ 2838285 3566956 4106152 4322362 4389984 4454325 4451538 4375318 4385861 4513846 4548473 4454711
6999D454711O0135K92879J56450l30471o52327o04885l94220k53959k54060j97239
$$ 4454711 4514846 4807725 4964175 4633704 3981377 3376492 2982272 2728313 2474253 2277014
6989B277014k32171m57394n53306m18064j96627n8153N5982J94243K01283J32491
$$ 2277014 2044843 1587449 1034143 616079 419452 361299 417281 611524 812807 945298
6979I45298Q4537M5574O7877K31662M93842N21886L09275N5814k17692m51727
$$ 945298 1029835 1075409 1143286 1374948 1868790 2390676 2699951 2755765 2538073 2086346
6969B086346m60703l61237m60252o40236n40146j38579J59902K72984L94475M46622
$$ 2086346 1625643 1264406 804154 163918 -376228 -514807 -354905 -81921 312554 759176
6959G59176L48447J90996R1432P8194J55642K11547P7577j3478J82580M25496
$$ 759176 1107623 1298619 1390051 1468245 1623887 1835434 1913011 1899533 2082113 2507609
6949B507609M59235L05661J03838j4997j17050k07904l40076l39070j3365L11369
$$ 2507609 2966844 3272505 3376343 3361346 3244296 3036392 2696316 2357246 2343881 2655250
6939B655250L31885L01811M00815M96421M13759J04553k66255m10679j97597K00015
$$ 2655250 2987135 3288946 3689761 4186182 4599941 4704494 4438239 4027560 3829963 4029978
6929D029978M72401N39880M64792L41884L02164M28446M57391K88420K50233K61216
$$ 4029978 4502379 5042259 5507051 5848935 6151099 6579545 7036936 7325356 7575589 7836805
6919G836805R327l82202o02732p62681r03609q45258o89914m54681n8045K85922
$$ 7836805 7846132 7463930 6861198 6098517 5194908 4349650 3659736 3205055 3147010 3432932
6909C432932L31272L0163k20287k33579k05071j87468J5674L18956N07063O13694
$$ 3432932 3764204 3794367 3574080 3340501 3135430 2947962 2963636 3282592 3789655 4403349
6899D403349O33358M26674N4164k80896m77934n08232n69942p17476p90433o75917
$$ 4403349 5036707 5463381 5517545 5236649 4758715 4250483 3680541 2963065 2172632 1496715
6889A496715l57678j62558j29505J1159J57041J29802Q662o0158j6170O9689K0781
$$ 1496715 1139037 976479 846974 858133 1015174 1144976 1153638 1093480 1077310 1146999 1167780
6878A167780p2960j59278k23792j07825J39075M06765M09961M9635m31145p14893
$$ 1167780 1094820 935542 711750 603925 743000 1149765 1559726 1609361 1178216 463323
6868D63323o24255k83978Q8104L13339K57669O2985j21513l25483l98306k22616
$$ 463323 -160932 -444910 -356806 -43467 214202 277187 155674 -169809 -568115 -790731
6858g90731Q3457J56638l4643k03267j39352N7854K34407L54643N31663P64860
$$ -790731 -707274 -550636 -585279 -788546 -927898 -870044 -635637 -280994 250669 1015529
6848A015529Q68114P30457L86352N6865k00002k77030l09236m45869n52746m75250
$$ 1015529 1883643 2614100 3000452 3057317 2857315 2580285 2271049 1825180 1272434 797184
6838G97184j39235J88474K14763L2660l6774J9924M8401j50530m44238n77576
$$ 797184 657949 846423 1061186 1093846 1057072 1076996 1125397 974867 530629 -46947
6828d6947n32259l67978k26219k5461L67326O56109O24156M76489M37355L33935
$$ -46947 -579206 -947184 -1173403 -1198864 -831538 -175429 448727 925216 1362571 1696506
6818A696506R1427k3760Q8564J30698J4389p4235n5716k1935o0915n4768R6112
$$ 1696506 1787933 1764173 1852737 1983435 1997824 1923589 1867873 1845938 1785023 1730255 1826367
6807A826367J89571L8617k11234k65174j57491Q3580L51718L31179Q2665k5913
$$ 1826367 2015938 2054555 1843321 1578147 1420656 1504236 1855954 2187133 2269798 2243885
6797B243885J23825K78907J75294n4561j41934j73723k46679k93332k37406j81279
$$ 2243885 2367710 2646617 2821911 2767350 2625416 2451693 2205014 1911682 1674276 1492997
6787A492997j42927r1410q1087j50215k37581k89054k98997k13709q9324M5332
$$ 1492997 1350070 1258660 1177573 1027358 789777 500723 201726 -11983 -101307 -55975
6777e5975J96743K30980J42153J60730L49453M70656L52011K54832L22018K02490
$$ -55975 140768 371748 513901 674631 1024084 1494740 1846751 2101583 2423601 2626091
6767B626091l8486j45181j44749j45267k29908k34069j66608j84504j71124o3401
$$ 2626091 2587605 2442424 2297675 2152408 1922500 1688431 1521823 1337319 1166195 1102794
6757A102794J02630K16608J11349r931J55810M57021O57170P19657M76155M0155
$$ 1102794 1205424 1422032 1533381 1523450 1679260 2136281 2793451 3513108 3989263 4029418
6747D029418k46075l33404k48735j59884k20912l32562m43618n14072m46213k52151
$$ 4029418 3783343 3449939 3201204 3041320 2820408 2487846 2044228 1530156 1083943 831792
6737H31792J5580K64851K98724J49767q8205j66540P6029K73091J86451p9647
$$ 831792 847372 1112223 1410947 1560714 1472509 1305969 1381998 1655089 1841540 1761893
6727A761893k99496l89954l95302l56839k68973n0041K64242M34992N33952P07644
$$ 1761893 1462397 1072443 677141 320302 51329 1288 265530 700522 1234474 1942118
6717A942118Q19419N73611J67036N8021K09947L21383K96994J16735j61047k56368
$$ 1942118 2761537 3335148 3502184 3560205 3770152 4091535 4388529 4505264 4344217 4087849
6707D087849k44121l82303o06622o05611m08430k33888o7058J14833K01258R3225
$$ 4087849 3843728 3461425 2854803 2249192 1840762 1606874 1539816 1654649 1855907 1949132
6697A949132J2520J6897k298M7234J51651K22626K25704K27872K86854K27160
$$ 1949132 1961652 1978549 1976251 2023485 2175136 2397762 2623466 2851338 3138192 3365352
6687C365352P8116R8476J67053J43965J11716R0177J485k33173l57510j75518
$$ 3365352 3443468 3541944 3708997 3852962 3964678 4054855 4056340 3823167 3465657 3290139
6677C290139O2103J85449J31194L1049r4971k64637k51326j03588r5245j90325
$$ 3290139 3352242 3537691 3668885 3699934 3604963 3340326 3089000 2985412 2890167 2699842
6667B699842r4261J82171L22425K81361L24023M72892N45444L95247P0064j16688
$$ 2699842 2605581 2787752 3110177 3391538 3715561 4188453 4733897 5129144 5199208 5082520
6657E082520o0805j45623l17048k02229K29784O55764Q08209P76222P24911N27586
$$ 5082520 5021715 4876092 4559044 4356815 4586599 5242363 6050572 6826794 7551705 8079291
6647H079291R6814j44365k9499R1866M1438q2369k4547J88180L10065L31879M36166
$$ 8079291 8176105 8031740 8002241 8094107 8135545 8053176 8028629 8216809 8526874 8858753 9294919
6636I294919P16537R80411J015550Q36703P16542P04986N55775K50643P7601K56749
$$ 9294919 10011456 10991867 12007417 12844120 13560662 14265648 14821423 15072066 15149667 15406416
6626A5406416O42871R37135J058509J275405J828993K398218K579393K476268
$$ 15406416 16049287 16986422 18044931 19320336 21149329 23547547 26126940 28603208
6618B8603208K490105K894824L401651L819762M298003M980796N790577O532112
$$ 28603208 31093313 33988137 37389788 41209550 45507553 50488349 56278926 62811038
6610F2811038P146140P733931Q357014Q825584Q805834Q219667P225326N746605
$$ 62811038 69957178 77691109 86048123 94873707 103679541 111899208 119124534 124871139
6602A24871139L714255J297507j282469l734784n792273p123007p566315p636576
$$ 124871139 128585394 129882901 128600432 124865648 119073375 111950368 104384053 96747477
6594I6747477p708899p700463p500766o898292n954252n081073m541473m312290
$$ 96747477 89038578 81338115 73837349 66939057 60984805 55903732 51362259 47049969
6586D7049969m126883l728951l343983l270202l138470k745948k362226k089543
$$ 47049969 42923086 39194135 35850152 32579950 29441480 26695532 24333306 22243763
6578B2243763j968070j996389j885272j478032r44072m20265p1570j39843m23065
$$ 22243763 20275693 18279304 16394032 14916000 13971928 13551663 13480093 13340250 12917185
6569A2917185o01655n36809k84905r4847j0426K0935O527O507Q3003O6040r4530
$$ 12917185 12315530 11778721 11493816 11398969 11388543 11409478 11416005 11422512 11505515 11571555 11477025
6558A1477025l77526n38526n12466n36834n63992m68445k86730j93324j85718
$$ 11477025 11099499 10560973 10048507 9511673 8947681 8479236 8192506 7999182 7813464
6549G813464k01805l17117m10557l07292j02389n1186j69288k88794l13098k42107
$$ 7813464 7611659 7294542 6883985 6576693 6474304 6423118 6253830 5965036 5651938 5409831
6539E409831j31650k0143O285J1093j00221m49140q17022q98473q77287p99520
$$ 5409831 5278181 5258038 5264323 5275416 5175195 4726055 3909033 3010560 2133273 1333753
6529A333753m86480k76318k33893k6773K89679N20373N43026L71886J88150M5748
$$ 1333753 847273 570955 337062 310289 599968 1120341 1663367 2035253 2223403 2269151
6519B269151k9729j0363J12674K88887M34724M26463K76961j3972k96697k61503
$$ 2269151 2239422 2229059 2341733 2630620 3065344 3491807 3768768 3754796 3458099 3196596
6509C196596L8171K76199L77328M12850L97593K93626J8714l54563n96524o10594
$$ 3196596 3234767 3510966 3888294 4301144 4698737 4992363 5011077 4656514 4059990 3449396
6499C449396n54195m26872k40367j36219L9802M08683P32127P56302M40295K0852
$$ 3449396 2895201 2468329 2227962 2091743 2131545 2540228 3272355 4028657 4468952 4489804
6489D489804j23414l1221Q0892J63927J87471r626l15281m30424l40288j94623
$$ 4489804 4366390 4335169 4416061 4579988 4767459 4757833 4442552 4012128 3671840 3477217
6479C477217j28560k14594l61124m08437l50704j77405N5529K34830L51711L82453
$$ 3477217 3348657 3134063 2772939 2364502 2013798 1836393 1891922 2126752 2478463 2860916
6469B860916K56900N5071L1915K92341M19584J84249o8650k62942o10947q42193
$$ 2860916 3117816 3172887 3204802 3497143 3916727 4100976 4032326 3769384 3158437 2316244
6459B316244q03059o49968l09432J08574L95576N33639N52417L96594R4058j72618
$$ 2316244 1513185 863217 553785 662359 1057935 1591574 2143991 2540585 2634643 2462025
6449B462025k63408l36351m16422m32218n10962n33859k92214K6921K29415L79026
$$ 2462025 2198617 1862266 1445844 1013626 502664 -31195 -323409 -296488 -67073 311953
6439C11953M75127L74728K56097K62578K42998J3507l14606m88705m70668k86084
$$ 311953 787080 1161808 1417905 1680483 1923481 1936988 1622382 1133677 663009 376925
6429C76925j3959J18160o080k64979m66344m40497l34728j95426M2055K61285
$$ 376925 362966 481126 475046 210067 -256277 -696774 -1031502 -1226928 -1184873 -923588
6419i23588L52588L68847K65428J63004J02369j4704k09598l35049l21357k87971
$$ -923588 -571000 -202153 63275 226279 328648 313944 104346 -230703 -552060 -840031
6409h40031l24316l14710j28800J01680L13050M12467K23054j8675k237P0792
$$ -840031 -1164347 -1479057 -1607857 -1506177 -1193127 -780660 -557606 -576281 -578518 -507726
6399e07726j19501l12857o9391K56243K42386K46439L57849K17402J7675K03525
$$ -507726 -627227 -940084 -1009475 -753232 -510846 -264407 93442 310844 328519 532044
6389E32044O17949P41871N55771L59404J05476j63178k90842l71242m99172m77395
$$ 532044 1149993 1891864 2447635 2807039 2912515 2749337 2458495 2087253 1588081 1110686
6379A110686k25455J38477M82483O54151N79080K52346p7738j76098j62008j49464
$$ 1110686 885231 1023708 1506191 2160342 2739422 2991768 2914030 2737932 2575924 2426460
6369B426460j45116j54076k60959k97460j05581j3352j77146k48162j52014p4702
$$ 2426460 2281344 2127268 1866309 1568849 1463268 1449916 1272770 1024608 872594 797892
6359G97892O816J46734J82048K9535j59172j57897J71994M14358K61063M4147
$$ 797892 804708 951442 1133490 1163025 1003853 845956 1017950 1432308 1693371 1737518
6349A737518q1029k46162l93409l99221l14094l01141j50874K81617O72886O36056
$$ 1737518 1656489 1410327 1016918 617697 303603 2462 -148412 133205 806091 1442147
6339A442147K80528o6877l66395n40487n46296m00356k0715M52015O41676N35104
$$ 1442147 1722675 1655798 1289403 748916 202620 -197736 -218451 233564 875240 1410344
6329A410344K71201o815n5986J86010L74467O2357n81023r00901o63857j57263
$$ 1410344 1681545 1674730 1618744 1804754 2179221 2241578 1660555 759654 95797 -61466
6319f1466K21452L18189K08671J06066J82695M19199M89986M32667N08317M33542
$$ -61466 159986 478175 686846 792912 975607 1394806 1884792 2317459 2825776 3259318
6309C259318R4933r3414o4084q5658k50860m62746o75180q20636o96380m39600
$$ 3259318 3354251 3260837 3196753 3111095 2860235 2397489 1722309 901673 205293 -234307
6299b34307k78785j94822k0778J28316J51453J08380J43228L46607N05138N16184
$$ -234307 -513092 -707914 -728692 -600376 -448923 -340543 -197315 149292 654430 1170614
6289A170614K06176m20622q59406r33701p40927l86828j7650L15855O12593P35995
$$ 1170614 1376790 956168 96762 -836939 -1577866 -1964694 -1982344 -1666489 -1053896 -317901
6279c17901O45711L56959k401j27973m4867M9540J31808J90950J99485J70504
$$ -317901 327810 684769 682368 554395 509528 559068 690876 881826 1081311 1251815
6269A251815K11373L45518M14421L55963K20307J5199j73794j47970M9679L23294
$$ 1251815 1463188 1808706 2223127 2579090 2799397 2814596 2640802 2492832 2542511 2865805
6259B865805N47943N13258K42943l3892j70594k08699j06617R2968J20198q3301
$$ 2865805 3413748 3927006 4169949 4136057 3965463 3756764 3650147 3743115 3863313 3780012
6249C780012l18144m50277n56908o42341n85557m59701k84619j09292O6579L08287
$$ 3780012 3461868 3011591 2454683 1812342 1226785 767084 482465 373173 439752 748039
6239G48039N12225O13740O57936O72677N38793K36416j4805l1065p736j43954
$$ 748039 1260264 1874004 2531940 3204617 3743410 3979826 3965021 3933956 3926220 3782266
6229C782266l25647m35835l38508L6069M22177O09109O15211M47120O9152k94190
$$ 3782266 3456619 3020784 2682276 2718345 3140522 3749631 4364842 4811962 4881114 4586924
6219D586924l62322k59454m5414K13858J27474k67239n43195o08284n01921j95520
$$ 4586924 4224602 3965148 3919734 4133592 4261066 3993827 3450632 2842348 2340427 2144907
6209B144907J59441L22522K89988N9831l16355m87996j92100J71966K64884J75034
$$ 2144907 2304348 2626870 2916858 2976689 2660334 2172338 1980238 2152204 2417088 2592122
6199B592122J04562Q3992o77j90676l43438l75100m58668o24567p08572n72330
$$ 2592122 2696684 2780676 2779999 2589323 2245885 1870785 1412117 787550 78978 -493352
6189d93352l50803k51267l01955l05206K9194L77745L86559J45856m8740J3646
$$ -493352 -844155 -1095422 -1397377 -1702583 -1673389 -1295644 -909085 -763229 -811969 -798323
6179g98323J08620q263j35631r510J08330O1430N6293J75867K48583J99401R8451
$$ -798323 -689703 -697966 -833597 -843107 -734777 -673347 -617054 -441187 -192604 6797 105248
6168A05248O8015J28061J69040K06941M03084N76480N21965K96185j3748j73292
$$ 105248 173263 301324 470364 677305 1080389 1656869 2178834 2475019 2461271 2287979
6158B287979n1067K67219M40923K96314J28087P8941l6301k50274l03751j87022
$$ 2287979 2236912 2504131 2945054 3241368 3369455 3448396 3412095 3161821 2858070 2671048
6148B671048j92202m30163p32304p43691l14246L34726P12607P74127O40892L27312
$$ 2671048 2478846 2048683 1316379 572688 258442 593168 1305775 2079902 2720794 3048106
6138C048106K3978j49163j10000K6981M5057j07220k30725k29560l72197m30869
$$ 3048106 3072084 2922921 2812921 2839902 2884959 2777739 2547014 2317454 1945257 1514388
6128A514388j96400K18650M84940L43699O5531j76617k85792j42534J23270L37350
$$ 1514388 1317988 1536638 2021578 2365277 2430808 2254191 1968399 1825865 1949135 2286485
6118B286485L81768J67177j47745k95001l48744l90713l39357k29085j07853o7751
$$ 2286485 2668253 2835430 2687685 2392684 2043940 1653227 1313870 1084785 976932 909181
6108I09181k15154l84444k52425J06345M36640O18764O01979M09114J41049o7838
$$ 909181 694027 309583 57158 163503 600143 1218907 1820886 2230000 2371049 2303211
6098B303211k68396l29461l34857n84162q61166q27328l64150N3101L04091M67078
$$ 2303211 2034815 1705354 1370497 786335 -74831 -902159 -1266309 -1213208 -909117 -442039
6088d42039N42231P57963R25996O87747K71049p4079l10197k82797p4089J1504
$$ -442039 100192 858155 1784151 2471898 2742947 2668868 2358671 2075874 2001785 2013289
6078B013289j11184k70550k82805k36054j97920o2470P7332O6560J06723L30351
$$ 2013289 1902105 1631555 1348750 1112696 914776 852306 929638 996198 1102921 1433272
6068A433272N34989N87220M21747J24814k21956n52076n87040j91010K39892M63385
$$ 1433272 1968261 2555481 2977228 3102042 2880086 2328010 1740970 1549960 1789852 2253237
6058B253237M28147K39485P6303j10369j67375M6074J36659j33806l48418j40233
$$ 2253237 2681384 2920869 2997172 2886803 2719428 2765502 2902161 2768355 2419937 2279704
6048B279704J69249J92636P0837p7778k40114k24320q7072k4738j14196m9985
$$ 2279704 2448953 2641589 2712426 2634648 2394534 2170214 2083142 2058404 1944208 1894223
6038A894223K57356M12950L37849J34171k3456o4454j47649l06326m22909n16044
$$ 1894223 2151579 2564529 2902378 3036549 3013093 2948639 2800990 2494664 2071755 1555711
6028A555711p85171j041023r13606m56488L7404M00336O62995R28637J047210
$$ 1555711 770540 -270483 -1184089 -1640577 -1603173 -1202837 -539842 388795 1436005
6019A436005P79535K80525j08687l79653o69437o75230l49173j04643q8481n4565
$$ 1436005 2215540 2496065 2387378 2007725 1338288 663058 313885 209242 120761 66196
6009F6196J74952N35777P99821Q49320N75549J52062j25592l82548o92154q60568
$$ 66196 241148 776925 1576746 2426066 3001615 3153677 3028085 2645537 1953383 1092815
5999A092815p53802m36341r2764M9958j41820m60236n89383k86759L67201R41003
$$ 1092815 339013 -97328 -190092 -140134 -281954 -742190 -1331573 -1618332 -1251131 -310128
5989c10128J044628P83351N30754K84476j30222m56835m72295k83618r9599K2
$$ -310128 734500 1517851 2048605 2333081 2202859 1746024 1273729 990111 890512 890534
5979H90534R3719Q2364j71270m40184l46452J00575M97919N33175L98791L25923
$$ 890534 984253 1066617 895347 455163 108711 209286 707205 1240380 1639171 1965094
5969A965094K87488Q0039k37318m00684k88630j4335J55464J89356K46402L84934
$$ 1965094 2252582 2332621 2095303 1694619 1405989 1391654 1547118 1736474 1982876 2367810
5959B367810M92235L91811O7472k32374l02503k5156L25216M01781K71660K41637
$$ 2367810 2860045 3251856 3319328 3086954 2784451 2759295 3084511 3486292 3757952 3999589
5949C999589L60658K18992k29334m79361m55715l47344k80416j41964M5298J2282
$$ 3999589 4360247 4579239 4349905 3870544 3414829 3067485 2787069 2645105 2690403 2702685
5939B702685L5371K15694J45599k10178m93152n65903m27674k24470j64018k23494
$$ 2702685 2738056 2953750 3099349 2889171 2396019 1830116 1402442 1177972 1013954 790460
5929G90460k85575l55174l60124j19771J25220N7292k20606l50631k78936j05145
$$ 790460 504885 149711 -210413 -330184 -204964 -147672 -368278 -718909 -997845 -1102990
5919a102990J44728M11175O46439P72639O61670L96939M6522k25306j54792K5380
$$ -1102990 -958262 -547087 99352 871991 1533661 1930600 1977122 1751816 1597024 1622404
5909A622404J26429J30834J20926J44442J04975Q7744j2222k01639r5780L76699
$$ 1622404 1748833 1879667 2000593 2145035 2250010 2337754 2325532 2123893 2028113 2404812
5899B404812P29441N29516N8350l83051p52140q22253m31710L9140K57521K61073
$$ 2404812 3134253 3663769 3722119 3339068 2586928 1764675 1332965 1372105 1629626 1890699
5889A890699K07160O7108k08754l94072l33671k14410q6815L4757j18128m11393
$$ 1890699 2097859 2164967 1956213 1562141 1228470 1014060 927245 962002 843874 432481
5879D32481m22490j61551J5881n1235j50146o0760N7398k226r8490j34593o9039
$$ 432481 9991 -151560 -135679 -186914 -337060 -397820 -340422 -342648 -441138 -575731 -644770
5868f44770K16435O04628P61112O41150M57625L54140J66723j55948k59914j21275
$$ -644770 -428335 176293 937405 1578555 2036180 2390320 2557043 2401095 2141181 2019906
5858B019906P9684K56021K81994J98502J90710J89784K5856j55325j75211j59277
$$ 2019906 2099590 2355611 2637605 2836107 3026817 3216601 3242457 3087132 2911921 2752644
5848B752644k04668j19391K4761p3673k07350m3199R6229j07970k95167k87520
$$ 2752644 2547976 2428585 2453346 2379673 2172323 2129124 2225353 2117383 1822216 1534696
5838A534696k83515k37899j25803j05618j91034j02096J61758L70481N78890P47486
$$ 1534696 1251181 1013282 887479 781861 590827 488731 650489 1020970 1599860 2347346
5828B347346O68668L35592m7108k63800l06833l70028m09558l52654k71560j52115
$$ 2347346 3016014 3351606 3304498 3040698 2733865 2363837 1954279 1601625 1330065 1177950
5818A177950k7382J35646J65832j24108n56001p85874o02623j93020J23967L20240
$$ 1177950 1150568 1286214 1452046 1327938 771937 -13937 -616560 -809580 -685613 -365373
5808c65373N01037M85794J11720l29904n61063n48076k33844K07302N07776N07621
$$ -365373 135664 621458 733178 403274 -157789 -705865 -939709 -732407 -224631 282990
5798B82990K64608J04033J88854L61617M62513L89415J5859l99505o05487n32800
$$ 282990 547598 651631 840485 1202102 1664615 2054030 2069889 1670384 1064897 532097
5788E32097l10634j50800j42236m9451K29960L82223L85956L81764M25216M83233
$$ 532097 221463 70663 -71573 -121024 108936 491159 877115 1258879 1684095 2167328
5778B167328L18921o7543l73721m50265k92332J2072L15213M34947K82380q2398
$$ 2167328 2486249 2418706 2044985 1594720 1302388 1314460 1629673 2064620 2347000 2264602
5768B264602l47799l21485j03767r812j21996j81983j05441j92853m84614o34598
$$ 2264602 1916803 1595318 1491551 1481739 1359743 1177760 1072319 879466 394852 -239746
5758b39746n31059l24675k02474j64464m6884K69285M98236M00988K07636J55080
$$ -239746 -770805 -1095480 -1297954 -1462418 -1509302 -1240017 -741781 -340793 -133157 21923
5748B1923J69235J56687J99889L43541M68134M58636K36627n7809j73816j30001
$$ 21923 191158 347845 547734 891275 1359409 1818045 2054672 1996863 1823047 1693046
5738A693046j03754k42372l52188k21827J08334M48663M66903J95869j37172l39570
$$ 1693046 1589292 1346920 994732 772905 881239 1329902 1796805 1992674 1855502 1515932
5728A515932k78794j64906j83001k95562m18476n34510m22052M827L18173L08004
$$ 1515932 1237138 1072232 889231 593669 175193 -359317 -781369 -776542 -458369 -150365
5718a50365L03678L89597L51746K03283Q4276J16129L14775N43998O12630M03369
$$ -150365 153313 542910 894656 1097939 1182215 1298344 1613119 2157117 2769747 3173116
5708C173116o1336n85011q28473p23244m93852k25953L898J85683L73135M71572
$$ 3173116 3111780 2526769 1698296 975052 481200 255247 259145 444828 817963 1289535
5698A289535M41130K81064N8004k58727n75479o19822l68804l5715K64789L97076
$$ 1289535 1730665 2011729 2069733 1811006 1235527 615705 246901 211186 475975 873051
5688H73051K59597j0080j87951k14220k31729k57959j40122J81945N44736O71077
$$ 873051 1132648 1122568 934617 720397 488668 230709 90587 272532 817268 1488345
5678A488345M33900J51566M6571j58108m64231o76350p58790p43520o13418l48202
$$ 1488345 1922245 2073811 2120382 1962274 1498043 821693 62903 -680617 -1294035 -1642237
5668a642237M808L93423P32751Q85713P40226M18617J23296j02371j81654r4699
$$ -1642237 -1637429 -1244006 -511255 374458 1114684 1533301 1656597 1554226 1372572 1277873
5658A277873r1011j38746m6178J33757L56168N59145N05575J44025j40094k30087
$$ 1277873 1186862 1048116 1001938 1135695 1491863 2051008 2556583 2700608 2560514 2330427
5648B330427k80951k96216k19465n775J51554J54069K06186J58288j17509k85614
$$ 2330427 2049476 1753260 1533795 1528020 1679574 1833643 2039829 2198117 2080608 1794994
5638A794994j34485K9392J0653J2311J01221J43642J09273P3679k0292j2239O5206
$$ 1794994 1660509 1689901 1700554 1712865 1814086 1957728 2067001 2140680 2120388 2108149 2173355
5627B173355m7376j79685j33585J83413O12791P35717L09588l40567p22775q17636
$$ 2173355 2125979 1946294 1812709 1996122 2608913 3344630 3654218 3313651 2590876 1773240
5617A773240p04245l52402J5996K00499L67489N33343N51125L73491N844k77570
$$ 1773240 1068995 716593 732589 933088 1300577 1833920 2385045 2758536 2764380 2486810
5607B486810k49495q8506N0400K59598M62850M40686L05296K46598K57395J80144
$$ 2486810 2237315 2148809 2199209 2458807 2921657 3362343 3667639 3914237 4171632 4351776
5597D351776k2577k80164m68344m79974m04570k61842r278J14392j3066j18387
$$ 4351776 4329199 4049035 3580691 3100717 2696147 2434305 2425027 2539419 2526353 2407966
5587B407966K8971L27911N25475N35986M45944K81023j3057k87568l31766j34778
$$ 2407966 2436937 2764848 3290323 3826309 4272253 4553276 4540219 4252651 3920885 3786107
5577C786107J86449L03873J27565j49878m11919n40235l78418N226K40768J37299
$$ 3786107 3972556 4276429 4403994 4254116 3842197 3301962 2923544 2928770 3169538 3306837
5567C306837R279L5369J9599j39828k55128k05975q7255L6466J14723J33478Q4963
$$ 3306837 3316116 3351485 3371084 3231256 2976128 2770153 2682898 2719364 2834087 2967565 3052528
5556C052528M3454o1475l34024n65493n33564l43391j87514j06158o8769j4728
$$ 3052528 3095982 3034507 2700483 2134990 1601426 1258035 1070521 964363 895594 880866
5546H80866R9341J70095J51586j6469l06262m99779o85573q29968n39378J30704
$$ 880866 980207 1150302 1301888 1285419 979157 479378 -206195 -1036163 -1575541 -1444837
5536a444837N69523O45753O81694P16545O98233O67018O13479M41045J80325k05839
$$ -1444837 -875314 -229561 452133 1168678 1866911 2533929 3147408 3588453 3768778 3562939
5526C562939n93102o09949m43960l72277k56788o3681J44004K83134J47305o0749
$$ 3562939 2969837 2359888 1915928 1543651 1286863 1223182 1367186 1650320 1797625 1736876
5516A736876j25871j73569k31526k93973k53148j12306p1438m0326J11401K94333
$$ 1736876 1611005 1437436 1205910 911937 658789 546483 475045 434719 546120 840453
5506H40453M36333L87848K54038K75124L11429L35379K84638Q1048j10114k00833
$$ 840453 1276786 1664634 1918672 2193796 2505225 2840604 3125242 3206290 3096176 2895343
5496B895343k55383j99105K7360K45664K13371O6500q2135l50868m68380k15953
$$ 2895343 2639960 2440855 2468215 2713879 2927250 2993750 2911615 2560747 2092367 1876414
5486A876414J54383K76117J6127m38884o68328m98785j81591R2531J57458O918
$$ 1876414 2030797 2306914 2323041 1884157 1215829 717044 535453 627984 785442 792360
5476G92360j19164j34590r6747m4660p7844j62824j21251J09107K74655J81791
$$ 792360 673196 538606 441859 397199 319355 156531 35280 144387 419042 600833
5466F00833M4359L2884J59702L05300K58129k452j98650n6083K67470L36074J49356
$$ 600833 645192 678076 837778 1143078 1401207 1398755 1200105 1144022 1411492 1747566 1896922
5455A896922J0815M5994q266l60047p06765n64956q7959J73192J65350J37172
$$ 1896922 1907737 1953731 1945465 1585418 878653 313697 225738 398930 564280 701452
5445G01452R258k13757j28017N3091K6582j5573J3993p2157k04925k08914j42037
$$ 701452 710710 496953 368936 422027 448609 433036 447029 374872 169947 -38967 -181004
5434a81004j19253j86634k45537k22318j90535k59051k55525K0965L40881O38398
$$ -181004 -300257 -486891 -732428 -954746 -1145281 -1404332 -1659857 -1638892 -1298011 -659613
5424f59613J058531J372194J297551Q14223K57742n3259j56682m10197p26519
$$ -659613 398918 1771112 3068663 3882886 4140628 4087369 3930687 3520490 2793971
5415B793971p98397p00821l73754J25459M24633M21628K67297J31759K8980k3111
$$ 2793971 1995574 1294753 920999 1046458 1471091 1892719 2160016 2291775 2320755 2297644
5405B297644r108R839J17241J85209R9658q9649l88459o69961p58506o36150m87289
$$ 2297644 2288536 2298375 2415616 2600825 2700483 2610834 2222375 1552414 793908 157758 -329531
5394c29531m10384l28268j17937K41293N15796O29600P17640O88885N16066L09461
$$ -329531 -739915 -1068183 -1186120 -944827 -429031 200569 918209 1607094 2123160 2432621
5384B432621J0839l71412n79587m36369k27660j91527j87403o1589K16692M71035
$$ 2432621 2443460 2072048 1492461 1056092 828432 636905 449502 387913 604605 1075640
5374A075640O48499O33190L23839j4464r8501R5611L51476M32993L81453K20606
$$ 1075640 1724139 2357329 2681168 2666704 2568203 2663814 3015290 3448283 3829736 4050342
5364D050342p9610l71973l45914l5510Q7913r6118l43943n01257n53728n20910
$$ 4050342 3970732 3598759 3252845 3217335 3305248 3209130 2865187 2363930 1810202 1289292
5354A289292m00437n6715K79887K70315P1838j5364P9416K14129K10558P9589
$$ 1289292 888855 832140 1112027 1382342 1454180 1438816 1518232 1732361 1942919 2022508
5344B022508m5496j69873l74263o82235r65760r40839n43099p4336J66566J16488
$$ 2022508 1977012 1807139 1432876 750641 -215119 -1155958 -1699057 -1773393 -1606827 -1490339
5334a490339n2633j47048j53435m8085K56131M73813L08300r2791k92439m7203
$$ -1490339 -1542972 -1690020 -1843455 -1891540 -1635409 -1161596 -853296 -946087 -1238526 -1285729
5324a285729K98738L26967J52013K2232k057J34057L26058L80247L10868J28464
$$ -1285729 -986991 -660024 -508011 -485779 -487836 -353779 -27721 352526 663394 791858
5314G91858j19942l69026m55459k91562m6434J52989L12809L83065K58374O2242
$$ 791858 671916 302890 -152569 -444131 -490565 -337576 -24767 358298 616672 678914
5304F78914o0216m2316o9172k30329l81514l43073q0379J87289L06981K87173
$$ 678914 618698 576382 507210 276881 -104633 -447706 -528085 -340796 -33815 253358
5294B53358J31550j69936m22431l96786j66657M784k3162q5123q9863j4012J78930
$$ 253358 384908 214972 -207459 -604245 -770902 -766118 -789280 -874403 -964266 -978278 -799348
$$ [...]
##END NTUPLES=NMR SPECTRUM
##END=
