##TITLE=C13cpd
##JCAMPDX= 6.0         $$ Bruker NMR JCAMP-DX V2.0
##DATA TYPE= NMR SPECTRUM
##DATA CLASS= NTUPLES
##ORIGIN= UXNMR, Bruker Analytische Messtechnik GmbH
##OWNER= root
$$ XWIN-NMR		Version 3.5
$$ Sat Feb 15 16:36:17 2025 Russian Standard Time (UT+4h)  servis@DPX200
##.OBSERVE FREQUENCY= 50.3277607988526
##.OBSERVE NUCLEUS= ^13C
##.ACQUISITION MODE= SIMULTANEOUS
##.ACQUISITION SCHEME= undefined
##.AVERAGES= 2051
##.DIGITISER RES= 17
##SPECTROMETER/DATA SYSTEM= spect
##.PULSE SEQUENCE= zgpg30
##.SOLVENT NAME= DMSO
##.SHIFT REFERENCE= (INTERNAL, DMSO, 0, 219.126)
##AUDIT TRAIL= $$ (NUMBER, WHEN, WHO, WHERE, WHAT)
$$ ##TITLE= Audit trail, XWIN-NMR		Version 3.5
$$ ##JCAMPDX= 5.01
$$ ##ORIGIN= Bruker BioSpin GmbH
$$ ##OWNER= servis
$$ F:\spectra/data/av/nmr/C13cpd/1/pdata/1/auditp.txt
$$ ##AUDIT TRAIL=  $$ (NUMBER, WHEN, WHO, WHERE, WHAT)
(   1,<2025-02-15 16:35:37.70 +0400>,<servis>,<DPX200>,
      <created by zg, POWCHK disabled, PULCHK disabled
       terminated by command 'halt'
       configuration hash MD5:
       00 E9 B6 7A A2 85 ED C7 34 08 36 98 17 FE 4E 26
       data hash MD5: 32K
       78 C2 AC AB 56 8A 42 0E BF 0A 3D BC 81 F5 39 58>)
(   2,<2025-02-15 16:35:39.68 +0400>,<servis>,<DPX200>,
      <Start of raw data processing
       efp BC_mod = 2 LB = 2 FT_mod = 6 PKNL = 1 PHC0 = -340.063 PHC1 = 25.66493 SI = 32K 
       data hash MD5: 32K
       4D 99 AD 99 88 6D A4 DA D7 05 39 11 D6 BB C0 E5>)
(   3,<2025-02-15 16:35:53.71 +0400>,<servis>,<DPX200>,
      <pk PHC0 = 2.4 PHC1 = 0 
       data hash MD5: 32K
       21 DA F5 6D 7F F2 FF 5B D9 C0 AA AA 2A 22 66 67>)
$$ ##END=
$$ 
$$ hash MD5
$$ 04 8B 38 10 3B 44 61 29 67 22 A7 84 BA 98 78 D2
##$RELAX= 
##$RELAX= 
##$RELAX= 
##$RELAX= 
##$RELAX= 
##$RELAX= 
##$RELAX= 
##$RELAX= 
$$ Bruker specific parameters
$$ --------------------------
##$DU= <F:\spectra>
##$EXPNO= 1
##$NAME= <C13cpd>
##$PROCNO= 1
##$TYPE= <nmr>
##$USER= <av>
##$AMP= (0..31)
100 100 100 100 100 100 100 100 100 100 100 100 100 100 100 100 100 100 
100 100 100 100 100 100 100 100 100 100 100 100 100 100 
##$AQSEQ= 0
##$AQ_mod= 1
##$AUNM= <au_zg>
##$AUTOPOS= <>
##$BF1= 50.322729
##$BF2= 200.13
##$BF3= 50.322729
##$BF4= 50.322729
##$BF5= 500.13
##$BF6= 500.13
##$BF7= 500.13
##$BF8= 500.13
##$BYTORDA= 1
##$CFDGTYP= 0
##$CFRGTYP= 5
##$CHEMSTR= <none>
##$CNST= (0..31)
1 1 145 1 1 1 1 1 1 1 1 1 1 1 1 1 1 1 1 1 1 1 1 1 1 1 1 1 1 1 1 1 
##$CPDPRG= <waltz16>
##$CPDPRG1= <>
##$CPDPRG2= <waltz16>
##$CPDPRG3= <>
##$CPDPRG4= <mlev>
##$CPDPRG5= <mlev>
##$CPDPRG6= <mlev>
##$CPDPRG7= <mlev>
##$CPDPRG8= <mlev>
##$CPDPRGB= <>
##$CPDPRGT= <>
##$D= (0..31)
0 2 0.00345 0 0 0 0 0 0 0.06 0 0.03 2e-05 3e-06 0 0 0.0002 0 0 0 0 0 0 
0 0 0 0 0 0 0 0 0 
##$DATE= 1739622937
##$DBL= (0..7)
120 120 120 120 120 120 120 120 
##$DBP= (0..7)
150 150 150 150 150 150 150 150 
##$DBP07= 0
##$DBPNAM0= <>
##$DBPNAM1= <>
##$DBPNAM2= <>
##$DBPNAM3= <>
##$DBPNAM4= <>
##$DBPNAM5= <>
##$DBPNAM6= <>
##$DBPNAM7= <>
##$DBPOAL= (0..7)
$$ [...]
##$SUBNAM2= <"">
##$SUBNAM3= <"">
##$SUBNAM4= <"">
##$SUBNAM5= <"">
##$SUBNAM6= <"">
##$SUBNAM7= <"">
##$SUBNAM8= <"">
##$SUBNAM9= <"">
##$SW= 238.246396889851
##$SWIBOX= (0..15)
0 1 3 0 0 0 0 0 0 0 0 0 0 0 0 0 
##$SW_h= 11990.4076738609
##$TD= 32768
##$TD0= 1
##$TE= 0
##$TE2= 300
##$TE3= 300
##$TEG= 300
##$TL= (0..7)
0 120 120 120 120 120 120 120 
##$TP= (0..7)
150 150 150 150 150 150 150 150 
##$TP07= 0
##$TPNAME0= <>
##$TPNAME1= <>
##$TPNAME2= <>
##$TPNAME3= <>
##$TPNAME4= <>
##$TPNAME5= <>
##$TPNAME6= <>
##$TPNAME7= <>
##$TPOAL= (0..7)
0.5 0.5 0.5 0.5 0.5 0.5 0.5 0.5 
##$TPOFFS= (0..7)
0 0 0 0 0 0 0 0 
##$TUNHIN= 0
##$TUNHOUT= 0
##$TUNXOUT= 0
##$USERA1= <user>
##$USERA2= <user>
##$USERA3= <user>
##$USERA4= <user>
##$USERA5= <user>
##$V9= 5
##$VALIST= <valist>
##$VCLIST= <CCCCCCCCCCCCCCC>
##$VD= 0
##$VDLIST= <DDDDDDDDDDDDDDD>
##$VPLIST= <PPPPPPPPPPPPPPP>
##$VTLIST= <TTTTTTTTTTTTTTT>
##$WBST= 1024
##$WBSW= 20
##$XGAIN= (0..3)
0 0 0 0 
##$XL= 0
##$YL= 0
##$YMAX_a= 34552699
##$YMIN_a= -29890010
##$ZGOPTNS= <>
##$ZL1= 120
##$ZL2= 120
##$ZL3= 120
##$ZL4= 120
##$ABSF1= 0
##$ABSF2= 0
##$ABSG= 0
##$ABSL= 0
##$ALPHA= 0
##$AQORDER= 0
##$ASSFAC= 0
##$ASSFACI= 0
##$ASSFACX= 0
##$ASSWID= 0
##$AUNMP= <proc_1d>
##$AZFE= 0.1
##$AZFW= 0.5
##$BCFW= 0
##$BC_mod= 2
##$BYTORDP= 0
##$COROFFS= 0
##$CY= 12.5
##$DATMOD= 1
##$DC= 0
##$DFILT= <>
##$DTYPP= 0
##$F1P= 99.9999945759776
##$F2P= -179.999992907048
##$FCOR= 0.5
##$FTSIZE= 32768
##$FT_mod= 6
##$GAMMA= 0
##$GB= 0
##$INTBC= 1
##$INTSCL= 0
##$ISEN= 30
##$LB= 2
##$LEV0= 0
##$LPBIN= 0
##$MAXI= 10000
##$MC2= 0
##$MEAN= 0
##$ME_mod= 0
##$MI= 0
##$NCOEF= 0
##$NC_proc= 3
##$NLEV= 6
##$NOISF1= 0
##$NOISF2= 0
##$NSP= 0
##$NTH_PI= 0
##$NZP= 0
##$OFFSET= 219.1257
##$PC= 1.4
##$PHC0= -337.663
##$PHC1= 25.66493
##$PH_mod= 1
##$PKNL= yes
##$PPARMOD= 0
##$PSCAL= 4
##$PSIGN= 0
##$REVERSE= no
##$SF= 50.322729
##$SI= 32768
##$SIGF1= 0
##$SIGF2= 0
##$SINO= 80
##$SIOLD= 32768
##$SREGLST= <13C.CDCl3>
##$SSB= 0
##$STSI= 32768
##$STSR= 0
##$SW_p= 11990.4076738609
##$SYMM= 0
##$S_DEV= 0
##$TDeff= 32768
##$TDoff= 0
##$TI= <>
##$TILT= no
##$TM1= 0
##$TM2= 0
##$TOPLEV= 0
##$USERP1= <user>
##$USERP2= <user>
##$USERP3= <user>
##$USERP4= <user>
##$USERP5= <user>
##$WDW= 1
##$XDIM= 32768
##$YMAX_p= 284954154
##$YMIN_p= -1169364
$$ End of Bruker specific parameters
$$ ---------------------------------
##NTUPLES= NMR SPECTRUM
##VAR_NAME=  FREQUENCY,     SPECTRUM/REAL,   SPECTRUM/IMAG
##SYMBOL=    X,             R,               I
##VAR_TYPE=  INDEPENDENT,   DEPENDENT,       DEPENDENT
##VAR_FORM=  AFFN,          ASDF,            ASDF
##VAR_DIM=   32768,         32768,           32768
##UNITS=     HZ,            ARBITRARY UNITS, ARBITRARY UNITS
##FACTOR=    0.365929370215793, 1,           1
##FIRST=     11027.0033138647, 0,            0
##LAST=      -963.404359996184, 0,           0
##MIN=       -963.404359996184, -1169364,    0
##MAX=       11027.0033138647, 284954154,    0
$$ Real data points
##PAGE= N=1
##DATA TABLE= (X++(R..R)), XYDATA
$$ [...]
13536 991227 1075311 1160002 1264171 1395278 1485187 1440704 1300240 1178050 1118417 1066081 991069
13525 991069 912165 801687 676444 634471 706902 895932 1198742 1502845 1675257 1731250
13515 1731250 1781179 1815419 1739752 1562049 1431098 1427399 1493167 1578593 1691825 1778628 1748797
13504 1748797 1622644 1463999 1297389 1176838 1116563 1095218 1101281 1128609 1180428 1204560 1122995
13493 1122995 994895 969247 1035403 1079175 1062143 1031500 1054347 1125466 1186730 1201512 1175497
13482 1175497 1104454 1028392 1048401 1207576 1430220 1560422 1546287 1457632 1354054 1233259
13472 1233259 1090575 929971 724989 526991 466499 551512 635589 631682 589921 594931 668750
13461 668750 778276 880611 951338 1010060 1096776 1179495 1181960 1051929 863823 750786 684407
13450 684407 647597 689640 763071 801911 827079 861311 882317 866215 836364 838634 869660 884780
13438 884780 851996 806729 826011 860687 818168 748020 726848 705811 649495 590564 511577
13427 511577 356629 175272 89879 150153 253550 303028 328310 399545 555261 726813
13417 726813 819036 866512 934923 983985 992955 1029154 1092231 1111534 1082310 1029741 959934 853203
13405 853203 674707 435755 210979 110025 150885 254807 348993 431291 508855 587829
13395 587829 716396 915873 1123780 1229116 1157217 970753 747001 484627 220504 59716
13385 59716 -45722 -182382 -277183 -228840 -24857 239841 455781 608856 699404 760153
13375 760153 828485 849637 787631 734096 767712 870147 985410 1039749 989405 871445 783619
13364 783619 776963 854073 945005 981326 952978 846258 685065 544550 486072 532995 655481
13353 655481 797848 885930 857802 741579 659545 659814 694023 666409 557927 461589 453727
13342 453727 504707 536432 506978 478915 524676 591136 611188 575434 492278 410315 335551
13331 335551 188101 -39491 -187570 -152374 -6927 180196 373010 510022 548281 537051
13321 537051 561223 635217 724752 824776 899765 909073 897471 909238 940723 1013160 1108222
13310 1108222 1169611 1214662 1308139 1428811 1512152 1527584 1443518 1267987 1079487 935038
13300 935038 819578 717232 678565 722631 772140 821640 916496 986626 913621 671701 361236
13289 361236 143330 112194 203122 313268 406769 479871 565169 704745 866707 941771 873790
13278 873790 677079 450094 369690 462515 595770 692236 752084 759338 711461 655199 663734
13267 663734 724677 773234 808453 834900 835690 839983 834961 736044 554543 375962 236362 82235
13255 82235 -80008 -151659 -136567 -131361 -152477 -126368 -21901 92578 172399 226484 229688
13244 229688 125934 -46505 -131242 -68606 109827 382418 713205 1059972 1334521 1480593
13234 1480593 1564943 1634700 1658695 1589853 1403071 1161622 986930 941181 1001299 1062964 1027864
13223 1027864 888101 689203 507224 376103 249001 121218 10443 -111030 -195930 -129851
13213 -129851 128032 449951 682361 828574 900371 844527 690139 568529 601632 772150
13203 772150 951494 1044098 1060016 1065541 1064443 953110 709121 477397 372286 360547 371030
13192 371030 390809 437238 487896 523347 558323 557566 518554 473335 404208 314214 271953 332375
13180 332375 454544 532783 492950 353554 224420 213008 347783 569675 795072 937695
13170 937695 969384 930063 869338 827268 786759 721025 679196 713723 769190 802138 809836 761725
13158 761725 623263 434407 303027 300084 419712 601459 802140 945020 929387 776374
13148 776374 614596 533870 513390 511702 528271 544902 561243 591136 580971 487839 321178
13137 321178 132227 -15945 -107241 -120345 -55340 40144 160032 292489 395456 471510
13127 471510 567583 678282 714632 645341 520430 374174 242345 193024 233389 322548 470440
13116 470440 642039 753467 738208 585982 379346 212106 125753 117566 148801 172268 118842
13105 118842 30968 -677 -22433 -102410 -183144 -190750 -159294 -192510 -259186 -279942 -292861 -333515
13093 -333515 -364325 -314215 -207813 -122253 -74674 -39569 -15370 11749 123422 345068 585118
13082 585118 762117 889989 1005995 1086061 1110100 1077014 995927 893374 785528 625565
13072 625565 353976 63280 -129347 -172660 -81073 52652 224704 434172 605399 741333
13062 741333 891594 1054029 1170729 1161940 997789 773406 615635 543772 495633 431882
13052 431882 364232 310988 235719 148731 129499 239521 484041 769897 1014892 1188265
13042 1188265 1251862 1179168 1028914 895638 842964 873865 960834 1096412 1211694 1217403 1098770
13031 1098770 852171 518269 229014 129557 217175 388251 552139 642168 674415 680257
13021 680257 674673 668200 675913 739762 876964 1030437 1136631 1200214 1238988 1229373 1178419 1078406
13009 1078406 885632 652349 521757 550363 688431 882141 1065337 1143556 1076410 954860
12999 954860 861911 801020 785725 863548 973703 948072 765971 588253 567280 712983 924538
12988 924538 1109414 1158794 1079565 1019960 1035460 1043571 1013154 980234 946204 908969 913787 955801
12976 955801 972541 930101 864614 802660 724135 639812 610042 675431 787147 854714 886312
12965 886312 938892 1032739 1156620 1258117 1313935 1326309 1312022 1276543 1197708 1121739 1061311
12954 1061311 951624 783952 628141 467150 263418 123430 120047 174741 166791 138137
12944 138137 165625 239346 363724 517158 664256 749617 728022 669415 652197 665814 700014
12933 700014 733594 754219 772295 769347 746796 716013 676556 657041 698346 767308 800314 791706
12921 791706 767430 691409 547367 389478 283219 241863 207287 150658 111844 137926 214514
12910 214514 273547 347356 486171 650761 791763 898092 971874 973139 934782 949459 973313
12899 973313 944789 940121 1001151 1061108 1081261 1077445 1040210 969782 918093 904870 898889 907174
12887 907174 948449 993114 988639 939959 874370 791568 715092 666328 633006 612807 603583 567373
12875 567373 481434 357220 206421 60562 -51102 -87262 -40465 33145 89671 131138 160393
12864 160393 152455 157116 251807 440556 664473 825522 872800 859426 844065 824902 766088
12853 766088 661633 600720 644914 745530 816762 809138 745648 691598 637782 550845 465576
12842 465576 409856 402864 498010 738007 1052878 1297993 1357146 1248827 1081673 950290
12832 950290 853450 748650 668294 635629 624540 596571 493965 286478 60135 -65956
12822 -65956 -93408 -71051 14507 139427 209981 207160 202483 198495 182989 182615 197669 217954
12810 217954 259715 353002 477967 597243 672050 666110 627372 648162 757274 931255 1094849
12799 1094849 1135206 1029281 873029 743242 632480 511659 419957 435475 562888 677295
12789 677295 703981 686215 650640 633569 644015 638137 594830 551254 520000 474565 443590 491249
12777 491249 617062 790196 995809 1152239 1204061 1165109 1077211 994337 979473 1061527 1150741
12766 1150741 1139630 1066488 1015394 983736 962679 941836 906669 919557 1003813 1097227 1135833
12755 1135833 1128978 1093371 1008304 891482 786305 697449 627582 620165 701854 844309 1011352
12744 1011352 1152632 1259061 1383548 1495243 1511047 1438298 1335201 1247720 1199357 1181735
12734 1181735 1192856 1213147 1173103 1056535 921294 782859 663771 586386 495204 344534
12724 344534 169033 20349 -76488 -123702 -181363 -235837 -187317 -23726 185971 383995
12714 383995 515969 576832 641811 773536 951709 1070732 1063098 938969 766677 650930
12704 650930 647971 700965 673754 542697 439198 426632 474321 604005 819850 1029599 1145617
12693 1145617 1143121 998870 779002 617408 533899 485821 487625 568663 710769 864653 1004420
12682 1004420 1099275 1119067 1082142 1034071 978941 912702 818568 698383 632953 674998 797880
12671 797880 903041 964326 1037499 1096771 1070894 932237 735291 620206 670278 853314
12661 853314 1048514 1196192 1325106 1409460 1382926 1267491 1100639 933422 858243 884224
12651 884224 973485 1048150 1034151 1000436 1021742 1068631 1108206 1111513 1021269 840911 651986
12640 651986 554771 572227 653226 776168 944707 1137602 1316750 1438752 1470657 1413046
12630 1413046 1298503 1186710 1140493 1204391 1359729 1488480 1495333 1408726 1285431 1188244
12620 1188244 1159589 1134225 1060141 954960 854995 828183 873227 904097 897463 866967 803163
12609 803163 708043 612323 532574 430677 282466 181905 243589 437674 652527 814259
12599 814259 895329 917780 915589 905151 872407 823399 826842 914789 1001173 1007957 980847 963115
12587 963115 894724 764076 632245 536575 487852 439059 374874 354288 422993 563612 674297
12576 674297 701838 660446 610581 668287 825672 977005 1089929 1157184 1146185 1056307 940442
12565 940442 823685 728661 682312 670650 735721 916110 1125045 1270118 1358161 1407711 1415246
12554 1415246 1382579 1312476 1187732 1040994 942184 879396 803072 697594 619847 597073 553526
12543 553526 456414 330217 218646 177706 191620 202243 245509 387809 582890 702967
12533 702967 699438 626470 514628 364138 246292 201285 181539 172924 215175 287293 309688
12522 309688 263594 189128 131698 97546 108610 188038 276445 303620 240713 87483 -73147
12511 -73147 -114208 -14293 125857 218817 272943 335843 435145 549426 654039 769025 851315
12500 851315 799983 652926 505636 389876 334626 370707 448554 475251 425995 366924 342382
12489 342382 342765 348930 333358 295304 291344 319166 321295 315681 362773 490017 649921 777495
12477 777495 840709 835269 799551 782980 769627 689161 492925 217147 -12289 -129413 -179953
12466 -179953 -193656 -159953 -74592 58344 210523 341962 450651 527387 549542 531330 495063
12455 495063 466884 510279 630910 736589 757715 721856 691382 684573 679336 687557 709854 691778
12443 691778 603584 468594 372783 362505 360206 282489 198932 231472 307501 310085 288895 390963
12431 390963 629786 852180 917005 820194 655560 542815 538807 626210 787349 929501
12421 929501 952874 938845 1011218 1133667 1205216 1219883 1219249 1165368 1012866 795581 566464
12410 566464 311546 61631 -91111 -120203 -57993 100360 312372 469767 586836 693206
12400 693206 707171 596768 422330 225711 1792 -213949 -308106 -202073 72556 390112
12390 390112 602617 651858 603092 562091 557025 566273 644013 813459 1040570 1305968 1526333
12379 1526333 1623046 1633631 1645050 1699430 1789024 1825644 1757564 1626491 1467684 1296352 1114529
12368 1114529 945081 829385 771638 777351 892004 1089186 1286197 1434563 1501796 1450697
12358 1450697 1310127 1156002 1013273 884630 783815 714253 630506 543914 533101 566721
12348 566721 549623 473068 388739 318292 260167 237811 241426 253598 363364 644423 1037605
12337 1037605 1417399 1667985 1723898 1617448 1478148 1401127 1420014 1530523 1651854 1681869
12327 1681869 1616594 1498143 1386301 1356895 1400834 1480909 1555984 1563862 1453776 1238014 1038195
12316 1038195 953625 981442 1081046 1196602 1256571 1234442 1207250 1218370 1212574 1160174 1096392
12305 1096392 1034110 956029 878036 799016 666276 482956 307569 161065 40884 -6478
12295 -6478 65275 236856 405743 485290 501474 503040 529724 591198 662097 741086 834329 882782
12283 882782 777297 505171 240065 131347 156657 216337 287348 329017 301192 275244 285358
12272 285358 289607 280368 299507 385167 509918 625738 682772 639305 538635 470392 448806
12261 448806 447544 462883 459731 428484 413589 420129 455002 504180 525766 515057 474514 392095
12249 392095 246096 106558 14971 -83943 -162881 -129076 35791 274592 515431 647902
12239 647902 618505 530642 498079 489306 442539 364555 322472 374880 534362 771779 1002761
12228 1002761 1123716 1093257 950007 735754 485031 311536 274858 281776 261208 240013
12218 240013 275628 391592 571939 797259 1017897 1165326 1234467 1277538 1304860 1279669
12208 1279669 1231151 1160782 1054494 985262 969496 938868 819028 606412 380504 213961
12198 213961 91782 -43634 -171395 -226412 -207852 -173661 -161942 -184427 -233308 -296254 -346599
12187 -346599 -323848 -201163 3922 293218 613736 795347 704016 389460 65723 -114001
12177 -114001 -147622 -26517 225047 481444 643877 723937 729144 616402 365059 75946
12167 75946 -126653 -185481 -104824 34928 152785 235376 283040 304533 252536 111007 -13573
12156 -13573 -37038 44683 173640 279902 334337 328447 300196 283574 275785 298984 371184 462000
12144 462000 550488 614133 614115 561485 525561 535211 572713 648060 761372 865090 961377 1047982
12132 1047982 1104035 1146906 1192007 1208493 1145459 995684 795933 661763 676572 765176 818115
12121 818115 826372 855043 937561 1057314 1155517 1189134 1199605 1202940 1160148 1084910 1029717 997619
12109 997619 966515 911316 820313 741880 711404 746314 844390 924328 908980 800330 662398
12098 662398 558639 479050 415075 390841 364480 307536 281702 359535 542661 778267 1006425
12087 1006425 1200232 1337821 1404479 1443571 1476527 1472214 1399902 1278406 1156494 1051057
12077 1051057 919175 721526 517571 415743 426491 513058 666662 863569 999254 1031344
12067 1031344 1006757 959454 943916 945614 889054 778759 717178 767123 885719 1042968 1238855
12056 1238855 1378736 1357548 1231929 1096871 934627 763003 686719 704101 722812 722723 782751
12045 782751 958115 1175936 1331162 1389325 1396515 1450213 1577270 1694871 1733676 1723028 1690998
12034 1690998 1602985 1446681 1246097 1051246 920248 858072 805798 730245 689485 701627
12024 701627 689967 648598 646831 668240 641078 607449 611829 631029 650485 670081 665406 619408
12012 619408 540672 463151 412864 366841 318520 310825 334462 303397 180748 20113 -77336
12001 -77336 -30560 146298 360646 583266 795200 936764 981141 981777 1030414 1119111 1193146
11990 1193146 1268060 1338801 1344231 1312467 1316887 1359013 1350582 1243176 1098647 1002834 966392
11979 966392 957817 958833 919194 831785 725754 624512 591588 634938 706088 830835 1054893
11968 1054893 1274567 1323582 1182931 996317 879748 840594 876231 1007482 1177003 1264706
11958 1264706 1235112 1103698 941286 810648 649002 453214 293452 175706 77078 18452
11948 18452 28632 85539 188372 315356 423497 507767 531063 435478 203381 -74543 -287856
11937 -287856 -439662 -551615 -585572 -539385 -476179 -470562 -532034 -583885 -549535 -436800 -231942
11926 -231942 39241 258281 355202 331876 272081 259672 276771 316170 392932 526918 721514
11915 721514 906903 1017744 1104618 1187487 1224790 1236006 1222748 1178153 1118759 1060964 981895
11904 981895 834130 621958 403411 247016 165218 103966 4565 -124476 -213163 -211889 -99070
11893 -99070 54950 148829 213864 311395 422154 512800 598310 696273 759283 736679 685905
11882 685905 669051 639312 572674 528196 498274 470041 479348 495364 500910 516258 514558 425911
11870 425911 287046 222856 340946 595015 795203 859217 863011 863395 845808 856238 913215
11859 913215 915839 847996 802402 788000 747649 654939 554730 500275 488340 508544 511680 433597
11847 433597 305188 245182 305542 361660 295984 178617 147025 209654 308784 380558 427760
11836 427760 498060 590359 689795 784182 847183 815794 660365 477112 388092 395819 445996
11825 445996 486415 496595 489024 483762 489476 537489 626051 727448 805666 793548 697219 569516
11813 569516 453617 373937 346216 331147 304184 255842 190652 134734 60873 -40816 -93042
11802 -93042 -36171 117499 300835 451604 543941 522769 365634 172978 73508 92730 217174
11791 217174 424086 610376 667268 616911 563844 571586 641822 757569 894498 1046754 1170863
11780 1170863 1256402 1331567 1390563 1412344 1384417 1282497 1073195 797242 547020 422371
11770 422371 481825 680926 911557 1104056 1231757 1269645 1211277 1033525 781654 579655
11760 579655 519824 572767 661473 747823 816994 843600 802917 744506 661797 562991 560964 649091
11748 649091 737097 774986 734291 595415 362803 107880 -36998 -10736 116262 207311
11738 207311 226167 228444 220492 178546 55349 -146484 -311060 -344079 -264398 -141936 -22818
11727 -22818 51695 41490 -32357 -73599 -14067 129059 262763 301806 277347 270987 318449
11716 318449 448327 669237 914657 1140864 1305685 1288128 1114351 969797 934755 911451
11706 911451 831368 760766 735840 711507 649277 565750 501007 476332 480373 429968 292876
11695 292876 131051 28757 29372 112586 246728 404824 558361 656054 640771 521913 352995
11684 352995 181184 75322 61744 113831 187254 254434 317476 359645 388176 425997 459511
11673 459511 503600 610325 793545 947056 953431 872140 788721 689610 566320 430844 328474
11662 328474 285251 278326 270009 277116 332129 420066 503480 549426 574705 639483 728794 765846
11650 765846 762907 801252 849036 835362 777006 707383 632011 598462 627885 665692 678809 676176
11638 676176 653380 607549 550874 442410 238834 7608 -85896 40427 295654 508569
11628 508569 588084 589191 588850 595968 576666 514173 406191 266456 152823 74847 -33799
11617 -33799 -203433 -406363 -576733 -644035 -605261 -490841 -343494 -233997 -180030 -114630
11607 -114630 -1863 105760 170468 218957 235667 272085 409870 588293 660496 607089 535211
11596 535211 525959 551183 543120 474233 409556 457908 552220 562408 522356 517505 576072 673423
11584 673423 747029 766178 760919 758662 757736 723369 670393 645085 634646 642787 686032 728083
11572 728083 764052 808572 833330 820329 773103 707357 688437 746288 835934 893753 888009 864467
11560 864467 863642 840453 747017 632274 541007 503050 541426 615591 652073 617176 527981 435921
11548 435921 382104 379994 400485 437912 527608 672958 847621 1013840 1091405 1057918 1008958
11537 1008958 994762 968465 870886 706614 529724 414077 406172 423903 393624 386784 493493
11526 493493 650916 730630 735205 749235 785499 798893 784761 786601 815113 834502 799130 729168
11514 729168 690817 664600 632876 674086 801270 916616 906461 753954 553190 381835
11504 381835 249531 138677 28303 -101885 -223644 -252332 -131131 118372 373757 490642
11494 490642 472526 443498 479618 579609 701054 754854 728501 705744 772581 929771 1070356
11483 1070356 1113869 1085790 1040259 1016162 976094 840646 584964 255569 -11391 -97092
11473 -97092 -23031 124532 265456 369446 476866 608331 768853 923874 1021146 1065384
11463 1065384 1064067 978486 868696 813153 775870 718225 673460 681980 710258 725047 734701 736688
11451 736688 692175 587586 458177 320993 188057 125947 184888 337268 562890 794447
11441 794447 931000 932670 818655 634134 489703 483345 570940 650073 711768 799036 919650
11430 919650 1041368 1141165 1198059 1208532 1216768 1215015 1178450 1121538 1044781 940236 767165
11419 767165 509603 270507 150105 154824 226296 303050 358068 369879 324237 257705 240165
11408 240165 350979 585709 825348 977023 1020567 998120 954001 874959 758611 646251
11398 646251 546070 443761 333081 238518 195116 192860 192525 165127 118101 86661 123586
11387 123586 202645 239017 230792 161986 34823 -76213 -130556 -124810 -87318 -79303 -103063 -114027
11375 -114027 -100943 -54579 6897 64364 167744 328430 464495 521835 479771 382710 332280
11364 332280 313214 290706 289727 285321 199138 55792 -15621 -4700 51541 154933 313270
11353 313270 503137 618249 603523 539042 492272 470393 497640 608205 734795 813175 897043
11342 897043 1040476 1162195 1152495 1032724 919871 918582 1031094 1127644 1073866 922294 842967
11331 842967 908876 1093798 1291875 1410470 1449185 1453660 1450975 1405754 1314729 1221025 1152425
11320 1152425 1131584 1171373 1212956 1164778 1035438 959245 1030208 1185693 1309659 1348398 1319875
11309 1319875 1264774 1246770 1315851 1439446 1539224 1540317 1438535 1302947 1194539 1106183 1011996
11298 1011996 923380 847916 770769 710737 726610 798913 811246 740507 704629 734288 771994
11287 771994 809880 846424 840501 798741 744303 694492 668335 611924 499120 400070 317028
11276 317028 214233 89222 -36927 -101318 -73802 26226 151347 239761 284330 326864
11266 326864 363842 392535 468319 664436 968888 1225505 1265820 1123588 996152 976173
11256 976173 983441 939478 874461 823380 759128 645227 508855 386144 263829 182178 149596
11245 149596 128212 106396 88701 92840 87549 16256 -113275 -192871 -152208 -42140 64425
11234 64425 149573 221472 250269 210177 157035 141754 164492 217205 333704 541727 743558
11223 743558 797410 702622 604877 619196 710893 804329 866805 848715 721130 523666 353750
11212 353750 296385 357089 447515 449010 305849 75662 -156241 -366688 -530836 -618294 -588629
11201 -588629 -400009 -86120 195321 357566 408362 343071 182597 5907 -114188 -165451
11191 -165451 -148397 -89732 -63656 -52517 74296 324525 572696 705168 711173 619695 454002
11180 454002 239619 26315 -137076 -270968 -412602 -551126 -642381 -665786 -656077 -655752 -615052
11169 -615052 -465656 -275954 -217851 -326965 -498722 -585766 -496046 -269441 -7238 179514
11159 179514 276897 355508 427392 463074 526688 678932 822195 844114 784006 751929 768046
11148 768046 774361 769962 763200 735339 714111 711142 676644 587893 499842 434367 387614 355851
11136 355851 312809 298548 386198 576279 801134 987018 1102410 1104462 969967 763575
11126 763575 586290 516273 576544 701721 802995 862151 899234 916025 923935 910811 830043
11115 830043 653724 447098 334416 308597 296059 296694 365823 505576 630195 660234 561144
11104 561144 357648 106988 -109461 -214264 -223765 -161119 -55290 5184 -58741 -179552
11094 -179552 -177312 644 162035 132709 6581 -107466 -239489 -369960 -370437 -278594 -283019
11083 -283019 -438734 -622042 -671289 -540169 -297661 -51876 114663 187958 222640 295472
11073 295472 426567 537508 536534 440660 350888 274977 160883 57114 13705 -8691 -39998
11062 -39998 -67467 -85825 -106504 -122414 -137428 -136416 -96480 23935 223828 416472 538025
11051 538025 614167 687234 772174 875630 989808 1109956 1221621 1241417 1162085 1070921 987579
11040 987579 904223 855810 845357 840127 846716 894356 951646 966681 919125 830497 743388 705682
11028 705682 729002 810829 927332 1044783 1187742 1311033 1368351 1436131 1548291 1607811
11018 1607811 1557050 1447983 1314457 1163067 1034574 969283 908127 755749 522663 268007
11008 268007 37003 -84365 -50786 69655 212425 384886 569544 731047 853174 909009
10998 909009 916062 923469 932825 896784 821093 728325 621441 575936 593390 612337 612060 566706
10986 566706 458592 308895 174215 70863 -35582 -131484 -174239 -164731 -128923 -81297 -51184
10975 -51184 -69434 -109041 -94121 29929 206231 333122 370823 327038 185057 -23003 -163401
10964 -163401 -168970 -108289 -35423 15118 30443 53171 128433 253844 376644 427116 414793
10953 414793 431227 510304 605996 703881 741695 643177 433717 220513 82406 73319 164163
10942 164163 241423 300376 442073 682555 918425 1027018 955543 774727 577502 409059
10932 409059 282433 144981 -29424 -160925 -164934 -71736 13063 57644 86598 87079 90489
10921 90489 136411 182417 192421 181510 173223 205095 226200 115838 -71942 -200205 -228754
10910 -228754 -180835 -105681 -14899 82068 190418 334329 460439 537820 612212 684630 700754
10899 700754 640393 532260 402169 265322 167369 171553 325564 560689 780549 973011
10889 973011 1103051 1111798 1002183 828581 681169 619050 646404 709501 751437 773606 825697
10878 825697 892715 834248 606558 326547 71835 -63177 -25583 122899 326805 548273
10868 548273 701658 748283 759892 789685 801963 727879 544329 293129 73494 3127 106968
10857 106968 303521 481144 544456 475751 337269 222300 200554 260232 331669 390644 477267
10846 477267 624168 809439 988611 1155335 1289823 1344922 1310169 1209999 1082977 982200
10836 982200 961882 1045414 1178060 1248049 1208882 1097158 977979 919179 941625 978674 956230
10825 956230 922568 952768 1033422 1106300 1098373 991145 818551 592611 351125 145165 -49195
10814 -49195 -236973 -347552 -347699 -276901 -156186 -2429 131652 206797 222024 195698 181410
10803 181410 186262 144802 137565 249542 451695 646106 776043 898065 972256 905075 739721
10792 739721 641031 644772 654007 628816 613203 652129 760058 868221 886477 872944 905200
10781 905200 954479 932527 806655 634475 482617 398260 403249 516143 688165 846254
10771 846254 909799 855953 742703 630011 576915 594488 674380 795877 898480 937934 898773
10760 898773 806085 733463 720065 757072 827890 923266 1066929 1222446 1339542 1392196 1382602
10749 1382602 1346696 1258314 1057950 775630 516256 354805 292342 290879 286077 217920 83841
10738 83841 -69763 -154577 -119259 -79614 -137947 -230376 -255331 -197720 -91155 25557 76724
10727 76724 22532 -129788 -308043 -421131 -473061 -501998 -509211 -479977 -402272 -312738 -325171
10716 -325171 -468121 -609169 -597155 -430027 -209874 -23337 119679 214665 202842 136818
10706 136818 153344 253948 346668 419102 489990 533345 494488 333023 86126 -130940 -234370
10695 -234370 -224524 -167022 -101420 -54091 -46405 -28432 46990 175880 383987 675494 1001919
10684 1001919 1287664 1483269 1614801 1723463 1804696 1803487 1682848 1459295 1139084 762508
10674 762508 432957 230265 155418 161339 187745 275238 486051 733901 931263 1129727
10664 1129727 1372660 1603547 1763379 1834205 1842804 1852070 1827549 1703063 1578937 1547347 1553523
10653 1553523 1501625 1340585 1099812 895755 827732 897561 1044191 1166158 1251228 1387062
10643 1387062 1575198 1720378 1778147 1755943 1659866 1537710 1440816 1358484 1291040 1256656 1232741
10632 1232741 1210956 1222249 1269926 1287123 1249217 1239027 1314061 1438701 1604287 1821770 2026287
10621 2026287 2145529 2154303 2093280 2029744 2021762 2096609 2211187 2328328 2431207 2481224 2472014
10610 2472014 2494230 2648108 2936880 3328378 3838312 4481571 5286619 6264085 7410422
10601 7410422 8798816 10554611 12875266 16020825 20174640 25273011 30751440 35172620
10593 35172620 36633862 34484056 29997942 24943230 20392263 16674269 13692260 11269289
10585 11269289 9353829 7951264 6949845 6141836 5431438 4851153 4442014 4158642 3892050
10576 3892050 3611210 3340063 3078946 2838011 2640176 2516254 2402932 2222702 2052070
10567 2052070 1945954 1853474 1710812 1509505 1311473 1195764 1207016 1335966 1504482 1588853
10557 1588853 1562382 1529895 1591163 1681135 1667195 1546665 1475577 1582982 1768146 1906382
10547 1906382 2008549 2097731 2140999 2102728 2033778 1980231 1950244 1956935 1954895 1899500 1792525
10536 1792525 1660563 1547349 1483990 1492304 1510316 1437160 1294982 1182053 1139787 1136637 1164581
10525 1164581 1209783 1216321 1178521 1149953 1143549 1122981 1064585 976351 908905 912662 954558 936805
10513 936805 865448 832322 867385 918327 924904 896718 828478 695708 535176 418796 407011
10502 407011 457293 461702 410705 350493 288046 212642 136387 83942 63372 18693 -54512 -53959
10490 -53959 57850 199405 266901 266490 258373 249600 237797 265018 364142 498978 614588 730661
10478 730661 886496 1087391 1261273 1299043 1177255 958134 737014 596288 596941 711073
10468 711073 841371 953089 1110814 1345274 1534827 1534797 1416437 1333669 1294627 1256740 1241028
10457 1241028 1256950 1255540 1195036 1107674 1051069 1078750 1232048 1450640 1609322 1644133 1603619
10446 1603619 1560177 1485672 1316220 1075954 833124 637567 523810 485863 516761 609160
10436 609160 742748 844354 840550 712923 498919 320369 292243 356717 418858 507055 622812
10425 622812 699195 720940 704552 659740 656107 740918 812813 777581 714860 747431 927704
10414 927704 1179350 1321738 1253162 1037771 843830 742435 672602 589023 477591 364745
10404 364745 270305 192129 131534 89572 73855 102336 192867 364905 581757 769351 899110
10393 899110 966095 967546 961298 982576 987254 924968 797002 659077 576560 589755 691597
10382 691597 849877 956636 960646 948949 990588 1052361 1065915 1035752 996750 940969 861502
10371 861502 755809 630864 470219 301608 191534 128593 115445 139938 143492 132762 162958
10360 162958 187638 86968 -133608 -314266 -343775 -255301 -116454 -5430 -7181 -93458 -202622
10349 -202622 -335550 -439387 -406123 -210409 73259 325886 452200 457094 411343 353521
10339 353521 278460 154025 18023 -96405 -201021 -295498 -344182 -307038 -189461 -9647
10329 -9647 199700 389541 517615 553600 495920 401448 302391 156653 -14031 -168105 -291759
10318 -291759 -334662 -284727 -192424 -126937 -96713 -64307 9538 130951 248354 400914 630125
10307 630125 886246 1141033 1388993 1605562 1751041 1777749 1698763 1535207 1312697 1080675
10297 1080675 861919 692485 605398 540649 460699 382646 339033 386832 575542 854341
10287 854341 1098433 1238789 1260798 1237100 1270843 1382067 1516766 1603753 1558431 1387745
10277 1387745 1224398 1158724 1168207 1207347 1233617 1159618 914850 551109 194803 -37924
10267 -37924 -89052 -40970 -29440 -83453 -126717 -68154 121987 412430 723231 976306 1120707
10256 1120707 1180717 1200966 1194750 1150677 1040553 847566 583444 351817 278003 350003 465568
10245 465568 549155 569741 526927 485495 471495 463725 459573 469511 490074 498486 437776 303617
10233 303617 204865 212941 266433 271608 232888 208240 180977 145075 125377 92269 11535 -102564
10221 -102564 -184502 -142488 1184 178035 364851 571653 792712 976104 1065319 1033277
10211 1033277 938607 863182 815589 779612 768364 782874 811757 836473 835484 837546 885424 946400
10199 946400 972576 967639 963185 952672 890105 769465 637622 561175 601145 686380 752363
10188 752363 789442 779042 740046 731716 785900 867593 906641 871218 811726 750335 640194
10177 640194 515865 480453 538089 658914 791817 887818 971583 1043355 1049042 956059 756480
10166 756480 493754 236363 35405 -79973 -122640 -135766 -101999 38785 261197 449386
10156 449386 541531 574415 612142 672456 771188 895637 976889 983436 920438 812326 708733
10145 708733 619240 555765 592489 741919 915290 1008757 967817 847322 731749 632283 542480
10134 542480 481570 441816 370214 248788 142603 102982 148453 321796 583154 832921
10124 832921 982239 1027167 1073817 1160992 1198728 1094788 886628 651116 449440 361249
10114 361249 415114 584757 797858 938626 979791 999495 1064105 1153980 1248608 1328923 1303618
10103 1303618 1152721 937016 748540 639741 601636 652792 782639 896796 937069 933079
10093 933079 884523 770976 661579 618018 593812 538036 438472 334827 260124 202168 189578
10082 189578 241450 308109 379704 477835 551315 543490 468066 351882 223302 86814 -115055
10071 -115055 -379385 -562695 -480906 -130697 299590 615355 754351 771882 755503 766279
10061 766279 786010 785613 779658 709717 527588 345134 293003 347461 408779 480407 558699 546804
10049 546804 422964 271172 156563 114881 181703 336145 449412 413103 263971 96989
10039 96989 -43699 -150576 -191569 -167157 -169456 -272396 -449950 -599346 -673540 -696556 -733694
10028 -733694 -820878 -906386 -958985 -962678 -890666 -750614 -547499 -276316 11342 257078 433941
10017 433941 559284 673592 778868 845960 830535 720043 573543 437161 272614 52212
10007 52212 -195802 -389870 -425478 -313395 -181755 -141087 -169757 -193623 -178196 -128702 -18104
9996 -18104 177371 398249 553668 623592 648612 646333 582657 507802 477078 445873 380131
9985 380131 297591 243250 230794 214610 139212 -2131 -139543 -191603 -150950 -77256 -11110
9974 -11110 76621 255964 551660 863140 1089945 1209418 1177899 972677 682082 434687
9964 434687 262609 90612 -98059 -250689 -370028 -436983 -384054 -199340 42281 273319
9954 273319 468771 600023 691459 770056 804175 856379 961303 1012494 947944 789570 596542
9943 596542 483288 508296 593702 627060 613162 644167 768169 952724 1115911 1173651 1089125
9932 1089125 904490 715166 639628 703777 822694 961385 1142021 1317056 1402931 1358488
9922 1358488 1211739 1063968 973954 923659 910262 959784 1051243 1155812 1212188 1160062 1043786
9911 1043786 984516 1067137 1232545 1320892 1189139 840963 467553 268172 274224 358681 418773
9900 418773 449187 454018 464907 550420 706033 871772 1001764 1042797 999475 923609 824434
9889 824434 723205 661631 650014 671775 683071 668880 603961 474617 344937 257845 198655
9878 198655 143756 108201 91913 98764 117068 111645 40643 -115846 -235747 -221338 -104390
9867 -104390 50048 203071 338320 399234 365134 297972 286003 338898 379595 414307 484792
9856 484792 567732 617006 624140 623961 631756 620899 607550 660846 732529 759112 757676 738874 741646
9843 741646 805301 928833 1044075 1055580 968533 844184 698342 537660 345528 135080
9833 135080 -4722 -20524 52242 175755 293657 339902 343044 384083 545493 789902 902240
9822 902240 771736 468913 141624 -108947 -233892 -178838 26259 252781 433319 593120
9812 593120 743464 852039 944844 1053170 1152749 1203559 1181074 1095263 962260 794469 622888
9801 622888 489499 400951 362503 388369 441379 470512 501858 584981 719670 857921 918752
9790 918752 897112 842371 784502 721058 643676 572390 510818 474621 473760 499684 569645 659543
9778 659543 718050 767249 833407 906527 983879 1041232 1058228 1043660 1034595 1072960 1145584 1176691
9766 1176691 1099474 963371 877487 801799 661710 474872 283470 105523 -15993 -40636
9756 -40636 -34001 -53253 -31087 102816 349964 657683 915852 1055830 1108936 1134350 1125344
9745 1125344 1049280 981464 982839 1033102 1105611 1105840 985536 807352 647259 566821 585552
9734 585552 623892 576096 455374 365083 349942 373658 421597 492380 579007 641192 628231
9723 628231 570254 565049 637822 699047 679510 558777 368787 217694 186797 242458 298327
9712 298327 339716 397485 435196 406898 340762 277966 250092 286874 362057 430452 449646 403458
9700 403458 343981 296040 238512 199323 203885 207664 213631 231902 279502 361244 422508 404479
9688 404479 309272 181715 34877 -99943 -144479 -75134 24433 48352 19133 37875 112664
9677 112664 199265 293160 405330 512702 602316 708665 836565 923639 944202 953811 967453
9666 967453 958418 976166 1042290 1100921 1102953 1053935 995748 911047 769230 569010 317992
9655 317992 50424 -172534 -282842 -236988 -72976 55439 68067 22468 -5714 6931 58997
9644 58997 162752 299230 408450 457424 463212 465043 469722 417759 281020 169118 196693
9633 196693 328555 443735 497742 516906 538389 566754 562257 487502 368117 264276 195848
9622 195848 137141 61384 -31818 -114728 -137208 -58816 45910 117976 214317 373418 572818
9611 572818 772358 925751 947532 825764 690248 624899 620308 658328 725073 819623 927009
9600 927009 987399 975518 936260 899004 872544 859607 863518 831441 697349 495813 299254
9589 299254 120233 -28840 -103482 -52937 139819 375057 572847 732413 839264 896431
9579 896431 918079 906318 888794 904657 987092 1067971 1026559 852025 629337 419337 239791
9568 239791 91527 -54480 -185146 -224456 -123662 70616 235874 280531 233097 160007
9558 160007 104840 90517 106760 138863 183061 272075 420185 581837 694108 751455 797239
9547 797239 841251 853850 817559 730413 618344 512122 429910 416893 454834 498967 554265
9536 554265 637560 774269 945825 1075902 1127877 1154415 1172027 1126509 1017838 915547 910279
9525 910279 1090743 1403712 1691151 1938459 2178471 2414316 2651237 2851989 2969662 2994799
9515 2994799 2985012 3048249 3238809 3564667 4046673 4666909 5371483 6090306 6835942 7693132
9505 7693132 8682147 9760841 10886904 12046863 13310292 14737610 16241052 17628056
9497 17628056 18740781 19487636 19845036 19773479 19223133 18266642 17069690 15734154 14329898
9488 14329898 12968240 11740344 10661354 9708967 8816729 7936780 7148463 6566933 6195944
9479 6195944 5899526 5548451 5181704 4901674 4660222 4385267 4060612 3691957 3325489 3030013
9469 3030013 2799307 2566478 2340388 2142872 1968201 1823334 1683174 1539285 1426163 1396915
9459 1396915 1467409 1613153 1778068 1903616 2020229 2155991 2239550 2159044 1907997 1605856
9449 1605856 1398289 1344787 1384812 1397542 1305323 1133567 970169 871850 867763 991471 1193064
9438 1193064 1401281 1598342 1753259 1824011 1792324 1749518 1775614 1802006 1755147 1663066 1568265
9427 1568265 1490846 1450725 1421076 1372434 1285107 1149216 1012300 944835 956183 991118 1002263
9416 1002263 983067 909408 764246 616985 556543 592216 670981 777797 913462 1056046
9406 1056046 1195721 1327090 1441189 1522826 1569487 1566428 1507092 1414348 1326316 1281570 1265305
9395 1265305 1202894 1063761 902458 757676 619398 503436 417924 343594 266001 226792
9385 226792 272870 353613 389165 380460 401565 497365 590347 596636 558912 561607 627132 721034
9373 721034 773764 763809 710814 612540 459569 254420 49819 -87849 -128452 -80887 41432
9362 41432 243529 493442 697331 791694 799656 789183 818624 872071 903419 877162 749647
9351 749647 583474 513554 546973 630457 711359 756171 772081 736433 593218 344924 118097
9340 118097 34707 9461 -99933 -281174 -410605 -412818 -295745 -69969 190825 395545
9330 395545 574397 784548 987758 1097947 1086376 995669 898172 845936 847388 876424 913566
9319 913566 949172 942711 908363 885793 880813 914735 975112 1057757 1156273 1236577 1303005 1380347
9307 1380347 1512057 1682827 1791759 1753670 1552862 1262316 947647 609462 308309 147160
9297 147160 110562 147248 227278 331001 488252 689358 868520 946319 918295 833899 698674
9286 698674 541931 396762 272751 188843 170678 193878 234777 255015 191139 5983 -268746
9275 -268746 -537927 -751018 -860735 -864756 -763535 -547119 -333200 -212872 -127311 12392
9265 12392 227912 421061 522249 613394 722677 755489 629692 420758 310557 369790
9255 369790 508411 628186 732463 875980 1005788 1004058 869999 725331 658229 643258
9245 643258 685952 824855 1034151 1259881 1494597 1692840 1796956 1853905 1940396 2055242
9235 2055242 2131798 2114438 2008217 1842281 1643931 1439952 1250490 1072900 939540 854800
9225 854800 733523 571569 446300 338278 213848 105798 22266 -52686 -116941 -159291
9215 -159291 -160881 -64432 119438 296876 448945 575285 597301 504440 428950 453418 531959
9204 531959 624411 762420 985904 1259021 1455537 1485961 1390954 1245507 1102449 988379
9194 988379 945161 1016130 1148334 1204771 1126181 997199 887378 799769 722321 647219 610420
9183 610420 661207 770779 857166 880489 851450 773350 655168 515495 418228 390772 326336
9172 326336 143197 -97923 -299524 -444260 -531657 -557322 -531979 -470000 -367147 -187774
9162 -187774 15245 133466 133961 54361 -56689 -205496 -395412 -548612 -614315 -592897 -475488
9151 -475488 -293226 -156250 -136590 -168081 -119970 39440 255596 493702 722320 890350
9141 890350 997423 1081971 1142221 1154659 1087304 913900 703879 555976 473998 424625 411567
9130 411567 417969 357741 199932 370 -136523 -89337 160297 497111 800111 1000633
9120 1000633 1069546 1012574 913474 866349 897589 976838 1031968 999478 873060 744720 683445
9109 683445 679013 732782 885407 1105875 1258983 1261232 1177062 1110968 1063098 963484 809087
9098 809087 653975 518108 413118 369521 393475 412685 357063 242634 156667 147655 224134
9087 224134 354760 429620 399579 350001 337450 347382 358902 349523 348290 394878 441250 449380
9075 449380 495030 639172 864704 1107971 1316968 1403033 1333445 1185902 985653 770553
9065 770553 652484 676379 723700 702241 663848 694381 803828 955275 1094254 1179118 1233654
9054 1233654 1287006 1308346 1235820 1053627 801555 545208 317236 169726 157411 246617
9044 246617 312184 254491 113397 -23531 -139780 -283279 -463385 -611110 -658115 -599748
9034 -599748 -452067 -215425 9638 75295 724 -84217 -118474 -102308 -5386 138538 222398
9023 222398 252497 313537 434452 564753 623417 581596 503709 484650 517073 551588 581841
9012 581841 633069 763104 1004757 1293412 1517051 1634641 1700759 1769302 1804188 1733831 1550281
9001 1550281 1277058 968447 711330 573326 581820 672850 797179 944549 1106189 1266939
8991 1266939 1386372 1390239 1262997 1118551 1024847 896960 701321 524625 432534 447511
8981 447511 546900 689842 824740 895462 912659 905095 893580 934610 1019646 1067009 1026243
8970 1026243 948963 913442 936418 975320 934170 754584 480184 189598 -30571 -89121 7333
8959 7333 153932 270519 373115 496147 653537 836821 987336 1121051 1313496 1530420
8949 1530420 1676639 1735765 1702247 1577997 1427742 1274773 1158303 1081292 998563 941920
8939 941920 929734 910907 835139 739599 664220 593261 526091 469324 423117 419375 459880 527042
8927 527042 633320 753377 858234 912178 871987 791667 708972 564551 390101 261824
8917 261824 194231 152027 126872 153362 222381 318534 452067 626744 810079 920218 889567
8906 889567 780766 698209 665923 643293 607134 598994 679327 857609 1116609 1380452 1502880
8895 1502880 1491444 1466678 1423345 1332142 1278981 1357734 1552313 1739925 1815076 1811145 1763001
8884 1763001 1657305 1533658 1413996 1287062 1134891 991742 864696 712299 517887 332332
8874 332332 263175 363019 573429 732883 761694 702950 604415 541042 585365 684618 752038
8863 752038 814859 897947 1006424 1202929 1466104 1629524 1610491 1484327 1348445 1273193
8853 1273193 1271188 1293525 1290149 1265764 1233312 1177636 1139702 1198643 1360004 1521878 1595044
8842 1595044 1643023 1768927 1957397 2105218 2095741 1897772 1631851 1420992 1271463 1118956
8832 1118956 922840 748602 702778 758686 824902 858568 858623 841345 855003 953904 1136105
8821 1136105 1337250 1478624 1521483 1494208 1454885 1434261 1411848 1364810 1311560 1285795 1259702
8810 1259702 1208830 1178322 1163147 1153120 1173492 1206125 1219590 1188754 1133966 1109082 1128549
8799 1128549 1171563 1196152 1182513 1165000 1202034 1323693 1490785 1630245 1688110 1639875 1544387
8788 1544387 1521924 1615846 1743887 1836562 1872955 1846778 1726624 1514998 1296868 1138567
8778 1138567 1021586 935865 882831 817406 743544 708274 713853 718408 707087 735613 823462 930658
8766 930658 1019683 1036987 981413 915829 925585 1003843 1088924 1202325 1312317 1328437 1267360
8755 1267360 1188013 1082033 955219 840895 757920 736786 795934 913568 1054611 1162953
8745 1162953 1195302 1169167 1104095 995451 886978 858993 909718 1027986 1181288 1285596
8735 1285596 1281620 1175274 998519 793554 646030 591495 621803 784334 1059836 1304525
8725 1304525 1406889 1414519 1456547 1578650 1730658 1866097 1911054 1881022 1879343 1913289 1953199
8714 1953199 1978894 1988570 2021541 2084274 2129667 2135197 2131746 2137975 2111053 1960108 1676707 1373034
8702 1373034 1177967 1133948 1187812 1295040 1415168 1497411 1520170 1508388 1520208 1589345 1680728
8691 1680728 1760609 1816333 1828420 1813198 1843954 1971436 2190176 2452622 2665768 2792410
8681 2792410 2842516 2868031 2901157 2916918 2944964 3033976 3172090 3288652 3306943 3235423 3156415
8670 3156415 3115190 3126915 3231509 3451182 3709103 3931182 4166782 4462340 4790199 5160000
8660 5160000 5633883 6217075 6844461 7502889 8215036 9010809 9973531 11113034 12409022
8651 12409022 13923700 15688562 17671125 19834111 22210730 24881331 27848412 30946853
8643 30946853 33951613 36656118 38826512 40224423 40641543 39996089 38403443 36098214
8635 36098214 33370370 30462066 27545916 24804265 22360363 20215537 18334743 16590628
8627 16590628 14864015 13233460 11800421 10580472 9561493 8716228 8010791 7446967 7021581
8618 7021581 6672549 6353364 6063612 5814377 5611679 5439136 5271733 5087618 4851041 4588925
8608 4588925 4368357 4137996 3807134 3445932 3177525 3002368 2921481 2943019 3003033 3061532
8598 3061532 3100886 3111562 3098892 3087487 3122102 3141931 3069437 2974225 2935861 2969553 3044064
8587 3044064 3077676 3034835 2949371 2857421 2798215 2736682 2602938 2440909 2302621 2166150 1998293
8576 1998293 1791698 1584809 1429619 1357126 1372175 1472950 1597712 1646601 1582128 1458852
8566 1458852 1350201 1290090 1237873 1181055 1194226 1309831 1486594 1655490 1779779 1827760
8556 1827760 1758762 1598049 1456594 1383261 1321774 1252050 1170000 1123717 1172703 1288410 1372874
8545 1372874 1387401 1365513 1318757 1283544 1344258 1497512 1669905 1822883 1965664 2097842
8535 2097842 2147522 2045740 1874545 1751950 1710682 1734774 1791942 1881872 1981864 2081849 2151491
8524 2151491 2169142 2200464 2294081 2390563 2400198 2331287 2210084 2099309 2086062 2172829 2286479
8513 2286479 2383777 2517450 2714000 2904069 2986776 2969854 2944172 2932413 2876909 2790703 2746864
8502 2746864 2771703 2848021 2923030 2948692 2892844 2805763 2786387 2876311 3113566 3467479 3814407
8491 3814407 4101632 4367145 4591337 4769760 4992663 5295103 5668353 6118292 6643149 7274585
8481 7274585 8035818 8888796 9795777 10760577 11841615 13148603 14719489 16477590 18326469
8472 18326469 20156202 21829115 23221110 24090599 24139599 23338995 21939569 20251491 18474250
8463 18474250 16735517 15164440 13798317 12553294 11390766 10348269 9424166 8644806
8455 8644806 8035231 7525639 7076894 6743315 6538656 6409344 6330936 6251745 6138215 6010395
8445 6010395 5898921 5875937 5975453 6094977 6109150 6002139 5807651 5602321 5477178 5443364
8435 5443364 5476975 5571077 5777715 6107180 6478888 6814436 7069193 7237307 7327230 7438899
8425 7438899 7759752 8349389 9074191 9815543 10625762 11578608 12674115 13907009 15238653
8416 15238653 16655730 18231059 20049306 22171218 24627889 27402616 30344313 33210320
8408 33210320 35786359 37849526 39235448 39819183 39514042 38365445 36578054 34416128
8400 34416128 32048910 29538265 26955677 24429186 22109691 20097734 18401747 16972139
8392 16972139 15757629 14719785 13827363 13000246 12129488 11232338 10450612 9896668 9589156
8383 9589156 9462492 9388831 9256031 9042806 8780944 8475243 8068081 7575832 7089643 6676876
8373 6676876 6404088 6307113 6313785 6295324 6234242 6174535 6063021 5867630 5664458 5481606 5275009
8362 5275009 5033721 4803699 4606427 4460978 4394159 4387483 4397340 4401251 4419334 4452219 4474139
8351 4474139 4452048 4389061 4325405 4285252 4260299 4258411 4323304 4479449 4683890 4848829 4921668
8340 4921668 4935995 4915408 4845811 4784628 4778843 4831111 4929529 5067523 5242022 5388540 5438817
8329 5438817 5423628 5434229 5570986 5878252 6287682 6712087 7120765 7599577 8262706 9184403
8319 9184403 10345433 11711688 13298526 15153775 17332097 19862845 22754694 25964104
8311 25964104 29408719 32957128 36387433 39354205 41495316 42578025 42502735 41287527
8303 41287527 39122542 36310007 33139276 29877851 26772237 23992547 21633950 19708651
8295 19708651 18102693 16769558 15742801 14948457 14261275 13598889 12975903 12490608 12158584
8286 12158584 11892541 11665434 11484004 11390945 11442309 11586422 11720982 11803583 11834785 11823784
8276 11823784 11768333 11699082 11697288 11844518 12177005 12685531 13361085 14187808 15174510 16388494
8266 16388494 17855181 19532175 21435438 23697564 26429763 29726221 33745792 38647474
8258 38647474 44518617 51411747 59448168 68707632 79057832 90035580 100857645 110580397
8250 110580397 118200017 122815303 123903950 121451367 115864907 107911495 98555451 88712359
8242 88712359 79131291 70254351 62294164 55380766 49516650 44669705 40819859 37786889
8234 37786889 35293961 33197984 31501640 30200023 29207577 28398138 27672286 26975342 26270978
8225 26270978 25549565 24848897 24202903 23601705 23091666 22744061 22616407 22734971 23057201
8216 23057201 23516851 24109924 24879431 25881410 27193955 28880567 30962478 33477832 36444354
8207 36444354 39879066 43890910 48691198 54564966 61785591 70610240 81302831 94120523
8199 94120523 109293519 126902975 146696863 167973194 189498172 209586167 226286315
8192 226286315 237644306 242168087 239311209 229645149 214664388 196319675 176545541
8185 176545541 156917069 138505160 121993994 107700218 95533728 85221159 76509626
8178 76509626 69179931 63126942 58235946 54250979 50983779 48340096 46217836 44491972
8170 44491972 42975913 41482134 39942612 38447920 37106707 35952934 34969595 34145646
8162 34145646 33470901 32935292 32615249 32595291 32860206 33373461 34145968 35235897 36719426
8153 36719426 38636362 41037931 44060337 47808955 52336050 57723852 64158140 71967449
8145 71967449 81506300 93090867 107030556 123631396 143081832 165302721 189712851
8138 189712851 215086487 239606419 260975939 276768306 284954154 284459068 275495476 259523898
8130 259523898 238777078 215579403 191900721 169231212 148527244 130195410 114303469
8123 114303469 100762254 89412262 80020072 72263963 65802578 60423215 55990422 52298100
8115 52298100 49148106 46408919 44010899 41874041 39909366 38072459 36390151 34975846
8107 34975846 33858678 32980734 32292460 31757205 31367520 31173593 31288340 31728543 32426162
8098 32426162 33392265 34675666 36274537 38182500 40463628 43248060 46626856 50691295
8090 50691295 55661791 61792083 69283405 78401393 89482328 102791368 118470729 136491479
8082 136491479 156451428 177481304 198265161 217083227 231997816 241195845 243505093
8075 243505093 238677502 227399355 211150498 191846773 171414107 151382938 132742530
8068 132742530 116048403 101522054 89164785 78830565 70249606 63134152 57155135
8061 57155135 52007126 47570833 43800146 40619480 37981558 35844449 34100880 32611805
8053 32611805 31271655 30054087 28931504 27871041 26906883 26093322 25504212 25208179 25211268
8044 25211268 25465303 25906594 26525200 27341583 28368890 29654698 31254579 33180008 35423977
8035 35423977 38070487 41240584 45020852 49481932 54656629 60503242 66935967 73896300
8027 73896300 81332952 89191756 97502874 106288354 115221626 123534066 130250384 134474662
8019 134474662 135516451 133037813 127216058 118709862 108475622 97492938 86565429 76226856
8011 76226856 66811392 58512243 51393482 45371644 40310882 36103945 32594867 29628933
8003 29628933 27132917 25055496 23258269 21651981 20285328 19119062 18036084 17000066
7995 17000066 16086797 15346184 14743017 14234000 13775135 13354515 13005561 12768599 12583437
7986 12583437 12359106 12136713 11978134 11855245 11787424 11834981 11994812 12214310 12469204 12848111
7976 12848111 13476070 14373956 15459610 16678207 18091234 19831031 22008248 24632718
7968 24632718 27618380 30847126 34163710 37319917 40035986 42026787 42967905 42694249
7960 42694249 41317306 39048629 36094897 32740308 29350873 26183432 23321709 20729627
7952 20729627 18371911 16313346 14661394 13360612 12256037 11263434 10346385 9519966 8789304
7943 8789304 8150986 7629866 7250505 6971098 6716952 6493061 6332493 6200237 6003457 5688524
7933 5688524 5338582 5078595 4920998 4807283 4713596 4635158 4590463 4611810 4631917 4539415 4309529
7922 4309529 4029517 3826745 3692312 3514684 3239515 2897468 2572338 2397968 2423237 2523000
7912 2523000 2597171 2644334 2662799 2653043 2625228 2616186 2671020 2775425 2853320 2810075 2625639
7901 2625639 2388691 2184104 2019935 1886421 1839313 1918937 2038328 2128816 2173437 2179224 2176338
7890 2176338 2218489 2357099 2543409 2643708 2586879 2444274 2337554 2348839 2459131 2552645
7880 2552645 2559939 2519094 2482077 2393639 2198525 1990811 1912582 1963458 2007667 1971604 1892495
7869 1892495 1796856 1717261 1693997 1723419 1745501 1771400 1829257 1845483 1787602 1731459 1715820
7858 1715820 1716037 1712113 1712503 1724709 1727704 1711862 1685705 1689512 1743674 1825013 1883700 1875191 1809801
7845 1809801 1741424 1731726 1796921 1889048 1951498 1955673 1865464 1675146 1462095 1347945 1406956
7834 1406956 1612749 1887214 2131339 2257738 2237534 2131256 2016857 1905318 1759984 1579937
7824 1579937 1443832 1412226 1432980 1411861 1304996 1165641 1105433 1172528 1350026 1560571
7814 1560571 1679516 1695518 1701167 1747899 1831251 1938657 2058994 2191154 2333078 2482679
7804 2482679 2552431 2468099 2302688 2143367 2018632 1917702 1845034 1790245 1726869 1691072 1680052
7793 1680052 1708858 1807389 1917399 1976411 1925969 1814793 1773481 1767429 1689106 1561974 1462932
7782 1462932 1419550 1411378 1369632 1260886 1137112 1035023 920461 802583 782272 865842 883781
7771 883781 785337 687982 672572 760328 900165 1063515 1257614 1452982 1607896 1645839 1543630
7760 1543630 1403137 1267734 1060416 790561 546033 377390 294707 257168 259792 357077
7750 357077 539922 702212 800985 854388 876775 909754 999644 1157797 1338387 1462427 1479241
7739 1479241 1401692 1287640 1224743 1247650 1299748 1339257 1380045 1451808 1566765 1735958 1938306
7728 1938306 2079961 2090547 2014213 1954383 1920728 1870955 1866281 1959437 2047157 2010979 1858191
7717 1858191 1649467 1481361 1446408 1538047 1740426 2056603 2441042 2802442 3011198 3015653
7707 3015653 2912635 2820139 2750702 2723948 2811455 2986258 3095749 2969396 2641973 2316416
7697 2316416 2079840 1936830 1900810 1901566 1843549 1719139 1594555 1574906 1707475 1939997 2172291
7686 2172291 2336392 2441996 2500249 2433703 2214352 1961835 1803557 1794143 1936978 2202136
7676 2202136 2534905 2860154 3096494 3251023 3383019 3553994 3773354 4024055 4327272 4691775
7666 4691775 5082378 5448898 5810054 6275924 6914060 7722587 8705903 9907977 11303412
7657 11303412 12804352 14348833 15874720 17382855 18854671 20155700 21137271 21665410
7649 21665410 21640679 21022621 19899903 18466037 16931456 15507212 14249354 13073859 11938357
7640 11938357 10859373 9838855 8934676 8209377 7631659 7116925 6615768 6165071 5764795
7631 5764795 5377188 5025204 4750494 4582638 4479828 4326720 4078129 3794463 3516701 3245032
7621 3245032 2980934 2736759 2539599 2413217 2368103 2388198 2449448 2593852 2812889 3016674
7611 3016674 3126015 3055393 2814910 2546685 2311449 2068590 1847186 1727875 1703947 1653115
7601 1653115 1501688 1257525 978388 774236 718334 776067 848986 894820 958925 1094273
7591 1094273 1327682 1619249 1910627 2160252 2324714 2376006 2295846 2102272 1877410 1672068
7581 1672068 1458823 1194073 879556 615448 499928 502831 569576 687825 793623 815869
7571 815869 786070 796439 876929 980132 1023756 944536 797668 703683 733763 885820 1104247
7560 1104247 1268639 1317210 1309664 1287839 1205400 1054067 926241 920440 987037 1002531 912230
7549 912230 751304 625113 600581 624847 610311 549590 495918 490054 527760 592656 658407
7538 658407 670181 623871 581961 572018 570679 548538 547531 642549 805023 905740 902395 830571
7526 830571 690923 521777 412513 394509 454297 566998 672301 718321 696778 658795 669407
7515 669407 750344 876127 977385 1013404 1036037 1117892 1287234 1514688 1751713 1935092
7505 1935092 1999839 1943886 1795608 1586901 1327267 1016249 738118 561680 424750 255240
7495 255240 68147 -77031 -105514 6265 166700 309052 423145 486524 484119 477633 530195
7484 530195 636840 714042 680356 577704 486506 465255 516002 569604 592719 626001 663916
7473 663916 707402 808559 920782 940164 931490 1016325 1148765 1242506 1267579 1245730 1202613
7462 1202613 1124872 996302 876352 867183 1012026 1200361 1305221 1310829 1281403 1219063 1049294
7451 1049294 798878 622226 575579 581902 614472 694923 805667 889372 904413 860406 786827
7440 786827 708681 662967 655499 649580 627007 611947 643511 753377 936730 1169403 1392679
7429 1392679 1553946 1661436 1694403 1644195 1589712 1575789 1546547 1477233 1413568 1368815 1360782
7418 1360782 1410368 1494622 1545903 1492162 1339442 1159207 1023189 938467 876697 847770 846353
7407 846353 839152 858625 934563 1002700 995902 964640 971448 1024143 1097312 1168268 1235898 1280554
7395 1280554 1247298 1145664 1063176 1002564 935846 900845 910951 977617 1100216 1172892 1105099
7384 1105099 970430 876045 858099 891921 953195 1017907 1078544 1144070 1178182 1149028 1085441
7373 1085441 1048627 1043900 1032528 947969 765760 568331 491203 602932 830726 1009544 1031491
7362 1031491 932248 787079 625686 480984 415789 492439 701227 936844 1067679 1031358
7352 1031358 936139 876711 851232 873009 924811 940245 875268 772682 708647 739462 876472
7341 876472 1058291 1173281 1140876 1008595 891311 818541 766970 764362 828505 919384 986569
7330 986569 986078 943456 894574 836157 756808 670701 585442 494187 406063 412439 553482 741471
7318 741471 891000 990842 1063609 1112352 1104472 1014808 850605 667311 534321 511379 599780
7307 599780 710756 807496 896123 972379 1024945 1031772 995276 957316 943456 918583 883792 843924
7295 843924 759135 704654 810162 1000999 1134650 1193984 1216924 1155567 985290 789547 620946
7284 620946 496811 429105 398842 400529 454642 556783 665465 718681 751941 855296 994926
7273 994926 1079401 1119101 1167868 1241780 1290299 1238118 1128402 1084218 1146490 1276493 1453873
7262 1453873 1629998 1742207 1797640 1862161 1948006 1971189 1876850 1674328 1450875 1341586
7252 1341586 1414102 1555914 1603226 1546068 1479692 1382550 1228907 1105614 1044755 985539 912764
7241 912764 864917 842611 873075 951763 1036972 1102806 1107668 1031012 883095 750124 699644
7230 699644 715055 777101 850059 945410 1061343 1169758 1293489 1416753 1494520 1490753 1418335
7219 1418335 1349583 1318677 1301832 1295540 1347688 1466617 1579622 1620053 1583844 1491148 1415718
7208 1415718 1408325 1398994 1315017 1188611 1048968 879045 727911 659339 659634 667419 626861 528978
7196 528978 430190 376424 414205 558576 749435 922730 1022107 1021008 955471 880934 835258
7185 835258 847821 860403 809491 732724 679607 647314 595148 545898 564331 652831 797094
7174 797094 991780 1201408 1379169 1504509 1581324 1603465 1579307 1591081 1705812 1862438
7164 1862438 1880414 1682832 1397909 1176745 1074444 1050407 1045818 1046228 1036554 1079628 1226871
7153 1226871 1376090 1412235 1334027 1211929 1111105 1045945 1007713 1018729 1094700 1212139 1352548
7142 1352548 1500289 1670865 1894521 2175291 2461749 2662202 2762563 2783985 2708319 2541853
7132 2541853 2346023 2227454 2211750 2229875 2234844 2251360 2349189 2562770 2899947 3329748 3843480
7121 3843480 4390676 4817881 5020667 5024333 4953113 4903642 4900603 4906273 4877145 4844526 4895001
7110 4895001 5087866 5420622 5870325 6408323 7038155 7852471 8940419 10305118 11969253
7101 11969253 14070172 16852098 20596521 25583465 32123078 40605818 51188682 63026098
7093 63026098 73402054 78068775 74700622 65659200 55085971 45401474 37282087 30719642
7085 30719642 25532164 21457780 18168378 15430832 13185076 11383243 9934824 8800577
7077 8800577 7944381 7257076 6677521 6201828 5752647 5323802 5014257 4847816 4758482 4711131
7067 4711131 4645649 4526341 4385773 4261753 4197753 4200952 4179439 4062329 3830781 3460087
7057 3460087 3014699 2666457 2495076 2481117 2618863 2871588 3157886 3386398 3524577 3586943
7047 3586943 3591220 3512689 3355507 3211053 3172186 3281841 3490419 3687747 3781908 3710200 3534319
7036 3534319 3389580 3292335 3141995 2901784 2628906 2418662 2294701 2181686 2065547 1970547
7026 1970547 1922582 1969860 2047044 2042646 1924527 1757535 1609524 1465709 1344318 1289256 1294331
7015 1294331 1339478 1365259 1322033 1192805 1033087 973516 1063737 1254316 1483630 1649373
7005 1649373 1659056 1520282 1323236 1137682 998834 937377 946180 982966 1031707 1085799 1133929
6994 1133929 1179813 1215435 1203192 1177540 1188587 1242771 1335965 1402434 1401811 1377934 1346176 1263932
6982 1263932 1141359 1066296 1087431 1184691 1349947 1576653 1824835 2009193 2084764 2093610 2075584
6971 2075584 2032198 1935722 1755522 1539550 1402593 1312718 1205677 1159714 1181722 1196086 1167013
6960 1167013 1086317 957283 799205 643642 522281 442849 428729 448560 449604 436460 434947
6949 434947 440623 395482 263752 122949 42594 21198 105085 299921 532253 761350 991156
6938 991156 1194724 1292537 1281803 1236820 1169807 1109226 1110215 1106843 1038978 1002600 1072952 1189893
6926 1189893 1291036 1360630 1386731 1377230 1380864 1429240 1511790 1597473 1620218 1525808 1336998
6915 1336998 1130085 934490 784467 746200 801011 892647 1030809 1191797 1312885 1392543
6905 1392543 1431664 1417657 1380762 1364861 1357974 1365943 1461356 1602414 1664169 1607158 1465960
6894 1465960 1306338 1182610 1083092 1007669 1008544 1122729 1316697 1485069 1531395 1442960 1298066
6883 1298066 1125354 927971 786849 776669 912678 1128681 1296040 1365498 1372782 1339457
6873 1339457 1299143 1279602 1303552 1401872 1535463 1606785 1587841 1521772 1453624 1437729 1469203
6862 1469203 1453309 1324435 1139831 1043302 1117531 1326261 1570214 1770545 1868548 1847107
6852 1847107 1774180 1706433 1629630 1533020 1479993 1517363 1625186 1730242 1754586 1700987 1642752
6841 1642752 1655135 1730218 1765190 1752948 1775239 1843769 1978745 2161219 2301815 2340274 2322463
6830 2322463 2349778 2430896 2483977 2465846 2439968 2473626 2553065 2670462 2776034 2799285 2765193
6819 2765193 2761463 2787343 2801459 2773810 2702228 2610201 2493920 2365521 2273169 2254866 2290678
6808 2290678 2350930 2448050 2606662 2807087 3003825 3156873 3250857 3303711 3390776 3643603
6798 3643603 4181444 4937078 5732589 6476504 7149400 7753346 8353897 9050615 9909327 10973859
6788 10973859 12315721 14011561 16113795 18644579 21668047 25297629 29644690 34859207
6780 34859207 40985998 47812711 54861907 61261944 65749001 67249643 65532651 61261001
6772 61261001 55525930 49307174 43241526 37674823 32767406 28530823 24930539 21937151
6764 21937151 19452095 17361223 15592377 14070101 12689858 11438874 10394529 9557159
6756 9557159 8796684 8041529 7298591 6559791 5846834 5190171 4567347 4024993 3681249 3554616
6746 3554616 3584808 3736430 3971396 4204421 4336912 4333186 4199452 3937542 3615269 3372407
6736 3372407 3284811 3299821 3346649 3443839 3586068 3721722 3855401 3996568 4139086 4250554
6726 4250554 4320796 4353081 4321944 4241717 4127017 3979187 3862959 3845466 3912472 4041737 4219437
6715 4219437 4458535 4805105 5223687 5660620 6143385 6747636 7471725 8331914 9425427
6706 9425427 10814079 12542959 14664207 17150789 19902469 22758655 25415322 27464883
6698 27464883 28539455 28405496 27137514 25068509 22595927 20010313 17494513 15178809
6690 15178809 13151709 11479289 10165032 9111722 8228267 7483740 6848738 6283827 5763709
6681 5763709 5292382 4873039 4498680 4160684 3819927 3460569 3140707 2882841 2703669 2604786
6671 2604786 2538431 2482106 2426679 2390465 2429409 2520015 2589249 2608547 2553297 2463790 2403050
6660 2403050 2356243 2293913 2202817 2056052 1860392 1692566 1662167 1784314 1960512 2096580
6650 2096580 2156603 2115625 2011248 1902506 1814248 1771118 1769733 1775604 1770274 1774696 1792283 1816018
6638 1816018 1829470 1779525 1626066 1427842 1204825 983126 937069 1129265 1373067 1491780
6628 1491780 1468671 1440446 1517396 1611840 1627171 1621837 1633229 1587622 1459535 1327342 1267908
6617 1267908 1286703 1306120 1247136 1154076 1154218 1293628 1484659 1635973 1725190 1729053 1622235
6606 1622235 1440770 1253587 1138771 1132616 1201794 1253235 1232602 1187127 1173865 1169540 1124722
6595 1124722 1038976 949012 890374 863681 850926 842406 882684 1042949 1327825 1619735 1833999
6584 1833999 1967456 2029077 2104688 2300554 2614142 2918148 3089417 3156303 3182434 3175057 3125414
6573 3125414 3074154 3079866 3161780 3311149 3528920 3844026 4247432 4681276 5161648 5704688
6563 5704688 6272040 6821525 7388421 8061729 8897167 9967695 11306488 12867275 14587705
6554 14587705 16484927 18579700 20714314 22628345 24123476 24980712 24932402 23879945 22029866
6545 22029866 19762246 17454955 15316981 13360225 11572720 10005178 8734725 7766515
6537 7766515 7017006 6403622 5848589 5314887 4834622 4397086 3978939 3636351 3438684 3347828
6527 3347828 3274897 3190738 3054365 2830062 2614367 2504534 2520242 2608333 2652989 2626028 2534310
6516 2534310 2350774 2084220 1849502 1782529 1853346 1930370 1994509 2050209 2053654 2004054 1960186
6505 1960186 1959367 1964313 1957833 1963630 1955225 1885214 1780058 1660060 1558029 1529269 1557846 1594991
6493 1594991 1595340 1541592 1440462 1314232 1191853 1110246 1128657 1252505 1414543 1529575 1555895
6482 1555895 1490833 1404972 1379655 1386444 1405670 1462604 1535397 1547547 1444754 1292369 1189397
6471 1189397 1119212 1056747 1046495 1116609 1254557 1394093 1454182 1410188 1330174 1294587 1287011
6460 1287011 1252901 1191482 1121856 1022095 884940 750534 649186 588636 544705 509826 550860
6449 550860 710375 935767 1127999 1211268 1180497 1105477 1094932 1176703 1199862 1069761 862009
6438 862009 659501 499777 420366 435465 541339 649637 689792 696031 712257 767859 875117
6427 875117 1020552 1226354 1586322 2118467 2684550 3054127 3081875 2873636 2578262 2193002
6417 2193002 1731506 1319558 1102309 1070393 1046401 923834 776667 753150 890875 1098970
6407 1098970 1296894 1429104 1454825 1390011 1298874 1174053 986058 782637 667001 675313
6397 675313 736781 795784 790567 665432 460290 299223 323994 537191 783568 916333 909969
6386 909969 842566 767533 700372 677331 743553 899727 1082289 1227362 1285415 1267033 1224193
6375 1224193 1200999 1185471 1119574 977969 798286 623507 491468 431393 424830 433322 427435
6364 427435 442177 538828 661253 716094 719342 700669 658489 598270 500195 359021 232036
6353 232036 154010 118983 128142 137889 93273 16534 -32727 -71147 -108545 -105519 -69121 -23944
6341 -23944 34576 161549 348826 526279 659815 774642 893813 961378 889468 706226
6331 706226 558985 537858 574392 615251 703066 817417 879064 893093 947437 1034612 1083658
6320 1083658 1108753 1158109 1216279 1221282 1124567 973001 859707 823907 763394 544057 214537
6309 214537 -71727 -229733 -254610 -144657 81083 293846 423100 567300 789236 1033744
6299 1033744 1230682 1388231 1497311 1532719 1530599 1527912 1536306 1547551 1559150 1536148 1414728
6288 1414728 1247573 1140803 1101535 1053187 999750 1004992 1052996 1079581 1078241 1092263 1116101
6277 1116101 1136959 1181142 1288874 1454645 1632924 1756939 1775389 1750919 1800785 1930403
6267 1930403 2062186 2131408 2125960 2094562 2119928 2236038 2419944 2645476 2886404 3149319
6257 3149319 3444880 3812875 4291960 4895399 5631396 6486436 7399343 8356252 9488337
6248 9488337 10917710 12616742 14479524 16432743 18435124 20389255 22041319 23095071
6240 23095071 23369420 22852371 21680144 20079043 18303344 16551113 14931534 13477169
6232 13477169 12186086 11079634 10128106 9222617 8323959 7451837 6663439 5988022 5342974
6223 5342974 4715666 4154156 3667072 3216573 2781093 2451578 2325338 2355414 2450722 2554056
6213 2554056 2597946 2569149 2526690 2502149 2443968 2314783 2162468 2075011 2110425 2288260 2534368
6202 2534368 2737231 2832571 2815296 2704678 2473530 2194234 2002854 1898490 1837459 1823826
6192 1823826 1840421 1863627 1877356 1860467 1827205 1755380 1581575 1361373 1176331 994847 803040
6181 803040 674660 638045 612527 543478 479783 504177 620910 752702 854739 906385 886808
6170 886808 831478 856807 1025253 1224448 1336449 1406141 1518629 1642104 1665478 1604726 1552352
6159 1552352 1505647 1442462 1379867 1318411 1274283 1202424 1049670 861653 720768 655255 622103
6148 622103 592715 591687 606881 562341 464268 393832 404971 479515 564337 642470 722681 772325
6136 772325 750314 706439 698271 670283 557441 410455 347434 409879 596723 852019 1046872
6125 1046872 1113228 1115259 1107182 1076223 1012302 954812 978878 1052904 1063619 1005455 993309 1081803
6113 1081803 1208922 1276753 1278467 1291943 1352033 1426234 1435735 1351833 1250458 1213748 1260944
6102 1260944 1380130 1477928 1469563 1367443 1232958 1119682 1089412 1139580 1163052 1058314 820829
6091 820829 542835 334009 255497 266005 266154 226684 205243 226019 239069 232672 258719 331042
6079 331042 408156 434562 384496 280958 131141 -1162 -18600 79646 231148 350341 378478
6068 378478 371993 374978 399191 487398 636356 803445 972899 1121493 1197521 1192317 1131234
6057 1131234 1089087 1146228 1243060 1237602 1118827 972320 909197 993839 1189120 1392419 1536825
6046 1536825 1636354 1711238 1691583 1482541 1150489 842172 631786 538483 524419 477791 358964
6035 358964 265122 256094 298225 354319 448280 611772 795081 879046 820302 711373 695173
6024 695173 816262 997739 1118437 1130943 1077168 963513 789369 644733 585358 533484
6014 533484 441632 372529 340965 287336 242052 268961 357608 499549 702539 929502 1139781
6003 1139781 1323642 1489145 1647482 1717702 1620698 1433594 1273751 1168272 1118279 1115301
5993 1115301 1105792 1095996 1152540 1266849 1360244 1397102 1422263 1445372 1451876 1417204 1313445 1146631
5981 1146631 957391 812163 754147 803514 934751 1064627 1116876 1138209 1225109 1364964
5971 1364964 1488972 1601583 1739479 1876101 1963980 2042296 2158813 2318745 2543908 2879511
5961 2879511 3308768 3751305 4173445 4605495 5077662 5560759 6043820 6638110 7423799 8344894
5951 8344894 9373163 10616285 12163605 14053764 16266434 18692990 21167978 23437511
5943 23437511 25123876 25876749 25545042 24218495 22160406 19734068 17304599 15075187
5935 15075187 13112427 11433366 10045530 8881462 7839563 6900309 6092804 5467348 5017371
5926 5017371 4622441 4171166 3710262 3371615 3157885 2973925 2832858 2770858 2705410 2606230
5916 2606230 2558893 2582545 2612527 2606604 2581813 2576918 2589211 2558961 2458601 2338376 2213264
5905 2213264 2028795 1797391 1609784 1440428 1230306 1064349 1022444 1049492 1066674 1080546
5895 1080546 1191282 1431986 1672998 1805498 1856138 1866547 1775591 1569203 1362608 1276616
5885 1276616 1276812 1215306 1073471 938570 794770 615992 454089 350356 314438 326309 365027
5874 365027 409418 469445 560592 664533 719238 709845 688687 721824 826571 954698 1078973
5863 1078973 1214964 1337315 1400360 1422787 1412491 1343158 1268938 1288593 1362461 1415429 1440016
5852 1440016 1397312 1282215 1194630 1209075 1286390 1314319 1201887 983670 796987 728000 726267
5841 726267 739359 762826 759116 688399 555837 460443 464014 528207 641125 782858 883401
5830 883401 892928 845122 759041 631420 487922 385202 387817 491407 613019 701082 746292
5819 746292 742354 707754 665723 626428 616686 655125 721101 827598 981717 1103718 1144126
5808 1144126 1101628 999313 885743 798783 752608 725854 733606 801544 853934 796174 629341
5797 629341 391730 118560 -83336 -132780 -47086 134678 342382 478513 539805 559968
5787 559968 555987 586909 698470 872512 1034874 1104697 1095110 1079880 1100002 1183868 1362001
5776 1362001 1567814 1661274 1627579 1556645 1480914 1389760 1300553 1218617 1148565 1134629 1164591
5765 1164591 1120550 953987 766681 683866 692178 713394 763881 842466 928693 1001796 1035723
5754 1035723 1011210 919617 836261 864999 1041538 1323933 1605143 1808355 1914530 1919103 1893350
5743 1893350 1900378 1970400 2065031 2075908 1979019 1837125 1701111 1559170 1381457 1215886 1106980
5732 1106980 1048241 1044931 1093365 1179992 1275505 1304511 1193560 968981 773467 743602 855917
5721 855917 975808 1007169 976121 973123 1039218 1152309 1229836 1256709 1259787 1228359 1197250 1191251
5709 1191251 1204442 1217773 1167289 1037420 873539 723717 641249 621739 613130 619303 703851
5698 703851 858544 943999 894841 832131 838480 859511 844792 833134 854535 897076 943767 965530
5686 965530 962841 946176 913902 912169 967737 1021929 1044716 1102333 1240123 1421815 1578574
5675 1578574 1657115 1611186 1418927 1180003 1044950 1034077 1085109 1133167 1143298 1161368 1248123
5664 1248123 1363949 1415678 1397460 1379497 1400948 1460201 1506503 1479983 1416289 1365437 1338955
5653 1338955 1327492 1288895 1200115 1092400 979985 832187 592656 276696 11071 -130674
5643 -130674 -174669 -157767 -86075 42966 145929 158895 135323 129317 144609 190551 204872
5632 204872 136194 25464 -54668 -52746 -6207 32354 56694 107179 207668 317703 424339
5621 424339 567267 771531 968233 1105170 1205384 1305319 1335818 1223215 1002278 759460
5611 759460 613973 563850 467757 280161 120579 84843 139930 214636 252837 243090 272034
5600 272034 392892 530038 632456 677314 581218 367517 173437 39782 -60426 -101760
5590 -101760 -59922 -3967 37288 135534 332577 544466 678189 781027 867673 908094 919614
5579 919614 912896 877516 793197 674358 540157 358072 113783 -128071 -302924 -384078 -367011
5568 -367011 -285717 -221077 -252806 -379057 -530120 -608656 -524276 -303682 -91455 18878 29547
5557 29547 -44730 -153563 -215708 -207360 -128428 10901 153522 235814 214116 80341 -127780
5546 -127780 -312248 -374532 -305695 -200192 -162054 -202327 -243271 -216912 -116327 77312 330207
5535 330207 529839 585808 495787 394861 406096 482345 549264 624723 721842 802214 823308
5524 823308 778961 710682 640337 587485 588796 640200 746999 932165 1166598 1394021 1595537
5513 1595537 1720947 1733936 1665207 1560474 1440975 1283364 1096142 910410 734292 602322
5503 602322 559566 591656 661243 736320 780038 770902 727813 707882 769975 876305 960059 960069
5491 960069 852716 705972 575090 442203 306739 205960 159962 159457 168136 190229 251099
5480 251099 304836 332253 407436 578302 790395 979498 1136433 1260873 1374469 1478069
5470 1478069 1539877 1525724 1418103 1267492 1155457 1128226 1125570 1067110 976411 926790 928942
5459 928942 930739 896501 863598 844615 771419 621728 456959 312194 210871 158980 135966
5448 135966 117003 47566 -65433 -149664 -179265 -138292 -16111 141893 317153 499662 653451
5437 653451 745853 795933 890176 1045274 1191751 1278676 1294144 1276197 1256404 1258196 1305453
5426 1305453 1382731 1468434 1518003 1453566 1276891 1114812 1082973 1118554 1119212 1061908 954133
5415 954133 845997 751972 658433 569954 506183 449442 348289 212912 89433 25109 51117
5404 51117 152680 282184 406340 523408 628844 743367 848860 868261 799092 683645
5394 683645 558132 489753 464852 439237 448897 542894 680802 800025 862042 841909 781709
5383 781709 720393 652610 637670 725235 873234 966005 922136 824367 742490 651337 557294
5372 557294 475223 422685 415272 439556 497157 582537 653179 694625 737953 768001 750356 719134
5360 719134 683127 625691 575954 558538 580992 657264 775768 899118 962055 945301 921527
5349 921527 915306 922829 953512 968572 921750 796039 597853 404800 275433 215524 217707
5338 217707 219541 179696 144817 110527 52735 18754 59972 155540 255703 342487 386688 370041
5326 370041 322073 269037 201556 138556 110857 78386 38940 9176 -21967 -45478 -65401 -62937
5314 -62937 -19185 34425 58069 21672 -37990 -95887 -166990 -227105 -226758 -159584 -57998 62671
5302 62671 189713 316388 446528 548316 603672 608818 578267 550843 511026 409407 256754
5291 256754 107004 20507 -22857 -73740 -118685 -97295 -4752 102514 184861 247913 335541
5280 335541 409812 363900 210909 58588 3085 108927 275704 360367 337655 245565 96105
5269 96105 -78716 -208943 -287652 -343810 -374781 -356750 -258525 -106263 33465 127771 157779
5258 157779 108618 17511 -111184 -307426 -475257 -499759 -414533 -345898 -295304 -105829 243006
5247 243006 546558 643330 599080 545688 536700 555670 585568 637805 689723 713403 745114 784621
5235 784621 784204 742871 642802 499760 407521 418414 501540 598682 664224 673123 682409 759684
5223 759684 909297 1087678 1205726 1179098 1030939 880265 817082 812040 824970 846498 877505
5212 877505 929904 969115 969134 985098 1024447 1020770 948306 849920 750006 646976 518260 358764
5200 358764 233555 164949 116252 76454 86363 183414 336215 458895 527491 564934 564828 557912
5188 557912 591864 696437 779960 704949 533297 423883 429938 500928 580567 619049 546608
5177 546608 390891 314356 396958 558119 676646 753556 840887 929400 999548 1036867 1024597
5166 1024597 931499 791431 710273 717413 715925 601229 414596 292264 278009 306139 339184
5155 339184 395542 451973 484193 550075 678656 793006 810167 738904 672573 610995 447763
5144 447763 228991 96678 89606 122684 133345 110810 71248 -20631 -170927 -291065 -403083
5133 -403083 -583518 -757000 -798884 -706194 -550034 -418392 -366518 -356978 -349944 -340760 -318463
5122 -318463 -264549 -181555 -71103 77467 253768 377751 364928 244255 149551 157259 193703
5111 193703 180129 118402 32988 -62374 -146315 -192608 -235100 -307599 -378484 -374514 -306785 -239692
5099 -239692 -119309 103164 298344 348095 269991 143349 75366 121791 242192 360938
5089 360938 469424 603895 773051 924995 1011633 1067666 1098261 1031540 848384 589152
5079 589152 315014 128051 82856 125070 199596 314253 459899 578147 650122 693463 732846
5068 732846 796471 828351 777196 702308 658814 605993 516293 473645 574563 781780 965338
5057 965338 1071429 1116593 1080223 969570 833722 688426 551910 469921 502006 646377
5047 646377 823869 974721 1054109 1027967 983549 1055996 1235540 1398542 1490017 1474236 1295392
5036 1295392 991553 664949 389784 159428 -42642 -176012 -248819 -286316 -247353 -98753
5026 -98753 125184 321519 435456 516208 598571 644250 638563 637034 622210 542430 413115
5015 413115 299261 259883 316241 450417 623342 765582 803592 757785 705588 659735 628406
5004 628406 589891 526680 503256 594786 778556 952879 1022481 933468 727680 511294 374398
4993 374398 329659 313207 290922 253340 199435 148495 117000 129861 194494 311125 536030
4982 536030 865518 1140764 1278582 1326005 1318714 1245471 1061156 802770 621178 546503 467773
4971 467773 355263 264972 253978 349141 492530 638968 797345 913121 924341 895357 944629
4960 944629 1074503 1182094 1164238 1032725 859274 641209 416281 312041 366783 491335
4950 491335 554949 475405 282849 85308 -17155 12664 131005 255046 368038 500336
4940 500336 637624 762387 877675 938519 942642 951792 936818 834766 690890 594376 574011
4929 574011 578688 524388 418660 295376 150774 35203 -6015 5378 83787 253534 434865
4918 434865 524350 550562 592555 631144 605164 522004 436336 345876 245602 150064 55512
4907 55512 545 5391 85821 276999 539446 781849 955511 1100434 1235493 1314167 1301504
4896 1301504 1197501 1057700 947470 883827 860503 835191 753264 615449 478121 413341
4886 413341 476078 619789 766421 872174 926040 941806 888936 727994 540777 458002 531451
4875 531451 671961 727515 703105 710816 800823 900653 912565 816127 689447 619807 610469 624603
4863 624603 627456 535974 343791 164742 62977 84115 241355 476645 690948 828774
4853 828774 879150 809291 666329 561207 503036 454203 455004 535571 616483 614983 514256 373077
4841 373077 260996 198442 135908 51706 22927 50301 26609 -81047 -166869 -159215 -92139
4830 -92139 -21177 24944 81536 185863 307197 416086 495052 534139 553699 582899 634005
4819 634005 681520 705718 674197 565558 430342 310083 172617 -27886 -274057 -467583
4809 -467583 -511161 -418244 -286467 -187153 -103072 -3577 137502 340179 540930 648426 648594
4798 648594 570101 421516 182923 -84282 -232181 -233295 -153438 -117995 -222516 -400239 -580528
4787 -580528 -725889 -773857 -695593 -525613 -315132 -157990 -112453 -151798 -205627 -212759 -190417
4776 -190417 -210969 -256626 -252587 -217732 -188048 -168846 -183043 -217515 -224986 -198432 -162062 -85037
4764 -85037 72606 274484 473181 665419 827818 908300 908448 898784 883806 821415 751022
4753 751022 699390 612989 457704 299659 216658 204329 233684 287689 345228 395862 438598
4742 438598 462926 463239 435326 380610 309769 260797 264056 336045 467908 598475 679002 754685
4730 754685 880923 988519 1031846 1037366 1023211 1040031 1092039 1096714 1031228 934848 838053 745574
4718 745574 634304 524611 478955 509670 557526 568742 574314 585729 569945 519665 465768
4707 465768 442497 429603 424386 442005 435192 390475 302828 211932 201559 267559 333489 345803
4695 345803 306678 287897 334642 423102 571153 753697 860573 864259 838279 845585 923092
4684 923092 1106801 1365177 1569611 1600778 1471122 1321963 1246900 1215090 1150979 1046965
4674 1046965 992171 1036849 1095425 1054262 917707 737113 514594 253741 19493 -80779
4664 -80779 34935 309488 588386 755156 832052 898932 943706 907038 783221 664070 672182
4653 672182 810283 941933 952384 865813 764667 702286 651628 544888 393565 237667
4643 237667 102759 20014 -166 -4346 -21232 -35650 -25227 26742 123278 292826 493879
4632 493879 634786 684439 621716 464149 297465 226183 239915 268232 264355 251481 283406
4621 283406 324516 288766 174795 98618 164224 340778 521391 608779 587296 522514 426019
4610 426019 248354 -31417 -351704 -581481 -638799 -555149 -425806 -320170 -256340 -217479
4600 -217479 -162375 -78256 35738 160491 276358 394966 550519 720472 838322 910361
4590 910361 972881 996673 992755 1018857 1046071 1001019 888863 806805 842436 912714 865537 751691
4578 751691 733633 813453 843243 768234 673856 591876 464304 283094 104226 -32663 -97551
4567 -97551 -67887 29556 142023 248857 323212 330416 275104 148296 -29819 -200002 -325854
4556 -325854 -344235 -236040 -54537 103512 180233 233960 302580 345225 338510 269861 131560
4545 131560 -44420 -152388 -122823 -65965 -35804 7706 65375 123917 201409 287168 326643
4534 326643 332169 335078 341018 373306 426129 459134 482076 499233 510473 533850 565478 612826
4522 612826 639636 595816 466658 274113 104842 33255 -9137 -109202 -221073 -255477 -220484
4511 -220484 -162145 -53436 164995 475059 778672 987242 1064178 992677 782968 482149
4501 482149 211191 80756 96690 179860 218313 187523 177900 253678 361204 474235 586438
4490 586438 671115 718388 728891 718462 743170 820101 857592 777262 615806 435972 288168
4479 288168 222553 261255 404504 617986 854373 1047510 1132180 1160989 1219889 1273961 1236157
4468 1236157 1100904 964796 924768 970348 995834 915845 795723 735803 734447 722547 610252
4457 610252 429580 375597 533654 755317 875282 892341 857680 802566 768035 736534 682823
4446 682823 655009 713344 827763 908155 910754 863585 804229 788424 853887 953178 1037023 1071544
4434 1071544 1048469 1023002 1007970 941199 809006 725172 784894 922292 1047945 1139755 1164982
4423 1164982 1075497 881899 646403 444828 322618 302230 381263 493230 583205 649985
4413 649985 691075 713498 691911 636290 615289 632115 656481 678347 702759 719415 749225 830918
4401 830918 985651 1155592 1206900 1085465 825491 550046 390604 347584 356697 392165 452145
4390 452145 522685 550260 507926 417558 297422 176732 76217 1298 -39937 -13394 118493
4379 118493 325792 494813 570906 612678 678321 737974 753396 741597 694958 573625 411060
4368 411060 312024 359341 511746 627715 672288 737323 846254 934874 992301 1011922 969356
4357 969356 889640 766445 607538 506195 514608 546002 522035 420164 269850 204552 297624
4346 297624 432464 480200 427483 298392 135928 7565 -92637 -222390 -356700 -428095
4336 -428095 -466191 -508307 -541349 -547999 -533369 -527337 -543321 -588034 -628405 -611118 -493876 -260788
4324 -260788 43403 340253 577241 710135 696864 555416 366130 164144 -52239 -207878
4314 -207878 -269878 -277123 -205671 705 263883 439844 492135 491577 477301 403628 250175
4303 250175 103491 47768 109699 292645 571716 860601 1040453 1089796 1076144 1041930 1003373
4292 1003373 984321 948486 866781 830792 830559 791077 767773 785952 767591 708169 675054 655047
4280 655047 604891 537891 515027 608181 773907 882522 918207 948933 999378 1033877 1032204
4269 1032204 986086 908059 860886 905596 984040 1043690 1069964 1058025 1051596 1059562 1042257 1004977
4257 1004977 989148 999649 987117 886258 727470 587415 478379 403222 371282 382788 473020
4246 473020 633085 744166 768483 758855 688107 508821 292221 122615 38393 82810 263044
4235 263044 505218 726698 881137 926956 877097 819632 767102 637059 435137 255396
4225 255396 143646 104895 107520 145927 279785 466649 590129 636591 643267 599164 507326
4214 507326 413449 399266 482452 547857 518991 450595 391392 325804 233906 180194 200227 226201
4202 226201 245211 279012 308243 329408 406593 581933 797188 976598 1117845 1201286 1186550
4191 1186550 1115320 1058949 1012300 992494 1017319 1007519 910849 753848 589821 458673 352855
4180 352855 307776 386346 555409 708074 783432 793783 760177 702154 674774 733265 821173
4169 821173 825710 766811 699387 570028 350515 126216 -25011 -125213 -214499 -286848 -305779
4158 -305779 -289564 -237341 -158673 -115680 -76388 -14086 59300 153433 267348 372783 428335
4147 428335 418620 358374 293037 264549 246739 165515 -30658 -289313 -483274 -583795 -620484
4136 -620484 -572719 -405801 -171619 62963 271314 374075 348888 302981 275005 225709 157893
4125 157893 88992 19681 -114704 -311085 -384585 -224357 33346 171017 171983 169355 240840
4114 240840 378262 494950 494133 368220 228114 155274 130853 109087 114099 188953 280753
4103 280753 297455 234160 166032 150047 218718 402545 677725 940814 1120652 1214280 1250729
4092 1250729 1233873 1143072 1006127 875180 756601 676261 648244 645621 659582 694641 757963
4081 757963 863411 1002411 1100213 1080600 966097 802452 642298 530558 456347 438877
4071 438877 472154 528372 654840 847594 1039392 1194745 1302785 1365774 1399025 1370837 1203416
4060 1203416 904753 640283 546331 648716 873932 1106054 1278366 1350320 1308270 1225802
4050 1225802 1138765 1011375 883258 779762 696816 580222 378408 108370 -112766 -168629
4040 -168629 -124853 -100430 -69409 42091 208066 340489 395496 451623 593572 782703 936874
4029 936874 1038322 1100741 1117116 1031875 859154 687097 562115 483707 414316 346075 293284
4018 293284 287619 321125 356526 389718 419028 423062 396844 382217 395664 436971 477132 461897
4006 461897 415142 396874 398760 365101 293580 226713 194965 234634 330875 441965 555617
3995 555617 628147 575296 379018 158933 -2032 -117375 -125899 -4874 155039 281589
3985 281589 355689 389733 421663 504936 618949 698787 730399 727707 715598 726125 777871 860805
3973 860805 935570 976213 982477 976736 1019190 1101121 1134439 1096871 1039198 994851 982371 969025
3961 969025 889722 738957 586700 516309 540287 601420 634509 595994 499937 393925 287140
3950 287140 197289 168493 229695 360155 485626 522730 471801 400095 287651 134591 40279
3939 40279 67093 193344 317909 371361 346813 235421 114670 74903 85009 75651 18805
3928 18805 -46935 -64544 -17318 21847 6458 43896 214137 434219 563407 573378 553265
3917 553265 570758 656024 798682 975014 1146309 1284460 1377523 1398464 1331696 1197426 1060932
3906 1060932 995613 1023001 1072126 1066279 1024321 958364 870829 793642 756478 784976 845450 845077
3894 845077 750518 589660 457147 398195 323710 163153 -75429 -363273 -566340 -564019 -364235
3883 -364235 -39941 282927 493341 580793 595762 588265 581052 575576 582090 597596 642100 740839
3871 740839 846326 911719 962098 1041135 1129255 1185654 1186466 1138648 1086971 1042559 996503 944879
3859 944879 825487 589592 319738 121092 4079 -31151 84034 345974 664013 943424
3849 943424 1123900 1193040 1162140 1045660 887142 757548 659116 574831 510553 388384 213211
3838 213211 130972 197055 321515 407802 480604 601345 691885 668852 606325 584816 557420
3827 557420 486998 433529 447634 490083 554921 708261 940275 1113230 1150781 1083502 976864
3816 976864 898875 843979 814238 851985 938350 1018424 1036143 937523 735446 482206 161256
3805 161256 -173304 -395908 -458604 -368656 -190674 -34370 69482 130598 120635 42249 -45242
3794 -45242 -90801 -68591 42998 252261 490156 630921 610866 459818 280716 184449 179375
3783 179375 210331 239878 259577 296636 334949 308922 226009 169212 173031 195565 122987 -84829
3771 -84829 -276989 -298924 -164363 19047 179235 296819 384482 460718 511431 512789 463809
3760 463809 357459 186424 -18750 -156454 -130160 30249 185854 229603 208367 208716 244801
3749 244801 261599 198973 102954 64113 87896 103108 78858 82762 160772 262826 323491 333218
3737 333218 338457 378412 462109 613111 809466 990916 1101845 1075968 941355 800978 703926
3726 703926 625163 538606 497362 544094 642385 744556 821424 862456 886347 894206 885976 866311
3714 866311 789516 597268 336202 107147 -5721 -2856 68976 220352 466601 704136
3704 704136 792327 707882 604206 603395 660575 671334 574174 432444 336254 324057 354697 362762
3692 362762 326798 270560 252406 289671 348579 368524 320312 276491 303365 318731 219991 2484
3680 2484 -234612 -394796 -491202 -551602 -542206 -407609 -167719 98476 336936 517310 631042
3669 631042 707431 782311 825703 768744 632712 515379 521821 608698 685238 752695 803652
3658 803652 835389 892362 1000363 1088562 1052358 898989 753350 702228 738759 845905 977706
3647 977706 1045006 1024524 1022965 1053375 999504 856216 711163 632084 644855 726260 867202
3636 867202 1031387 1152432 1192799 1158801 1142505 1163911 1138277 1080944 1047045 1035660 1037563
3625 1037563 1065238 1110574 1104798 991122 831389 765336 826164 938892 1031146 1051992 982995
3614 982995 887343 814899 731581 650338 633756 699654 766705 756980 704704 688559 713400 730912
3602 730912 703829 594479 428389 296913 224309 146868 28068 -78569 -110154 -103299 -95560
3591 -95560 -85851 -54126 83399 304921 484569 563581 554512 490291 405825 321919 251533 168599
3579 168599 44311 -68186 -80067 12397 139975 264866 377996 426076 313853 90196
3569 90196 -83323 -183310 -275868 -366491 -381628 -277144 -116903 24126 119417 156694 141489
3558 141489 133348 203257 316701 424036 497242 519783 549425 585165 611859 650661 642202 538218
3546 538218 401657 340942 408461 506013 479171 348358 244997 193500 161537 135397 130705
3535 130705 184587 281109 366847 461980 565455 618781 614643 587983 562605 551581 572025 633621
3523 633621 697564 725096 711203 684366 690313 762599 873573 972918 1077151 1234285 1427273
3512 1427273 1569762 1610652 1561185 1419728 1226990 1073947 957538 830398 701859 599355
3502 599355 530288 509636 558006 697696 857575 930139 915361 889171 898114 919212 955189
3491 955189 1028302 1063662 958144 773283 649908 629105 638886 639785 634922 588061 504743 439147
3479 439147 393992 373414 381584 383475 364987 352388 383496 479498 613802 727688 775073 722083
3467 722083 591287 470238 434606 500174 642176 791386 882776 912423 866606 729835 598768
3456 598768 643388 861800 1076311 1166322 1137929 1025527 871241 754512 787006 964150
3446 964150 1110539 1066480 880283 744151 801059 996968 1185065 1335703 1446510 1446024 1306436
3435 1306436 1075804 826277 647408 543932 427091 298180 236457 270167 341250 349405
3425 349405 325936 396341 599707 889724 1184573 1366681 1385494 1279275 1088975 822612
3415 822612 508361 211894 -1538 -64510 -669 85161 177642 311290 452259 588835
3405 588835 716820 766759 731656 659184 580279 499854 443640 411821 361589 285061 269037
3394 269037 359089 461114 519875 596399 673507 644266 507335 375642 324242 352257 379922
3383 379922 320089 184468 8497 -171486 -330826 -442069 -477167 -435432 -334575 -216592
3373 -216592 -79406 85604 250036 365270 420927 421537 360195 281957 227583 189799 151110
3362 151110 99201 32750 -5087 29703 81704 104784 116643 113702 85525 22618 -46259 -68207
3350 -68207 -17765 102110 265964 407771 436306 373176 292130 200701 126262 103046 106333
3339 106333 154936 305337 484234 556029 466191 274377 49561 -94203 -59887 96430
3329 96430 263850 397526 462404 380640 165116 -17946 9808 268997 589274 812731
3319 812731 909892 944980 1005941 1116428 1253982 1322892 1247278 1058893 842326 651888 526619
3308 526619 501103 577040 719762 829960 804193 639953 427142 231716 90976 90782 249506
3297 249506 479592 693608 863887 988462 1031225 999687 957214 913151 805660 671469
3287 671469 622855 623818 545165 395240 334377 412513 513803 555458 526824 462150 423605 419662
3275 419662 367377 229679 66124 -63729 -189690 -347109 -455779 -471231 -451649 -460960 -489420
3264 -489420 -448661 -289908 -94013 59566 160710 208832 247835 337763 452296 522487 533423
3253 533423 521015 499502 464860 402342 321691 261028 232080 223521 264818 390420 564492
3242 564492 718641 822410 887640 913072 864364 754064 691526 669857 643789 674575 755984
3231 755984 825977 872714 881571 828560 708741 526528 333295 195747 152547 169509 179879
3220 179879 190953 243468 334168 413950 429824 330627 135846 -35268 -82498 16401 203002
3209 203002 419537 642508 830884 930395 965775 1009314 1076761 1150896 1205254 1221617 1176499
3198 1176499 1021665 760250 501818 312350 184013 97311 35674 -10460 -41772 -99864
3188 -99864 -181274 -224654 -186042 -62105 72931 142617 171671 213198 263783 319762 401168
3177 401168 500323 575384 629733 691352 747204 785268 835461 906350 936369 899433 808271 672928
3165 672928 491173 237283 -51845 -294799 -461690 -575071 -637237 -653738 -662252 -727598 -835556
3154 -835556 -873233 -785906 -607078 -411716 -278378 -246726 -294480 -345987 -360628 -345801 -297471
3143 -297471 -241330 -210963 -194985 -197132 -220713 -201360 -109463 30377 176010 277273 342500
3132 342500 410905 463395 496900 550565 641574 737511 816368 849728 808012 722844 644116 663076
3120 663076 840654 1067643 1208320 1256416 1270678 1279792 1279958 1241068 1151793 1038665 924829
3109 924829 836691 821511 882177 973086 1085691 1176797 1190606 1119853 961168 761300 611166
3098 611166 555523 569731 573067 579570 667444 826150 981174 1073157 1060476 957144 836120
3087 836120 749836 699804 708006 806164 966631 1101118 1155105 1166642 1177707 1184697 1144892 1049728
3075 1049728 896840 706762 499488 341093 354134 501804 599907 571278 527607 558674
3065 558674 623818 685405 712241 685268 664013 671813 677262 661671 655730 671672 663593 576126
3053 576126 407373 252572 209235 249369 263387 173078 -8339 -157352 -167010 -67405 82636
3042 82636 233010 340674 389031 390201 378121 392691 409374 384138 287073 92365 -149431
3031 -149431 -341058 -493687 -685895 -915232 -1100907 -1169364 -1122448 -1021319 -903566 -760935
3021 -760935 -588181 -403103 -287709 -328400 -461141 -528265 -474172 -379060 -302733 -209181 -42206
3010 -42206 222703 535295 775331 851761 789171 707809 703400 755084 732081 576809 357236
2999 357236 164602 30124 -66216 -85998 69536 372102 651897 764272 722105 656110
2989 656110 645734 697394 724881 604886 335536 45961 -172083 -301380 -355133 -330646 -201962
2978 -201962 -3981 163921 244395 246035 203557 171712 193914 269556 325625 323505 360318 490687
2966 490687 655053 775531 771579 634169 495946 467200 538019 611877 605987 517456 386241
2955 386241 237756 134012 145704 226450 290206 331472 403869 470698 410280 251301 137263
2944 137263 168003 351540 587423 773328 875974 929094 982605 1030318 1044910 1046918 1060574
2933 1060574 1101536 1156448 1156127 1040264 849776 648791 486466 381294 339987 322052 215898
2922 215898 13583 -155874 -183129 -59784 156202 361443 494297 539129 525537 530587 590038
2911 590038 656307 667967 646231 639111 629539 556624 440328 344445 325435 454566 683890
2900 683890 876362 971001 1024402 1038677 974508 885514 841013 836166 788015 654602 531521
2889 531521 521410 586005 626589 662559 742625 826907 907965 1050410 1210625 1255775 1191447
2878 1191447 1119239 1070199 1043215 1044569 1046403 1038643 1020639 979146 979542 1095826 1291465 1471927
2866 1471927 1549428 1491106 1374456 1258353 1129838 1003668 873963 722434 557301 386680
2856 386680 238533 179425 240534 413541 639947 820151 866122 793513 702668 643674 610741
2845 610741 637691 759741 903755 967697 934781 838230 731637 672742 655822 669404 727931
2834 727931 768395 699480 542576 357836 193787 91432 65448 43283 -50818 -170453 -233127
2823 -233127 -227242 -185887 -180954 -232014 -268218 -240876 -155670 -47348 53751 121731 170513 272464
2811 272464 426254 533590 569323 528807 360781 124384 -46408 -77335 -12156 72797 139292
2800 139292 174076 198377 212029 200476 167526 90077 -33755 -181060 -284022 -286069 -144718
2789 -144718 130549 382834 491038 474109 396657 282592 172605 93112 -2931 -216737
2779 -216737 -549523 -858593 -1008991 -969633 -815190 -648173 -481032 -267949 -16720 212438
2769 212438 371687 450384 508195 592646 682051 788772 901059 963732 988376 983091 893541
2758 893541 726958 591472 559156 582611 562174 438961 255155 121961 36055 -53145 -123332
2747 -123332 -139371 -71293 67932 182232 203993 183694 207720 271344 304060 306291 281529
2736 281529 194212 92662 67443 121154 236770 385948 473034 457884 429715 430724 398468
2725 398468 364579 407534 499591 566044 616682 719936 886697 1100214 1279066 1369442 1468733
2714 1468733 1620112 1721437 1692585 1564328 1367042 1146728 964876 809182 676470 549948
2704 549948 402913 325857 407540 592806 799320 999396 1164064 1218384 1159711 1046031
2694 1046031 888019 674069 401040 142727 -177 -40438 -9109 78934 213436 370115
2684 370115 476714 525743 584535 651685 667836 631207 582951 512904 409799 313643 297566
$$ [...]
##END NTUPLES=NMR SPECTRUM
##END=
