##TITLE=C13DEPT135
##JCAMPDX= 6.0         $$ Bruker NMR JCAMP-DX V2.0
##DATA TYPE= NMR SPECTRUM
##DATA CLASS= NTUPLES
##ORIGIN= UXNMR, Bruker Analytische Messtechnik GmbH
##OWNER= root
$$ XWIN-NMR		Version 3.5
$$ Sat Feb 15 10:04:41 2025 Russian Standard Time (UT+4h)  servis@DPX200
##.OBSERVE FREQUENCY= 50.3277607988526
##.OBSERVE NUCLEUS= ^13C
##.ACQUISITION MODE= SIMULTANEOUS
##.ACQUISITION SCHEME= undefined
##.AVERAGES= 315
##.DIGITISER RES= 17
##SPECTROMETER/DATA SYSTEM= spect
##.PULSE SEQUENCE= dept135
##.SOLVENT NAME= DMSO
##.SHIFT REFERENCE= (INTERNAL, DMSO, 0, 219.126)
##AUDIT TRAIL= $$ (NUMBER, WHEN, WHO, WHERE, WHAT)
$$ ##TITLE= Audit trail, XWIN-NMR		Version 3.5
$$ ##JCAMPDX= 5.01
$$ ##ORIGIN= Bruker BioSpin GmbH
$$ ##OWNER= servis
$$ F:\spectra/data/av/nmr/C13DEPT135/1/pdata/1/auditp.txt
$$ ##AUDIT TRAIL=  $$ (NUMBER, WHEN, WHO, WHERE, WHAT)
(   1,<2025-02-15 10:04:05.79 +0400>,<servis>,<DPX200>,
      <created by zg, POWCHK disabled, PULCHK disabled
       terminated by command 'halt'
       configuration hash MD5:
       00 E9 B6 7A A2 85 ED C7 34 08 36 98 17 FE 4E 26
       data hash MD5: 64K
       82 5D BF 08 68 8A E1 2F 4B 19 F3 71 60 81 CF FB>)
(   2,<2025-02-15 10:04:15.07 +0400>,<servis>,<DPX200>,
      <Start of raw data processing
       efp BC_mod = 2 LB = 1 FT_mod = 6 PKNL = 1 PHC0 = 384.807 PHC1 = 5.268371 SI = 32K 
       data hash MD5: 32K
       32 BA FB A7 BE C5 6E C8 47 3D C5 C6 3A 0A D2 06>)
$$ ##END=
$$ 
$$ hash MD5
$$ 83 2A A6 1A DD 2B 0C BF DF 25 4A B1 C3 DA 34 85
##$RELAX= 
##$RELAX= 
##$RELAX= 
##$RELAX= 
##$RELAX= 
##$RELAX= 
##$RELAX= 
$$ Bruker specific parameters
$$ --------------------------
##$DU= <F:\spectra>
##$EXPNO= 1
##$NAME= <C13DEPT135>
##$PROCNO= 1
##$TYPE= <nmr>
##$USER= <av>
##$AMP= (0..31)
100 100 100 100 100 100 100 100 100 100 100 100 100 100 100 100 100 100 
100 100 100 100 100 100 100 100 100 100 100 100 100 100 
##$AQSEQ= 0
##$AQ_mod= 1
##$AUNM= <au_zg>
##$AUTOPOS= <>
##$BF1= 50.322729
##$BF2= 200.13
##$BF3= 50.322729
##$BF4= 50.322729
##$BF5= 500.13
##$BF6= 500.13
##$BF7= 500.13
##$BF8= 500.13
##$BYTORDA= 1
##$CFDGTYP= 0
##$CFRGTYP= 5
##$CHEMSTR= <none>
##$CNST= (0..31)
1 1 145 1 1 1 1 1 1 1 1 1 1 1 1 1 1 1 1 1 1 1 1 1 1 1 1 1 1 1 1 1 
##$CPDPRG= <waltz16>
##$CPDPRG1= <>
##$CPDPRG2= <waltz16>
##$CPDPRG3= <>
##$CPDPRG4= <mlev>
##$CPDPRG5= <mlev>
##$CPDPRG6= <mlev>
##$CPDPRG7= <mlev>
##$CPDPRG8= <mlev>
##$CPDPRGB= <>
##$CPDPRGT= <>
##$D= (0..31)
0 2 0.003448276 0 0 0 0 0 0 0.06 0 0.03 2e-05 4e-06 0 0 0.0002 0 0 0 0 
0 0 0 0 0 0 0 0 0 0 0 
##$DATE= 1739599445
##$DBL= (0..7)
120 120 120 120 120 120 120 120 
##$DBP= (0..7)
150 150 150 150 150 150 150 150 
##$DBP07= 0
##$DBPNAM0= <>
##$DBPNAM1= <>
##$DBPNAM2= <>
##$DBPNAM3= <>
##$DBPNAM4= <>
##$DBPNAM5= <>
##$DBPNAM6= <>
##$DBPNAM7= <>
##$DBPOAL= (0..7)
0.5 0.5 0.5 0.5 0.5 0.5 0.5 0.5 
##$DBPOFFS= (0..7)
0 0 0 0 0 0 0 0 
##$DE= 6
##$DECBNUC= <off>
##$DECIM= 12
##$DECNUC= <off>
##$DECSTAT= 4
##$DIGMOD= 1
##$DIGTYP= 9
##$DL= (0..7)
$$ [...]
##$SUBNAM2= <"">
##$SUBNAM3= <"">
##$SUBNAM4= <"">
##$SUBNAM5= <"">
##$SUBNAM6= <"">
##$SUBNAM7= <"">
##$SUBNAM8= <"">
##$SUBNAM9= <"">
##$SW= 238.246396889851
##$SWIBOX= (0..15)
0 1 3 0 0 0 0 0 0 0 0 0 0 0 0 0 
##$SW_h= 11990.4076738609
##$TD= 65536
##$TD0= 1
##$TE= 0
##$TE2= 300
##$TE3= 300
##$TEG= 300
##$TL= (0..7)
0 120 120 120 120 120 120 120 
##$TP= (0..7)
150 150 150 150 150 150 150 150 
##$TP07= 0
##$TPNAME0= <>
##$TPNAME1= <>
##$TPNAME2= <>
##$TPNAME3= <>
##$TPNAME4= <>
##$TPNAME5= <>
##$TPNAME6= <>
##$TPNAME7= <>
##$TPOAL= (0..7)
0.5 0.5 0.5 0.5 0.5 0.5 0.5 0.5 
##$TPOFFS= (0..7)
0 0 0 0 0 0 0 0 
##$TUNHIN= 0
##$TUNHOUT= 0
##$TUNXOUT= 0
##$USERA1= <user>
##$USERA2= <user>
##$USERA3= <user>
##$USERA4= <user>
##$USERA5= <user>
##$V9= 5
##$VALIST= <valist>
##$VCLIST= <CCCCCCCCCCCCCCC>
##$VD= 0
##$VDLIST= <DDDDDDDDDDDDDDD>
##$VPLIST= <PPPPPPPPPPPPPPP>
##$VTLIST= <TTTTTTTTTTTTTTT>
##$WBST= 1024
##$WBSW= 4
##$XGAIN= (0..3)
0 0 0 0 
##$XL= 0
##$YL= 0
##$YMAX_a= 1188156
##$YMIN_a= -1563922
##$ZGOPTNS= <>
##$ZL1= 120
##$ZL2= 120
##$ZL3= 120
##$ZL4= 120
##$ABSF1= 0
##$ABSF2= 0
##$ABSG= 0
##$ABSL= 0
##$ALPHA= 0
##$AQORDER= 0
##$ASSFAC= 0
##$ASSFACI= 0
##$ASSFACX= 0
##$ASSWID= 0
##$AUNMP= <proc_1d>
##$AZFE= 0.1
##$AZFW= 0.5
##$BCFW= 0
##$BC_mod= 2
##$BYTORDP= 0
##$COROFFS= 0
##$CY= 12.5
##$DATMOD= 1
##$DC= 0
##$DFILT= <>
##$DTYPP= 0
##$F1P= 215.000008851289
##$F2P= -4.99998459219978
##$FCOR= 0.5
##$FTSIZE= 32768
##$FT_mod= 6
##$GAMMA= 0
##$GB= 0
##$INTBC= 1
##$INTSCL= 1
##$ISEN= 30
##$LB= 1
##$LEV0= 0
##$LPBIN= 0
##$MAXI= 10000
##$MC2= 0
##$MEAN= 0
##$ME_mod= 0
##$MI= 0
##$NCOEF= 0
##$NC_proc= -2
##$NLEV= 6
##$NOISF1= 0
##$NOISF2= 0
##$NSP= 0
##$NTH_PI= 0
##$NZP= 0
##$OFFSET= 219.1257
##$PC= 1.4
##$PHC0= 384.807
##$PHC1= 5.268371
##$PH_mod= 1
##$PKNL= yes
##$PPARMOD= 0
##$PSCAL= 4
##$PSIGN= 0
##$REVERSE= no
##$SF= 50.322729
##$SI= 32768
##$SIGF1= 0
##$SIGF2= 0
##$SINO= 80
##$SIOLD= 32768
##$SREGLST= <13C.CDCl3>
##$SSB= 0
##$STSI= 32768
##$STSR= 0
##$SW_p= 11990.4076738609
##$SYMM= 0
##$S_DEV= 0
##$TDeff= 65536
##$TDoff= 0
##$TI= <>
##$TILT= no
##$TM1= 0
##$TM2= 0
##$TOPLEV= 0
##$USERP1= <user>
##$USERP2= <user>
##$USERP3= <user>
##$USERP4= <user>
##$USERP5= <user>
##$WDW= 1
##$XDIM= 32768
##$YMAX_p= 353623536
##$YMIN_p= -365323336
$$ End of Bruker specific parameters
$$ ---------------------------------
##NTUPLES= NMR SPECTRUM
##VAR_NAME=  FREQUENCY,     SPECTRUM/REAL,   SPECTRUM/IMAG
##SYMBOL=    X,             R,               I
##VAR_TYPE=  INDEPENDENT,   DEPENDENT,       DEPENDENT
##VAR_FORM=  AFFN,          ASDF,            ASDF
##VAR_DIM=   32768,         32768,           32768
##UNITS=     HZ,            ARBITRARY UNITS, ARBITRARY UNITS
##FACTOR=    0.365929370215793, 1,           1
##FIRST=     11027.0033138647, 0,            0
##LAST=      -963.404359996184, 0,           0
##MIN=       -963.404359996184, -365323336,  0
##MAX=       11027.0033138647, 353623536,    0
$$ Real data points
##PAGE= N=1
##DATA TABLE= (X++(R..R)), XYDATA
$$ [...]
12252 -28372169 -25706768 -24960862 -24633185 -22416809 -20406708 -19051209 -16410713 -14691576
12244 -14691576 -15700883 -15915851 -14720612 -15945848 -16542621 -15957522 -13975830 -10774702
12236 -10774702 -9382432 -8096128 -6986409 -8038356 -10331467 -11150644 -10550599 -11372512
12228 -11372512 -12569714 -12718334 -13280222 -13707344 -14848290 -14706709 -15396493 -16469156 -14389313
12219 -14389313 -12791879 -12912695 -14709405 -16022616 -15934255 -15905323 -18127213 -19436987 -19141012
12210 -19141012 -18736359 -16419541 -17318254 -20092818 -19716406 -20285466 -20521204 -18015861 -17165230
12201 -17165230 -19692243 -21637576 -22057915 -21745130 -22371560 -23691204 -24322242 -25738096 -28486164
12192 -28486164 -28326621 -27513573 -28203148 -30701396 -32796040 -34266992 -37538448 -41020347
12184 -41020347 -45160465 -47243428 -49903123 -54494838 -64615175 -76467091 -84350401 -92447940
12176 -92447940 -101439611 -110843954 -122866702 -135787886 -147289045 -157027511 -165983837 -172444151
12168 -172444151 -173980425 -166898206 -152250364 -134465001 -117126207 -102697075 -86648158
12161 -86648158 -72760421 -61182821 -52142082 -46918520 -42887949 -36294104 -30740007 -28795592
12153 -28795592 -28427818 -27254618 -23420448 -20667043 -17776427 -12051060 -7870829 -8183598
12145 -8183598 -9542509 -11449224 -11794563 -10504297 -10042751 -7791149 -5699168 -5560565 -5756793
12136 -5756793 -7148085 -9541956 -10097724 -8955023 -4020106 1380840 2209003 116922
12128 116922 -1041934 -1479647 -971336 203812 1773738 1628868 2134806 3786074 3357317
12119 3357317 1786355 347100 803183 -204982 -2246706 -3112750 1217292 3600935
12111 3600935 2845408 1936678 1825497 627335 241384 -2372896 -3565684 -2907360 -2539418
12102 -2539418 -3999006 -4588939 -4798151 -4747033 -3470382 -1030859 -1213970 -1896174 -257372
12093 -257372 3212697 4096367 3374497 3690459 2269511 964155 1093615 190497 669581
12084 669581 1730484 1855910 3899541 7422441 8837727 4888941 1096751 583995 36046
12075 36046 -443851 1582576 1919148 1763043 1829695 1919178 3140318 5065959 4720183 4255522
12065 4255522 4511407 2774135 -2472476 -6964762 -6945650 -2556561 -3107146 -3978366 -521380
12056 -521380 2928220 3774456 2426268 877661 370040 2016544 1654979 59967 -1089848
12047 -1089848 275889 1621545 2986330 3714583 3094034 3315815 5188097 4536323 875671
12038 875671 -2439473 -4580487 -4616338 -3696788 -3383292 -2870145 -2398645 -2527031 -2326613
12029 -2326613 -843700 -91374 505224 610487 2985358 4948487 3687443 2137555 2644424
12020 2644424 2300756 247192 8085 -1482091 -5527127 -7153044 -4990428 -1826487
12012 -1826487 -412124 -1750011 -2546496 -3776793 -5094853 -3067978 -1015641 -1203431
12004 -1203431 -1852623 -2580880 -3366656 -1880865 -737588 693890 2607181 2290558 510774
11995 510774 -307839 577627 3547425 5241238 7307772 8404450 5171951 -41440 -1489564
11986 -1489564 -1540841 -3886704 -4419555 -4623416 -4115663 -2189624 -301231 -1783 482470
11977 482470 918119 1077856 1938866 -291566 -2759107 -2819464 -384127 1409265 560370
11968 560370 5742 -1842170 -5067767 -6404893 -7905964 -9214226 -8069877 -5711056
11960 -5711056 -4017015 -2057966 -2064473 -573591 2755935 3975708 2437225 -94866 -1701535
11951 -1701535 -3458365 -4347602 -3775207 -3704547 -2321438 -1023226 -230021 -1320444 -1437866
11942 -1437866 -1439395 -2915609 -2972926 -2202933 -3221171 -5653475 -7275601 -5837348 -4583221
11933 -4583221 -3572365 -3070918 -3170791 -2844054 -4903189 -6881686 -8370974 -7537100 -3364492
11924 -3364492 619617 3841016 6085549 8001485 8209446 6599977 5204812 4776205
11916 4776205 4882131 3828842 2295782 -44529 -368636 290304 -119671 -426370 2707539
11907 2707539 4367834 4027700 3024629 1789420 1616586 1625838 1007239 -972966 -983469
11898 -983469 -1000650 1556441 2966263 3012951 3335528 3809217 2669440 951003 2043799
11889 2043799 1566604 1108049 -531821 393 2843401 5167407 5777536 2870325 -1593707
11880 -1593707 -2485762 -2701536 -3345974 -2048186 -123120 44575 -576225 175083 1411045
11871 1411045 1657254 1258133 689207 1524297 893056 -208987 574960 476756 -1558379
11862 -1558379 -3844474 -4269389 -5071858 -6447298 -5249134 -3993749 -3469736 -2396914 -792377
11853 -792377 -1790092 -3690841 -2665234 -259220 -411650 -1102377 -576456 5114 479492
11844 479492 1194118 2292481 1757897 -1274538 -4118157 -4361323 -4426162 -4781762 -4396923
11835 -4396923 -1983488 -2053334 -5586036 -8755040 -9523157 -7822376 -7387956 -7655854 -8409435
11826 -8409435 -9675289 -8132811 -6856601 -6512156 -7318419 -8820809 -8727729 -9405085 -11851166
11817 -11851166 -14147125 -12118834 -9272088 -7532356 -7894562 -7942009 -7377155 -7524380 -7520065
11808 -7520065 -7165900 -6311463 -3753213 -3792984 -4728615 -8522285 -12502726 -12232046 -11951366
11799 -11951366 -13667363 -15235386 -16506898 -17405090 -15853683 -14645204 -14177318 -13368484
11791 -13368484 -13843615 -17408801 -22295084 -25483250 -25954557 -24385230 -24832939 -26749284
11783 -26749284 -27384049 -28463795 -31486913 -33630673 -35489296 -41171098 -46459024 -49791726
11775 -49791726 -52805996 -57461391 -65733385 -78051096 -87336534 -94410744 -105835648 -118846688
11767 -118846688 -130361532 -140526823 -147801878 -151300712 -152367553 -148909979 -141566717 -133161493
11759 -133161493 -121573563 -109453050 -97474336 -83134304 -69606239 -58178730 -47894235
11752 -47894235 -40486842 -32888700 -27742858 -25086174 -22604447 -18656896 -14512673 -12789795
11744 -12789795 -10281675 -9433156 -10545489 -8654185 -7719703 -9554256 -8006456 -3349206
11736 -3349206 -2489464 -1507518 4673 130938 -1874618 -2809984 -2058696 -1681058 -2975882
11727 -2975882 -5509966 -4851673 -753695 2942545 4677198 5809303 6565319 4473556
11719 4473556 1889362 -119505 -1666019 -1683672 -3809334 -2460075 -2624536 -2391134 -1586095
11710 -1586095 -4152267 -5866912 -3696178 -2302901 -776811 1599331 1133599 -1221196
11702 -1221196 62135 1863575 3423753 4902335 5474959 5525358 4353042 2963158 25048
11693 25048 778650 5345607 5686886 4132265 4739227 3516056 -33521 -1628180 -2616833
11684 -2616833 -3724942 -1285885 1072241 -1559948 -2065690 -797040 2275773 4415882
11676 4415882 3050334 -49911 -1164709 1304837 2649368 1129194 -545051 68877
11668 68877 2628620 5932715 7801967 5752815 4142434 6234809 7693214 8210129 7470032
11659 7470032 7160557 5711555 4201345 3114399 3007814 2420612 -453308 -4517854 -5391649
11650 -5391649 -2235218 2095414 3991267 3632317 2819346 3638948 4653977 6322598 4887571
11641 4887571 2080592 -1594559 -1982786 -1261449 123721 2760494 4304859 4387479 2590906
11632 2590906 5714 -3202506 -4801791 -4737272 -3135141 -141482 -1443790 -2532502
11624 -2532502 323494 2222560 1333234 2630487 2976082 3020413 1049083 724789 901302
11615 901302 -571757 -4160502 -4837403 -5664379 -6460925 -3439582 698440 396161 -1639571
11606 -1639571 -3136304 -4259338 -4227678 -2520872 557139 2933830 4563616 4799924 1429603
11597 1429603 -1261337 -1043143 409445 1464780 1553174 303382 247735 1497509 3079850
11588 3079850 3857479 3188767 2835535 1788616 1995789 2832185 2309569 755648 -905939
11579 -905939 -3300960 -3890814 -3850371 -3283064 -241616 2129010 975035 -1470352 -1462967
11570 -1462967 -1016070 -648572 592375 -851733 -5225628 -5744193 -2349462 1583824 1321350
11561 1321350 815024 -699630 -3999875 -6139278 -4961594 -5323238 -5695870 -6564049 -8932302
11552 -8932302 -8252153 -4995011 -3302338 -1296544 3287662 4249107 1132075 -573779
11544 -573779 -1795218 -3769107 -5848099 -5777882 -4920583 -5193191 -4675272 -2594185 -2661811
11535 -2661811 -3641118 -6367475 -8260331 -6936636 -5468447 -4461127 -3668874 -2834756 -1561005
11526 -1561005 -1001963 -22198 1522496 1512961 -969756 -1937685 612496 2209268 883997
11517 883997 -447351 -11054 214912 -476588 -2641019 -5058540 -4283769 -1858833 -562490
11508 -562490 205551 1838922 1997196 1284126 484216 864348 -696954 -3403346 -4052693
11499 -4052693 -2277976 -3380554 -3513793 -5894961 -8446466 -6222353 -1629762 -613189
11491 -613189 -944655 -1153985 -2463464 -3907668 -4537245 -5034844 -2659200 1037845 3706874
11482 3706874 4994962 5066911 3457227 1663810 1265655 615653 327137 2470382 1449288
11473 1449288 589091 1999937 3414338 3743516 841161 -2976390 -2482349 -3244736 -3681545
11464 -3681545 -1369939 -884828 -2367063 -3766528 -3865266 -2587704 -1389729 1145553 3159983
11455 3159983 2339998 -698220 -1883124 -2502887 -3193989 -3175890 -4142288 -2873566 745406
11446 745406 2561271 2390688 830078 2087646 3630512 5263292 7048366 8050817
11438 8050817 6963586 4986357 3867028 3684788 2856822 2490267 3219179 3193692 2712031
11429 2712031 -345209 -3746589 -5354865 -7125594 -8498883 -6489071 -3204634 -2523739
11421 -2523739 -2396294 1254265 5235101 7526560 6451730 5806666 5068450 3860776 2663953
11412 2663953 3737539 4524236 5570008 7126653 7110092 3879221 3907089 5784845 5322079
11403 5322079 2945503 2835038 2792695 415868 -428772 -1096997 -330375 -709965 -3992392
11394 -3992392 -3207216 -345489 923805 239372 -2206162 -3963405 -4558176 -5567915 -3413729
11385 -3413729 -369998 2174273 2510223 605316 -2863076 -3422207 -2769124 -2747975 -1882989
11376 -1882989 -1133573 -177447 679473 -863138 -129819 224258 -3352926 -6695105 -4604116
11367 -4604116 -456140 794772 -298527 -926916 -46842 978018 205193 -1559642 -173291
11358 -173291 660702 -1853821 -3254236 -4036590 -3741688 -3802336 -4049313 -5220940 -3429375
11349 -3429375 -2694997 -1643681 336729 2162108 1149103 -868970 347015 1208403
11341 1208403 -545049 -1359072 -1428317 -1158549 -1050924 -2001202 -1329176 -520256 391342
11332 391342 1264642 3129791 3177942 2606837 1915897 1405486 1473657 26854 -3963461
11323 -3963461 -4594945 -222098 1617119 770019 1171257 1398394 813051 -102423 -491538
11314 -491538 378005 -444416 -2698701 -3808205 -1819764 401362 913068 776143 59188
11305 59188 1009324 2760841 6254144 7742345 5448001 1307116 794382 -1141024 -2505468
11296 -2505468 -3264763 -4253365 -1849544 2766356 4892465 6786264 6863194 5854129 5621219
11287 5621219 4575154 3147388 3803617 3776542 3797083 3270977 1963479 1242799 479798
11278 479798 65391 -1789639 -2931464 -2270087 -2245476 -625499 -1343914 -4186607 -5040770
11269 -5040770 -2298605 -1293561 -2633067 -2621466 -1149263 -808761 -2133504 -3170979 -2575012
11260 -2575012 -1127238 -850630 -610392 2998496 6492697 9072104 8615300 6015622 3691293
11251 3691293 3442371 5501672 8797372 9705749 6624727 5426513 6523887 6055934 4823605
11242 4823605 3263086 1501164 430257 2535446 2298779 517082 611121 3799327 4728187
11233 4728187 4741865 4018246 2721114 2718625 317330 -1291265 -2590796 -4205642 -2821777
11224 -2821777 2079940 5429778 5716811 4633800 2176150 914878 1679490 2339467 -1045928
11215 -1045928 -3244657 -4863419 -3718947 -480676 2184858 1620102 1334516 3466283
11207 3466283 3333841 -311395 -435372 2521989 3518486 1803101 -274587 -566982 1023040
11198 1023040 2233151 1138582 2681163 3596537 1267388 -1493434 -2941021 -2072238
11190 -2072238 351395 179009 225430 1124296 159559 -497814 -421842 -2973083 -4697115
11181 -4697115 -4769303 -1279449 2545871 2302554 -68284 -2472692 -2628632 -732562 -355388
11172 -355388 -3013538 -5319042 -3790838 -689355 1153935 519243 897345 901402 -1604752
11163 -1604752 -2926321 -3181562 -2708098 -3883635 -3460084 -1259560 831201 3566779 6029501
11154 6029501 6521092 5657948 3161790 2450205 5479373 6587749 4250427 2307969 935618
11145 935618 965562 1126004 1839856 3053924 2195636 1711519 2398622 1502200 1618589 1198753
11135 1198753 204142 690536 2707817 5183272 4862735 6544141 6628697 5356356 4404837
11126 4404837 4064537 4475087 4671064 3356795 -1273190 -2696348 -3595876 -3891578 -3502671
11117 -3502671 -1960287 -1682479 -1147820 -981553 -2453177 -3977177 -4407600 -4978944 -3815542
11108 -3815542 -271628 1562322 1556015 1569135 889343 -1410303 -2999217 -4824640 -2749493
11099 -2749493 -1241780 -4323825 -6174732 -5359610 -3852280 -3852886 -3593646 -3918582 -2646420
11090 -2646420 -1434853 -2131419 -3999143 -4387876 -1884876 1135503 1158865 1898320 916955
11081 916955 -1310403 -2611784 -2434086 -3049200 -3526702 -3919666 -5421919 -4017089 121181
11072 121181 5625205 7051744 4318369 2305944 3636150 3452896 2600139 2372127 3661878
11063 3661878 6552516 7203624 6482578 3277105 -1314127 -3080659 -3680925 -4750839 -2740299
11054 -2740299 1822525 6960630 9106370 9447426 8663882 6553974 5078499 4258526 4001370
11045 4001370 4384554 4600757 3350984 -782723 -5130119 -5418779 -3434924 -7057 1822852
11036 1822852 2511474 4181636 4695135 3178260 1702847 1423940 3047146 3288016 4273664
11027 4273664 5702416 3568136 1420136 3591314 5118237 5499554 3014924 1432215
11019 1432215 1400815 -826041 -1865064 -2413052 -490775 3092669 3654534 187189 -2995786
11010 -2995786 -4251685 -3483783 -609433 483610 -306118 1352144 2570427 754428
11002 754428 385164 -469430 -1914661 -1988986 -1226545 -1912697 -3456181 -3783255 -2618372
10993 -2618372 -124835 1405765 2499437 3504257 1011422 -2742124 -3385920 -1902597
10985 -1902597 -654224 -824042 -1302384 -1113908 -1396897 -1396617 634766 1834803 1982503
10976 1982503 573447 -1436602 -3386791 -4282601 -2682852 -1167538 -688517 -871411 -1602860
10967 -1602860 -2525082 -1144197 2097544 1949183 514962 -428501 -2193744 -1969465 -312751
10958 -312751 3008535 7343111 7534302 4006168 4299308 4932472 3876408 3615074 2581614
10949 2581614 962395 879439 1875315 3711476 5075542 5166275 6748049 6732254 4133264
10940 4133264 3084919 2382233 2049860 1136366 373366 70170 -1613575 -5746273 -7049154
10931 -7049154 -6715537 -5304504 -4135181 -5956256 -6965429 -5594162 -5517971 -4607318 -3107805
10922 -3107805 -953074 586917 801247 733517 -773743 -3102659 -4280897 -3432466 -3468414
10913 -3468414 -2511612 -818519 2002921 5022103 5088060 2948326 1430686 2384135 4091266
10904 4091266 4458882 1430786 -1562850 -2018941 -1591731 2782886 4825187 4425924 2506359
10895 2506359 -877829 -312438 1934891 2219842 1129306 665301 1392845 -164880 -1352144
10886 -1352144 330618 1058115 850704 1122133 1402608 1866668 111373 -835117 -462465
10877 -462465 -298192 912557 2315627 3372119 2172013 772637 -1254607 -4166711
10869 -4166711 -5866672 -6188331 -7150343 -9222514 -10295413 -9871476 -6907712 -685135 2067327
10860 2067327 3047591 1299343 -1214015 -2331973 -2435209 -2317609 -1492307 -686418 -1858371
10851 -1858371 -3866542 -3172381 -3124356 -4668699 -4787025 -5780268 -7783125 -7070499 -2810667
10842 -2810667 -737463 -624857 -586826 -540885 980213 2238256 2026581 722064 -814594
10833 -814594 -952094 -1108248 62657 1719981 728771 -128429 1879718 1751586 600540
10824 600540 -946315 -2371944 -2095377 1172635 1753432 -311213 -1107960 -200616 -1527465
10815 -1527465 -4516578 -4505220 -2424317 859342 2814169 1643048 1126878 2785686 3360923
10806 3360923 2215554 -232237 -2308110 -2043594 -3345825 -815176 3989833 5672637
10798 5672637 3432407 779694 16563 -575376 -1474009 -1241431 -792016 478598 637912
10789 637912 596613 1741055 2750101 4738149 2865228 939273 192340 -353128 -1048307
10780 -1048307 -2972856 -3272573 -2546599 2552122 7065634 7075609 2828614 346811 6181
10771 6181 1238491 2633311 130736 -3413338 -4356710 -3301076 -407540 2246525 3510599
10762 3510599 4844637 4852758 2266752 2315018 3644636 2734107 1805399 2256499 1925795
10753 1925795 985774 861241 2709031 2880183 2481398 4996610 6455402 5546552 5157233
10744 5157233 6184236 5829594 3277652 2561081 3180869 4172513 4969077 7082944 9421195
10735 9421195 10158152 9625541 8496530 7952770 5196772 1276105 352815 1285706 -351869
10726 -351869 -1503409 -1595287 -640474 1521777 2177144 2039869 3032759 4862459 5939871
10717 5939871 6708518 8669869 8272045 5355422 3758011 2878719 4253479 3267549 1173733
10708 1173733 52475 -102529 -1266625 -3499552 -3497427 -1691751 1242726 3239425 2056014
10699 2056014 884177 1780139 2190939 1197344 1090541 -1670214 -4091310 -4690571 -3646666
10690 -3646666 -2526148 -2649412 -3826325 -4108335 -3139640 -3977263 -5231614 -4830805 -6349330
10681 -6349330 -6927735 -4474376 -2219703 -1042300 1342652 4050594 4381939 3490797 2072539
10672 2072539 3595680 4730122 4863225 3896005 1818582 1336044 4366972 6918235 6456116
10663 6456116 6632404 8479862 9440486 10121638 9687456 6851115 5971287 5608963 5156680
10654 5156680 3785166 2624344 2963788 4126791 3891110 1869484 958550 1282315 -739507
10645 -739507 540495 750557 -1490175 -3219013 -4816281 -6204079 -3210733 603792
10637 603792 3054281 1448859 75670 -661539 -531790 -460658 1669972 1333127 -1330068
10628 -1330068 -5529737 -7206627 -7755392 -6945676 -4331971 -2771680 272089 751871 -901383
10619 -901383 -986157 550888 618276 1853085 4241601 5920744 7554330 8187357 7175533
10610 7175533 6599721 5552031 5372896 6710123 4443344 1316156 729807 783227 2341386
10601 2341386 5117263 5977783 5874056 4954899 3768595 4881783 5683529 2982509 664123
10592 664123 2452354 2096240 1689384 2021672 3370295 3006432 1389359 -471905 -1730257
10583 -1730257 -2570365 -4043579 -3301651 -3581323 -4762049 -4923003 -3658573 -1732490 -451556
10574 -451556 -1138072 865306 1582954 569601 600448 2617467 2014362 469692 848740
10565 848740 1130756 792659 1219780 1661163 1060995 1943205 1872316 1035817 -231545 -997622
10555 -997622 -353618 1315576 1688222 2445680 1177388 347263 -661179 171978 1308560
10546 1308560 -2180756 -3793909 -3690075 -2964527 -2863970 -4239596 -7354297 -7906160 -7995796
10537 -7995796 -7743579 -6426452 -6089353 -4020167 -688660 -1004689 -3078737 -4235542 -4883828
10528 -4883828 -3607439 -1735899 -2145128 -2779256 -3176214 -4502339 -3506252 -526417 3163912
10519 3163912 4406337 549883 -3414799 -4017552 -3930139 -3396272 -3491071 -4116008 -3578449
10510 -3578449 -2800987 -907564 -545140 -2705148 -4505324 -4032395 -781023 918379 1469163
10501 1469163 2149192 1799609 1288508 1998566 3109091 3813184 3197871 3134399 1423851
10492 1423851 454814 1838975 1526377 216479 -224929 1832553 5745891 6322929 4935985
10483 4935985 2873808 -1056095 -3311616 -3334925 -3138576 -2008384 150606 -1059541 -2592133
10474 -2592133 -2220369 -733756 142001 1630516 179047 -727030 1522659 4555168 4800562
10465 4800562 4735740 2774681 1806048 1891925 2448427 2466378 1607821 -1337331 -4523985
10456 -4523985 -4662832 -3459206 -3074287 -2931267 -4427024 -3911654 -2797267 -271351 -1061473
10447 -1061473 -4352805 -6217411 -6099050 -7966276 -9435597 -8321965 -8715157 -9391803 -7696734
10438 -7696734 -5466346 -3971097 -1354170 -1137364 -3250151 -4911411 -3381215 -937735
10430 -937735 -473261 -721579 1236254 3292603 2344172 5255 -2261124 -3020388 -3333655
10421 -3333655 -2183978 -1642517 -2033934 154560 2689209 4804090 5174852 4003391 3191543
10412 3191543 3681444 2734330 2958064 4352668 2805184 -1116517 -3609061 -4335078 -2988068
10403 -2988068 459616 637610 -504361 -749302 -198614 2026150 3104252 3941677 6443178
10394 6443178 5813528 3159283 2745890 4342813 5942930 6087761 5354071 1841297 -551575
10385 -551575 -945523 -19880 1840273 185068 -1158806 189614 -190574 -2095057 -4543099
10376 -4543099 -6722205 -6075726 -4120554 -4277952 -4251149 -4223212 -5456562 -6061857 -7056424
10367 -7056424 -8059783 -8522885 -8002990 -5966737 -4612372 -5181830 -5415755 -1972905 569793
10358 569793 -768470 -871151 2603600 4481153 4114686 5272057 5376590 4793634 4125415
10349 4125415 3353580 1531727 1466742 2513681 3952287 3924912 2322428 2827702 2210930
10340 2210930 905893 2902828 1870849 -262618 -2252343 -2823227 -1654018 -1409396
10332 -1409396 -1599100 -1798414 -1554975 -1797637 -768194 1062091 1524350 87213 -2298253
10323 -2298253 -4470108 -4205918 -2541329 -2890232 -5302983 -5360768 -3941748 -1659029 -2254224
10314 -2254224 -4159699 -3254472 -1755939 -2746241 -5555699 -5442476 -1937635 186819 496450
10305 496450 1440577 -935670 -1091385 -333524 -774528 -1864643 -1167998 1156654 2908763
10296 2908763 5184361 8016899 5646871 -452350 -2616540 -741815 393198 1733884
10288 1733884 2284001 23982 -2363584 -2996818 -2575558 -15765 1668236 2116231 3614022
10279 3614022 5137405 4553909 3196587 2362213 692989 -304106 250790 1748677 32868
10270 32868 -1788221 -845520 -962476 -1826800 -1365379 908470 1615640 1616610 2340877 4043400
10260 4043400 4941102 4563436 4343814 4809963 4440326 3987020 3516823 3907343 1908113
10251 1908113 -555987 -462356 855180 2072272 3391399 3625410 3496252 2589282 3223426
10242 3223426 1973684 -879411 -3596103 -3913767 -401589 846809 -1170619 -1629122
10234 -1629122 -2606572 -1445802 2052098 2054229 1718416 168381 391977 1493764 2836844
10225 2836844 2527190 844333 474289 1405901 1322009 4553906 6604326 5073672 3748042
10216 3748042 3134859 3815135 5111835 4936678 2422066 2951532 3783983 4562699 3238908
10207 3238908 1158136 -1338222 -6080511 -7923897 -8303582 -8734035 -6259563 -5144026
10199 -5144026 -3984199 -1536780 -1957615 -1810216 1432826 2591658 -111647 -3103599
10191 -3103599 -5902337 -7678683 -6331502 -3528488 -886267 -2259666 -3555849 -1846756
10183 -1846756 -374608 -1414968 25279 909510 -1396675 -748615 517640 800742 998182
10174 998182 4365482 5804777 4994371 5245409 4311611 2580565 2901904 3296495 661529
10165 661529 -1340221 -2264430 -3346473 -3428524 -3308728 -2440206 -2091279 -2206922 -2909817
10156 -2909817 -1988811 -2549787 -2883293 -663370 541478 -295718 -1800923 639101 2399077
10147 2399077 860303 -618299 -396573 -1650583 -2084803 -1212237 262113 -1129290 -1025310
10138 -1025310 471014 2218887 4298711 3974983 1769570 1370340 1780468 -753182 -2123536
10129 -2123536 32736 1141956 462774 146428 1586779 2724313 4176562 3701192 2793373
10120 2793373 2005248 2030949 2666065 1481381 -1812189 -4273130 -3081246 -2347159 -2271664
10111 -2271664 -2341233 -4301772 -4651813 -2453288 -629109 387662 627610 481944 618644
10102 618644 851146 -475404 -2896989 -2652269 -1540785 -112534 3206615 4228108 3883427
10093 3883427 1320049 -785761 -1357867 -48007 1146214 2969940 6799899 7594067
10085 7594067 6179529 2698753 227848 124305 -1722141 -2595822 -2234862 -1448051 -690921
10076 -690921 -2192313 -3032478 -1475253 1695865 3702018 3897663 1121422 -3205865 -6362357
10067 -6362357 -5896859 -2291729 562584 -356569 -2156672 -1522040 -1976880 -5575957 -8201892
10058 -8201892 -7632303 -5660116 -4155885 -5115207 -3729070 -1598389 286265 45181 -117099
10049 -117099 -1201201 -4091806 -6040596 -5760607 -5164774 -5617923 -4748016 -5176667 -5853648
10040 -5853648 -5220165 -5598966 -6365416 -5950177 -4173634 -1127133 206256 -806654 -698125
10031 -698125 1025144 2710836 4557502 5945481 6494119 7440906 8177156 7190081 4539697
10022 4539697 1741506 1769292 1339438 2176160 134752 -2359117 -4477080 -6096595 -7459417
10013 -7459417 -5386922 -1535726 -422306 -456706 -1099303 -284844 2034033 2314769 2644332
10004 2644332 2854635 2542576 5815850 7338684 3021867 909659 3880526 4023916 1300057
9995 1300057 1046065 428127 -734058 -1278544 -1910220 -1915365 -1185623 176182 1836703
9986 1836703 455661 -398212 1128086 1469210 -1827214 -4616544 -5933409 -5224962 -3523586
9977 -3523586 -2156149 -1495457 -859906 -551985 167670 14025 -793714 330757 3364342
9968 3364342 4133422 476201 -4634554 -7206971 -7750817 -7515390 -6821207 -6306136 -4745346
9959 -4745346 -784901 1796642 1685268 -509134 -3896626 -5361067 -5513969 -5394507 -4931920
9950 -4931920 -3999392 -2453137 -2039579 -232801 417689 -848468 -1133855 -2076161 -3695169
9941 -3695169 -4554963 -2164255 572631 2394637 3801791 2803556 872355 -1226819 -3706836
9932 -3706836 -5824424 -5294468 -3911637 -2577968 740286 1703123 810479 -840141 437745
9923 437745 1129714 640734 1447172 475824 -1999431 -4031261 -3942836 -1267851 441512
9914 441512 2108059 3074511 2581231 290433 -3388841 -2892620 -604837 1908432 4364132
9905 4364132 4309879 2794813 2486168 998486 -1640920 -2696658 -3914290 -4295095 -1281369
9896 -1281369 2687008 4285492 4767527 5101847 4683150 5399588 5594412 4425582 1964547
9887 1964547 1518813 2842583 4268819 3859869 3754301 5133409 5726697 4284939 3983507
9878 3983507 3599401 623286 -711082 -1290652 -563960 2845621 3874347 862630 -2536162
9869 -2536162 -5168941 -4924627 -4324254 -5437819 -4557112 -4027075 -5244431 -8254005 -8581997
9860 -8581997 -5065305 -2975549 -1110711 46276 -460658 -306650 294081 3126912 4522892
9851 4522892 1987653 -2138691 -3962182 -4156887 -3616326 -3793584 -2577779 -2381769 -3693889
9842 -3693889 -2101997 1575346 2309416 1575746 1181825 1052651 2371285 4064476 4319975
9833 4319975 3318760 647669 -182693 1720061 1879501 779762 -1135415 -941632 -1371624
9824 -1371624 -2975503 -5640989 -7597702 -6591378 -5799264 -5658128 -4783310 -4204995 -2783247
9815 -2783247 -2427681 -3925198 -4252767 -5396365 -5571702 -3725072 -1683553 1145078 3108882
9806 3108882 1022156 265105 2895425 4468242 4083981 4411350 3968500 3938654 4650356
9797 4650356 883892 -2334856 -1008803 1243755 1627385 1845935 3007778 1967452 -388102
9788 -388102 -1192761 -1812980 -1884605 -1180889 -395500 708024 -148742 -2675228 -4500262
9779 -4500262 -4539601 -4388521 -2626495 -340026 1290363 1621452 1910521 2170802 264468
9770 264468 -2342074 -2567853 -2329090 -2104889 852046 3758899 3224704 -66235 -59235
9761 -59235 2664041 5091958 3612930 -1141792 -4296376 -4024165 -2241479 128632 2165404
9752 2165404 3959823 3216495 3855572 4315668 3875355 3749865 3086736 1718601 -1086448
9743 -1086448 -3767953 -5383184 -4932233 -2999964 -1046398 -1727750 -2080696 -1950175 -1767126
9734 -1767126 506621 847825 -950841 -822043 -593597 -1207518 -1531974 -849755 -1482221
9725 -1482221 -2071307 -3910238 -4411190 -1574882 296567 -594600 894569 3243291 2290277
9716 2290277 1131412 520065 -1870904 -2168002 -1925412 -1853698 -1232457 -2746801 -3115730
9707 -3115730 -2613675 -248061 680915 -423526 139556 911843 2051901 1404516 2287348
9698 2287348 5042435 7815059 8476842 7084886 4686377 3893988 5590315 6428215 4487311
9689 4487311 5034451 6021515 4481030 676801 -78393 3490933 6378685 5664302 1930311
9680 1930311 -1514341 -592265 1668635 699003 -1484660 -297841 1318852 1227767 -3167826
9671 -3167826 -6729385 -4763159 -2700078 -2900533 -2379144 -1607225 -29215 -672429 -1535368
9662 -1535368 -2269492 -2392145 487483 3228973 2528781 2265778 1642505 249638 150344
9653 150344 2657509 4850070 5238183 4542997 5749317 8456195 10117643 9581283 6259228
9644 6259228 2499941 1274864 -459091 -702652 1464031 1529919 1803722 4382096 4089687
9635 4089687 1494459 595496 1732627 3210499 321325 -2878419 -3861321 -3533646 -3171325
9626 -3171325 -3704232 -1265508 90306 119119 -53181 492474 -78071 249932 1145187
9617 1145187 -268706 -1515299 -1696001 -3547553 -3672038 -2383820 -2123022 -863642 1270878
9608 1270878 3369616 1165361 -2403038 -3699185 -3373561 -4180697 -3082047 -2182753 -4042250
9599 -4042250 -1961299 -1355280 -4604811 -5979959 -5225682 -5628259 -5848190 -5880389 -5102334
9590 -5102334 -2358114 -1543218 -2868747 -3347439 -2024227 1571028 4328249 5303140 2827524
9581 2827524 -2426958 -3888845 -3278820 -1826673 180516 3389520 6518481 5992348 4065728
9572 4065728 2375078 501780 131245 1069708 2471285 3272246 4816697 2868430 -295049
9563 -295049 -271289 1109219 1346377 3248700 4905220 5099774 3891914 3429352 4790785
9554 4790785 5709296 6390045 6013960 4446175 3537509 3200104 4468255 3883353 2283404
9545 2283404 1796747 1614494 2676091 6065309 7655892 6772059 3756702 35282 -3355904
9536 -3355904 -3119000 -1001056 -352407 759525 341300 -1734230 -3172864 -4593350 -4613094
9527 -4613094 -1468905 591081 1294033 1396565 423985 689650 4041828 4399523 179261
9518 179261 -2555089 -1599562 -1430000 406564 2234348 1621431 -561449 -1206571 312488
9509 312488 1494992 2569463 4253355 4572482 1213089 -1561081 -1088998 1304789 3638917
9500 3638917 2959505 497666 -2807577 -5479967 -5222169 -3090700 -2204266 -1748304 330268
9491 330268 2583152 3752974 3489793 3875236 2873596 1864711 3608708 3879544 4363297
9482 4363297 4669311 2902412 1813213 3668690 5426595 3981032 1568739 1246087 2832245
9473 2832245 5111890 5614969 3326939 -628578 -4374254 -4870977 -237589 3743123 4583024
9464 4583024 4891790 3636351 1453922 2156428 2956171 1858603 329055 -1137632 542228
9455 542228 1385662 877666 1955092 5962005 7642896 6668045 4202381 -423135 -631257
9446 -631257 -1750153 -3145788 -2903847 -2396837 -486031 302974 643223 961046 2291197
9437 2291197 2360531 -226498 -2409894 -3245297 -3023586 -829451 -1134271 -519314 1893415
9428 1893415 515863 -2011596 -1818190 -2041590 -3379202 -2358756 -603619 1778857 3539345
9419 3539345 4896699 3760322 239218 -3213097 -5169431 -2994833 -298036 -3058350
9411 -3058350 -5090499 -3404376 -2174766 -967261 607218 1146749 1917491 2348758 2256708
9402 2256708 364058 -1801760 -2565614 -3910007 -5502722 -6799993 -5614283 -6311103 -6936798
9393 -6936798 -5642849 -4802175 -3414640 -4448038 -5807018 -5354756 -3543722 -1878198 -1374338
9384 -1374338 -2748441 -2207233 -491305 -644535 -1251044 -1134938 -1022718 1386569 5022550
9375 5022550 8561990 7377802 3403215 67476 1089224 2320645 1152665 -1003157
9367 -1003157 -1057018 92862 145165 -1901850 -3310933 -2087555 581680 1529372 1147671
9358 1147671 1561886 4693000 4651976 2704500 257306 -1617076 -114984 2468591 1565682
9349 1565682 -125872 195857 481967 2351004 3007518 1405719 -501098 -2105898 -2705292
9340 -2705292 -2093681 1317973 4125069 6145444 5948067 4940416 4375425 4257944 3044934
9331 3044934 -538268 -2383535 -3405503 -3827186 -3275355 -496848 1298106 3240586 3874454
9322 3874454 3187466 2389705 3128132 3237890 850625 -2105581 -3194927 -2918720 -2188499
9313 -2188499 1024084 4480186 4456001 3529932 1589754 122856 -26173 17138 -2262815
9304 -2262815 -3509571 -2597261 -45166 2159864 2252584 3530143 5156660 5498334 3329085
9295 3329085 1845215 1697511 1182793 852720 -3000615 -5992010 -5594657 -4008655 -2563904
9286 -2563904 -2485379 -1641980 -2187163 -1957435 305173 -420431 -2535753 -5449900 -9296329
9277 -9296329 -8814096 -8316258 -10017599 -11564731 -9324933 -5260839 -2990277 -3260156 -3824711
9268 -3824711 -4317575 -3062125 -1649172 -1046838 -581050 936427 2992849 3132676 4515075
9259 4515075 6014956 3563980 -308916 -2725030 -4129769 -3561036 -1882851 -3506443
9251 -3506443 -7386104 -10626157 -8977133 -4295626 -726867 198310 1495028 2242563 219289
9242 219289 -3068740 -3610713 -4243522 -2592706 -72150 422781 -846145 -1668017 -2645994
9233 -2645994 -3670620 -3346188 -1990408 -3523222 -5531497 -5561446 -4807638 -4877920 -3607978
9224 -3607978 -1788610 -1070657 -724397 27698 1669712 3352201 2939436 2253152 3018213
9215 3018213 3277031 -83886 -2959346 -4435418 -4215989 -1538881 1122636 -826976 -4453425
9206 -4453425 -5201063 -2701217 -1422048 227538 2105115 3036610 1488569 1067183 1732751
9197 1732751 1785379 1827833 1367892 -588360 -1820928 -1414551 -1318725 -2662365 -1176406
9188 -1176406 243134 649022 1021531 -894187 -2813653 -716415 4156544 6345800 6144681
9179 6144681 5004943 2931903 661651 -1816481 -3931286 -6369988 -9051173 -10176812
9171 -10176812 -9114407 -6014426 -3891240 -4847663 -6297041 -6538456 -5212062 -4505401 -3341891
9162 -3341891 -3230309 -1319975 1391307 -1124162 -4379231 -3837761 -1977070 -1092102 154558
9153 154558 914363 -128133 -1461818 -1816941 -2818692 -2790336 -1634276 -590064 359941
9144 359941 692192 1157437 2381323 3489694 4574476 5322492 2940787 1531775 814754
9135 814754 -3039543 -5485457 -4148329 -675769 3138577 3959150 3075151 3745288 2989307
9126 2989307 2839592 2415922 2541881 5063229 6044107 3214698 365258 1723322 4914014
9117 4914014 4825090 2132340 -547586 -4224622 -5284730 -4821276 -1347024 2142415 4626257
9108 4626257 5244906 2986888 -1237215 -3102145 -1359208 1619873 1607111 84388 -2510398
9099 -2510398 -2841363 -1693189 -4547139 -6123433 -3209803 -1032749 1558000 6010619
9091 6010619 7908848 7917887 5429951 5576659 5040043 3051063 4544024 6445058 3162639
9082 3162639 -465574 -3027729 -3142443 608208 4405024 3185508 4022263 5428051 5939635
9073 5939635 6057853 2780170 -714126 -3264052 -5249608 -6499164 -6225032 -4036609 -3869506
9064 -3869506 -4578193 -3133875 -1891142 -228682 1698896 2288254 898947 238144 1803279
9055 1803279 2492190 1348874 784126 71728 253647 5476 418841 1418257 203456
9046 203456 -199656 551899 1645486 845323 1406484 3254054 3429856 2688573 1898319
9037 1898319 3909621 4085000 739803 -3252309 -6035066 -8182242 -9523490 -7584001
9029 -7584001 -5196573 -3298907 -1904949 -2228131 -2509562 -3964521 -5467898 -5843646 -4545504
9020 -4545504 -5285976 -8121078 -9251070 -8231854 -4804607 -2787833 -260531 2342208
9012 2342208 4398649 5024635 2899652 -1195805 -1970888 -958164 -747358 -327392 538876
9003 538876 1872449 2990660 2252836 1570743 1684204 3635841 3526446 2506231 2213493
8994 2213493 2675771 6017670 6754413 3987299 -1534730 -5300463 -5271699 -4349202 -4300570
8985 -4300570 -4419269 -4493230 -5052160 -1997858 -577639 -2112654 -5237700 -5877917 -3445637
8976 -3445637 -1685839 -1916263 -3103070 -2920797 -1323860 1518859 2113691 158174 -2758310
8967 -2758310 -3478154 -4083298 -5702322 -4605374 -2987032 -2151789 -1230038 -1826935 -4763461
8958 -4763461 -4965920 -3190241 -3012286 -3446942 -1209087 402786 -954825 -1292476 1034799
8949 1034799 3344443 2869647 938913 -1138154 -1961718 -3407101 -7912561 -8045436 -5977682
8940 -5977682 -3764439 -3674985 -3858959 -3623166 -4136922 -4790090 -4397448 -4207052 -3490073 -3383934
8930 -3383934 -3868214 -4454556 -4005017 -1806746 -299232 -1419249 -2015023 -561441 -26288
8921 -26288 -306096 -533779 -1341297 -2739303 -3853798 -4471164 -3796598 -3749651 -2121483 -871374
8911 -871374 -1238323 -936380 656489 2276872 3417352 2317665 2882573 5476734 5961089
8902 5961089 6697228 8624146 6797504 1830040 -1752340 -1923673 -1211976 -1458552 -1521156
8893 -1521156 -1436572 -1748752 -1389404 -1879957 -1585978 -669118 2391101 1594813 353782
8884 353782 1375854 4102688 5325518 4088325 492773 -1660332 -299228 3458288
8876 3458288 4784823 4664298 2490367 -816135 -1000622 -1012445 -2250783 -1582695 2122928
8867 2122928 3260080 2362165 1165764 1080983 559184 -2259769 -5498309 -5986108 -5990910
8858 -5990910 -6572843 -6701419 -5627111 -3410434 -3629324 -5211922 -5673280 -5209246 -4752641
8849 -4752641 -2787760 -630988 764747 -674631 -3254731 -3520216 -2676250 -581116 -473988
8840 -473988 -2580452 -4235392 -4329400 -3996428 -4179161 -5220893 -1500250 2283756 2802701
8831 2802701 5530162 5646935 998313 -1214066 125266 2244379 2160724 753109 -28110
8822 -28110 -868124 -1878179 -4462282 -5337584 -5010101 -4264769 -2573344 698316 1605163
8813 1605163 3251232 3128065 2288237 100375 -2669171 -2669300 -176037 -292525 51593
8804 51593 -301404 974690 2546572 655808 -1228209 -1503149 147826 2154664 161191
8795 161191 -3554203 -4234276 -3062924 -1695165 -1481647 309315 2831383 3655896 3534513
8786 3534513 4793092 4016290 877968 -3995914 -7324106 -6499594 -3471728 -2653503 -2323926
8777 -2323926 -1331731 621430 999198 424527 -898053 -3593751 -3723439 -1813710 -1153848
8768 -1153848 694582 1966935 167481 1773345 4898871 3842890 2068164 12996
8760 12996 -418841 -1339877 -971802 -1898554 -2150758 1681741 4557376 5176186 2854099
8751 2854099 1521125 374204 -1114705 -3161459 -4967827 -6250072 -7092029 -5862549
8743 -5862549 -4915272 -3341559 294054 3737743 4034871 3457318 4447064 5051394 3584578
8734 3584578 -976998 -4530416 -3960622 -1570991 -1246208 -2210948 -3889665 -3774912 -2947635
8725 -2947635 -1027883 2517554 4307065 3736678 2572906 1907106 402217 -2083534 -5655350
8716 -5655350 -6799860 -5351944 -4823182 -4276016 -2888910 -3242303 -3983919 -2702045 -1236497
8707 -1236497 -681531 626251 1085688 417437 917677 816756 -564359 -2547894 -3205043
8698 -3205043 -794727 682093 1251425 1444291 1889654 2256371 1257589 -672119 -2637222
8689 -2637222 -5126305 -8388339 -9483659 -7438637 -7135081 -5744327 -3181098 -1626862
8681 -1626862 -2316386 -3695845 -4841181 -5249313 -6345571 -6049936 -3927939 -3378802 -3217740
8672 -3217740 -4024805 -4093341 -1833603 -1214028 -2318725 -3467965 -5682992 -6225554 -4819676
8663 -4819676 -3126094 -4652945 -6162520 -7327010 -6368596 -5833944 -5555950 -3819881 -3454835
8654 -3454835 -4871804 -6531566 -5056517 -3126795 -814226 78528 410224 -392465 -1427861
8645 -1427861 -1778742 -3421264 -5365138 -6334861 -7691539 -7538609 -7776705 -6136541 -3769890
8636 -3769890 -2921336 -3804797 -6430116 -7413483 -8276667 -6839052 -4320100 -1559883 -3371475
8627 -3371475 -7519106 -8766410 -7836144 -7423034 -6041776 -7769263 -10509749 -11564971 -10315615
8618 -10315615 -9120922 -8001518 -8280392 -9639217 -10214083 -10295516 -10527895 -8385220 -7353123
8609 -7353123 -7921986 -7379146 -5247652 -3945745 -3609595 -5075905 -7650189 -9565931 -10992887
8600 -10992887 -11875034 -13027309 -13275716 -11728877 -11814385 -12685398 -13183979 -15599193 -13697370
8591 -13697370 -10590106 -12123060 -12190063 -12032308 -11634218 -12077374 -12917929 -14562425 -17972535
8582 -17972535 -21765490 -23223594 -22287002 -19688677 -16675660 -17526128 -20581013 -22457968
8574 -22457968 -22651959 -26193326 -29994272 -33323482 -39137456 -44131633 -47315792 -52131062
8566 -52131062 -57339108 -64065448 -69715113 -76284097 -84624581 -93944476 -103584533 -113584879
8558 -113584879 -126050803 -137743894 -148190012 -156136015 -159230640 -157607484 -150794391 -140118456
8550 -140118456 -125953325 -111622883 -98077103 -86528545 -76007639 -67425561 -58688956
8543 -58688956 -51881876 -45416023 -40084823 -37509587 -33068811 -28155595 -22120334 -19398645
8535 -19398645 -19302202 -17309744 -16043937 -15849575 -15883713 -16155838 -15450062 -14059084 -14074559
8526 -14074559 -12780509 -10766894 -9207175 -9003597 -11696525 -11812091 -10399783 -7098403
8518 -7098403 -5097538 -3796983 -2823220 -1807070 -1271743 -1456891 -2803547 -4766040 -4589731
8509 -4589731 -4496466 -4174315 -4420397 -2991870 -2099908 -1889197 -324894 651093 775633
8500 775633 -793245 -1702047 -1711178 -1923242 -2514241 -842751 84766 1562786 2472061 737319
8490 737319 -873831 -855841 -852651 -1810999 -1570893 402051 3657241 5457872 6398923 5993212
8480 5993212 4479328 1846167 -2608021 -6395995 -8764773 -9928452 -9529345 -7416652
8472 -7416652 -5767513 -4018565 -2258717 -1518406 -1869645 -1710420 -2172357 -4427953 -4519955
8463 -4519955 -3314637 -3377375 -3735744 -4252017 -5106489 -4822103 -3607263 -4731162 -4596014
8454 -4596014 -1913194 1064269 980354 237478 2431906 4680985 1817142 -1054617 948941
8445 948941 3841080 6170828 5684071 4574570 2823068 -1289146 -2083162 -179214 2039629
8436 2039629 1823483 244657 82647 -446388 -763820 -1991665 -2022307 -1576389 204059
8427 204059 42877 -2210237 -4660675 -9467196 -11433343 -7991673 -2141298 1926647 5377786
8418 5377786 7480641 8008646 8865698 7355716 5688296 5199822 4497794 1625461 -1570586
8409 -1570586 -4256132 -5008951 -3319712 -1184822 1128849 1760440 87518 -2210163 -3473351
8400 -3473351 -4149586 -3495062 -671429 -828156 -3643684 -7302842 -8869531 -7620244 -4810812
8391 -4810812 -3737193 -5785947 -8632346 -7610399 -5131248 -3272484 -4489606 -5821816
8383 -5821816 -2866849 4003 54274 -367018 -1844729 -2968280 -3259489 -3866445 -3522542
8374 -3522542 -516542 1272174 475471 742117 2555711 4535703 4799695 4019096 2952230
8365 2952230 2229843 1506088 4024850 2707767 2003280 2117693 147422 1277001 1657171
8356 1657171 -1160802 -2683582 -4190193 -3426156 -1068526 1872571 2339361 1319522 369583
8347 369583 -909793 -428796 1659345 1528911 593211 1279962 2740027 2015036 1370511
8338 1370511 1716064 1200864 -1464740 -4729507 -5189971 -3997314 -554638 3952686 6996202
8329 6996202 7443560 5383328 3465094 3092597 1848899 662567 77384 -2314969 -5805509
8320 -5805509 -7857261 -5348840 -2351969 -1208064 -642839 943172 2311086 497881
8312 497881 -3053025 -3661276 -3545580 -4083323 -3141312 -2392459 -1615864 -1851013 -437544
8303 -437544 -575588 -1018135 -1535235 -872326 426116 2208701 3388503 3658580 5389379
8294 5389379 5081772 3878345 2460106 2493859 2008859 1192403 -1177000 -2433370 -1794347
8285 -1794347 795060 4823183 7091264 4823030 2299368 2017115 1802306 3037484 4074243
8276 4074243 1195695 -2854585 -3110075 -811835 -860797 -399351 794421 825232 -1140218
8267 -1140218 -2034390 -1714921 -3058381 -4546755 -3989359 -2055707 469366 1517717 2954406
8258 2954406 2424428 1817540 274018 323447 2592794 3634989 5710710 6438390 6297445
8249 6297445 8223215 7270930 5038065 3433423 117397 -1533412 -1699500 1375307 4618000
8240 4618000 3482267 3092793 2437650 -5826 -247538 2632073 4988846 5993316 8578064
8231 8578064 9375063 9417051 9877315 8232958 5443154 6120926 8545848 8539521 7695570 7210608
8221 7210608 5514761 5210817 3886261 2866623 4330608 3522081 794951 -318341 188653
8212 188653 1617490 3338676 2352828 -554605 -2204608 -3260070 -4743079 -4923548 -4691320
8203 -4691320 -5186703 -6066288 -7255679 -7657565 -10126365 -12114502 -11882950 -9986924 -5250110
8194 -5250110 -2600001 -2859740 -2577181 -2059885 -1510504 -1130833 -1289798 1129904 1342793
8185 1342793 -1501490 -2886570 -3948106 -4118506 -3875219 -2385146 -1514090 -2261786 -1955479
8176 -1955479 -979665 -2430727 -4320096 -1834772 3087928 6337030 4659620 3617011
8168 3617011 6863684 11080821 12568639 12560323 12973585 10627393 7858577 6984686 8884806
8159 8884806 9828444 8550401 5112957 -495933 -3639186 -2532136 -518887 544143
8151 544143 -957840 -1703437 -1819304 -3944462 -3489985 -834952 -3041573 -4817195 -1959732
8142 -1959732 -342334 -3199636 -5273732 -4433522 -3714181 -3128866 -1544414 310698 1514058
8133 1514058 2670122 1376851 -52147 -2242607 -3527249 -1535595 2531647 5770822
8125 5770822 7119547 5576704 4477605 4261162 4506849 3135000 3993917 5714405 7801662
8116 7801662 8746783 6012695 3725016 3245680 2395363 3098803 3816468 4575455 6705898
8107 6705898 5889275 4176474 3283338 1503327 479211 -1636472 -1712512 -284148 -724284
8098 -724284 -1888202 -2155566 -4148072 -5349941 -6061630 -5781553 -3121483 -516504 399269
8089 399269 808699 499066 225672 1818388 4354523 3928201 1752119 1383713 1381801 1891508
8079 1891508 3414615 3937240 3809084 5264743 6929459 6323628 4807975 2700418 1646878
8070 1646878 3158098 1338547 -858241 -1335390 763269 2609825 3824350 2457461
8062 2457461 232298 -1768698 -2997100 -1256508 -105117 -2066560 -1303394 1912439
8054 1912439 4883897 7502505 7627753 6453555 5286762 6537505 6151100 4051036 1172040
8045 1172040 -2812923 -4560561 -5543366 -5438148 -5027483 -6303274 -5372189 -4893019 -6468715
8036 -6468715 -4502594 -5037948 -7913965 -8637769 -9777342 -11425981 -12056543 -9900080 -8196615
8027 -8196615 -9801896 -11398275 -10969877 -11303522 -10805029 -8986000 -7566051 -7739484 -5211616
8018 -5211616 -4005715 -2374556 -1626039 -3108592 -6351164 -8578945 -10622639 -10644823 -10831824
8009 -10831824 -11180564 -9677592 -10351381 -12653662 -14497975 -16470140 -18080671 -20259764
8001 -20259764 -21653743 -23634557 -23882199 -23901828 -23826368 -24747856 -24758536 -25540516 -29107018
7992 -29107018 -31879394 -33446339 -34502380 -35346236 -37942734 -43263113 -48468125 -51719212
7984 -51719212 -55637353 -60746182 -69467433 -78865219 -89906824 -100095054 -110726808 -120517082
7976 -120517082 -129905029 -141216214 -149695697 -155376815 -156654768 -150619467 -141437368 -131256712
7968 -131256712 -118905970 -105994854 -96207531 -91599193 -86819867 -79980157 -70908078 -61119585
7960 -61119585 -54497406 -48352013 -42233774 -38324009 -34034901 -28771537 -24417536 -22578028
7952 -22578028 -22365490 -22120123 -20160852 -18165872 -19342375 -21388268 -21277698 -18363514 -16583327
7943 -16583327 -14893892 -13104761 -8832850 -4953203 -3936211 -5258992 -7496942 -10243269
7935 -10243269 -12070542 -9573806 -7243154 -6232957 -5851571 -6317667 -4984422 -4896435 -7607420
7926 -7607420 -9369773 -8394762 -7281885 -5396768 -5101990 -6328913 -7706739 -8898975 -10240640
7917 -10240640 -12227665 -12022602 -10980685 -11082454 -11380779 -9289419 -7116622 -6248516 -5149800
7908 -5149800 -4517294 -6829218 -10785195 -14181215 -14072429 -12677943 -10913435 -10227157 -8680490
7899 -8680490 -6835211 -7274670 -9479286 -9426000 -7877071 -4908600 -2797448 -1517403 -2458468
7890 -2458468 -4125140 -6076147 -9652529 -10395777 -7668443 -5793074 -7087412 -9348470
7882 -9348470 -9819915 -10568327 -10311338 -11939252 -13352880 -13460553 -15284600 -15999097 -15865892
7873 -15865892 -15394101 -15767736 -12802750 -12708887 -17979622 -20329046 -20346307 -21068812 -21676165
7864 -21676165 -21753455 -22155617 -21656726 -20562311 -20823484 -22394876 -21821659 -22008428 -21474163
7855 -21474163 -21209907 -21608011 -24130943 -28296710 -29984154 -30023091 -28139000 -24113470 -22606778
7846 -22606778 -23662592 -27669915 -30975617 -29301793 -27631856 -26868676 -27300329 -25929683
7838 -25929683 -24653670 -26316452 -27487613 -27490052 -28394970 -31461914 -34392294 -37057178 -38141722
7829 -38141722 -38725037 -39383331 -41295329 -46951747 -51849339 -56111901 -60614055 -62986856
7821 -62986856 -66317677 -69451714 -70249563 -71331730 -75451206 -83374416 -92310364 -101726438
7813 -101726438 -110110821 -119017254 -131498868 -143338193 -157345470 -172297279 -189652455
7806 -189652455 -206285966 -226219886 -251536244 -277143730 -302486703 -326129500 -346990115
7799 -346990115 -361555747 -365323336 -357809463 -340395043 -317755978 -291114247 -262935662
7792 -262935662 -235461470 -208142975 -182873538 -161951294 -141363501 -123049241 -109062599
7785 -109062599 -97508080 -87100379 -78086206 -69056770 -60921640 -56292184 -52718506 -48692963
7777 -48692963 -43518558 -35349871 -29964216 -24859946 -20906503 -19025516 -17003354 -14209537
7769 -14209537 -14371327 -18185424 -16675088 -15417920 -13784882 -12957153 -13361396 -13402250 -11201328
7760 -11201328 -7963401 -5091503 -3973340 -4886802 -6478265 -8332971 -9455794 -9078648
7752 -9078648 -7556774 -4969820 -1829091 2164970 5365146 5144629 2209313 -683727
7744 -683727 -1662709 -1736021 -3249464 -4876821 -3922940 -3099412 -3242873 -2861229 -319615
7735 -319615 819920 -1633698 -4352395 -6344883 -7269763 -5772353 -4156658 -2119169 -2528136
7726 -2528136 -4054875 -3388032 -3699137 -4798414 -5029950 -3942051 -2808655 -2825809 -407564
7717 -407564 3377715 2998593 118987 -1183193 -437376 353573 771320 -309077 -55374
7708 -55374 -166807 43535 2272857 1698435 -567542 -356495 -919531 -2347187 -3035208
7699 -3035208 -5018308 -4012939 -619215 931197 58461 -933083 2159792 5916332 6972091
7690 6972091 5612125 4453843 5430585 5937282 6361876 5234398 2329118 493074 -555606
7681 -555606 1152280 3182599 4101112 5048779 5603326 4206654 191876 -3294903 -5419913
7672 -5419913 -5033687 -3265830 -1155521 -1235044 -4667301 -7984554 -8094709 -5538030 -3834797
7663 -3834797 -3253127 -5170637 -6694319 -5606268 -752989 1986770 -1220905 -2997200
7655 -2997200 -949439 1697156 1200548 -189751 -795448 848159 1620618 -111369 -2682829
7646 -2682829 -3547932 -4449547 -4962478 -3824374 -4054414 -4914448 -5646590 -6913025 -5988101
7637 -5988101 -5211064 -5699899 -5889479 -5776170 -4502514 -2173177 -2062385 -3205088 -4752740
7628 -4752740 -4904833 -4671379 -5599075 -8179081 -9896423 -8603270 -5996037 -5040825 -7027881
7619 -7027881 -11642697 -13217533 -12127176 -11041439 -8625682 -8218814 -7642512 -6029407 -4944267
7610 -4944267 -6465115 -10329477 -14687884 -15259009 -12833491 -10347671 -7334091 -5223125
7602 -5223125 -3278141 -2369976 -4744416 -7152786 -8737491 -10629415 -11199049 -11113807 -11227228
7593 -11227228 -13345841 -14380757 -14041709 -15721966 -15917482 -14567503 -12764454 -14565010
7585 -14565010 -19856804 -21636942 -21198023 -20142415 -20253550 -19436251 -19831528 -19617120 -19455844
7576 -19455844 -21041744 -24325261 -27124304 -28221899 -28035353 -27780837 -28750747 -33033692 -39289264
7567 -39289264 -42884247 -43618646 -43915511 -45178181 -46978452 -49409234 -53148227 -57633935
7559 -57633935 -61123330 -66269499 -71824666 -78741570 -84540491 -90337562 -99481951 -111036470
7551 -111036470 -122179632 -135246866 -151735149 -170742702 -191566772 -211651173 -233204840
7544 -233204840 -256563617 -279723786 -303620151 -323865311 -339167233 -349052097 -348438098
7537 -348438098 -337655619 -320412542 -297836551 -271640378 -245405232 -221394170 -199105169
7530 -199105169 -177216949 -156907633 -137516109 -122082243 -110311250 -99306298 -88081582
7523 -88081582 -78482337 -71434048 -66078607 -59065601 -52389492 -48632398 -48056228 -48863162
7515 -48863162 -46885750 -41198829 -34505127 -27745818 -24279868 -23290798 -21857304 -19599587
7507 -19599587 -17702458 -17838640 -18417007 -17872954 -17693913 -16266545 -12246412 -9289451 -10552634
7498 -10552634 -12984468 -15034702 -16381858 -16747834 -16013673 -15718739 -14521720 -14417584 -15743469
7489 -15743469 -17461464 -17023276 -13836659 -10222497 -7233247 -6427004 -7115103 -6444634 -5071345
7480 -5071345 -4286709 -4013778 -5853308 -7160688 -8949935 -11360178 -11486122 -9372123 -7936397
7471 -7936397 -6371274 -4678482 -2299458 -3211957 -4380999 -2176101 690012 -661922
7463 -661922 -2887606 -3030217 -2033805 -809459 1292034 2286461 957088 -57359 -1768342
7454 -1768342 -4080019 -4173022 -4282363 -4968326 -2100443 723304 491537 -1158641 -1808589
7445 -1808589 -1439299 -1778349 -3663088 -3130651 -3367867 -4342119 -5881102 -5103681 -2607347
7436 -2607347 -1345143 -2295640 -3093728 -546059 2565426 1957828 2131006 3188582 3974812
7427 3974812 3493348 4194985 3538748 1557717 1754941 2873602 1772417 1632 -1544426
7418 -1544426 -2078077 -4359883 -4654723 -1968313 -471930 -470959 -668317 -1996082 -623107
7409 -623107 311480 1693452 2415829 1824699 753936 -216240 269730 2299943 2134274
7400 2134274 313398 1247270 2647608 2442436 800799 -603300 -58712 -2192859 -3519873
7391 -3519873 -3564181 -3328681 -1002214 2103680 1351675 -1750777 -3253632 -1705910 -1221951
7382 -1221951 -1747481 -1201972 -1019003 -982368 2150624 7303122 9795830 10817597 9722485
7373 9722485 6785127 3285993 2571093 4290558 6818308 7836181 8295119 7999777 8201841
7364 8201841 6432373 4802750 3041907 -884359 -1380016 805464 2787562 4694601
7356 4694601 5529620 3655694 4279213 4729392 5483934 7538938 9339849 9046418 5628316
7347 5628316 1972496 -146998 -449676 1750276 3783271 3619656 2410935 447542 -1201488
7338 -1201488 703083 2567833 1935576 2136314 4036554 6093149 7902045 8858066 8780459
7329 8780459 8366645 5833535 4421317 5208512 5962580 6518609 5291696 3653559 2039967
7320 2039967 560369 -1053181 -905898 -773020 1532403 4778912 4103786 788325 -480731
7311 -480731 -951524 438658 496291 -1513847 -1297288 540516 2043904 1880821 3444968
7302 3444968 4106803 1647268 1396624 1426894 2378990 5324280 8349786 9638202 9228109
7293 9228109 8147166 6804280 3731877 427682 -1489717 -743661 43251 -639450 791063
7284 791063 3430181 5581659 3347320 -2163011 -4606606 -4595319 -6892624 -5977640 -3556852
7275 -3556852 -412185 545804 2725028 4188409 3250627 2671352 1171372 1279728 1715174
7266 1715174 167380 -735437 -756734 1033641 2827904 5059371 9152684 13389846 13473773
7257 13473773 11265969 8584887 6475532 3264411 802429 545732 1690480 3299703
7249 3299703 3258691 3597232 4591026 3786005 3127425 2631586 2306717 1049912 1932392 2576207
7239 2576207 1156739 2016553 2710885 3953528 5796294 7181794 7208379 6621045 5212252
7230 5212252 2614506 -381522 -1453668 -2016141 -1676976 -566202 -277044 -2853425 -4257330
7221 -4257330 -3200375 -3035077 -1026693 1515370 1991488 977398 520616 358065 -437338
7212 -437338 -1925357 -2329167 -80935 1575616 876528 -485617 514174 478764 -615024
7203 -615024 -2619968 -3365537 -2958394 -2515789 -369677 780459 1844799 2678963 2543068
7194 2543068 2381128 3339293 3855429 2172724 -1210967 -2739913 -40316 2587686 2852006
7185 2852006 2821394 2066950 3240664 5251775 7479435 7023806 8923307 11899991 9367483
7176 9367483 6738269 6301129 4984474 3838190 2048694 1911140 2718192 5053252 7648976
7167 7648976 8402308 7615320 8737099 7764266 6148593 4852468 4082060 5038470 3528382
7158 3528382 1038060 -1387491 -3906598 -4415690 -3584527 -2589149 -3202041 -2359246 17281
7149 17281 1224101 2885640 3485252 2470013 4852017 6018302 4238852 1562077 1981035
7140 1981035 1055241 -518822 -2152114 -1788113 -103069 -1287586 -2244725 -3753898 -4363645
7131 -4363645 -1149332 235248 -2553394 -2719832 -551724 2227712 3004905 3117598 3319556
7122 3319556 2939189 2319914 932913 -268350 -1514194 -2017700 -2488607 -3975007 -3900966
7113 -3900966 -3082660 -1227648 260136 218924 155941 1011868 3641928 3303967 2213300
7104 2213300 2882243 3494935 2266905 -239047 -3689373 -4962378 -5550061 -6035182 -4221722
7095 -4221722 -2171062 -105126 754231 1093803 2044338 898056 72337 -3540386 -7068356
7086 -7068356 -8932338 -9372142 -8511492 -5590907 -2687101 -2326962 -2072510 -295523 836137
7077 836137 2261803 6287765 5556515 3949994 4832913 4942118 1506359 771914 630
7068 630 -1905992 -4207806 -4334325 -1411835 2130900 6816171 9890876 8999647 6412615
7059 6412615 4104717 2739874 3571241 2880812 520129 -880386 -898714 1679799 2836717
7050 2836717 267994 -3605863 -4050836 -3951440 -2683246 -969366 -1608999 -1208021 -208684
7041 -208684 -1151914 -3917250 -3055704 29062 3841410 5621081 5222436 3410776 134011
7032 134011 -853346 464052 1963448 644915 -1802100 -3184858 -1825622 -138586 739346
7023 739346 954828 -1636703 -2271279 -1966241 -442267 3079110 4321725 1553341 1376765
7014 1376765 1907513 42638 -835912 -1064017 -1531501 1234970 4427942 7056092 8076963
7005 8076963 5946446 4070940 2084110 1754665 1838039 918702 1204049 1850556 1974821
6996 1974821 3531964 3604667 4403825 4208550 4060002 2587177 2083125 3064037 2304230
6987 2304230 2795979 2601966 3031811 3496308 1622497 3042208 5230709 5601461 5053717
6978 5053717 5227587 5184381 3816434 2736631 1422091 -393307 -625855 -832163 -433158
6969 -433158 -801213 -1972855 -807192 1787363 3093679 1592441 80608 1542001 2397907
6960 2397907 2558336 4724345 3940346 -1051501 -4919644 -3438663 1580552 5310477 4646177
6951 4646177 3367792 2036573 2284177 3504019 5300284 7785252 8903315 8249849 7658674
6942 7658674 5338876 5503444 6839554 7198328 5004398 2785444 3116446 3309410 4566644
6933 4566644 5452852 5812588 5199965 7790835 11099088 13167763 15269593 18675023 21852529
6924 21852529 23019856 26956295 33259092 36499828 39798399 40498633 37501226 33721303
6916 33721303 26971107 20919653 17395510 13288224 9190506 8645557 9920345 10330240
6908 10330240 10368199 11564798 10718598 7448307 6997921 7254415 6579090 6183796 4403304
6899 4403304 3157087 4538557 6424720 8526764 9943450 9201171 9032716 8004057 7173712
6890 7173712 6535187 3997660 1637975 2261874 2313191 1652949 1293150 1871925 3809086
6881 3809086 4990741 5307540 4976292 5305028 5427318 4782023 4210681 3274165 1208763
6872 1208763 -608141 -782218 -1619405 -1085211 287484 723190 -760799 682133 4232735
6863 4232735 4397344 4562793 6109361 6552924 6389372 5685370 3316518 1188822 2687821
6854 2687821 4659840 4500467 4782905 5496992 6447095 7312487 5369104 2763581 1791073
6845 1791073 2069693 3262983 4516120 8303112 11460324 9150899 5426293 3044723
6837 3044723 791241 -900769 -1425303 349569 3769528 5027805 3506748 1761018
6829 1761018 1720698 3244081 4150038 2484335 -76537 -2127270 -3670967 -5350865 -4761675
6820 -4761675 -2566989 563108 2323870 3703742 4007413 3798594 3627714 2320154 1204969
6811 1204969 866668 991398 995562 1817502 1707029 261546 -224138 -365576 -864379 -867582
6801 -867582 298727 554373 -124533 1277806 3530991 2791134 3565047 3636731 3060393
6792 3060393 3607579 3576979 5198018 7428843 7442524 6590319 6396861 6066777 6263520 3470331
6782 3470331 1546757 2529627 4433969 7088979 9661698 10719116 8877164 7063209
6774 7063209 6107316 5229889 5535473 5600192 2248067 3352304 6169756 4377736 3042763
6765 3042763 2717381 3091645 3943205 4305407 4148759 3951076 3964769 3181024 2628475 2995859
6755 2995859 2730513 804761 520265 682434 338506 851769 2592017 3160861 4001507
6746 4001507 4694544 4566660 5162866 4902669 3763569 2011489 792406 3413089 4189000
6737 4189000 2359867 2080535 4768031 8128881 7815601 3642431 1648844 2435600 2960835
6728 2960835 2774895 4023504 5837225 7168309 6846210 8099686 9100327 9443546 8112978
6719 8112978 4849642 1877275 -569154 130230 1338908 -293607 551127 3274206 4699778
6710 4699778 5184657 6016448 3996525 2127106 1606493 1358364 1491217 2083237 1423855
6701 1423855 815768 2635365 3337564 2608805 1430577 320292 1089367 2068452 4292456
6692 4292456 7284519 11403008 12996254 11133771 9105879 7949047 6936699 4654365
6684 4654365 5531043 8203427 9975383 10540696 10137810 7274911 6955072 6679951 7696115
6675 7696115 9571589 9933384 10917308 11961039 11686012 11325920 11179836 9762294 9244824
6666 9244824 9476315 10336524 10821094 9878710 7681947 7166613 9101665 10499817 10551747
6657 10551747 11072873 10655913 10173280 11180112 11894866 12404203 12868354 15289526 16498772
6648 16498772 15806203 15513726 17719088 17988340 18309648 20035998 19523813 21096982 23143874
6639 23143874 25594837 28073946 28586443 27903637 28422441 27531854 27137067 28631942 30859142
6630 30859142 29000421 26705434 27283185 32845004 39029258 43317511 47938602 53780744
6622 53780744 58927609 64316495 71955310 79945927 90042316 100644002 112067011 127535901
6614 127535901 143794105 161190131 183120347 206910609 233708827 264087947 294285028
6607 294285028 321460087 343004374 353623536 349222112 333544119 309186716 279539943
6600 279539943 246906499 212897270 182668556 159512253 140257236 122276042 108514417
6593 108514417 97404632 87417705 79160039 71268495 63250438 57864387 50970223 45643392
6585 45643392 41538120 38196137 36260833 35696918 36256056 35495201 32836819 28621652 24643492
6576 24643492 22960382 24727647 23500731 19394942 15726325 16500106 18055980 20111373
6568 20111373 19461388 16062699 14407999 15735839 16738840 14930320 14543961 15745711
6560 15745711 15189412 12998427 10307959 7147295 5594969 6692951 8579364 9912357
6552 9912357 11149448 11557664 11066634 9747437 7713940 4641401 2368227 3779684 4755173
6543 4755173 4341161 2862476 -463565 -3684121 -3203446 -1610135 835060 2488738 2718372
6534 2718372 2018512 1663124 2155279 2917653 3482114 3401179 4321051 5255871 5158170 5843317
6524 5843317 6356443 4602037 2724266 627274 1283588 1511598 668083 292466 749209
6515 749209 -1488718 -2304896 -4122249 -3819096 -934479 909648 623154 -1526304 -402673
6506 -402673 2778515 3181984 1794087 -150609 -947318 -615656 2432908 4702838 2274537
6497 2274537 -1373790 -2346764 -795389 1822508 3180887 4173210 5003675 4959818 3763227
6488 3763227 4946590 6100122 5164728 3447236 2728058 2838570 2873576 3422547 885711
6479 885711 -2694923 -3478782 218295 853020 -539624 -2487584 -2327045 -1158456 -654459
6470 -654459 -953317 -1451740 -2833855 -3935175 -3491214 -2750143 -753239 1144432 4723216
6461 4723216 6704945 5825111 5227708 3714567 2171638 2101911 4252684 6828261 6980581
6452 6980581 4767670 2676576 3371063 3544288 2829509 3701349 4628069 4456963 4998986
6443 4998986 4596576 2454254 2911781 4147264 3904207 4097908 5250264 6109453 6476649
6434 6476649 5752919 3303175 1961172 1810462 844770 1189031 2620125 2475152 1691898
6425 1691898 2281299 723249 -3227958 -5350896 -6032607 -5761995 -2499872 -576219 -1285968
6416 -1285968 -3374295 -5108672 -6032779 -6219167 -4880883 -2183994 507914 2327208 2566034
6407 2566034 2257044 2778143 2511167 1113770 -240932 136105 -597532 -2114106 -3666886
6398 -3666886 -4857693 -5487235 -4652599 -5708543 -7030715 -6004820 -4748817 -2959216 -1399703
6389 -1399703 106581 889046 568606 -742634 -524770 461563 2168262 1640838 2716847
6380 2716847 4477966 2803358 -971548 -2670783 -463503 1139029 1865050 3705689
6372 3705689 1837584 -161176 -2251703 -2270887 -1125347 539683 2871559 3575320 2984692
6363 2984692 578425 757158 1647140 2372906 4485122 4886194 5118586 3608393 1872061
6354 1872061 2123800 3812420 5672420 7105737 5851539 4930398 5781957 6154153 5189626
6345 5189626 4019536 1823346 -1311823 -2147316 -3827846 -6038802 -6021954 -4911660 -3654335
6336 -3654335 -1517228 -363735 757709 1241907 2321731 3861232 3417798 -223198 -388575
6327 -388575 380469 -2176650 -2813473 451189 2804082 4947096 7435528 7471246 5087345
6318 5087345 2977526 -186226 -1850269 -221118 3737548 5729014 5724475 5418186 5547883
6309 5547883 5032872 3774695 1821836 1716722 1653846 1943334 3041552 4801292 5904894
6300 5904894 5279636 4745271 3358404 -312195 -5521453 -5226868 -874685 -1338065 -3072352
6291 -3072352 -1181959 1969644 3003128 1537471 1639977 927867 617073 -420227 508516
6282 508516 4256227 7696779 5095736 201916 -9722 2335216 907162 1729660 4805372
6273 4805372 4225217 1292295 -2182063 -2046673 -809531 1610655 3719269 2174923 -266038
6264 -266038 211876 1806966 1172769 -2090942 -1791763 881539 1694399 1736299 1988360
6255 1988360 2105659 1028641 3601811 4037175 618271 -829279 -737558 260002 857793
6246 857793 1822001 4847062 7445405 8631614 7057821 5807932 5467510 7581487 8122082
6237 8122082 5566311 1925683 849629 1724987 2612451 5268604 5436076 4724453 5253146
6228 5253146 5611130 3498760 634379 1238096 4188915 4270669 1453549 39969 1336164
6219 1336164 4585587 6587521 5665920 3491656 3093200 3129058 3873729 3079334 1058310
6210 1058310 -1405846 -1355895 1742284 3962102 3962651 1221750 86435 2343424 2446849
6201 2446849 919827 1111507 4532943 4743899 605092 -2481235 -2624478 -2040580 -2039227
6192 -2039227 -431301 577811 1766739 2365813 2770862 -66069 -1145450 1010412 1085277
6183 1085277 650714 2866861 4669566 2989251 738059 849663 3053070 4511710 2989215
6174 2989215 1308979 -408345 -2030189 -572811 -1125158 -2244637 -2089841 -1026420 1725125
6165 1725125 3410506 2647302 2148850 2581241 3052957 4030576 5326239 5032506 2953877
6156 2953877 395022 -1174594 -2915576 -2738567 -2411508 -2389502 -1058672 185045 531812
6147 531812 703433 858108 799379 1478841 1750718 345132 -597975 -2365598 -858100
6138 -858100 1855514 3567342 5067622 6982930 9423315 7180422 1528295 -1173196
6130 -1173196 -758500 1078209 2349533 3430327 3791538 4451806 3652628 2507295 1316675
6121 1316675 -487961 -1095807 -643531 987991 2091577 849389 1485569 2013174 461629
6112 461629 1138120 4220160 7635441 10651651 10825772 8451963 6853534 4916931 3400560
6103 3400560 4280051 3071389 553328 -1030132 -323179 -501472 -1569080 -998267 -570856
6094 -570856 193002 1733879 4100326 4339187 3580827 5276170 8006204 8651576 7556280
6085 7556280 5740015 4877837 5142413 4148985 454887 -464979 1781561 2240878 1842106
6076 1842106 1918519 481919 -389694 -1107455 -2332895 -2786115 -3069693 -2479151 -2076583
6067 -2076583 -1003619 -381489 -159143 338853 1910926 5221201 8100477 8063289 5449210
6058 5449210 2740519 750033 159952 -533958 568215 2452579 4138890 4540445 4832716
6049 4832716 4394135 4071451 6011539 6086077 5690761 4604208 2709028 2323080 2492971
6040 2492971 514574 51595 100415 575032 1534166 1693040 2935174 3385276 3095901
6031 3095901 1066362 -1462680 -2509715 -2546739 -465230 933200 602247 1883797 4752943
6022 4752943 5611162 6387363 5545006 4529682 5263085 4225606 1389074 -332920 -549637
6013 -549637 -816212 -644016 -1691104 -2834380 -1774668 1068758 3584446 2100547 -1307269
6004 -1307269 -4388844 -6186321 -5586091 -5851366 -6464751 -4963195 -1569226 3873108 6701915
5995 6701915 8633130 9803954 9586182 7713588 6591778 7700142 6585232 3477013
5987 3477013 3045461 3660730 3139393 2718254 2048798 338699 -1313734 -2160291 -3211913
5978 -3211913 -3826643 -4310242 -2985316 624025 3188435 3404380 2762344 2203930 1786836
5969 1786836 3356586 5553395 5201074 1346533 -549245 258281 484290 828807 1578511
5960 1578511 2831890 1259774 -742867 -1089500 2987401 6144440 5026165 1778353
5952 1778353 548579 2765546 2491926 1204513 2832015 3486438 740974 -2004471 -2715678
5943 -2715678 -3857399 -3778503 -1855575 942345 2717080 768587 -118357 -248193 -2381992
5934 -2381992 -4237718 -2802067 932657 2828201 2627111 1948921 1498627 321304 -79572
5925 -79572 1187299 2363298 2777951 3868402 5177122 3938751 1911251 -182972 -518090
5916 -518090 1076012 1909142 535157 80267 -642573 -47209 681835 661470 2020729
5907 2020729 4326640 4228663 2913442 1829878 -11684 369538 415011 -814469 -1525067
5898 -1525067 150155 2619522 1794223 1847717 3759740 3657929 1564591 -1150659 -1524783
5889 -1524783 686220 -535200 -3244410 -2143828 1064874 3024382 1964031 958690
5881 958690 1590452 3006482 3304906 2642224 2383978 3182318 2578843 2926226 3386899 1307028
5871 1307028 -2764448 -5145348 -7376170 -8163701 -7463274 -8196871 -6777611 -2225650 -2313364
5862 -2313364 -5937053 -5118463 -1542147 1015625 1712352 6531 -4765379 -5642380 -3358204
5853 -3358204 1183574 3260855 3745534 3190938 2976499 3553055 4632631 4408877 4481666
5844 4481666 4265115 2782932 1878725 3212948 6858297 9670874 9390783 8029850 4304522
5835 4304522 1517817 1954129 3587880 5364353 4195677 3447425 3956940 4538454 4456126
5826 4456126 1785214 -2597380 -4263985 -4010528 -3179883 -2361158 -1045396 -873177 -2166018
5817 -2166018 -3957503 -6033419 -8209752 -7994516 -6513731 -5323987 -2518588 -1273822
5809 -1273822 -388242 140601 -1054791 -2669478 -3755138 -2926758 -389050 2217117 4548894
5800 4548894 3819212 2102856 -314505 -1847240 -1022459 -919160 746983 1233853 613680
5791 613680 554443 1837320 2962529 3827125 4065438 2486681 -171175 -317649 1105875
5782 1105875 4650867 7330953 7343145 5677524 1987470 38342 591032 -1283557 -3961696
5773 -3961696 -1127492 3086762 2023904 -1489469 -3574662 -2166978 -388628 -968834
5765 -968834 -363549 1602600 2050351 1848786 252966 -150795 -21914 -995926 512284
5756 512284 1830629 1769809 3932972 6244373 6411200 5668901 3203903 269331 -631609
5747 -631609 150959 442982 835998 3942505 5446376 4355145 3082972 4806082 6550081
5738 6550081 5396168 3358301 1753336 540290 592192 836447 59167 3976316 8034211
5729 8034211 9901263 7934785 6067676 7000976 9769292 10570963 8845777 3820711 -99014
5720 -99014 -1956328 -1950967 -910752 -2146806 -3965540 -3972135 -1644588 -655219 -923654 -2082271
5710 -2082271 -3130888 -1378291 1702566 3027366 3336512 3122457 2679401 2660603 2749410
5701 2749410 2296893 -626136 -3647389 -4305503 -3517584 -3215105 -2012406 -1483354 -1304192
5692 -1304192 -678180 -2411788 -3009556 -1688224 -1509314 1142764 4405368 6714644 7619143
5683 7619143 7400091 5704326 1673557 304861 2849008 2551824 471526 794132 1342704
5674 1342704 2321563 -151933 -2373092 -1866139 -320115 1465222 2784082 1507640 1449719
5665 1449719 3908941 3335945 -310132 -3373108 -3875304 -2738286 -2965047 -5084615 -4463189
5656 -4463189 -2383552 -3310638 -3805280 -1487382 1225454 1219590 1466677 1196001 649892
5647 649892 859467 948919 -1624005 -4448936 -6080754 -6314270 -6979493 -4647668 -148346
5638 -148346 3597623 3852006 1861521 -686374 -1387397 1832687 5916764 9395126 8721547
5629 8721547 5473567 2525083 303292 -702807 652834 548524 -2812070 -2969879 513015
5620 513015 2410995 3811304 2767638 1097830 1900869 1812968 2296408 3333202 3753230
5611 3753230 5450159 4585218 1473252 1343918 3198915 2513531 1911855 2686441 2340919
5602 2340919 2661905 1215871 -734311 2102338 5202442 3153497 2812466 5228488 7068420
5593 7068420 5419700 -494643 -4741672 -5671283 -4450249 -3754482 -1986174 57374 602512
5584 602512 408038 70517 375728 1121697 3726223 5694822 4336313 3215673 1936920
5575 1936920 1412529 -429540 -3721410 -4039121 -2327899 -2735618 -2676819 -1735246 -996448
5566 -996448 -1485297 -377207 -577641 62839 3177152 4771097 6306657 7335057 9773854
5557 9773854 11155932 10086394 7718592 6810056 6583118 6917550 6568378 5196948 3581590
5548 3581590 3572207 2536091 -920590 -1724770 -677482 -976078 -1565133 -703055 214122
5539 214122 1460691 1899555 1777712 2618700 1664647 745502 151133 -208314 -1604972
5530 -1604972 -4324944 -4915550 -5159512 -5730926 -5976663 -5763060 -5241940 -1357080 -2314767
5521 -2314767 -5621384 -5565404 -3337090 -2662107 -3566762 -4751264 -2489176 770778 3358842
5512 3358842 5265439 8562884 10653890 9034969 5745628 3742722 2907793 2115631 648475
5503 648475 742294 1213850 2559441 3266640 1305923 649524 -733544 -1932444 -3406451
5494 -3406451 -3520737 -897718 -892666 -3785996 -2913398 632034 2828699 4164102 3183228
5485 3183228 2219037 328959 -2669951 -3464825 -1661406 -1499669 -750117 660322 -1300125
5476 -1300125 -1775056 -789330 -789165 2133530 4430203 1771800 745648 4057511 6438232
5467 6438232 6131223 5920241 5804199 6956894 7580308 7224283 7755558 9107648 8830987
5458 8830987 6624042 3023086 -286884 506768 4198527 4426725 3239794 2529078 2514239
5449 2514239 577000 1476492 5298165 6830258 6405049 4299417 3029072 3262460 1857403
5440 1857403 2708822 4290915 2496358 820797 2919641 3646518 1872214 1313607 2355685
5431 2355685 2783994 1897845 1926712 1820809 1101918 2559267 2150948 1347058 899284 1225020
5421 1225020 1671999 920236 985624 1362908 1003419 2227262 3596619 4518994 4247161
5412 4247161 2296493 1363201 1807594 3506906 2849386 61168 -1633554 -1922078 -767564
5403 -767564 -896049 -669108 -260596 -1958958 -735352 750988 1332048 535281 -930106
5394 -930106 -1557559 -539521 1593253 3559696 3056055 1962053 938477 671612 158258
5385 158258 1200480 2321837 2076286 771526 -1383735 -3394957 -4787081 -4150487 -5277429
5376 -5277429 -6015761 -5675736 -6352846 -6894386 -6521494 -3353408 -123141 774393 2279611
5367 2279611 2217215 361626 1097541 3438190 2375536 111783 -181839 1472220 3033883
5358 3033883 5817287 7582341 6933761 3782338 2672839 3516591 3768232 3801532 2285672
5349 2285672 1640659 62252 1023425 1609209 254973 -1228725 -1135295 928208 3265758
5340 3265758 3360353 5691834 6875935 5092360 2141233 -1142468 -794461 -63792 -663821
5331 -663821 -1119415 -2533577 -4050254 -3526430 -1623611 -1816851 -557767 727492 -198589
5322 -198589 640538 2051279 3149134 2236594 473479 -177454 -901382 -2163218 -53609
5313 -53609 2570159 2259143 2022914 2647844 3130686 3647937 5692758 5363948 2181975
5304 2181975 844083 1716213 2360284 4036398 4729935 4928506 2904743 714668 1090732
5295 1090732 1439712 581938 -1111276 -964366 -1286091 -3088992 -4353628 -5915440 -6302085
5286 -6302085 -5468334 -5186284 -3575613 -2000081 -2996518 -2219626 -712188 -242435 -131037
5277 -131037 685635 791110 -372413 425742 1406404 2147125 4966542 4427141 -80116
5268 -80116 -1402142 -1473927 -1135085 -237327 1749332 3739277 4826030 4340117 3581795
5259 3581795 4330330 5830801 5403309 4374849 4450728 3986032 2065609 1585738 1343448
5250 1343448 -598638 -303747 2847960 4068634 1804687 -1736603 -3278855 -5123419
5242 -5123419 -4139770 -755793 843493 286924 -73755 127174 739869 1203226 3433963
5233 3433963 5763859 5705631 5872873 6705331 6386156 4689724 3865592 1136180 479850
5224 479850 337959 1129180 4872001 5989240 2619036 129029 -1163110 -3898979 -6004993
5215 -6004993 -4137885 -1597121 -2370456 -4993188 -6756093 -4930436 -1842899 2247177
5207 2247177 3881133 3433919 2021815 56277 -2775475 -3169585 -3978584 -4908779 -3358527
5198 -3358527 -2926306 -2001787 745103 3305077 2426115 585134 506460 -244398 -3494782
5189 -3494782 -4996381 -5531942 -6828601 -4777250 -1873817 -419028 2034785 4908822
5181 4908822 4304506 -698533 -3652857 -2901595 -1820074 -717536 -390619 988927 4128040
5172 4128040 5185164 4098833 2600557 -946051 -2780772 -1642446 -140158 -1733541
5164 -1733541 -2832720 -2277567 -2646036 -1916963 -88735 690903 -404903 -870704 -329373
5155 -329373 776048 219745 353850 205962 -1919078 -2614864 -2806767 -3129638 -1621361
5146 -1621361 1658513 1541942 494792 -322450 1211910 1284070 -1566609 -4972454 -5191861
5137 -5191861 -4334553 -4604460 -3363041 -2259315 -752721 -814832 -2359578 -4058711 -4728466
5128 -4728466 -5604351 -4244396 -881726 539532 -834994 -856537 -1179880 -2714189 -3097661
5119 -3097661 -2224010 -2894689 -2434890 283033 410575 905507 1406890 1194588 473611
5110 473611 -467539 -2010635 -1261097 -1261725 -1358069 218598 290756 -3298187 -6110227 -6969596
5100 -6969596 -6823204 -5569532 -5064882 -3921010 -3085518 -2238138 426207 2721589 3475637
5091 3475637 5232150 5766607 5257418 7454789 7440520 6691653 6509776 6311946 4807199
5082 4807199 4615974 4736597 3012948 444412 -812829 -1124797 1228974 2545184 444914
5073 444914 162033 986990 -411174 -329852 1075614 3668020 4573313 5214183 2180204
5064 2180204 -294901 -46752 1554175 3102216 2887338 1963462 1730165 2766171 3669816
5055 3669816 3352951 2686420 1635090 578488 -1215575 781335 1629844 48842 -1889761
5046 -1889761 -3633691 -4458402 -2690590 -3182042 -4981291 -6547177 -5575008 -4103543 -3675636
5037 -3675636 -2422211 -539031 -1407627 -3360966 -2029922 -556853 1311978 2114107 3083872
5028 3083872 5907102 8358795 8531614 6722160 5064046 6035062 8345766 6625041 2126833
5019 2126833 1652885 2008060 -423491 -991140 -1526468 -3133777 -2682739 -2670584 -2333397
5010 -2333397 -1791035 -618660 -1607356 -2121685 -1086354 -1052442 275523 4404015 3903689
5001 3903689 2633439 2429175 3455828 3556780 3678163 4703730 5472798 7008981 7129395
4992 7129395 5986933 4176939 2988117 1566300 1142087 2630159 2533245 1062706 -645923
4983 -645923 -1343483 -451652 -743741 -1266626 -364089 -1674733 -2478284 -2160599 2401929
4974 2401929 5944683 4397814 1875000 1275706 359952 863148 2992852 2296072 -2440140
4965 -2440140 -4107055 -3098094 -595363 482910 1136879 1564872 572890 475729 1968206
4956 1968206 4458991 4684104 3562871 3351170 4179697 4897929 2914376 1309846 -1485107
4947 -1485107 -2414647 505685 2441829 1992433 2400910 3783017 4702351 2793230 402208
4938 402208 -1888144 -4794208 -6104471 -5207498 -3586873 -867609 1538740 2731103 2357801
4929 2357801 582116 -458160 -2243858 -5066326 -6012139 -6981898 -5035453 -1472674 1831784
4920 1831784 5059746 3818056 1281444 -491167 205683 1195210 1761176 3797762 4646823
4911 4646823 3687579 3169094 1958248 -940516 -4291330 -6457414 -4371211 -1385954 1490912
4902 1490912 1743571 2104460 2726535 3126761 1394004 -1348740 -2634003 -1902032 95591
4893 95591 1965272 413465 -1874188 -1616194 -1371148 -2141811 -5061094 -4658770 -2115289
4884 -2115289 -826079 914903 2843632 4916722 1962844 -1848574 -223343 1369422
4876 1369422 1986722 2572961 4271109 3697833 1310927 1395956 1859221 1412213 2102322
4867 2102322 1167028 71516 -241418 -54975 -18055 953481 2008419 1445793 1842144
4858 1842144 1917643 2275893 3358724 4844675 4191934 2050996 1144797 2423057 2210577
4849 2210577 1127984 385929 2550993 3494504 5130274 6482194 6463858 3514602 -2170334
4840 -2170334 -3811695 -1337622 5655 -996088 -653347 -1557854 -1716748 -2572502 -1531945
4831 -1531945 -1070653 -775752 -1120502 -1167827 45311 -1077630 -2896648 -2526714 -964095
4822 -964095 -1914582 -3337711 -3776485 -1553827 2858380 4307572 3839255 2156356 1405274
4813 1405274 1015885 1897279 2342118 2518676 2691221 1374118 872617 1861427 2742494
4804 2742494 3581212 3286722 2233725 2049570 2285859 1930261 1776105 1511332 790040
4795 790040 754320 1563290 2931652 3641858 2402986 -2553644 -4380217 -627593 1259466
4786 1259466 1969116 3343130 3168397 2365663 857754 -378669 158772 -1547759 -3689762
4777 -3689762 -5134254 -5354008 -3677621 -2183469 963017 2242463 1272706 878875 4183079
4768 4183079 7065226 8933988 9178730 8995559 9504882 5605746 254896 -1946275 -1025616
4759 -1025616 -60877 484992 1354049 -1274692 -2408229 -1334772 -624420 -3718902 -8047119
4750 -8047119 -10570553 -14099718 -13125494 -10357544 -7414718 -1254385 3412561 5078630
4742 5078630 3042596 780156 -1054404 -1852520 -1740666 -2465164 -1662663 -116401 -977453
4733 -977453 -3275986 -4231967 -3642241 -4174965 -2199414 2447488 2937195 1633462 1205355
4724 1205355 665775 429001 -2549661 -4494448 -5749183 -5522603 -3637543 -1675973 -1097385
4715 -1097385 -2995067 -2798312 -2528744 -2022373 -2200937 -2096536 -597192 -2030976 -3647959
4706 -3647959 -3625759 -1820573 -845444 -2113762 -2335844 -615815 1625945 1403640 440100
4697 440100 413778 327240 -1494069 -1171623 90128 808422 3787974 6252559 7339000
4688 7339000 6614447 5155104 6003878 6187518 4322098 2771168 -349332 -4582027 -5734714
4679 -5734714 -3905572 -1702261 -1041308 -1177697 -2204430 -3576762 -4655892 -4922812 -4552645
4670 -4552645 -2390876 -2714828 -4460301 -3966005 -4424957 -3525224 -950937 12891 881968
4661 881968 642000 2715521 4323849 1307825 809851 2098230 2212371 1815293 1613796
4652 1613796 -207628 890774 3262780 2309024 84936 -1713265 -2811133 -3048893 -2976331
4643 -2976331 -1226493 3805184 7491538 6762427 2962217 -539583 -2555682 -4418253
4635 -4418253 -5615758 -4461187 -2533528 -2992918 -4305715 -3032922 178106 2672063
4627 2672063 2913836 2294220 -1524738 -3772033 -3586356 -2858412 -2449128 -1033526 1523660
4618 1523660 4257501 4504788 2527745 451253 -1307613 -2657818 -1783049 429557 398419
4609 398419 -4273306 -6530507 -4646859 -4073432 -2876151 -2322507 -2956765 -3909309 -1892455
4600 -1892455 471672 2388388 4348920 2603832 1896347 852157 1514692 2615720 1850433
4591 1850433 2132315 2646632 2319108 862837 -395220 -1465148 -3267704 -3296208 -1426777
4582 -1426777 -1583236 -4612260 -4407378 -1692845 -530295 274780 1042305 1875512 1659106
4573 1659106 -1381945 -4442940 -4628114 -3160431 -1997491 -1334732 -2772150 -3397694 -3176397
4564 -3176397 -5195100 -9235373 -13356064 -14606135 -13083973 -10692354 -5642761 -1636761
4556 -1636761 1208350 3606955 4502484 4672219 3258450 2433643 2074156 2026346 1788054
4547 1788054 -294303 -3013746 -5338228 -5232685 -3921685 -4163539 -4812902 -3124061 -157282
4538 -157282 2295920 3093375 2407841 1289516 -715906 -1715532 -3719711 -3350696 -361005
4529 -361005 2319793 1129942 -1163991 -795004 547979 1298838 378063 -898435 -2673419
4520 -2673419 -4174406 -2944019 -639419 1208217 1503376 18617 -945642 -245644 549389
4511 549389 991526 -701011 -2641537 -2656044 -2585175 -2031902 937172 2233806 1473579
4502 1473579 2278178 4028890 4038335 3769777 3869503 2723612 2293883 648036 -487832
4493 -487832 265482 877723 1211688 90474 -2071516 -3022729 -2515485 -2041472 -897991
4484 -897991 1892172 1940417 929005 1363806 401314 1104574 1237198 860745 -326648
4475 -326648 328404 2313886 3504592 3058424 1285609 1054277 148882 -2609480 -4231051
4466 -4231051 -4843179 -6226488 -6595253 -5137861 -4076315 -5229922 -3540290 -1283875 -850257
4457 -850257 -1099983 -2128215 -2766750 -2718035 -2275155 54766 2047000 2722187 3298838
4448 3298838 5069983 5336832 3795135 2823289 2528721 1636669 -357789 -1672073 -1488672
4439 -1488672 -702699 -261556 -861464 -1332751 -1073954 -585905 36826 169580 1776998
4430 1776998 2343922 2425181 3876283 5217577 6664105 6010577 3864739 3221008 1890275
4421 1890275 972536 464632 -173409 -607021 -3046079 -4143259 -2703786 -2442438 -653174
4412 -653174 1798129 3511954 2508810 -687249 -414696 2733026 4274913 3455093 1510852
4403 1510852 -878172 -1114601 -812309 -2290300 -2463778 -1546472 -1891507 -2981214 -2890040
4394 -2890040 -3916354 -2519707 -294489 1099883 3139446 3968077 1959323 -796057
4386 -796057 -3643014 -2978907 -1020221 231177 1086607 2329022 4156685 3809610 778884
4377 778884 -1212844 -601093 1103639 2205780 1166836 -3474445 -8739338 -9479706 -7748424
4368 -7748424 -6026387 -2683582 204182 81452 -596589 763101 1807289 161238 -1886671
4359 -1886671 -4196402 -5441610 -4654647 -4146269 -3612186 -3387266 -4303228 -4643401 -3643463
4350 -3643463 -2510009 -4420851 -6222556 -6623397 -7273912 -5856747 -1521553 1268306 1842928
4341 1842928 -419088 390746 2819307 3747008 4935194 5628293 3599840 290177 234281
4332 234281 1544880 603594 -191263 -552155 -1481014 -1234327 629746 692783 -938808
4323 -938808 943649 4286381 7271237 6719327 2225404 -345695 389696 1707287 1965934
4314 1965934 1718399 3868079 5366252 3760176 3732246 4301212 3566822 4776635 5629266
4305 5629266 3849424 281814 -90269 2306357 2793280 897459 -1511210 -1978098 1436329
4296 1436329 2867582 1892717 3235887 3029446 2889264 3934871 4594891 5912746 7494689
4287 7494689 6902062 6056608 5479412 5668602 2850600 1393748 -1062789 -5051497 -5810054
4278 -5810054 -3550850 -924043 2288096 2603735 1434580 168155 913517 3772491 4689909
4269 4689909 6410874 7481932 6777194 4932145 2957788 1596550 2538510 3039395 1891574
4260 1891574 2319627 2827158 2457288 4139240 3503839 654831 -763529 -2153953 -3531697
4251 -3531697 -3684604 -1105152 2437624 2154895 -968787 -3036161 -6457635 -6977166 -3654562
4242 -3654562 623421 2880057 788204 -198968 123436 -1190220 -2107361 -2550468 -1088447
4233 -1088447 -958728 -4717059 -5884391 -4912612 -2532337 -630964 -147788 2541590 4439742
4224 4439742 1570869 -359557 -428976 -1972215 -4165369 -6331467 -6276088 -6461935 -4023692
4215 -4023692 1089170 4827090 4751772 3146596 3186565 2368266 -322773 -4162630 -6039666
4206 -6039666 -3005632 -2148437 -3400054 -3522745 -2207439 -1783025 -982543 -289415 -996479
4197 -996479 886111 5474700 10033571 11221752 9147429 6075293 4192487 2785780
4189 2785780 2892715 4191880 6008541 6747220 5008196 2895369 2588828 4134685 2644703
4180 2644703 755067 3208318 4536172 3972575 1986494 -1335325 29868 2680901
4172 2680901 4721910 4752435 3429424 3693335 2843088 3169798 3436791 3219175 3994084
4163 3994084 3870102 990751 -1175915 -231445 919441 1730814 2465908 1853851 1443043
4154 1443043 2640907 4688969 4432266 3869065 1583467 -1035533 -1239059 633786 194439
4145 194439 -1143273 -1355274 -1410781 -540341 1123483 2386114 4649402 6004885 5702677
4136 5702677 4442959 3973861 5280420 3929038 989305 -999587 -3412107 -2400054
4128 -2400054 -380822 1662908 2758216 4514628 4116694 1810852 2334809 4476744 1636869
4119 1636869 -3738251 -7708252 -9594475 -8963564 -7980159 -7975820 -7269031 -6497875 -4515134
4110 -4515134 -3303910 -3419510 -3453506 -2062139 -1439323 -1498340 -2518146 -3325076 -1891307
4101 -1891307 170894 -145259 -2667554 -4416922 -3831248 -5356080 -6074433 -6296918 -5426959
4092 -5426959 -4746618 -4764392 -7101027 -8465741 -6644971 -4338410 -2680549 -788847 -365199
4083 -365199 -2066585 -3640321 -3281787 -777855 247298 -1376246 -756265 672249 1387583
4074 1387583 469085 -1169971 -1979024 -527344 467846 2343686 1886890 -827581 -1632247
4065 -1632247 -191709 -949373 -2203737 -2230646 -2343907 -291327 5517 -2139027 -3092839
4056 -3092839 -2835451 -2977528 -3423373 -3093449 -2741485 -4211231 -5041241 -3122223 -1121884
4047 -1121884 -643136 -2913820 -3622752 -2339740 -2587088 -3234393 -1914092 -865706 -790012
4038 -790012 89517 -682388 -2624510 -2478943 -1556642 949914 3733324 2806999 521008
4029 521008 -2100861 -5606912 -7098732 -6144750 -6741476 -7248352 -4901604 -2013820 -78886
4020 -78886 2219263 3368087 3181013 1385918 -965671 -509551 525326 -433070 -972329
4011 -972329 -2017057 -1626769 321967 1074205 1969948 2767854 3268376 2012608 637315
4002 637315 -304608 -2539850 -3442101 -2603101 -67924 2180349 3247054 3121683 2496279
3993 2496279 2932721 2262431 -709165 -3118487 -3235461 -2869531 -4359560 -4787353 -4441195
3984 -4441195 -4981556 -2715157 -468827 -2693251 -5468491 -1218618 3791277 4585868 4928198
3975 4928198 6533773 4350421 754148 -463099 76289 510134 2460435 4080545 4740270
3966 4740270 5170159 4716374 5610666 7681714 7378287 6422827 7620108 8423817 5854902
3957 5854902 3353771 3403430 3490550 4303043 5956712 6193610 4525640 4350335 4585113
3948 4585113 1539325 524028 406501 -1409578 -2615491 -2500980 -3918727 -5419306 -5422807
3939 -5422807 -3940888 -2417014 297178 1834277 200366 -2404580 -3741713 -3672753 -3905135
3930 -3905135 -2287046 469094 648262 -825773 -1036983 2912955 5678197 4861716 714894
3921 714894 -2362157 -3393561 -2887499 -1634307 -2086795 -1282319 -620961 -918013 -2250353
3912 -2250353 -2693694 -1633616 428722 -668758 -2361162 -2342899 -1270586 1070138 3044590
3903 3044590 3789584 3236007 2197452 1869796 821922 -31137 -96543 2153514 4814666
3894 4814666 4776732 4668642 2792362 2545171 3001837 2056951 1666321 75369 -214565
3885 -214565 1568805 524272 -32999 854976 428273 1100823 2898951 5326028 6423298
3876 6423298 3397105 -1367470 -3942742 -3758951 -1771798 -52163 26229 -872813 -734441
3867 -734441 -634484 151590 -265515 -561235 -1562964 -2754025 -3277212 -4362764 -3458767
3858 -3458767 -1259590 1034573 3535852 6126766 5394384 3813037 3414689 3473124 1535431
3849 1535431 510760 762820 2193654 2475818 2180146 2798854 2494614 2175565 296902
3840 296902 -3034249 -3230146 -2614211 -1946647 -245939 756560 1389885 812366 1599158
3831 1599158 2983214 3045090 3607160 4943398 4853127 2576930 893396 1284523 908336
3822 908336 1043595 1400094 1545922 2412161 2983087 2074395 -5328 -2415882 -6258078
3813 -6258078 -9636627 -9860288 -7875457 -5039981 -2576018 -24282 2096949 4683108
3805 4683108 7093063 8146971 6702041 2132798 85031 1645363 2551666 2639761 2976252
3796 2976252 2268545 1427048 214304 -474911 -160905 1427106 2031578 1065645 -970201
3787 -970201 -1381812 -744659 -930750 -907226 60535 896305 1747065 3369591 3600839 245945
3777 245945 -4548285 -6049346 -5427103 -3787484 -2049357 -2945363 -2202672 -40647 133442
3768 133442 233182 -2206643 -2886052 -784851 -1805062 -4072652 -4513567 -3482174 -3430627
3759 -3430627 -5255501 -7017555 -6346528 -6163042 -4311047 -358207 2253665 4162646 5182478
3750 5182478 3471379 3141733 4184533 2639386 -437083 -1449554 -1164899 -1575353 -2711103
3741 -2711103 -3271408 -3227161 -1582748 -37708 -1371124 -1657220 -2168949 -2045037 -1999327
3732 -1999327 -1388095 561012 1360797 1825260 1299812 4422470 3708817 -988709 -2173135
3723 -2173135 -1605825 -3532819 -6077187 -7404456 -5093893 -2455690 -1276583 374065
3715 374065 -1275889 -1738512 1746826 3697341 4894423 4687569 1195811 -1058124 -1235951
3706 -1235951 372896 1389447 2735555 3376334 2127982 354835 -1452358 -688899 -470861
3697 -470861 -241899 164388 663851 1925887 2391054 3189410 3666928 2705028 1986445 3597025
3687 3597025 4096892 4272956 2523223 1439169 608409 -954312 2164354 4261061 3965800
3678 3965800 3241271 4409543 6681659 6421303 3396994 1378700 1890929 1455401 22915
3669 22915 -425683 -715725 -1007195 1522664 4714084 6021730 6696626 6753614 6416558 3362524
3659 3362524 1870837 1662370 2037746 2214495 1471032 2228127 1402188 1613722 2334981
3650 2334981 906756 -1343202 -4139460 -3288861 -3075757 -2853734 -1152595 143587 305292
3641 305292 -219651 -1676749 -2953539 -3653461 -3677860 -5300765 -6316371 -4386120 -1336085
3632 -1336085 1288672 4735731 7534286 8177985 5046542 1264128 1330815 2950956 3276631
3623 3276631 3201987 2029292 414812 2949097 6291223 6945157 7101262 6550556 6297008
3614 6297008 6660480 7146987 5285575 3976410 4752122 3863912 452558 -470822 -1466676
3605 -1466676 -950934 -643573 51962 2130757 3872643 4345100 6050792 9614686 10101409
3596 10101409 8204061 7140809 5719206 3216441 401122 -1349961 -3407355 -3989511
3588 -3989511 -3124035 -2615090 -1628686 -1442700 -1710149 -407229 874193 2087256 2356714
3579 2356714 2085382 2691688 3998837 3807834 1861953 1560669 5071282 7041151 5251546
3570 5251546 2060992 -811613 -1471835 -479986 1446456 1244436 1280019 1549556 300625
3561 300625 -645331 709945 830584 -1729790 -3115080 -3277779 -1679636 931999 1397304
3552 1397304 2480582 4381860 4590684 4000368 2300956 2208047 3116791 4703878 3054209
3543 3054209 1683060 3033779 4391323 3889698 3176245 3414867 2182563 1617226 2138032
3534 2138032 1533699 917166 2008540 281822 -1911439 -1084734 2698526 3090128 2573232
3525 2573232 2694761 2227687 968079 -1836379 -4740047 -4682136 -2639286 -2902292 -2998468
3516 -2998468 -2036232 -1214826 -1317283 -2705471 -1979986 588863 1017911 1746278 1557045
3507 1557045 675971 1575861 2470776 -784070 -4626846 -5490943 -4997065 -1904863 952643
3498 952643 1043534 3304465 6448169 7749346 7764049 6646253 3988144 624109 -3049125
3489 -3049125 -5101568 -4321517 -3403237 -2945183 -2030541 1209469 5980164 7069617 5348158
3480 5348158 4850421 3775617 1880920 601308 755537 755691 793705 268986 1030547 2927576
3470 2927576 3308074 957418 -2873491 -5794118 -5163176 -2213168 1268092 3396298 5246143
3461 5246143 3991991 2805082 2706147 2250373 1757957 2952050 2837920 1209926 2932446
3452 2932446 6041486 5828206 3731989 3917467 3515029 817434 -406181 2336643 4026527
3443 4026527 3315733 -383463 -590119 1668877 3064232 3724142 3712674 4652022 3616664
3434 3616664 926836 290667 1107639 879071 -87689 -1902561 -3031881 -3753737 -4228252
3425 -4228252 -1941802 387200 2038115 3918413 5198984 1469463 -1418435 -3135949
3417 -3135949 -4586615 -3144014 -2518347 -2541222 -3558232 -1971050 -2345438 -2568473 -362249
3408 -362249 1902568 815162 -1860581 -4069453 -4928268 -4068628 -1331095 460038 776993
3399 776993 -2178735 -5703695 -8340285 -7504151 -3121660 -2023414 -3674802 -6591010 -8323325
3390 -8323325 -6678642 -5348127 -5029837 -2287281 -358872 94819 -415301 -629714 -2299853
3381 -2299853 -4778741 -4634130 -2677871 -1579066 -987485 257367 1065506 1493167 3123781
3372 3123781 5424534 6373920 5543832 4669089 4761448 3991103 2410856 1660490 2127407
3363 2127407 2426706 958782 -530216 -2219271 -3577639 -1896097 -1382078 -3450115 -2660298
3354 -2660298 -1669396 -237813 -296678 -310455 659865 2111192 3937873 4786902 4022769
3345 4022769 2015044 1632445 3307794 4562308 5812173 4254983 4689869 4243705 1514580
3336 1514580 -984790 -2553624 -4334109 -4287569 -2212154 -1314782 -497618 1374759 2158176
3327 2158176 1852781 3821555 4850746 6523396 8450470 8920610 7047164 2919842 1279124
3318 1279124 -266960 -560715 -250221 223891 2060904 3074537 964106 -1689348 -3327657
3309 -3327657 -1649492 822946 3096097 5295672 6199046 5402744 3884897 2532160 705299
3300 705299 -1907625 -5966607 -8483307 -7950599 -8915185 -7305612 -3615650 295645 3104501
3291 3104501 3222054 548242 -1255523 -2260333 -4164491 -3688846 -283475 460696 -1434486
3282 -1434486 -2273846 -2502537 -2610380 -693009 524181 93358 -1109009 -557458 3962422
3273 3962422 7603280 8320387 8629415 8680252 7770048 6713349 6333073 5651888 5673291 4409660
3263 4409660 2537108 2925578 1707156 192375 -1334133 -3480298 -3011372 -243423 1481797
3254 1481797 743969 -1504675 -826069 222346 -2291282 -4930108 -5070004 -3246545 -3663494
3245 -3663494 -3995125 -4369849 -4175918 -2538757 -730387 -1888864 -3592900 -4193326 -2768044
3236 -2768044 2115985 4671577 4212558 5422533 6697513 5373749 4043883 -523499
3228 -523499 -4564132 -3327766 -1339273 327940 2132571 1951224 1530075 1747840 1385400
3219 1385400 2093354 2665789 1065677 1205202 1887835 3839605 5694155 4113839 2151221
3210 2151221 2565186 2792320 3369068 1682932 -875741 -1832259 -164809 -965414 -2456288
3201 -2456288 -2821552 -2760630 -1135781 618605 1933779 917055 -1568866 -4266670 -5943064
3192 -5943064 -4854701 -1014847 24520 -839328 -881825 -726368 1057736 3797388 4416503
3183 4416503 4470021 2202113 -1359126 -2212915 -2212944 -3062827 -2861169 -3253107 -2205955 757297
3173 757297 -18511 -3181821 -4834125 -5636399 -4830201 -2430659 256664 930822 108465
3164 108465 1748942 5175221 3572618 -1046244 -3238616 -1020422 1992712 2992348 3297709
3155 3297709 3499233 3515804 3171705 3892429 409240 -2397541 -4640033 -6542076 -4768785
3146 -4768785 273703 4340838 6462035 4264276 1389928 65025 950161 3556608
3138 3556608 3510173 2547530 543986 -1671605 -1126389 -488232 2402554 1647186 -1462264
3129 -1462264 -205204 1959853 1479444 -1099577 -3015997 -2829798 -2736988 -3201654 -3106836
3120 -3106836 876607 1936746 2790928 4048781 2188585 1078274 1542732 -1118879 -2463252
3111 -2463252 -1685530 -1319111 -551523 1913289 2212867 2972703 3355191 2371378 1746614
3102 1746614 1952901 1353238 -969642 -2237036 -1330377 -946684 -2811042 -3610029 -3204215
3093 -3204215 -1886077 -2427727 -3434481 -4986865 -6631617 -6265884 -4159994 -1294272 -168770
3084 -168770 507409 564161 -421359 127972 544093 2528255 2923207 2459989 1977856 1577442
3074 1577442 3378440 5336419 4394404 705371 -1921500 -994133 -1846307 -4208347 -6351347
3065 -6351347 -6027400 -5692262 -4146195 -1679706 1896519 4245342 5658433 7155669 6633684
3056 6633684 5689031 4215935 3766288 2555954 872078 315328 1493540 3078698 4411685
3047 4411685 5457219 5469649 4178841 1090369 1843734 4523456 3671904 3329060 2640879
3038 2640879 1495694 1101023 1157986 744728 -756389 -1217031 -2000324 -2756377 -1733247
3029 -1733247 -1124294 397785 2434314 3737541 3364546 1137840 -533327 -1123868 -2373624
3020 -2373624 -3258400 -2602748 -3651943 -2512627 337343 2998323 3507180 2664859 2764828
3011 2764828 2507606 2088152 192404 -858015 -127464 -1768286 -2224858 -2653710 -2493572
3002 -2493572 -374805 963230 -1519 -752431 -1007926 -2401747 -5334251 -5685502 -3394202
2993 -3394202 -550733 3541645 5617952 4580016 3881457 3549559 4585756 6224432 6840818
2984 6840818 6892775 5823468 5250777 4076987 488596 -1553425 -1357942 1594159 3858748
2975 3858748 5941653 6322075 4596617 4798736 5856292 6806105 6100376 3713294 1092047
2966 1092047 1303778 3673144 2206499 -1998552 -3296438 -2133915 -731789 277598
2958 277598 807960 843162 704755 -399457 -2258277 -706039 2755618 3990870 2553978
2949 2553978 1361126 246877 556703 1923889 2035529 3137010 4759435 5591390 6172228
2940 6172228 6555496 3902610 265293 -1031539 128785 2149484 731170 -1878481
2932 -1878481 -1349237 970419 939518 -528624 -3671750 -6011886 -3017203 1832464 5150164
2923 5150164 5026682 4276760 2635002 2274360 3532072 3967848 3418109 1678042 1416395
2914 1416395 -314369 -2308593 -3544669 -5088794 -4536616 -3271021 -1926710 83133
2906 83133 3771452 6551452 7331111 8297136 7366321 4158287 2378990 1934382 204064
2897 204064 -1601402 -1973527 -731028 -74778 1029014 1553280 1829176 1014097 3383823
2888 3383823 5030088 3690154 1056199 1458966 2094167 781249 1336837 2769328 2115653
2879 2115653 951514 148856 -755559 -2888241 -2809399 -720700 -427113 -2001895 -3381602
2870 -3381602 -2547738 481264 2479535 1087117 -917770 -3293662 -5434323 -4566299 -2306204
2861 -2306204 -1572804 -1108266 -284144 -296135 962779 1492601 -81687 -926850 -323204
2852 -323204 1942067 2992550 987509 1682209 5151352 4203169 1747838 1899130 1550605
2843 1550605 1089919 624720 170392 1025397 464197 -546056 -3286787 -3032048 -1478535
2834 -1478535 1180392 3675297 3982547 3395864 4007397 3956960 1096090 -1229803 115890
2825 115890 1797571 629172 -602301 854417 3400657 3982246 1160403 160742 595468
2816 595468 1334136 2019177 1772874 1856386 2619003 3798504 5218547 6198664 5812074 2920225
2806 2920225 -50944 -714363 -105633 1328571 988693 -1888454 -2155283 163948 1270145
2797 1270145 721556 -26411 -1176660 -1860149 -1783845 -1282396 -1179062 -845862 1215768
2788 1215768 3375234 3697541 2810578 2812731 4505105 6238074 6313799 6236260 5812432 6061103
2778 6061103 4861079 5198944 5708445 3527559 -571595 -1199071 984445 3621706 2170866
2769 2170866 -963013 -1829959 -1746483 -2185064 -2269831 288915 4812398 5359509 858782
2760 858782 1075488 4430187 7021372 7368705 5080928 3797504 2376449 2440119 2028090
$$ [...]
##END NTUPLES=NMR SPECTRUM
##END=
