##TITLE=C13DEPT135
##JCAMPDX= 6.0         $$ Bruker NMR JCAMP-DX V2.0
##DATA TYPE= NMR SPECTRUM
##DATA CLASS= NTUPLES
##ORIGIN= UXNMR, Bruker Analytische Messtechnik GmbH
##OWNER= root
$$ XWIN-NMR		Version 3.5
$$ Sat Feb 15 13:04:22 2025 Russian Standard Time (UT+4h)  servis@DPX200
##.OBSERVE FREQUENCY= 50.3277607988526
##.OBSERVE NUCLEUS= ^13C
##.ACQUISITION MODE= SIMULTANEOUS
##.ACQUISITION SCHEME= undefined
##.AVERAGES= 951
##.DIGITISER RES= 17
##SPECTROMETER/DATA SYSTEM= spect
##.PULSE SEQUENCE= dept135
##.SOLVENT NAME= DMSO
##.SHIFT REFERENCE= (INTERNAL, DMSO, 0, 219.126)
##AUDIT TRAIL= $$ (NUMBER, WHEN, WHO, WHERE, WHAT)
$$ ##TITLE= Audit trail, XWIN-NMR		Version 3.5
$$ ##JCAMPDX= 5.01
$$ ##ORIGIN= Bruker BioSpin GmbH
$$ ##OWNER= servis
$$ F:\spectra/data/av/nmr/C13DEPT135/1/pdata/1/auditp.txt
$$ ##AUDIT TRAIL=  $$ (NUMBER, WHEN, WHO, WHERE, WHAT)
(   1,<2025-02-15 13:03:46.15 +0400>,<servis>,<DPX200>,
      <created by zg, POWCHK disabled, PULCHK disabled
       terminated by command 'halt'
       configuration hash MD5:
       00 E9 B6 7A A2 85 ED C7 34 08 36 98 17 FE 4E 26
       data hash MD5: 64K
       1E 33 C4 5B 7D 3E 4B 7D 49 AB 1B B9 E1 8E BE E7>)
(   2,<2025-02-15 13:03:48.01 +0400>,<servis>,<DPX200>,
      <Start of raw data processing
       efp BC_mod = 2 LB = 1 FT_mod = 6 PKNL = 1 PHC0 = 384.807 PHC1 = 5.268371 SI = 32K 
       data hash MD5: 32K
       F2 BB 56 E1 7C 1B 07 21 32 90 10 89 FE 18 6F 01>)
(   3,<2025-02-15 13:04:02.37 +0400>,<servis>,<DPX200>,
      <pk PHC0 = 9.799999 PHC1 = 0 
       data hash MD5: 32K
       31 4A E9 2E AF 32 41 82 C7 F9 E5 D5 3F 4F 86 D0>)
$$ ##END=
$$ 
$$ hash MD5
$$ 5A 31 E0 70 C6 D2 F8 DB F6 73 88 DA 96 E0 10 41
##$RELAX= 
##$RELAX= 
##$RELAX= 
##$RELAX= 
##$RELAX= 
##$RELAX= 
##$RELAX= 
$$ Bruker specific parameters
$$ --------------------------
##$DU= <F:\spectra>
##$EXPNO= 1
##$NAME= <C13DEPT135>
##$PROCNO= 1
##$TYPE= <nmr>
##$USER= <av>
##$AMP= (0..31)
100 100 100 100 100 100 100 100 100 100 100 100 100 100 100 100 100 100 
100 100 100 100 100 100 100 100 100 100 100 100 100 100 
##$AQSEQ= 0
##$AQ_mod= 1
##$AUNM= <au_zg>
##$AUTOPOS= <>
##$BF1= 50.322729
##$BF2= 200.13
##$BF3= 50.322729
##$BF4= 50.322729
##$BF5= 500.13
##$BF6= 500.13
##$BF7= 500.13
##$BF8= 500.13
##$BYTORDA= 1
##$CFDGTYP= 0
##$CFRGTYP= 5
##$CHEMSTR= <none>
##$CNST= (0..31)
1 1 145 1 1 1 1 1 1 1 1 1 1 1 1 1 1 1 1 1 1 1 1 1 1 1 1 1 1 1 1 1 
##$CPDPRG= <waltz16>
##$CPDPRG1= <>
##$CPDPRG2= <waltz16>
##$CPDPRG3= <>
##$CPDPRG4= <mlev>
##$CPDPRG5= <mlev>
##$CPDPRG6= <mlev>
##$CPDPRG7= <mlev>
##$CPDPRG8= <mlev>
##$CPDPRGB= <>
##$CPDPRGT= <>
##$D= (0..31)
0 2 0.003448276 0 0 0 0 0 0 0.06 0 0.03 2e-05 4e-06 0 0 0.0002 0 0 0 0 
0 0 0 0 0 0 0 0 0 0 0 
##$DATE= 1739610225
##$DBL= (0..7)
120 120 120 120 120 120 120 120 
##$DBP= (0..7)
150 150 150 150 150 150 150 150 
##$DBP07= 0
##$DBPNAM0= <>
##$DBPNAM1= <>
##$DBPNAM2= <>
##$DBPNAM3= <>
##$DBPNAM4= <>
##$DBPNAM5= <>
##$DBPNAM6= <>
##$DBPNAM7= <>
##$DBPOAL= (0..7)
$$ [...]
##$SUBNAM2= <"">
##$SUBNAM3= <"">
##$SUBNAM4= <"">
##$SUBNAM5= <"">
##$SUBNAM6= <"">
##$SUBNAM7= <"">
##$SUBNAM8= <"">
##$SUBNAM9= <"">
##$SW= 238.246396889851
##$SWIBOX= (0..15)
0 1 3 0 0 0 0 0 0 0 0 0 0 0 0 0 
##$SW_h= 11990.4076738609
##$TD= 65536
##$TD0= 1
##$TE= 0
##$TE2= 300
##$TE3= 300
##$TEG= 300
##$TL= (0..7)
0 120 120 120 120 120 120 120 
##$TP= (0..7)
150 150 150 150 150 150 150 150 
##$TP07= 0
##$TPNAME0= <>
##$TPNAME1= <>
##$TPNAME2= <>
##$TPNAME3= <>
##$TPNAME4= <>
##$TPNAME5= <>
##$TPNAME6= <>
##$TPNAME7= <>
##$TPOAL= (0..7)
0.5 0.5 0.5 0.5 0.5 0.5 0.5 0.5 
##$TPOFFS= (0..7)
0 0 0 0 0 0 0 0 
##$TUNHIN= 0
##$TUNHOUT= 0
##$TUNXOUT= 0
##$USERA1= <user>
##$USERA2= <user>
##$USERA3= <user>
##$USERA4= <user>
##$USERA5= <user>
##$V9= 5
##$VALIST= <valist>
##$VCLIST= <CCCCCCCCCCCCCCC>
##$VD= 0
##$VDLIST= <DDDDDDDDDDDDDDD>
##$VPLIST= <PPPPPPPPPPPPPPP>
##$VTLIST= <TTTTTTTTTTTTTTT>
##$WBST= 1024
##$WBSW= 4
##$XGAIN= (0..3)
0 0 0 0 
##$XL= 0
##$YL= 0
##$YMAX_a= 1267883
##$YMIN_a= -1370580
##$ZGOPTNS= <>
##$ZL1= 120
##$ZL2= 120
##$ZL3= 120
##$ZL4= 120
##$ABSF1= 0
##$ABSF2= 0
##$ABSG= 0
##$ABSL= 0
##$ALPHA= 0
##$AQORDER= 0
##$ASSFAC= 0
##$ASSFACI= 0
##$ASSFACX= 0
##$ASSWID= 0
##$AUNMP= <proc_1d>
##$AZFE= 0.1
##$AZFW= 0.5
##$BCFW= 0
##$BC_mod= 2
##$BYTORDP= 0
##$COROFFS= 0
##$CY= 12.5
##$DATMOD= 1
##$DC= 0
##$DFILT= <>
##$DTYPP= 0
##$F1P= 215.000008851289
##$F2P= -4.99998459219978
##$FCOR= 0.5
##$FTSIZE= 32768
##$FT_mod= 6
##$GAMMA= 0
##$GB= 0
##$INTBC= 1
##$INTSCL= 1
##$ISEN= 30
##$LB= 1
##$LEV0= 0
##$LPBIN= 0
##$MAXI= 10000
##$MC2= 0
##$MEAN= 0
##$ME_mod= 0
##$MI= 0
##$NCOEF= 0
##$NC_proc= -2
##$NLEV= 6
##$NOISF1= 0
##$NOISF2= 0
##$NSP= 0
##$NTH_PI= 0
##$NZP= 0
##$OFFSET= 219.1257
##$PC= 1.4
##$PHC0= 394.607
##$PHC1= 5.268371
##$PH_mod= 1
##$PKNL= yes
##$PPARMOD= 0
##$PSCAL= 4
##$PSIGN= 0
##$REVERSE= no
##$SF= 50.322729
##$SI= 32768
##$SIGF1= 0
##$SIGF2= 0
##$SINO= 80
##$SIOLD= 32768
##$SREGLST= <13C.CDCl3>
##$SSB= 0
##$STSI= 32768
##$STSR= 0
##$SW_p= 11990.4076738609
##$SYMM= 0
##$S_DEV= 0
##$TDeff= 65536
##$TDoff= 0
##$TI= <>
##$TILT= no
##$TM1= 0
##$TM2= 0
##$TOPLEV= 0
##$USERP1= <user>
##$USERP2= <user>
##$USERP3= <user>
##$USERP4= <user>
##$USERP5= <user>
##$WDW= 1
##$XDIM= 32768
##$YMAX_p= 475820652
##$YMIN_p= -417550030
$$ End of Bruker specific parameters
$$ ---------------------------------
##NTUPLES= NMR SPECTRUM
##VAR_NAME=  FREQUENCY,     SPECTRUM/REAL,   SPECTRUM/IMAG
##SYMBOL=    X,             R,               I
##VAR_TYPE=  INDEPENDENT,   DEPENDENT,       DEPENDENT
##VAR_FORM=  AFFN,          ASDF,            ASDF
##VAR_DIM=   32768,         32768,           32768
##UNITS=     HZ,            ARBITRARY UNITS, ARBITRARY UNITS
##FACTOR=    0.365929370215793, 1,           1
##FIRST=     11027.0033138647, 0,            0
##LAST=      -963.404359996184, 0,           0
##MIN=       -963.404359996184, -417550030,  0
##MAX=       11027.0033138647, 475820652,    0
$$ Real data points
##PAGE= N=1
##DATA TABLE= (X++(R..R)), XYDATA
$$ [...]
$$ plain form
9309 3061608 797329 -767912 -4066201 -2271710 4157853 4303189 5883388 8217863
9301 8217863 5331250 8886191 13260599 6858569 -3027693 -2449260 1427121 1761795 -926340
9292 -926340 1067079 3343185 2299164 -2383887 -5225665 889129 8038903 11369037
9284 11369037 7020289 63526 -1608773 759344 5291190 8824958 5153565 5320837
9276 5320837 5648183 4928948 1962108 -1470636 185803 974901 -1989699 -2370208 -3202311
9267 -3202311 -4268222 -3631787 -1533625 2008741 1161628 -1224577 -561354 -509107 71779
9258 71779 -1651334 -2516098 -2258749 -5585538 -7354678 -8167407 -9742845 -5274529 1264851
9249 1264851 4767745 3982645 5539880 8341077 8254163 4788214 -1045943 -5025412 -2571769
$$ packed form
9309C061608k264279j565241l298289J794491O429563J45336J580199K334475
9301H217863k886613L554941M374408o402030r886262N78433L876381L34674k688135
9292i26340J993419K276106j044021m683051k841778O114794P149774L330134
9284A1369037m348748o956763j672299K368117M531846L533768l671393J67272
9276E320837L27346p19235k966840l432744J656439P89098k964600l80509q32103
9267c202311j065911O36435K098162L542366q47113k386205O63223N2247N80886
9258G1779j723113q64764K57349l326789j769140q12729j575438M468316O539380
9249A264851L502894p85100J557235K801197q6914l465949n834157l979469K453643
$$ plain form
9240 -2571769 1066181 3947288 6047381 8536986 6781846 1828620 704312 1612415
9232 1612415 1460996 4831959 8561772 6872990 3847807 2843938 1168413 2892315
9224 2892315 5111378 5650948 6214066 6050023 3626487 3156983 5111978 6933547 8082477
9215 8082477 7994807 2059053 -3271530 438816 4906359 4904457 1577324 1852246 8738715
9206 8738715 10295042 9072656 8392296 5442217 4791096 3142880 -2712286 -4836446 -5445648
9197 -5445648 -1295025 434722 -1645554 -4444605 -6809789 -5036615 2078524 7300729
9189 7300729 4883419 4071973 5358237 7922420 8685685 6975770 3428221 5298744 7812270
9180 7812270 6392193 3894758 2249647 5069693 8847351 11028922 14625088 16001893
$$ packed form
9240b571769L637950K881107K100093K489605j755140m953226j124308R08103
9232A612415j51419L370963L729813j688782l025183j003869j675525J723902
9224B892315K219063N39570N63118j64043k423536m69504J954995J821569J148930
9215H082477q7670n935754n330583L710346M467543j902l327133K74922O886469
9206H738715J556327j222386o80360k950079o51121j648216n855166k124160o09202
9197e445648M150623J729747k080276k799051k365184J773174P115139N222205
9189G300729k417310q11446J286264K564183P63265j709915l547549J870523K513526
9180G812270j420077k497435j645111K820046L777658K181571L596166J376805
$$ plain form
9172 16001893 15054920 12102211 7126208 913774 -4065891 -6491437 -6055401 -1658473
9164 -1658473 240658 2653798 2050418 80914 -2182447 -5916659 -9467061 -12542689
9156 -12542689 -12924558 -8167767 -1390950 -532739 -4408711 -6168550 -4574643 278496
9148 278496 6182661 9382558 9371676 7736872 5772305 1834505 -2221859 -4558484 -4499102
9139 -4499102 -5524283 -4331674 847942 5625671 3830458 1442534 -693953 -6158461
9131 -6158461 -5090157 -162156 403337 619338 348054 2202347 -1324527 -6203543 -1378065
9122 -1378065 5191948 7023738 9446392 10763622 10201815 10114307 11603910 14420601 15287734
9113 15287734 14689287 18578813 17824361 14589798 12801953 5747658 1092621 843682 -1826849
$$ packed form
9172A6001893r46973k952709m976003o212434m979665k425546M36036M396928
9164a658473J899131K413140o03380j969504k263361l734212l550402l075628
9156a2542689l81869M756791O776817Q58211l875972j759839J593907M853139
9148B78496N904165L199897j0882j634804j964567l937800m056364k336625N9382
9139d499102j025181J192609N179616M777729j795213k387924k136487n464508
9131f158461J068304M928001N65493K16001k71284J854293l526874m879016M825478
9122a378065O570013J831790K422654J317230n61807q7508J489603K816691Q67133
9113A5287734n98447L889526p54452l234563j787845p054295m655037k48939k670531
$$ plain form
9104 -1826849 -3169685 -3252960 -2310947 -3069189 -1888992 1470554 3758528 3101795 1982292
9095 1982292 1117431 -216272 1158948 6590816 6188303 3633217 773365 -2570242 -5358211
9086 -5358211 -5915278 -4540299 -5049802 -6336115 -3197674 1407932 6240910 8884904 7828833
9077 7828833 3763409 -399809 -3024501 -5212272 -5019045 -1516802 466599 -4106347
9069 -4106347 -8891238 -9091836 -12096638 -15215003 -15182270 -14201945 -12755966 -11564921 -9992665
9060 -9992665 -9201479 -9365000 -10071423 -7143269 -1269203 1889635 -813678 1085859 3749283
9051 3749283 5886311 5590370 5244339 4382634 5171924 5541956 6695980 8301648 6619854
9042 6619854 2884353 213867 -3347924 -2072143 1621443 2714229 5070035 6845199
$$ packed form
9104a826849j342836q3275R42013p58242J180197L359546K287974o56733j119503
9095A982292q64861j333703J375220N431868m02513k555086k859852l343607k787969
9086e358211n57067J374979n09503j286313L138441M605606M832978K643994j056071
9077G828833m065424m163218k624692k187771J93227L502243J983401m572946
9069d106347m784891k00598l004802l118365L2733R80325J445979J191045J572256
9060i992665P91186j63521p06423K928154N874066L158838k703313J899537K663424
9051C749283K137028k95941l46031q61705P89290L70032J154024J605668j681794
9042F619854l735501k670486l561791J275781L693586J092786K355806J775164
$$ plain form
9034 6845199 8469720 12269729 14650418 11239803 3965402 1769404 4433016 5032557
9026 5032557 2565362 -377341 -5037418 -6700532 -6642835 -6905800 -9103909 -12517012 -12719116
9017 -12719116 -13620937 -12244659 -8258409 -1650503 2702417 1089098 -3109732 -6584779
9009 -6584779 -8266900 -12981202 -19361750 -24950531 -31875050 -38283651 -40010396 -40275965
9001 -40275965 -38477088 -33937887 -29924076 -31134474 -26843774 -17527477 -10668041 -8119230
8993 -8119230 -5648689 -768806 680343 1446267 3786936 514068 -4081486 -5640100
8985 -5640100 -6557670 -9161166 -6917989 -3314018 -1729900 -2468555 -2731834 -1489045 1579004
8976 1579004 759139 -1125807 -4544320 -5161315 -2085454 3179363 2200361 -216174 -2405915
$$ packed form
9034F845199J624521L800009K380689l410615p274401k195998K663612N99541
9026E032557k467195k942703m660077j663114N7697k62965k198109l413103k02104
9017a2719116r01821J376278L986250O607906M352920j613319m198830l475047
9009f584779j682121m714302o380548n588781o924519o408601j726745k65569
9001d0275965J798877M539201M013811j210398M290700R316297O859436K548811
8993h119230K470541M879883J449149P65924K340669l272868m595554j558614
8985e640100r17570k603496K243177L603971J584118p38655k63279J242789L068049
8976A579004q19865j884946l418513o16995L075861N264817r79002k416535k189741
$$ plain form
8967 -2405915 -5436471 -5635917 -5410025 -5707988 -6390234 -6136199 -1438274 906502 2856692
8958 2856692 3556754 6594107 12542224 12517248 5995905 -1297369 -6601805 -10463857 -10261283
8949 -10261283 -7430791 -4642773 -101060 1402009 -1149545 -1992409 -1562072 -1581845 -1901087
8940 -1901087 -793272 -1664750 -5780506 -7528029 -3976812 1437250 5883751 8867486
8932 8867486 6202870 2103677 -2085925 -5486683 -4587281 -3998857 -6646775 -7613258 -8027329
8923 -8027329 -7624343 -3060795 1967132 6690254 7857400 9546535 9912938 3464131 -5637432
8914 -5637432 -10593990 -10557000 -6040732 430423 2942780 691725 -3765053 -8352455 -11142538
8905 -11142538 -11333912 -8188649 -7319865 -7481885 -10659777 -15458402 -17042208 -16348244 -15623074
$$ packed form
8967b405915l030556j99446K25892k97963o82246K54035M697925K344776J950190
8958B856692P00062L037353N948117k4976o521343p293274n304436l862052K02574
8949a0261283K830492K788018M541713J503069k551554q42864M30337j9773l19242
8940a901087J107815q71478m115756j747523L551217N414062M446501K983735
8932H867486k664616m099193m189602l400758Q99402N88424k647918r66483m14071
8923h027329M02986M563548N027927M723122J167146J689135L66403o448807r101563
8914e637432m956558L6990M516268O471155K512357k251055m456778m587402k790083
8905a1142538j91374L145263Q68784j62020l177892m798625j583806O93964P25170
$$ plain form
8896 -15623074 -11652476 -8234044 -3926450 1212070 1941369 1497737 630808 3122160 8087187
8887 8087187 8254006 2530301 -4882409 -10139175 -13569908 -16659658 -12395296 -5754992
8879 -5754992 -2769923 -427243 2398277 5809628 5360158 5439817 4876373 1402514 -2872708
8870 -2872708 -3418849 -2206203 -1827338 -1815622 431394 -304190 -1896508 -4226817 -4201434
8861 -4201434 -3758031 -3407916 1824767 1770035 -1894074 -4844085 -5924768 -8930246 -10807107
8852 -10807107 -9191228 -5261700 202398 4520869 4464063 5512661 7664418 5507209
8844 5507209 88247 -4643541 -3510461 -2510209 -1286893 -1553695 -3222853 -2655961 -4403047
8835 -4403047 -8124576 -9331183 -5744130 -2781612 303346 3151480 327989 -5005418
$$ packed form
8896a5623074L970598L418432M307594N138520P29299m43632q66929K491352M965027
8887H087187J66819n723705p412710n256766l430733l089750M264362O640304
8879e754992K985069K342680K825520L411351m49470P9659n63444l473859m275222
8870b872708n46141J212646L78865J1716K247016p35584j592318k330309K5383
8861d201434M43403L50115N232683n4732l664109k950011j080683l005478j876861
8852a0807107J615879L929528N464098M318471n6806J048598K151757k157209
8844E507209n418962m731788J133080J000252J223316k66802j669158N66892j747086
8835d403047l721529j206607L587053K962518L084958K848134k823491n333407
$$ plain form
8827 -5005418 -5370693 -2162311 -767258 1263243 695772 -473901 694988 2136059 2105469
8818 2105469 2179324 3127702 8579270 7111669 5967871 4442339 4088177 5431814 5268140
8809 5268140 1957513 -1437027 -4368714 -3748494 45504 -231494 380428 -2188001 -3433468
8800 -3433468 -6379574 -5750719 -2878465 1029526 73517 -1696765 307909 3816775 4833470
8791 4833470 1054913 -3199246 -225432 3099824 2186892 1852370 3674173 2869780 1757566
8782 1757566 671054 -2260334 -3153473 -1451316 -696604 -2398694 -2483197 -1863425 -2759395
8773 -2759395 -3643129 -4818225 -5535027 -2612945 1233479 246895 -2109054 -2326937 -1482842
8764 -1482842 -319394 61400 4187610 5212045 5824878 4585082 -598249 172491 -338694
$$ packed form
8827e005418l65275L208382J395053K030501n67471j169673J168889J441071l0590
8818B105469P3855R48378N451568j467601j143798j525532l54162J343637j63674
8809E268140l310627l394540k931687O20220L793998k76998O11922k568429j245467
8800c433468k946106O28855K872254L907991r56009j770282K004674L508866J016695
8791D833470l778557m254159K973814L325256r12932l34522J821803q04393j112214
8782A757566j086512k931388q93139J702157P54712j702090q4503O19772q95970
8773b759395q83734j175096p16802K922082L846424r86584k355949k17883Q44095
8764a482842J163448L80794M126210J024435O12833j239796n183331P70740n11185
$$ plain form
8755 -338694 -2749692 -3254592 -6142272 -8760855 -6875431 -7390846 -6394634 -3427456 2516293
8746 2516293 3116639 2432493 4421543 8766427 12110422 10728111 11498354 12356589 10248889
8737 10248889 7211830 6056955 5418413 7335573 9369534 4427041 888552 1206112
8729 1206112 1289278 -777102 -2984028 -10247762 -13197510 -7958013 -3658608 -3608036 -8163535
8720 -8163535 -11473666 -14438865 -15533599 -12859303 -8389419 -6435675 -6352862 -9515114 -10679112
8711 -10679112 -7456916 -5828067 -4038957 -3639948 -6399951 -6485134 -4300786 -6108669 -9740188
8702 -9740188 -12049988 -10247615 -8734528 -8813883 -7176777 -2022696 -1348640 -4565519 -9406312
8693 -9406312 -9786554 -6567845 -8748360 -9685271 -6857658 -8686790 -5223708 -194464 -2452649
$$ packed form
8755c38694k410998n04900k887680k618583J885424n15415R96212K967178N943749
8746B516293O00346o84146J989050M344884L343995j382311P70243Q58235k107700
8737A0248889l037059j154875o38542J917160K033961m942493l538489L17560
8729A206112Q3166k066380k206926p263734k949748N239497M299405N0572m555499
8720h163535l310131k965199j094734K674296M469884J953744Q2813l162252j163998
8711a0679112L222196J628849J789110L99009k760003q5183K184348j807883l631519
8702i740188k309800J802373J513087p9355J637106N154081O74056l216879m840793
8693i406312l80242L218709k180515r36911K827613j829132L463082N029244k258185
$$ plain form
8684 -2452649 -7442189 -9029310 -11166573 -14747710 -13843938 -7394534 -5540691 -4335100
8676 -4335100 -5356960 -4870997 -3365441 -3828677 -3838899 -2591392 -3854811 -9353089 -13195000
8667 -13195000 -14881228 -11300504 -9562986 -11171484 -12649905 -7436051 -4573022 -4838913
8659 -4838913 -4901308 -2217641 -2839729 -7610581 -13264113 -16064051 -14392575 -12218785 -13637055
8650 -13637055 -18733976 -20391658 -19018505 -19210325 -19390288 -17929723 -15208997 -17243346
8642 -17243346 -19527525 -21662178 -23539218 -24030082 -21729266 -24345580 -29413100 -36663192
8634 -36663192 -44147294 -48397567 -51368215 -55201310 -65558604 -71170067 -74408348 -80569140
8626 -80569140 -88772992 -98638176 -117297916 -141198232 -165910952 -189556689 -220299101
$$ packed form
8684b452649m989540j587121k137263l581137R03772O449404J853843J205591
8676d335100j021860M85963J505556m63236j0222J247507j263419n498278l841911
8667a3195000j686228L580724J737518j608498j478421N213854K863029k65891
8659d838913o2395K683667o22088m770852n653532k799938J671476K173790j418270
8650a3637055n096921j657682J373153j91820j79963J460565K720726k034349
8642a7243346k284179k134653j877040m90864K300816k616314n067520p250092
8634c6663192p484102m250273k970648l833095j0357294n611463l238281o160792
8626h0569140q203852r865184j8659740k3900316k4712720k3645737l0742412
$$ plain form
8619 -220299101 -256536391 -289990861 -323086627 -351634048 -380267611 -404472011 -415969884
8612 -415969884 -417550030 -411489292 -394010517 -367045734 -336571775 -300956243 -264353904
8605 -264353904 -233261683 -202318130 -175625975 -155489810 -135659877 -117730058 -106076186
8598 -106076186 -98205658 -93011517 -87592067 -83759840 -76517911 -65202679 -55680956 -55598818
8590 -55598818 -57453895 -54260261 -50199952 -46456004 -44596132 -39434723 -32431687 -29552764
8582 -29552764 -31506342 -34080135 -31932069 -26958039 -23839296 -18838369 -18956694 -23833716
8574 -23833716 -25771433 -23849158 -21433388 -20528136 -20830043 -16189272 -10668217 -9752392 -10378747
8565 -10378747 -10928467 -14572885 -16965642 -18403099 -15982388 -13134308 -11737718 -11756631 -15039434
$$ packed form
8619b20299101l6237290l3454470l3095766k8547421k8633563k4204400j1497873
8612d15969884j580146O060738J7478775K6964783L0473959L5615532L6602339
8605b64353904L1092221L0943553K6692155K0136165J9829933J7929819J1653872
8598a06076186P870528N194141N419450L832227P241929J1315232R521723Q2138
8590e5598818j855077L193634M060309L743948J859872N161409P003036K878923
8582b9552764j953578k573793K148066M974030L118743N000927j18325m877022
8574b3833716j937717J922275K415770R05252l01907M640771N521055R15825o26355
8565a0378747n49720l644418k392757j437457K420711K848080J396590j8913l282803
$$ plain form
8556 -15039434 -19831132 -22062176 -19834715 -13776465 -9708387 -8700648 -9496302 -12684772
8548 -12684772 -15151199 -14810018 -13970384 -10761271 -3853273 243117 1815635 2964935
8540 2964935 300115 -4474697 -4010991 -378467 -328651 -2860958 -2908724 -1640182 -1885655
8531 -1885655 -5825128 -8800282 -7914849 -7503282 -11277080 -9351422 -5260194 -3726383 -31452
8522 -31452 3057635 3287284 4448345 6198964 7804162 5004725 1005651 1604577 746890
8513 746890 -4709405 -10960551 -9775356 -8264093 -5273119 424098 2242382 2234006 -403951
8504 -403951 -2703679 -2238846 -3618821 -6830225 -6780944 -5148057 -6040493 -7195114 -5082523
8495 -5082523 -2093917 4114 -2295976 -6066501 -7425437 -6608275 -5732367 -3731869 -5247159
$$ packed form
8556a5039434m791698k231044K227461O058250M068078J007739p95654l188470
8548a2684772k466427L41181Q39634L209113O907998M096390J572518J149300
8540B964935k664820m774812M63706L632524M9816k532307m7766J268542k45473
8531a885655l939473k975154Q85433M11567l773798J925658M091228J533811L694931
8522c1452L089087K29649J161061J750619J605198k799437l999074N98926q57687
8513G46890n456295o251146J185195J511263K990974N697217J818284q376k637957
8504d03951k299728M64833j379975l211404M9281J632887q92436j154621K112591
8495e082523K988606K098031k300090l770525j358936Q17162Q75908K000498j515290
$$ plain form
8486 -5247159 -7549786 -6858919 -6607133 -9155183 -6962260 -1502377 1842117 -1083323 -4985364
8477 -4985364 -5661762 -1940553 2799571 1731029 374440 3740475 2370733 -747735
8469 -747735 -365581 1018988 1071465 1186473 -1176084 -3465623 -5413447 -3991462 -1235322
8460 -1235322 1209238 1774582 1797864 705893 -2453044 -6677645 -10610731 -10092042 -11796073
8451 -11796073 -16132621 -17696706 -15363173 -9864040 -6674365 -7948367 -9620218 -8732029
8443 -8732029 -10943790 -13785121 -16646640 -15497408 -14922534 -12761288 -6777025 -1406743
8435 -1406743 -3997050 -11268989 -14943556 -15740603 -13967494 -16153271 -17893152 -18102862 -19706751
8426 -19706751 -18869555 -16515145 -18428212 -23531105 -28340861 -33979100 -40122383 -44137208
$$ packed form
8486e247159k302627O90867K51786k548050K192923N459883L344494k925440l902041
8477d985364o76398L721209M740124j068542j356589L366035j369742l118468
8469g47735L82154J384569N2477J15008k362557k289539j947824J421985K756140
8460a235322K444560N65344K3282j091971l158937m224601l933086N18689j704031
8451a1796073m336548j564085K333533N499133L189675j274002j671851Q88189
8443h732029k211761k841331k861519J149232N74874K161246N984263N370282
8435a406743k590307p271939l674567p97047J773109k185777j739881k09710j603889
8426a9706751Q37196K354410j913067n102893m809756n638239o143283m014825
$$ plain form
8418 -44137208 -51711559 -61707520 -68147741 -76374977 -91670568 -111054111 -130144094 -149673731
8410 -149673731 -172260726 -195680989 -217261969 -236531619 -260414093 -287878474 -308994912
8403 -308994912 -323713776 -330255359 -324058694 -310413495 -293996670 -273712583 -250813725
8396 -250813725 -227382453 -200557756 -175398568 -156380722 -142690183 -129096784 -109654170
8389 -109654170 -92585409 -86809284 -80281453 -69435754 -61109202 -56409626 -51833420 -45827952
8381 -45827952 -44401136 -44949961 -43667673 -38919778 -33675363 -30915031 -28034593 -25035305
8373 -25035305 -25742649 -29317957 -31056656 -31349055 -30332204 -28820749 -23078686 -19774460
8365 -19774460 -21456969 -26715146 -26780253 -23778290 -21897256 -19649561 -21505100 -23290779
$$ packed form
8418d4137208p574351r995961o440221q227236j5295591j9383543j9089983j9529637
8410a49673731k2586995k3420263k1580980j9269650k3882474k7464381k1116438
8403c08994912j4718864o541583O196665J3645199J6416825K0284087K2898858
8396b50813725K3431272K6824697K5159188J9017846J3690539J3593399J9442614
8389a09654170J7068761N776125O527831J0845699Q326552M699576M576206O005468
8381d5827952J426816n48825J282288M747895N244415K760332K880438K999288
8373b5035305p07344l575308j738699k92399J016851J511455N742063L304226
8365a9774460j682509n258177o5107L001963J881034K247695j855539j785679
$$ plain form
8357 -23290779 -23027711 -23409705 -24957852 -23396636 -20263970 -17316754 -15153378 -14817184 -14597950
8348 -14597950 -12838125 -14342635 -15378872 -16691444 -17643886 -18620693 -18254278 -18043130 -17633323
8339 -17633323 -16463243 -14575740 -12047258 -11248242 -11400373 -12292816 -14887713 -16269911 -16559032
8330 -16559032 -19002641 -18734573 -14921428 -13557225 -14930096 -16633282 -12881222 -6894435
8322 -6894435 -1347009 -649059 14721 -2993839 -6470674 -5833518 -6823453 -6859845 -2701191
8313 -2701191 -1497658 -3860860 -2522206 -3884635 -6532359 -2474120 2388543 1399300
8305 1399300 -1782193 -2594434 -8074477 -8161916 -934591 4080634 3836109 2498856 -1007848
8296 -1007848 -4762475 -618163 5869295 11046462 11982465 10300350 9681643 14642273 17425495
$$ packed form
8357b3290779K63068l81994j548147J561216L132666K947216K163376L36194K19234
8348a4597950J759825j504510j036237j312572r52442r76807L66415K11148M09807
8339a7633323J170080J887503K528482P99016j52131q92443k594897j382198k89121
8330a6559032k443609K68068L813145J364203j372871j703186L752060N986787
8322f894435N547426O97950O63780l008560l476835O37156r89935l6392M158654
8313b701191J203533k363202J338654j362429k647724M058239M862663r89243
8305A399300l181493q12241n480043q7439P227325N015225k44525j337253l506704
8296a007848l754627M144312O487458N177167R36003j682115o18707M960630K783222
$$ plain form
8287 17425495 17220075 18325128 21782626 27830570 30125525 28904655 26228574 22227713
8279 22227713 20377572 20390530 16695158 8402084 705288 -789727 2212874 -1079231
8271 -1079231 -616234 1779324 -572955 -2870261 224670 4935220 4369472 -86424 -3698572
8262 -3698572 -5613466 -1086636 3343942 1698718 -2169160 -2464261 1364438 -135028
8254 -135028 -66361 3066548 2673839 703787 -2449663 -7665895 -9257062 -8141607 -9826312
8245 -9826312 -10602091 -9492794 -5974871 -1539791 2620759 6730925 15673589 20002330
8237 20002330 20607386 23972827 29031966 33316732 34720148 38403811 39292838 40842789
8229 40842789 46585279 53048125 55947370 56765510 57781565 54051460 46047829 38562535
$$ packed form
8287A7425495k05420J105053L457498O047944K294955j220870k676081m000861
8279B2227713j850141J2958l695372q293074p696796j495015L002601l292105
8271a079231M62997K395558k352279k297306L094931M710550n65748m455896l612148
8262c698572j914894M526830M430578j645224l867878k95101L828699j499466
8254a35028O8667L132909l92709j970052l153450n216232j591167J115455j684705
8245i826312p75779J109297L517923M435080M160550M110166Q942664M328741
8237B0002330O05056L365441N059139M284766J403416L683663Q89027J549951
8229D0842789N742490O462846K899245Q18140J016055l730105q003631p485294
$$ plain form
8221 38562535 33501253 30667439 29670291 27915490 22592241 18990699 15129544 15130117 13126355
8212 13126355 8095606 6665793 5339197 4344023 7889641 11031294 11858120 7807026
8204 7807026 4647934 7770290 10347343 10751560 6455412 1429216 -1548496 -2842384
8196 -2842384 -3944667 -4772295 -1789403 4955700 5547094 5602206 4234792 3984676 4011959
8187 4011959 4934578 7769817 7646327 8441704 8602167 6875878 6235169 8319878 15682649
8178 15682649 24431161 28669849 33570739 42892199 50105314 54953731 56920874 62071762
8170 62071762 71269504 76886110 77034067 71945971 62477541 55725327 57086007 54652005
8162 54652005 47496831 41702283 36992192 31542071 30373594 29605915 30194606 27630056
$$ packed form
8221C8562535n061282k833814r97148j754801n323249l601542l861155N73k003762
8212A3126355n030749j429813j326596r95174L545618L141653Q26826m051094
8204G807026l159092L122356K577053M04217m296148n026196k977712j293888
8196b842384j102283q27628K982892O745103N91394N5112j367414k50116K7283
8187D011959R22619K835239j23490P95377J60463j726289o40709K084709P362771
8178A5682649Q748512M238688M900890R321460P213115M848417J967143N150888
8170F2071762R197742N616606J47957n088096r468430o752214J360680k434002
8162E4652005p155174n794548m710091n450121j168477p67679N88691k564550
$$ plain form
8154 27630056 21143352 16014433 12835177 12728169 11493102 11037445 11720368 10726834 9117233
8145 9117233 6430721 9170622 15959950 17689646 18863552 21676860 21253367 18243315
8137 18243315 15202501 12711915 11920180 11699976 9153312 7114180 4785778 1530430
8129 1530430 71315 886661 2606742 5934002 9593624 12494269 16868450 20398918
8121 20398918 20588739 22721086 28353654 35594361 38333931 36898986 39883527 43389327
8113 43389327 45410710 46808149 45192279 41521981 41296736 44408156 46392971 41262403
8105 41262403 34385984 28899527 22573436 21764445 22865329 19572934 15743315 11455141
8097 11455141 6207352 4256196 7876685 10647372 10044086 11044445 9532071 7365870
$$ packed form
8154B7630056o486704n128919l179256j07008j235067m55657O82923r93534j609601
8145I117233k686512K739901O789328J729696J173906K813308m23493l010052
8137A8243315l040814k490586p91735k20204k546664k039132k328402l255348
8129A530430j459115Q15346J720081L327260L659622K900645M374181L530468
8121B0398918J89821K132347N632568P240707K739570j434945K984541L505800
8113D3389327K021383J397439j615870l670298k25245L111420J984815n130568
8105D1262403o876419n486457o326091q08991J100884l292395l829619m288174
8097A1455141n247789j951156L620489K770687o03286J000359j512374k166201
$$ plain form
8089 7365870 7727309 11554498 13583198 16903874 18631162 18202900 15552891 12890359 13426123
8080 13426123 13999882 8712373 6008811 7221711 9425407 9398648 3914134 -624378 973578
8071 973578 4948855 3276562 -212817 -531424 2161384 4686135 5796129 7681740 11198363
8062 11198363 15214741 18802905 20555710 17942198 21197020 26176395 26164409 26158871 29125238
8053 29125238 27730276 22272069 15933444 11262748 8567948 8549631 6527466 3092595
8045 3092595 2353133 237842 -1886796 -4340260 -8504886 -11235235 -7322581 -3937772
8037 -3937772 -5816516 -10117548 -17893600 -24829786 -28643879 -33003800 -38727390 -43116894
8029 -43116894 -47558687 -53328298 -60894282 -72548251 -88992790 -107783601 -123558527 -136828823
$$ packed form
8089G365870L61439L827189K028700L320676J727288m28262k650009k662532N35764
8080A3426123N73759n287509k703562J212900K203696k6759n484514m538512J597956
8071I73578L975277j672293l489379l18607K692808K524751J109994J885611L516623
8062A1198363M016378L588164J752805k613512L254822M979375j1986n538K966367
8053B9125238j394962n458207o338625m670696k694800j8317k022165l434871
8045C092595p39462k115291k124638k453464m164626k730349L912654L384809
8037c937772j878744m301032p776052o936186l814093m359921n723590m389504
8029d3116894m441793n769611p565984j1653969j6444539j8790811j5774926j3270296
$$ plain form
8021 -136828823 -149575780 -158611103 -167790790 -175236169 -178832113 -175597622 -167851507 -158788890
8013 -158788890 -148137124 -132034231 -113467782 -97404668 -89087837 -80816193 -68508087
8006 -68508087 -55836790 -46402992 -42003374 -38638904 -37461692 -37458380 -36211500 -37648553
7998 -37648553 -39231194 -40322071 -37546162 -32195969 -33062878 -37142717 -36220074 -36059433 -36112951
7989 -36112951 -37558875 -34952986 -28427372 -27703780 -33772047 -42502468 -47699361 -44181854
7981 -44181854 -37598678 -32845023 -26886328 -21371418 -21269041 -21352122 -19574374 -20798889 -22332846
7972 -22332846 -21097202 -17922769 -14896185 -13038784 -7779941 -2655788 -3465974 -2572907
7964 -2572907 331329 1905613 5793452 11687108 12582145 7284186 6116910 3967804
$$ packed form
8021a36828823j2746957r035323r179687p445379l595944L234491P746115R062617
8013a58788890J0651766J6102893J8566449J6063114Q316831Q271644J2308106
8006f8508087J2671297R433798M399618L364470J177212L312J246880j437053
7998c7648553j582641j090877K775909N350193q66909m079839R22643J60641n3518
7989c6112951j445924K605889O525614P23592o068267q730421n196893L517507
7981d4181854O583176M753655N958695N514910J02377q3081J777748j224515j533957
7972b2332846J235644L174433L026584J857401N258843N124153q10186Q93067
7964b572907K904236J574284L887839N893656Q95037n297959j167276k149106
$$ plain form
7956 3967804 -886991 -873880 1071098 -317784 -1727277 -1277666 142145 2350519 5404338
7947 5404338 4533637 -1249020 -8165890 -10447745 -6746742 -1644891 -2592824 -9814727 -14869529
7938 -14869529 -18171156 -18076365 -16917809 -15528919 -10501496 -4207313 -2073647 -2395414 -3974719
7929 -3974719 -3065679 310119 4180481 4944628 1694592 882673 -931226 -1081654 692795
7920 692795 2944096 4407792 2394506 -221700 -788922 -1174609 -4677676 -5423006 -1419597
7911 -1419597 -1760209 -6156763 -9638111 -13216955 -11832078 -5700833 -1903923 -2855595 419484
7902 419484 4704441 2741883 -645161 -849973 -2453942 -6224931 -8257947 -9985637 -9941798
7893 -9941798 -8844005 -6511498 -1478663 4155691 2587993 -1154392 -3118998 -4373522
$$ packed form
7956C967804m854795J3111J944978j388882j409493M49611J419811K208374L053819
7947E404338q70701n782657o916870k281855L701003N101851r47933p221903n054802
7938a4869529l301627R4791J158556J388890N027423O294183K133666l21767j579305
7929c974719R09040L375798L870362P64147l250036q11919j813899j50428J774449
7920F92795K251301J463696k013286k616206n67222l85687l503067p45330M003409
7911a419597l40612m396554l481348l578844J384877O131245L796910r51672L275079
7902D19484M284957j962558l387044k04812j603969l770989k033016j727690M3839
7893i941798J097793K332507N032835N634354j567698l742385j964606j254524
$$ plain form
7885 -4373522 -925876 58003 -4736632 -5439562 -3214139 -4544287 -10182918 -12608751 -10542566
7876 -10542566 -10643944 -11607111 -13116285 -15476403 -17276321 -15593319 -11860430 -8339323
7868 -8339323 -5202918 -6879538 -7172636 -2413970 2220274 1387193 -2313874 -5224803 -3227618
7859 -3227618 -4075179 -7821056 -11543429 -10025894 -11135030 -12651647 -9069763 -5458967
7851 -5458967 -4753849 -4094525 762839 3744813 715554 -950927 -1152237 764880 2364086
7842 2364086 5955960 10636208 11880288 6180660 -2054095 -1033769 7486828 12897950
7834 12897950 14182877 11783392 4017062 788399 3235805 5588784 4621864 3884743
7826 3884743 2663368 -306029 756224 3906455 5628289 2830286 -2656846 -4216317
$$ packed form
7885d373522L447646R83879m794635p02930K225423j330148n638631k425833K066185
7876a0542566j01378r63167j509174k360118j799918J683002L732889L521107
7868h339323L136405j676620k93098M758666M634244q33081l701067k910929J997185
7859c227618q47561l745877l722373J517535j109136j516617L581884L610796
7851e458967P05118O59324M857364K981974l029259j666481k01310J917117J599206
7842B364086L591874M680248J244080n699628q234755J020326Q520597N411122
7834A2897950J284927k399485p766330l228663K447406K352979r66920p37121
7826C884743j221375k969397J062253L150231J721834k798003n487132j559471
$$ plain form
7818 -4216317 341549 3875472 1969445 -1875612 -6682835 -10424011 -11957073 -7451203
7810 -7451203 -3697847 -351293 -420855 -3225910 -3150232 -1845262 -2707627 -2128670 469476
7801 469476 2850961 3745190 354527 -2694546 -4708332 -4069428 -2261353 844243 213864
7792 213864 -4293951 -4914519 -1897945 238005 3767234 5731327 1456357 -579932 -2588562
7783 -2588562 -5782815 -6515141 -3912722 -1619385 -50411 2254744 95651 -3931391
7775 -3931391 -3916843 -1014249 83143 1063825 5065851 7223807 5028503 1575356 -6538923
7766 -6538923 -11894299 -10740942 -7761610 -5270227 -1564708 266391 -2835367 -6399636
7758 -6399636 -9470635 -10799512 -9570090 -6549803 -6779940 -6385762 -578974 -137035 -2487292
$$ packed form
7818d216317M557866L533923j906027l845057m807223l741176j533062M505870
7810g451203L753356L346554o9562k805055P5678J304970q62365N78957K598146
7801D69476K381485Q94229l390663l049073k013786O38904J808075L105596o30379
7792B13864m507815o20568L016574K135950L529229J964093m274970k036289k008630
7783b588562l194253p32326K602419K293337J568974K305155k159093m027042
7775c931391J4548K902594J097392R80682M002026K157956k195304l453147q114279
7766f538923n355376J153357K979332K491383L705519J831099l101758l564269
7758f399636l070999j328877J229422L020287k30137L94178N806788M41939k350257
$$ plain form
7749 -2487292 -4617948 -7624571 -10949604 -12433684 -7256112 -4004100 -4969940 -7635565
7741 -7635565 -8411199 -6082743 123228 4015073 2404268 791013 -398250 -2950497
7733 -2950497 -5302609 -1367464 5176349 6516132 2884027 -717417 -1696483 -2049621 -750773
7724 -750773 2409646 5455791 2940366 982770 -4893066 -9532752 -10762440 -11644416 -10152320
7715 -10152320 -8877645 -8816344 -10553079 -12906377 -10687338 -6550105 -4305019 -5605545
7707 -5605545 -8538817 -11169219 -7721455 1079256 4221582 1289980 -4372931 -8287970
7699 -8287970 -7210831 -4141498 -4691498 -3291618 -1240640 -1513445 119117 107668 -5374416
7690 -5374416 -2864251 5639572 8782899 6787372 2227899 -2982371 -4360603 -754549
$$ packed form
7749b487292k130656l006623l325033j484080N177572L252012r65840k665625
7741g635565p75634K328456O205971L891845j610805j613255j189263k552247
7733b950497k352112L935145O543813J339783l632105l601444r79066l53138J298848
7724g50773L160419L046145k515425j957596n875836m639686j229688q81976J492096
7715a0152320J274675O1301j736735k353298K219039M137233K245086j300526
7707e605545k933272k630402L447764Q800711L142326k931602n662911l915039
7699h287970J077139L069333n50000J399880K050978k72805J632562j1449n482084
7690e374416K510165Q503823L143327j995527m559473n210270j378232L606054
$$ plain form
7682 -754549 2659143 1672045 144273 399505 3237519 8329223 6714771 468204 -3156569
7673 -3156569 -4699199 -3233237 -2326049 -1926531 328182 -622816 -1351821 -4001941 -5671160
7664 -5671160 -5073493 -8563778 -14057462 -16655660 -12804051 -8396861 -7299408 -8291230 -7735306
7655 -7735306 -9212596 -12130474 -5712489 628564 -1638688 -6434295 -6601756 -3233773
7647 -3233773 -1106749 -596120 -1152107 -2729921 -4593548 -6076141 -4964742 -4518134 -7157540
7638 -7157540 -7519456 -5379972 -7961889 -12051000 -13470743 -17193644 -17299359 -19327719 -24015035
7629 -24015035 -27705099 -32076548 -42301720 -51928280 -61310040 -74612872 -92071869 -112072628
7621 -112072628 -129294074 -138312833 -148289082 -159376972 -164054783 -163855030 -159386872 -149299545
$$ packed form
7682g54549L413692r87098j527772K55232K838014N091704j614452o246567l624773
7673c156569j542630J465962R07188L99518K254713r50998p29005k650120j669219
7664e671160N97667l490285n493684k598198L851609M407190J097453r91822N55924
7655g735306j477290k917878O417985O341053k267252m795607j67461L367983
7647c233773K127024N10629n55987j577814j863627j482593J111399M46608k639406
7638g157540l61916K139484k581917m089111j419743l722901j05715k028360m687316
7629b4015035l690064m371449j0225172r626560r381760j3302832j7458997k0000759
7621a12072628j7221446r018759r976249j1087890m677811J99753M468158J0087327
$$ plain form
7613 -149299545 -133598986 -121009945 -108037422 -95026199 -83385620 -70386451 -60612946
7606 -60612946 -54276152 -50274485 -46785855 -45152036 -43874526 -42825928 -42491507 -39465156
7598 -39465156 -37627026 -36033540 -28898281 -20094040 -16476938 -15971175 -16807210 -17602568 -17763211
7589 -17763211 -17777120 -18174594 -13060166 -7896926 -4981921 -4049441 -5194808 -5479639 -4346344
7580 -4346344 -8830632 -14097534 -14155667 -12910281 -15859542 -19808192 -20047588 -17071984 -13075363
7571 -13075363 -12186184 -13349325 -10990458 -6861452 -4828156 -5983561 -7188383 -4155670
7563 -4155670 -853596 -4822241 -6847121 -6447210 -8058884 -11899926 -10123552 -6082210
7555 -6082210 -4651272 -4667760 -5531265 -8188099 -12628335 -14301389 -8468367 -4444041 -2609943
$$ packed form
7613a49299545J5700559J2589041J2972523J3011223J1640579J2999169R773505
7606f0612946O336794M001667L488630J633819J277510J048598L34421L026351
7598c9465156J838130J593486P135259Q804241L617102N05763q36035p95358j60643
7589a7763211j3909l97474N114428N163240K915005R32480j145367k84831J133295
7580d346344m484288n266902n8133J245386k949261l948650k39396K975604L996621
7571a3075363Q89179j163141K358867M129006K033296j155405j204822L032713
7563d155670L302074l968645k024880L99911j611674l841042J776374M041342
7555f082210J430938j6488q63505k656834m440236j673054N833022M024326J834098
$$ plain form
7546 -2609943 -377792 -1850882 -4802583 -8964552 -13513197 -18570188 -16780224 -11588426
7538 -11588426 -7024184 -975727 -502151 124348 6537957 13310515 16288891 14877296
7530 14877296 9022222 4701962 2116924 636706 -3057500 -218987 6020299 6480399
7522 6480399 10677161 14226603 10046951 2382911 -1139534 -1201350 -1384216 -2003966 2725
7513 2725 2400310 4237314 2363413 -471219 -2510036 -5904956 -6686121 -5005928 -3935696
7504 -3935696 -2819220 1019985 4402382 2653210 -3634546 -7929946 -8917735 -7748929
7496 -7748929 -4607010 -2948593 -3003472 -3783602 -3045481 634771 3552767 3239905 -232983
7487 -232983 -456828 2317472 2761803 4826286 8587953 10795159 9085362 8374726 8644441
$$ packed form
7546b609943K232151j473090k951701m161969m548645n056991J789964N191798
7538a1588426M564242O048457M73576O26499O413609O772558K978376j411595
7530A4877296n855074m320260k585038j480218l694206K838513O239286M60100
7522F480399M196762L549442m179652p664040l522445o1816j82866o19750K006691
7513B725K397585J837004j873901k834632k038817l394920p81165J680193J070232
7504c935696J116476L839205L382397j749172o287756m295400r87789J168806
7496g748929L141919J658417n4879p80130P38121L680252K917996l12862l472888
7487b32983k23845K774300M44331K064483L761667K207206j709797p10636K69715
$$ plain form
7478 8644441 4701622 2604857 4054115 2456490 4514305 7267342 5444849 7023973
7470 7023973 6638674 1390755 -1089861 1855892 3901661 5831656 8020394 12510913
7462 12510913 11273328 7005505 5592337 2787150 3657815 4548704 2792161 591736
7454 591736 471620 106573 387456 2205060 5113035 6469624 1570218 -5451188 -5718929
7445 -5718929 -1081725 1515769 1762707 550876 -673800 -1561826 -367066 2920683 1048183
7436 1048183 -1937284 88015 3903786 3198158 2637322 3036725 2420753 2702563 3455697
7427 3455697 2534193 -1808278 -1617331 470869 3605905 5542325 4529898 6700109 9312036
7418 9312036 8837015 6133571 4090377 4435077 706772 -3285896 -4865883 -5653919 -6993467
$$ packed form
7478H644441l942819k096765J449258j597625K057815K753037j822493J579124
7470G023973l85299n247919k480616K945753K045769J929995K188738M490519
7462A2510913j237585m267823j413168k805187Q70665Q90889j756543k200425
7454E91736j20116l65047K80883J817604K907975J356589m899406p021406k67741
7445e718929M637204K597494K46938j211831j224676q88026J194760L287749j872500
7436A048183k985467K025299L815771p05628n60836L99403o15972K81810P53134
7427C455697r21504m342471J90947K088200L135036J936420j012427K170211K611927
7418I312036m75021k703444k043194L44700l728305l992668j579987p88036j339548
$$ plain form
7409 -6993467 -7384094 -6015084 -2762652 -1193178 -6972801 -14865719 -15595118 -10644326 -8199319
7400 -8199319 -7861422 -4280435 -1509036 -2791255 -5525881 -7805224 -7967405 -3279806 -6251067
7391 -6251067 -12588054 -16182535 -20202102 -21573655 -18279361 -15262619 -11567740 -3076305
7383 -3076305 -269363 1343416 3293004 2501997 911736 -112195 1745694 4336300
7375 4336300 4409890 4649677 6098955 4166102 483260 -389459 -1295244 2147908 6362595
7366 6362595 6436162 2577134 -2858003 -5306365 -5761191 -3610510 1467585 1982403 -57599
7357 -57599 -889017 -43572 -2480510 -671978 930971 669961 1361070 2054185 282677
7348 282677 -3231623 -3235550 -4894082 -6042970 -5522831 1208269 6323254 6816023 5207910
$$ packed form
7409f993467l90627J369010L252432J569474n779623p892918p29399M950792K445007
7400h199319L37897L580987K771399j282219k734626k279343j62181M687599k971261
7391f251067o336987l594481m019567j371553L294294L016742L694879Q491435
7383c076305K806942J612779J949588p91007j590261j023931J857889K590606
7375D336300P3590K39787J449278j932853l682842q72719r05785L443152M214687
7366F362595P3567l859028n435137k448362m54826K150681N078095N14818k040002
7357e7599q31418Q45445k436938J808532J602949k61010O91109O93115j771508
7348B82677l514300l927j658532j148888N20139O731100N114985M92769j608113
$$ plain form
7339 5207910 4742205 3450765 2645961 5143708 1834255 -5295680 -5806468 -4748433 -3130417
7330 -3130417 -363650 1592799 1448078 4341747 4502746 9648971 10103431 5957535 2441135
7321 2441135 258035 -1033937 -1325744 2116705 6135404 7575197 6745262 5848370 7552531
7312 7552531 5483647 3776926 7050753 11007383 7460724 2715373 1097871 2651605
7304 2651605 1398585 1245178 3099603 2736333 593036 2313237 4608634 360993 -3433649
7295 -3433649 -3665457 -5092862 -3299327 -3213768 -3599399 -4455213 -1925426 1737346 1037296
7286 1037296 -2654136 -4924081 -3140798 1152522 3630222 1272764 -2605754 -3759379
7278 -3759379 -6316259 -4873164 -509607 513431 -5969558 -9494419 -7690666 -6331823
$$ packed form
7339E207910m65705j291440q04804K497747l309453p129935n10788J058035J618016
7330c130417K766767J956449j44721K893669J60999N146225M54460m145896l516400
7321B441135k183100j291972k91807L442449M018699J439793q29935q96892J704161
7312G552531k068884j706721L273827L956630l546659m745351j617502J553734
7304B651605j253020j53407J854425l63270k143297J720201K295397m247641l794642
7295c433649k31808j427405J793535Q5559l85631q55814K529787L662772p00050
7286A037296l691432k269945J783283M293320K477700k357458l878518j153625
7278c759379k556880J443095M363557J023038o482989l524861J803753J358843
$$ plain form
7270 -6331823 -3850221 -1559644 -2195534 -3573313 -629261 -551414 -1592489 2178137 2801719
7261 2801719 2318561 2809748 3796842 4082922 3495380 2814813 -292247 -3382622 -720232
7252 -720232 2658234 7981749 7017885 5627392 4841102 2592927 1633125 4745974 6221343
7243 6221343 3846465 1614909 -545299 1339704 2188287 3837348 7914165 11827083
7235 11827083 11937214 7009532 479370 -2573689 510415 2386627 -1604999 -8139708
7227 -8139708 -11381472 -8897312 -2394952 2005183 1853117 1461814 1486125 4895516 10510831
7218 10510831 15655424 16978275 13570162 10271202 7125358 1983043 -3166213 -4166935
7210 -4166935 587668 2381089 -3663860 -6557030 -2080424 678195 -4969119 -9193994
$$ packed form
7270f331823K481602K290577o35890j377779K944052P7847j041075L770626O23582
7261B801719m83158M91187R87094K86080n87542o80567l107060l090375K662390
7252g20232L378466N323515r63864j390493p86290k248175r59802L112849J475369
7243F221343k374878k231556k160208J885003Q48583J649061M076817L912918
7235A1827083J10131m927682o530162l053059L084104J876212l991626o534709
7227h139708l241764K484160O502360M400135j52066l91303K4311L409391N615315
7218A0510831N144593J322851l408113l298960l145844n142315n149256j000722
7210d166935M754603J793421o044949k893170M476606K758619n647314m224875
$$ plain form
7202 -9193994 -8354518 -4576262 2682736 3116755 1155967 3070149 2583347 789599 730467
7193 730467 2679650 3976499 2784635 -996209 -4897104 -4494389 -4459441 -3023522 804479
7184 804479 4375201 6364715 7893109 4268414 317547 -4034347 -4168636 -1565420 2573114
7175 2573114 4567396 3609104 6534271 9621806 8789560 8113589 4656562 3272520 4822363
7166 4822363 4771175 1504936 -793966 -1259947 -4103608 -7193302 -7074590 -4284223 -1220433
7157 -1220433 -3828571 -5521479 -3120537 1878840 3647269 4528643 5254366 7130125 7840394
7148 7840394 8240333 5395148 3163724 3780880 6091573 6940043 8234949 10295532 9954334
7139 9954334 3982411 -2670616 -4878276 -3128736 -1684008 -728671 -4864362 -7348674
$$ packed form
7202i193994Q39476L778256P258998M34019j960788J914182m86802j793748n9132
7193G30467J949183J296849j191864l780844l900895M02715L4948J435919L828001
7184H04479L570722J989514J528394l624695l950867m351894j34289K603216M138534
7175B573114J994282r58292K925167L087535q32246o75971l457027j384042J549843
7166D822363n1188l266239k298902m65981k843661l089694J18712K790367L063790
7157a220433k608138j692908K400942M999377J768429Q81374P25723J875759P10269
7148G840394L99939k845185k231424O17156K310693Q48470J294906K060583l41198
7139I954334n971923o653027k207660J749540J444728R55337m135691k484312
$$ plain form
7131 -7348674 -7943031 -9638499 -10243623 -7618614 -5237392 -5039110 -2473130 814724 -356958
7122 -356958 -2767596 -2391346 -1687707 -6335345 -7812350 -1565461 2828152 1694501 -4673365
7113 -4673365 -7398573 -4956185 -5105799 -6725937 -8875659 -11246663 -11506751 -9749783 -4847163
7104 -4847163 -2594214 -3353739 -7182857 -9544270 -6841657 -1681219 3795689 8115402
7096 8115402 9475681 10711748 9741975 9320779 10443737 11271269 10747900 4779766 -63405
7087 -63405 -183301 1970361 3887905 3226117 1444287 862632 -223697 -1090120 76600
7078 76600 4476620 6732061 9401257 8608946 10326476 11500362 7947197 5924507 6508747
7069 6508747 6609364 4095523 323739 -2382536 2011829 7480843 7675996 4704718 875986
$$ packed form
7131g348674n94357j695468o05124K625009K381222J98282K565980L287854j171682
7122c56958k410638L76250P03639m647638j477005O246889M393613j133651o367866
7113d673365k725208K442388j49614j620138k149722k371004k60088J756968M902620
7104d847163K252949p59525l829118k361413K702613N160438N476908M319713
7096H115402J360279J236067r69773m21196J122958Q27532n23369n968134m843171
7087f3405j19896K153662J917544o61788j781830n81655j086329q66423J166720
7078G6600M400020K255441K669196p92311J717530J173886l553165k022690N84240
7069F508747J00617k513841l771784k706275M394365N469014J95153k971278l828732
$$ plain form
7060 875986 -2417115 -2751517 -294861 -2146643 -1787288 1273037 1815737 1263477 965252
7051 965252 683276 1066266 4283006 10402452 13105042 9776970 7279120 9124085 12227927
7042 12227927 13928509 16642066 18927739 13273345 8203326 2582784 -578164 -1705109
7034 -1705109 -1327377 -1957870 -3393669 1269116 8125675 8625064 6310911 5731908 6907251
7025 6907251 8761430 8698956 7773598 8550974 7747830 7473415 7255914 6916224 9586894
7016 9586894 8190507 6900802 8379565 9449709 8705417 4820995 1459388 507262 531293
7007 531293 -1911945 -2801509 1452746 4508010 3688230 2985265 6460388 8496227 8646098
6998 8646098 7853968 3936166 2559976 5398498 6415789 3341633 383453 -1976340
$$ packed form
7060H75986l293101l34402K456656j851782L59355L060325N42700n52260k98225
7051I65252k81976L82990L216740O119446K702590l328072k497850J844965L103842
7042A2227927J700582K713557K285673n654394n070019n620542l160948j126945
7034a705109L77732o30493j435799M662785O856559M99389k314153n79003J175343
7025F907251J854179o2474r25358P77376q03144k74415k17501l39690K670670
7016I586894j396387j289705J478763J070144p44292l884422l361607r52126K4031
7007E31293k443238q89564M254255L055264q19780p02965L475123K035839J49871
6998H646098p92130l917802j376190K838522J017291l074156k958180k359793
$$ plain form
6990 -1976340 -2605387 2329868 1738487 -737374 2653660 1968107 -2456136 -590643 735735
6981 735735 -4532878 -10586235 -13895442 -9689264 -6353890 -3224115 2944405 8758909
6973 8758909 8322793 3510382 1793232 221019 -1274603 -1848815 -818549 -45310 634169
6964 634169 -23480 -1206194 -2689822 -1703433 2212745 2399654 700016 -2901649 -6156143
6955 -6156143 -8363927 -7545717 -6105792 -2652429 7043177 11339188 8799986 7125930
6947 7125930 7603458 7046977 4605371 -673408 -2380611 -2119967 -2764285 -1482446 949303
6938 949303 1237414 -497134 -3819412 -4583969 -2391902 -2203437 -3091823 1442902 8506136
6929 8506136 10092758 6067250 7422462 14700433 14954098 10034280 5641501 2377802
$$ packed form
6990a976340o29047M935255n91381k475861L391034o85553m424243J865493J326378
6981G35735n268613o053357l309207M206178L335374L129775O168520N814504
6973H758909m36116m812411j717150j572213j495622n74212J030266P73239O79479
6964F34169o57649j182714j483628R86389L916178J86909j699638l601665l254494
6955f156143k207784Q18210J439925L453363R695606M296011k539202j674056
6947G125930M77528n56481k441606n278779j707203K60644o44318J281839K431749
6938I49303K88111j734548l322278p64557K192067J88465q88386M534725P063234
6929H506136J586622m025508J355212P277971K53665m919818m392779l263699
$$ plain form
6921 2377802 906479 1585681 4604822 6025001 5264569 2956786 4225193 10274482 11426509
6912 11426509 11727082 12393822 11380766 8255068 8338834 9960229 8604993 3834827 90234
6903 90234 -3076541 -2395437 2544108 4726467 2419749 286211 4768692 7234413 9839466
6894 9839466 11880149 5685519 -3300154 -5030132 -3528116 511391 3240395 4207373
6886 4207373 441055 -4397618 -7439732 -8334044 -5144566 614069 6487529 8405313
6878 8405313 8568236 5141275 -1074632 -5047815 -6831032 -5886518 -4314988 -301509 6398276
6869 6398276 11775861 12912149 11149881 8000349 1390813 -791953 2207799 4507847
6861 4507847 4391109 4315552 4773748 6576006 8615335 9260170 10584598 14122191 17128282
$$ packed form
6921B377802j471323O79202L019141J420179p60432k307783J268407O049289J152027
6912A1426509L00573O66740j013056l125698Q3766J621395j355236m770166l744593
6903I0234l166775O81104M939545K182359k306718k133538M482481K465721K605053
6894I839466K040683o194630q985673j729978J502016M039507K729004R66978
6886D207373l766318m838673l042114q94312L189478N758635N873460J917784
6878H405313J62923l426961o215907l973183j783217R44514J571530M013479O699785
6869F398276N377585J136288j762268l149532o609536k182766K999752K300048
6861D507847j16738p5557M58196J802258K039329O44835J324428L537593L006091
$$ plain form
6852 17128282 18345844 19588422 20043861 15020829 12087499 13229196 11305695 7227908
6844 7227908 6498450 460088 -5482759 -3140558 -3292081 -1881659 3074447 5732865 1888191
6835 1888191 -3009489 -5782637 -128673 5321776 9883357 13214516 14935364 13419464
6827 13419464 9788130 7204399 6432419 7289397 7696907 6741034 8782226 11693214 13314955
6818 13314955 13092889 16217718 19452905 19952705 18242644 20451770 25164470 25963601 19760620
6809 19760620 17739202 21910251 23557905 20142173 21474809 26350588 30378957 32877441
6801 32877441 36460856 37620629 38786242 43423459 47896471 51639731 56713683 63790874
6793 63790874 72563065 79515868 87035871 97455739 114632021 138310004 160051514 184356218
$$ packed form
6852A7128282J217562J242578M55439n023032k933330J141697j923501m077787
6844G227908p29458o038362n942847K342201j51523J410422M956106K658418l844674
6835A888191m897680k773148N653964N450449M561581L331159J720848j515900
6827A3419464l631334k583731p71980Q56978M07510r55873K041192K910988J621741
6818A3314955k22066L124829L235187M99800j710061K209126M712700P99131o202981
6809A9760620k021418M171049J647654l415732J332636M875779M028369K498484
6801C2877441L583415J159773J165613M637217M473012L743260N073952P077191
6793F3790874Q772191O952803P520003J0419868J7176282K3677983K1741510K4304704
$$ plain form
6785 184356218 216083740 257029838 305275861 356376044 407886735 452008431 475820652
6778 475820652 471587493 443235252 398844668 353689666 308513106 266901411 234190260
6771 234190260 208978153 189681912 173030014 161999611 152262506 145650385 136890481
6764 136890481 123008730 110308086 100590095 87629238 78371169 74989431 69769327 61733499
6756 61733499 56570473 51110096 41807162 35519034 31369707 29719805 26554885 23516963
6748 23516963 23807285 27657671 28471097 24811830 22235690 22885276 19149565 16850531 18440427
6739 18440427 17060787 13042568 11493443 15770191 20135161 19086643 15672515 16043239
6731 16043239 16713033 16594531 13749933 9226842 5969886 5718257 12305419 17121935 19262862
$$ packed form
6785A84356218L1727522M0946098M8246023N1100183N1510691M4121696K3812221
6778D75820652m233159k8352241m4390584m5155002m5176560m1611695l2711151
6771B34190260k5212107j9296241j6651898j1030403r737105o612121q759904
6764A36890481j3881751j2700644r717991j2960857r258069l381738n220104q035828
6756F1733499n163026n460377r302934o288128m149327j649902l164920l037922
6748B3516963K90322L850386Q13426l659267k576140O49586l735711k299034J589896
6739A8440427j379640m018219j549125M276748M364970j048518l414128L70724
6731A6043239O69794j18502k844598m523091l256956k51629O587162M816516K140927
$$ plain form
6722 19262862 19532524 16842799 15063272 13586193 12386940 14877337 13175827 11539721
6714 11539721 14136572 17741063 22323445 27145510 31148003 36528887 44661352 52736202
6706 52736202 60742272 73210306 91569175 109479502 127443457 145151448 161259636
6699 161259636 173392540 180553957 181151128 169721274 153899185 137463985 120668606
6692 120668606 106385388 91680042 81726386 73203768 64281747 55896097 50208007 43753045
6684 43753045 39021143 35507193 35822036 34085115 26977101 25198609 28358025 26834249
6676 26834249 24335855 24028813 20815706 13957723 8245093 7275685 7635688 6018970 7334039
6667 7334039 11847518 12032344 8255571 6807229 7565383 9259167 9014702 5098352 1327475
$$ packed form
6722A9262862K69662k689725j779527j477079j199253K490397j701510j636106
6714A1539721K596851L604491M582382M822065M002493N380884Q132465Q074850
6706E2736202Q006070J2468034J8358869J7910327J7963955J7707991J6108188
6699A61259636J2132904P161417N97171j1429854j5822089j6435200j6795379
6692A20668606j4283218j4705346r953656q522618q922021q385650n688090o454962
6684D3753045m731902l513950L14843j736921p108014j778492L159416j523776
6676B6834249k498394l07042l213107o857983n712630r69408L60003j616718J315069
6667G334039M513479J84826l776773j448342P58154J693784k44465l916350l770877
$$ plain form
6658 1327475 437607 -1922465 -1259819 2289399 2472735 3957429 4486075 756380 -2970008
6649 -2970008 -358516 2128651 4227283 5843934 8761628 11022228 15634172 18236452
6641 18236452 17308634 14858676 13068996 10687881 8670227 8748422 8925422 11183962 7590683
6632 7590683 848201 -3030646 1024489 5437746 6170922 4496329 6483427 10671969
6624 10671969 9253510 4826425 4083531 1825520 -2123602 -4384227 -2894896 -911689
6616 -911689 4532231 6760247 5542898 981883 -3136145 -9929725 -12748858 -8148932
6608 -8148932 -2248176 -2860840 -2930716 618308 811100 -2181967 -5770935 -7904806 -5344479
6599 -5344479 -4893785 -5353292 -1614684 933539 -442281 -543324 -3245133 -7804112 -9577631
$$ packed form
6658A327475q89868k360072O62646L549218J83336J484694N28646l729695l726388
6649b970008K611492K487167K098632J616651K917694K260600M611944K602280
6641A8236452r27818k449958j789680k381115k017654P8195J77000K258540l593279
6632G590683o742482l878847M055135M413257P33176j674593J987098M188542
6624A0671969j418459m427085p42894k258011l949122k260625J489331J983207
6616i11689N443920K228016j217349m561015m118028o793580k819133M599926
6608h148932N900756o12664o9876L549024J92792k993067l588968k133871K560327
6599e344479M50694m59507L738608K548223j375820j01043k701809m558979j773519
$$ plain form
6590 -9577631 -8108200 -2999973 -1230287 -2740731 -1928659 1667959 1382949 -2591073 -4396706
6581 -4396706 -2461087 -2904646 -4094945 3155219 11010117 14080612 10965487 3895135
6573 3895135 740507 2189710 1210230 -2218392 -7713107 -8426223 -6227143 -1847556 6594586
6564 6594586 10908627 10104210 6126935 6028082 7501536 9479244 9356325 7345391 6829151
6555 6829151 6548113 1066458 -6560953 -10670765 -11776605 -6473684 -1480846 -606076 -524156
6546 -524156 -5350967 -8229722 -6898116 -5016487 -1956152 -1792157 -2922887 1449564 8727554
6537 8727554 12935848 13360228 12654021 10202303 9507566 9638152 7315977 2284798 -1386060
6528 -1386060 698541 4793199 9486292 14256054 11466070 4922984 3225431 3246756 3329889
$$ packed form
6590i577631J469431N108227J769686j510444Q12072L596618k85010l974022j805633
6581d396706J935619m43559j190299P250164P854898L070495l115125p070352
6573C895135l154628J449203r79480l428622n494715p13116K199080M379587Q442142
6564F594586M314041q04417l977275r8853J473454J977708j22919k010934n16240
6555F829151k81038n481655p627411m109812j105840N302921M992838Q74770Q1920
6546e24156m826811k878755J331606J881629L060335J63995j130730M372451P277990
6537H727554M208294M24380p06207k451718o94737J30586k322175n031179l670858
6528a386060K084601M094658M693093M769762k789984o543086j697553K1325Q3133
$$ plain form
6519 3329889 1533174 562322 1441549 3242326 4107615 1597402 -3257036 -3660726 -3021209
6510 -3021209 -559502 -83032 -258217 2274090 2501983 4133288 6476055 4898860 1265587
6501 1265587 862946 3373626 4705001 5231633 7580509 10551837 7850202 1711344 -932817
6492 -932817 -137662 2163304 2846609 5827431 8089496 7429188 2633934 1363120 253371
6483 253371 -3017049 -1375364 1152623 166426 -4831543 -10649921 -12416135 -9637154 -4251714
6474 -4251714 -640693 -522324 -5744054 -8933998 -7646539 -2955055 2144451 5328340
6466 5328340 5477332 3390429 -1225426 -4852423 -4717008 -2531233 994426 2483790 -948182
6457 -948182 -4090443 -4976247 -5195481 -4737951 -2574472 -698618 475819 1496037 3234205
$$ packed form
6519C329889j796715r70852Q79227J800777Q65289k510213m854438m03690O39517
6510c021209K461707M76470j75185K532307K27893J631305K342767j577195l633273
6501A265587m02641K510680J331375N26632K348876K971328k701635o138858k644161
6492i32817P95155K300966O83305K980822K262065o60308m795254j270814j109749
6483B53371l270420J641685K527987r86197m997969n818378j766214K778981N385440
6474d251714L611021J18369n221730l189944J287459M691484N099506L183889
6466E328340J48992k086903m615855l626997J35415K185775L525659J489364l431972
6457i48182l142261q85804k19234M57530K163479J875854J174437J020218J738168
$$ plain form
6448 3234205 3671572 1712619 -3558259 -9019929 -13468145 -17191973 -15645059 -13264109
6440 -13264109 -11044342 -9354481 -7758182 -3406952 -1858091 -3611326 -4067643 -3354468
6432 -3354468 -1067083 -2655142 -2510979 407845 6937843 11606960 8287583 5954755
6424 5954755 6218913 4548641 5608265 3405311 -342216 1257702 2510437 4245254
6416 4245254 8529126 8857826 2217913 -3018052 -5926171 -3878721 719992 437520 -4000261
6407 -4000261 -8758878 -6560109 185800 5296449 7804451 7855129 5615454 6027906 4640127
6398 4640127 731059 -3460719 -5214992 -7557998 -10037330 -11948337 -13291329 -14451163
6390 -14451163 -9934197 -5287317 -2531523 -1303823 -1606918 3159269 5569109 5634324 8280191
$$ packed form
6448C234205M37367j958953n270878n461670m448216l723828J546914K380950
6440a3264109K219767J689861J596299M351230J548861j753235m56317P13175
6432c354468K287385j588059J44163K918824O529998M669117l319377k332828
6424E954755K64158j670272J059624k202954l747527J599918J252735J734817
6416D245254M283872L28700o639913n235965k908119K047450M598713k82472m437781
6407d000261m758617K198769O745909N110649K508002N0678k239675M12452j387779
6398D640127l909068m191778j754273k343006k479332j911007j342992j159834
6390a4451163M516966M646880K755794J227700l03095M766187K409840O5215K645867
$$ plain form
6381 8280191 12786398 10846596 7690258 3546761 -1099274 -6442817 -8637613 -5466190
6373 -5466190 -2374541 -4425318 -10075498 -11749417 -8751899 -8157476 -5269985 -685537
6365 -685537 -485970 2721335 4662270 3050082 -2422622 -6483950 -3415954 -31738 348785
6356 348785 -146246 -2859034 -4375864 -6845692 -7754180 -4350688 -3181192 -5773145 -9041212
6347 -9041212 -7394624 -6794240 -9082582 -12248675 -13529614 -8991234 -7205319 -8572347
6339 -8572347 -7156266 -6392217 -6063712 -6474171 -4961115 -3671602 228924 4582226 5277367
6330 5277367 3930358 5522164 6175955 3819069 4530644 6482642 2990025 -1560289 -4115934
6321 -4115934 -1717286 2479998 6012927 9998668 11017232 12484441 13889134 11780534
$$ packed form
6381H280191M506207j939802l156338m143497m646035n343543k194796L171423
6373e466190L091649k050777n650180j673919K997518N94423K887491M584448
6365f85537J99567L207305J940935j612188n472704m061328L067996L384216L80523
6356C48785m95031k712788j516830k469828r08488L403492J169496k591953l268067
6347i041212J646588O00384k288342l166093j280939M538380J785915j367028
6339h572347J416081P64049L28505m10459J513056J289513L900526M353302O95141
6330E277367j347009J591806O53791k356886P11575J951998l492617m550314k555645
6321d115934K398648M197284L532929L985741J018564J467209J404693k108600
$$ plain form
6313 11780534 6234323 -263792 -7334110 -11314828 -14052872 -12054002 -5455761 -4830753
6305 -4830753 -5566870 -4160928 -3528321 888619 5564809 6290147 4682190 915195 -1586517
6296 -1586517 -802001 -2900058 -6878183 -7556400 3556548 8841525 4851933 3951890 4086936
6287 4086936 3109258 3443575 3574644 5080209 8562832 12458184 17185183 15877934 11492553
6278 11492553 10881383 10345721 10193239 8559698 6046648 5301000 2738076 -122641 779597
6269 779597 -3513141 -8310853 -13235712 -14656292 -15592053 -15466133 -15732971 -12130299 -6749379
6260 -6749379 -4664898 -4540929 -2642723 5297 3966497 5558401 852926 -1693614
6252 -1693614 -3753131 -4334280 -4249692 -6839984 -7489104 -6483128 -6875950 -9242371 -7986609
$$ packed form
6313A1780534n546211o498115p070318l980718k738044J998870O598241O25008
6305d830753p36117J405942O32607M416940M676190P25338j607957l766995k501712
6296a586517P84516k098057l978125o78217J1112948N284977l989592r00043J35046
6287D086936r77678L34317J31069J505565L482623L895352M726999j307249m385381
6278A1492553o11170n35662j52482j633541k513050p45648k562924k860717R02238
6269G79597m292738m797712m924859j420580r35761J25920k66838L602672N380920
6260f749379K084481J23969J898206K648020L961200J591904m705475k546540
6252a693614k059517n81149Q4588k590292o49120J005976l92822k366421J255762
$$ plain form
6243 -7986609 -5642595 -1905683 405230 -807839 -682196 160583 717770 3551861 7115364
6234 7115364 6649128 2734544 552168 -142536 -169869 -938435 -50880 2196655 848067
6225 848067 895036 3763016 4850198 1424891 -1868463 100590 3523469 4555363 4742296
6216 4742296 5477578 4798822 5318391 4240863 407353 570552 2662493 3270698 4531463
6207 4531463 3904794 2921733 4088970 6775510 6255602 6980683 6393498 8717825 13691190
6198 13691190 18535937 22881827 22657274 19075658 14578369 9929909 6163860 2148008
6190 2148008 -2353692 -4506270 -3710640 -3305812 -3457223 -6661622 -12380667 -13129239 -9913711
6181 -9913711 -4057788 77511 -1430735 -4127229 -1964256 1280831 3351445 6691649
$$ packed form
6243g986609K344014L736912K310913j213069J25643Q42779N57187K834091L563503
6234G115364m66236l914584k182376o94704k7333p68566Q87555K247535j348588
6225H48067M6969K867980J087182l425307l293354J969053L422879J031894J86933
6216D742296P35282o78756N19569j077528l833510J63199K091941O08205J260765
6207D531463o26669r83061J167237K686540n19908P25081n87185K324327M973365
6198A3691190M844747M345890k24553l581616m497289m648460l766049m015852
6190B148008m501700k152578P95630M04828j51411l204399n719045p48572L215528
6181i913711N855923M135299j508246k696494K162973L245087K070614L340204
$$ plain form
6173 6691649 8711492 5295526 2952048 1871043 2691850 1942702 -1141873 -5761332 -7840553
6164 -7840553 -2942547 5308351 7408744 7129732 6753103 2056052 -1072121 -2013599 -1641517
6155 -1641517 -1605705 2579309 4407290 3201324 3260312 2486918 239777 2169286 7941386
6146 7941386 8961398 5460405 2605455 1500552 1788744 1283059 450914 -4061479 -7192492
6137 -7192492 -6912493 -3838486 -3102954 -8616100 -9107831 -8015132 -6752688 -8447942 -6548751
6128 -6548751 -4722206 -5944410 -7048772 -7457334 -5859854 -6668956 -10231918 -7550390 -2343250
6119 -2343250 -2615694 -3068868 -5905687 -13941499 -16681197 -13672960 -10661774 -10771510 -10007743
6110 -10007743 -8889671 -7776911 -2879629 5674479 5738771 -2293268 -8530773 -8143197 -7272587
$$ packed form
6173F691649K019843l415966k343478j081005Q20807p49148l084575m619459k079221
6164g840553M898006Q250898K100393k79012l76629m697051l128173r41478L72082
6155a641517L5812M185014J827981j205966N8988p73394k247141J929509N772100
6146G941386J020012l500993k854950j104903K88192n05685q32145m512393l131013
6137g192492K79999L074007P35532n513146m91731J092699J262444j695254J899191
6128f548751J826545j222204j104362m08562J597480q09102l562962K681528N207140
6119b343250k72444m53174k836819q035812k739698L008237L011186j09736P63767
6110a0007743J118072J112760M897282Q554108O4292q032039o237505L87576Q70610
$$ plain form
6101 -7272587 -5879456 -5419543 -1624970 2756393 10053686 11814281 11349390 8969803 6114604
6092 6114604 2911210 2693746 4948815 6272727 4167887 4420417 3511843 1792109 1997538
6083 1997538 -556045 -5325313 -3456241 1005031 3916403 6128431 6971340 9208704
6075 9208704 12933152 12766992 6554801 3292341 2906241 3720873 1592034 -1778398 -2014772
6066 -2014772 1396745 5194765 8134378 8375568 7485641 5129748 2923851 534003 -1996711
6057 -1996711 -812739 4532966 8946688 9873583 9174598 6191530 4557305 4621767 4599106
6048 4599106 4709691 4575668 5187600 6956566 10745047 10973190 10303682 11443889 11601619
6039 11601619 10779284 6962392 5824458 5130052 2807761 -1197521 -5751538 -4419603
$$ packed form
6101g272587J393131M59913L794573M381363P297293J760595m64891k379587k855199
6092F114604l203394k17464K255069J323912k104840K52530r08574j719734K05429
6083A997538k553583m769268J869072M461272K911372K212028Q42909K237364
6075I208704L724448j66160o212191l262460l86100Q14632k128839l370432k36374
6066b014772L411517L798020K939613K41190q89927k355893k205897k389848k530714
6057a996711J183972N345705M413722R26895o98985k983068j634225O4462k2661
6048D599106J10585j34023O11932J768966L788481K28143o69508J140207J57730
6039A1601619q22335l816892j137934o94406k322291m005282m554017J331935
$$ plain form
6031 -4419603 -976090 -2876163 -2770054 3109127 4406730 1389190 1654638 2534240 4685714
6022 4685714 2303862 532051 1885721 5703657 6607110 5254056 5207664 8518199 10628015
6013 10628015 9117513 10060557 9647264 9607660 11106583 7361269 -15868 -5899994 -11195200
6004 -11195200 -12489330 -7404849 -1910131 -3396564 -6069510 -9230624 -9761973 -8977730
5996 -8977730 -9288217 -8766542 -6916384 -5832371 -4860616 -3046813 -5621270 -5631657 -4822910
5987 -4822910 -3945781 -1391414 -2961434 -5878007 -3507598 -1552636 -4421758 -8833008
5979 -8833008 -10908343 -11170425 -11295380 -13365122 -11005322 -4383095 -121949 -558265 -3380444
5970 -3380444 -5151814 -2540227 3294518 7383144 6526273 -365211 -5757670 -5202176 -3149304
$$ packed form
6031d419603L443513j900073J06109N879181J297603l017540K65448Q79602K151474
6022D685714k381852j771811J353670L817936R03453j353054m6392L310535K109816
6013A0628015j510502R43044m13293l9604J498923l745314p377137n884126n295206
6004a1195200j294130N084481N494718j486433k672946l161114n31349P84243
5996h977730l10487N21675J850158J084013R71755J813803k574457j0387Q08747
5987d822910Q77129K554367j570020k916573K370409J954962k869122m411250
5979h833008k075335k62082j24955k069742K359800O622227M261146m36316k822179
5970c380444j771370K611587N834745M088626q56871o891484n392459N55494K052872
$$ plain form
5961 -3149304 -608016 1543045 2666827 690427 -3269872 -1733731 4719895 1722478
5953 1722478 -3799229 -4307622 -6936997 -9846668 -7546613 -3542352 804797 2086055
5945 2086055 -2992757 -9926395 -9968315 -4650381 -2448319 -1361455 3382445 7838823 8641706
5936 8641706 3743806 -1124310 -2914685 381009 4751465 9028683 8604069 5849221
5928 5849221 -638353 -6342077 -6539624 -7671502 -8999560 -9469802 -7992449 -4655349 636886
5919 636886 3653309 4031094 4342886 2815525 1266893 701177 -3159237 -3265017 -2053666
5910 -2053666 -1540019 1462773 2910171 3664736 1534879 2770576 7404080 7210054 4045488
5901 4045488 -308261 -6774661 -8649836 -5319942 -2072250 179149 1362058 -417459
$$ packed form
5961c149304K541288K151061J123782j976400l960299J536141O453626k997417
5953A722478n521707n08393k629375k909671K300055M004261M347149J281258
5945B086055n078812o933638m1920N317934K202062J086864M743900M456378Q02883
5936H641706m897900m868116j790375L295694M370456M277218m24614k754848
5928E849221o487574n703724j97547j131878j328058m70242J477353L337100N292235
5919F36886L016423L77785L11792j527361j548632n65716l860414j05780J211351
5910b053666N13647L002792J447398P54565k129857J235697M633504j94026l164566
5901D045488m353749o466400j875175L329894L247692K251399J182909j779517
$$ plain form
5893 -417459 -3541453 -4449811 -3780482 -3297493 -1088710 2384581 3811131 570123 -2004727
5884 -2004727 -6345052 -9766470 -8571790 -2810781 2359841 2256776 3787865 4724585 587218
5875 587218 2171372 9053991 10719321 10172313 10534463 7929459 3807493 89738 -3097317
5866 -3097317 -3865969 -2840288 -3172996 -2837448 -1997881 -2272118 -6290469 -5906169 -2857896
5857 -2857896 -199761 -39682 -623316 27923 4821036 7535014 6280465 4601048 5243885
5848 5243885 2591662 -742802 1502731 4553418 6361056 5731896 3122624 602378
5840 602378 578292 630814 2422760 3933436 3461401 4396547 6142820 4779263 6574196
5831 6574196 10347691 9205340 1462176 -1990781 -2592651 -4262104 -2651441 1080833
$$ packed form
5893d17459l123994r08358O69329M82989K208783L473291J426550l241008k574850
5884b004727m340325l421418J194680N761009N170622j03065J531089R36720m137367
5875E87218J584154O882619J665330n47008L62150k605004m121966l717755l187055
5866c097317p68652J025681l32708L35548Q39567k74237m018351L84300L048273
5857b857896K658135J60079n83634O51239M793113K713978j254549j679417O42837
5848E243885k652223l334464K245533L050687J807638o29160k609272k520246
5840F02378k4086N2522J791946J510676m72035R35146J746273j363557J794933
5831F574196L773495j142351p743164l452957o01870j669453J610663L732274
$$ plain form
5823 1080833 2059552 2129739 2496868 -374419 1081705 6172533 7355048 3840363 138695
5814 138695 864046 1978866 3963447 5663488 6600206 4255842 -686033 -4435745 -2101133
5805 -2101133 -1073159 -1372126 -2200259 -944979 -117261 -1632502 -5668659 -9565921 -11580112
5796 -11580112 -12828975 -12059449 -16854087 -16452785 -13580600 -12466860 -10585742 -7785241
5788 -7785241 -6264868 -5481396 -2230043 -2168782 -2529990 1707403 5571110 8907536 7356851
5779 7356851 2437143 1075682 -26311 -1179992 -613912 -1441965 -2506649 -3186129 -2392296
5770 -2392296 -3835525 -9433600 -15596414 -15803643 -7735505 1053808 3166000 1642012
5762 1642012 1054532 -792661 -1568077 -2579000 -1940879 -720042 4502481 6176367 6190563
$$ packed form
5823A080833R78719P0187L67129k871287J456124N090828J182515l514685l701668
5814A38695P25351J114820J984581J700041R36718k344364m941875l749712K334612
5805b101133J027974k98967q28133J255280Q27718j515241m036157l897262k014191
5796a1580112j248863P69526m794638M01302K872185J113740J881118K800501
5788g785241J520373P83472L251353O1261l61208M237393L863707L336426j550685
5779G356851m919708j361461j101993j153681N66080q28053j064684o79480P93833
5770b392296j443229n598075o162814k07229Q068138Q789313K112192j523988
5762A642012n87480j847193p75416j010923O38121J220837N222523J673886J4196
$$ plain form
5753 6190563 9380786 10323976 10859429 13220755 14583698 13729854 8806115 3720605 2631492
5744 2631492 4789457 8184524 6584525 2038487 157081 -355181 949776 -2822975
5736 -2822975 -6928246 -5850176 -2174078 -1785857 -144694 -1488204 -2512019 -400586
5728 -400586 1589975 1268299 3383825 4494104 2957732 5765622 10247735 13827861 13165387
5719 13165387 11588142 12737262 13398787 12995473 13990261 14732583 14140311 13952477 11838068
5710 11838068 6198056 -925363 -1965434 -756322 34908 964273 2510988 3299640 385986
5701 385986 -3650548 -2146206 -668724 -3031156 -4373106 -1206082 -3233665 -7261679
5693 -7261679 -3826385 3676715 6334173 2389712 -1517884 -1451118 1084653 929089 2654778
$$ packed form
5753F190563L190223R43190N35453K361326J362943q53844m923739n085510j089113
5744B631492K157965L395067j599999m546038j881406n12262J304957l772751
5736b822975m105271J078070L676098L88221J641163j343510j023815K111433
5728d00586J990561l21676K115526J110279j536372K807890M482113L580126o62474
5719A3165387j577245J149120O61525m03314R94788P42322n92272j87834k114409
5710A1838068n640012p123419j040071J209112P91230R29365J546715P88652k913654
5701C85986m036534J504342J477482k362432j341950L167024k027583m028014
5693g261679L435294P503100K657458l944461l907596O6766K535771j55564J725689
$$ plain form
5684 2654778 6378388 8902743 5620738 -403621 -3166254 1720888 6941128 6673967
5676 6673967 4356997 6641078 8705765 9162359 5182585 3826300 6795901 3656574
5668 3656574 -1034126 -5083272 -6255367 -6149744 -3663383 191823 1044301 -1373229 -3511761
5659 -3511761 -7903393 -10571162 -10947870 -10039089 -7380438 -5697332 -7861899 -13251739 -13397849
5650 -13397849 -9735495 -5358765 -1463275 1749913 4322034 7989943 5758185 1829993
5642 1829993 2711642 3026179 1832389 240468 -298833 1660080 3530777 818957 734852
5633 734852 1429028 4276195 7745916 10096814 10697800 8261847 4579547 689171 -698527
5624 -698527 -338678 -3088531 -1862227 913773 5751569 12966695 15531870 11973264 6133920
$$ packed form
5684B654778L723610K524355l282005o024359k762633M887142N220240k67161
5676F673967k316970K284081K064687M56594l979774j356285K969601l139327
5668C656574m690700m049146j172095J05623K486361L855206Q52478k417530k138532
5659c511761m391632k667769l76708R08781K658651J683106k164567n389840j46110
5650a3397849L662354M376730L895490L213188K572121L667909k231758l928192
5642A829993Q81649L14537j193790j591921n39301J958913J870697k711820q4105
5633G34852O94176K847167L469721K350898O00986k435953l682300l890376j387698
5624f98527L59849k749853J226304K776000M837796P215126K565175l558606n839344
$$ plain form
5615 6133920 3422925 1185209 -829344 -2124835 1299673 1179096 625614 5407900 6826585
5606 6826585 4502215 5981380 4458178 4298763 8905269 8584923 1158006 -3772374 -4854404
5597 -4854404 -7130422 -11296171 -18281895 -16358390 -6822892 -2829852 -4828905 -4934369
5589 -4934369 -3114790 -4501555 -8957006 -11001487 -8243406 -2859516 759568 6978403
5581 6978403 11869463 12301713 11820315 10768872 6026801 2368328 3265767 5596943 9601001
5572 9601001 6604343 1805488 154271 -60406 626222 5309847 6911997 6271449 5228675
5563 5228675 3596555 1444298 -4080581 -5527556 -5609960 -2948079 1722010 1165736 -2443244
5554 -2443244 -669813 1217777 2576308 3646676 3425287 672066 -5583461 -7526493
$$ packed form
5615F133920k710995k237716k014553j295491L424508j20577n53482M782286J418685
5606F826585k324370J479165j523202j59415M606506l20346p426917m930380j082030
5597d854404k276018m165749o985724J923505R535498L993040j999053j05464
5589d934369J819579j386765m455451k044481K758081N383890L619084O218835
5581F978403M891060M32250m81398j051443m742071l658473Q97439K331176M004058
5572I601001k996658m798855j651217k14677O86628M683625J602150o40548j042774
5563E228675j632120k152257n524879j446975q2404K661881M670089n56274l608980
5554b443244J773431J887590J358531J070368k21389k753221o255527j943032
$$ plain form
5546 -7526493 -4533087 -3869193 -2565906 379663 2386959 238463 -1017939 -1155822 -3803648
5537 -3803648 -5657603 -3129291 855175 -913964 -5899657 -8446791 -7733290 -4466658
5529 -4466658 -334821 2813095 5111277 3282982 2587675 2722057 9908541 13218382 9751037
5520 9751037 7216347 3193289 750829 3927234 3270253 4284589 6220864 5017670
5512 5017670 1004284 -598834 -319534 2590650 7108051 9746285 8413981 5477522
5504 5477522 3488111 5165762 11157769 10606248 8844158 10313530 10355564 8461341 7777815
5495 7777815 5047573 3266002 3055011 1469822 -1356237 -5421472 -5005485 -863633 5618796
5486 5618796 9620658 13640412 12140945 6593877 3237367 4697308 5054705 2558136
$$ packed form
5546g526493K993406O63894J303287K945569K007296k148496j256402j37883k647826
5537c803648j853955K528312L984466j769139m985693k547134P13501L266632
5529d466658M131837L147916K298182j828295o95307J34382P186484L309841l467345
5520I751037k534690m023058k442460L176405o56981J014336J936275j203194
5512E017670m013386j603118K79300K910184M517401K638234j332304k936459
5504E477522j989411J677651N992007n51521j762090J469372M2034j894223o83526
5495G777815k730242j781571k10991j585189k826059m065235M15987M141852O482429
5486E618796M001862M019754j499467n547068l356510J459941L57397k496569
$$ plain form
5478 2558136 3915404 7133779 4850632 225528 -5499178 -5445496 -4893851 -5097180 -1183005
5469 -1183005 5969709 7690452 4345723 1962075 -1340741 -2244871 -692511 308944
5461 308944 550847 725685 -456162 -350825 -1417648 -587661 3597692 4525722 881340
5452 881340 -2255822 -3739801 -6355287 -5142867 -4726171 -5175159 -5323687 -4788554 -5691339
5443 -5691339 -7829150 -9364720 -6136282 -63423 1321621 1165581 -1626614 -5298141
5435 -5298141 -5418202 -4722308 -3960549 -4556196 -2527183 -1941186 -2590883 -1863728 3127030
5426 3127030 10467083 9964912 4653814 6861640 12042918 13921575 13043242 11291454 6513008
5417 6513008 4778377 10477184 12903952 15274507 16779537 14488365 10765010 9598419
$$ packed form
5478B558136J357268L218375k283147m625104n724706N3682N51645k03329L914175
5469a183005P152714J720743l344729k383648l302816r04130J552360J001455
5461C08944K41903J74838j181847J05337j066823Q29987M185353R28030l644382
5452H81340l137162j483979k615486J212420M16696m48988j48528N35133r02785
5443e691339k137811j535570L228438O072859J385044j56040k792195l671527
5435e298141j20061O95894P61759n95647K029013N85997o49697P27155M990758
5426C127030P340053n02171n311098K207826N181278J878657q78333j751788m778446
5417F513008j734631N698807K426768K370555J505030k291172l723355j166591
$$ plain form
5409 9598419 10945362 10670865 7134054 6287038 9520807 11363035 10608729 12001647 11218799
5400 11218799 9442372 8095164 5448442 2658521 -1067836 -5629252 -8214547 -6919321
5392 -6919321 -4621566 -3695304 -2600486 -2351581 -1870145 -3105535 -235424 -4219590 -8514860
5383 -8514860 -4450791 -3976622 -9347817 -13060443 -13954591 -15412208 -13108125 -7467049 -5869398
5374 -5869398 -2114918 4348827 4933941 2349873 -364942 -3576210 -4863718 -1312024
5366 -1312024 4237495 4421381 3063466 2631469 3389945 4356266 5708671 5503594 7126764
5357 7126764 10444860 12057086 13071307 11279969 7469157 4552611 926401 -5625995
5349 -5625995 -9428423 -10787807 -6418264 133570 4233064 2285645 -160756 -3069300
$$ packed form
5409I598419J346943k74497l536811q47016L233769J842228p54306J392918p82848
5400A1218799j776427j347208k646722k789921l726357m561416k585295J295226
5392f919321K297755R26262J094818K48905M81436j235390K870111l984166m295270
5383h514860M064069M74169n371195l712626q94148j457617K304083N641076J597651
5374e869398L754480O463745N85114k584068k714815l211268j287508L551694
5366a312024N549519J83886j357915m31997P58476R66321J352405k05077J623170
5357G126764L318096J612226J014221j791338l810812k916546l626210o552396
5349e625995l802428j359384M369543O551834M099494j947419k446401k908544
$$ plain form
5341 -3069300 -1405335 -870093 -2238800 -4508265 -8145554 -11729786 -13499619 -11394999
5333 -11394999 -8299761 -12883822 -12529341 -9146297 -8527319 -6078075 -5042523 -4639791 -469320
5324 -469320 -2953780 -2283881 1011183 -1916769 -5087922 -3420454 3702699 5589270 3997980
5315 3997980 3807741 4109083 3569954 1453725 1774221 5116768 3683286 -310381 -46470
5306 -46470 2533413 3941794 796236 -3542299 -6855476 -7859856 -9096097 -11920592 -11570663
5297 -11570663 -8018221 -385429 7179526 8464159 2212868 -169354 -1579563 -8535772
5289 -8535772 -9937620 -9357954 -9532931 -13257805 -10631755 -3273269 106697 -943179 -3707463
5280 -3707463 -1815977 2027746 -70058 -2424795 -149535 944664 -322984 -228372 1944633
$$ packed form
5341c069300J663965N35242j368707k269465l637289l584232j769833K104620
5333a1394999L095238m584061L54481L383044O18978K449244J035552M02732M170471
5324d69320k484460O69899L295064k927952l171153J667468P123153J886571j591290
5315C997980j90239L01342n39129k116229L20496L342547j433482l993667K63911
5306d6470K579883J408381l145558m338535l313177j004380j236241k824495L49929
5297a1570663L552442P632792P564955J284633o251291k382222j410209o956209
5289h535772j401848N79666j74977l724874K626050P358486L379966j049876k764284
5280c707463J891486L843723k097804k354737K275260J094199j267648R4612K173005
$$ plain form
5271 1944633 5355250 7771838 12027287 9732272 7434412 5520415 433731 -2324443
5263 -2324443 -3374701 -4811547 -4393644 -2417399 -245862 3523454 6889903 5251958
5255 5251958 720490 434051 298990 -2023445 -4949384 -8261394 -5564183 828411 4285903
5246 4285903 5043498 6136497 4307933 2893499 1920436 2105770 2574169 1474245 5146193
5237 5146193 8737986 4831994 4707478 6086686 7569460 6604495 6343908 4247237 -1465598
5228 -1465598 -6088497 -3330076 -2034152 -6324807 -9259030 -9552117 -6290972 -4949852
5220 -4949852 -2752271 3667515 8211943 10061333 11736069 9291845 9134443 11332064
5212 11332064 4926486 913634 1467961 5941870 10769816 12287512 14009657 15137787
$$ packed form
5271A944633L410617K416588M255449k295015k297860j913997n086684k758174
5263b324443j050258j436846M17903J976245K171537L769316L366449j637945
5255E251958m531468k86439j35061k322435k925939l312010K697211O392594L457492
5246D285903P57595J092999j828564j414434r73063J85334M68399j099924L671948
5237E146193L591793l905992j24516J379208J482774r64965k60587k096671n712835
5228a465598m622899K758421J295924m290655k934223k93087L261145J341120
5220d949852K197581O419786M544428J849390J674736k444224j57402K197621
5212A1332064o405578m012852N54327M473909M827946J517696J722145J128130
$$ plain form
5204 15137787 14549862 11881064 7402595 6490206 3839884 -1440181 -5425080 -6188394 -2994185
5195 -2994185 -4596645 -8339417 -8104505 -6074308 -4230363 -5007031 -1519038 5045494 9310067
5186 9310067 10579444 9289860 4029894 1029363 75640 1874732 5213019 2008772
5178 2008772 -387994 199313 3549304 -74437 -2550914 -1042683 -3591431 -6768983
5170 -6768983 -4360361 -319142 3340705 7498491 8946090 12810982 17818374 14085187
5162 14085187 5705150 4547968 967154 -2977366 -3053797 -2425723 -2682329 -5344070 -8182428
5153 -8182428 -6617741 -6498941 -5296268 -2378064 3988474 9823355 13478810 13978895 12184974
5144 12184974 10082235 4431245 4839480 9257220 10421091 9998470 10495735 13568183 16649229
$$ packed form
5204A5137787n87925k668798m478469r12389k650322n280065l984899p63314L194209
5195b994185j602460l742772K34912K030197J843945p76668L487993O564532M264573
5186I310067J269377j289584n259966l000531r53723J799092L338287l204247
5178B008772k396766N87307L349991l623741k476477J508231k548748l177552
5170f768983K408622M041219L659847M157786J447599L864892N007392l733187
5162A4085187q380037j157182l580814l944520p6431O28074k56606k661741k838358
5153h182428J564687J18800J202673K918204O366538N834881L655455N00085j793921
5144A2184974k102739n650990M08235M417740J163871m22621M97265L072448L081046
$$ plain form
5135 16649229 10106278 2356822 -537305 -1927513 -207393 4034686 4353256 4586540
5127 4586540 2965083 -2187872 -6568534 -7829342 -7299820 -5929568 -3491684 -3337507 -3557129
5118 -3557129 -2170134 -936059 -3934868 -8390638 -7862653 -9076955 -6354163 -2003521
5110 -2003521 -2843787 -5077441 -3139681 -2045977 -1734199 -418411 380423 -3506564 -4669546
5101 -4669546 -2971444 -4072635 -9232605 -11504341 -10968159 -10294335 -5219070 2381236 6128001
5092 6128001 4182859 4619621 3161052 2487407 6754594 14053359 15056332 10576671 8900382
5083 8900382 10826908 10494427 5647419 764320 -2187243 -4363037 -4499492 -998993 102813
5074 102813 -2953092 -3104593 -3386103 -5369756 -3698906 -2283735 -4116024 -7461334 -10618298
$$ packed form
5135A6649229o542951p749456k894127j390208J720120M242079L18570K33284
5127D586540j621457n152955m380662j260808N29522J370252K437884J54177k19622
5118c557129J386995J234075k998809m455770N27985j214302K722792M350642
5110b003521q40266k233654J937760J093704L11778J315788P98834l886987j162982
5101d669546J698102j101191n159970k271736N36182O73824N075265P600306L746765
5092F128001j945142M36762j458569o73645M267187P298765J002973m479661j676289
5083H900382J926526l32481m847008m883099k951563k175794j36455L500499J101806
5074A02813l055905j51501k81510j983653J670850J415171j832289l345310l156964
$$ plain form
5065 -10618298 -14960627 -13648331 -10320974 -8605729 -8939191 -7309601 -4355149 -2608972
5057 -2608972 -3964888 -2955871 -2852577 -6007236 -6800269 -4201331 -3183237 78625 4776874
5048 4776874 7236094 7071133 7482150 9341105 13593915 13187459 10437901 7827313 3202499
5039 3202499 -965486 -3961914 -1118839 -1913131 -2843824 -3349749 -4106850 -2537874 673968
5030 673968 3896345 6673665 8013385 9779907 8106181 8323037 11364058 10915657 5188237
5021 5188237 -448844 -3270219 -8251099 -10823756 -9680364 -6143649 -953130 -1475962
5013 -1475962 -4013989 -6442924 -7095639 -5690133 -772757 6303026 9623557 8515649
5005 8515649 8703434 5152824 2856894 2565671 766290 -2606304 -5190485 -3824694 -1554711
$$ packed form
5065a0618298m342329J312296L327357J715245l33462J629590K954452J746177
5057b608972j355916J009017J03294l154659p93033K598938J018094L261862M698249
5048D776874K459220j64961M11017J858955M252810m06456k749558k610588m624814
5039C202499m167985k996428K843075p94292r30693n05925p57101J568976L211842
5030F73968L222377K777320J339720J766522j673726K16856L041021m48401n727420
5021E188237n637081k821375m980880k572657J143392L536715N190519n22832
5013a475962k538027k428935o52715J405506M917376P075783L320531j107908
5005H515649J87785l550610k295930k91223j799381l372594k584181J365791K269983
$$ plain form
4996 -1554711 -4665950 -5374877 -4955497 -4287135 -242832 3703302 4572560 2603594 3178537
4987 3178537 5748032 4409615 1720349 1511189 1843922 -2740305 -8767909 -5473665 1546735
4978 1546735 2292987 686007 -2751548 -7245255 -8614524 -11097514 -12058749 -8459046 -7817849
4969 -7817849 -6879678 -4395057 -2614347 -3585742 -5199776 -7821678 -12211108 -16524453 -19512987
4960 -19512987 -20645373 -17447566 -13222278 -10030521 -8340656 -6607708 -3389264 131909
4952 131909 -1441518 -7805343 -6363570 -3984128 -5491335 -7473190 -8900090 -7486294
4944 -7486294 -6452022 -5586359 -6380533 -6958552 -3288960 -1505469 -3430019 -5017546 -3505217
4935 -3505217 -6143106 -9405567 -9497539 -6775521 -3631724 -3204386 -7033161 -9630283 -12822687
$$ packed form
4996a554711l111239p08927M19380O68362M044303L946134Q69258j968966N74943
4987C178537K569495j338417k689266k09160L32733m584227o027604L294244P020400
4978A546735P46252j606980l437555m493707j369269k482990r61235L599703O41197
4969g817849R38171K484621J780710r71395j614034k621902m389430m313345k988534
4960a9512987j132386L197807M225288L191757J689865J732948L218444L521173
4952A31909j573427o363825J441773K379442j507207j981855j426900J413796
4944g486294J034272Q65663p94174n78019L669592J783491j924550j587527J512329
4935c505217k637889l262461r1972K722018L143797M27338l828775k597122l192404
$$ plain form
4926 -12822687 -18167173 -19474680 -16958815 -11307727 -8636697 -7231659 -6139943 -8145527
4918 -8145527 -6670527 -5012027 -3228577 -451299 -3416453 -9969763 -8876536 -6456610
4910 -6456610 -3820744 -3468132 -5163576 -6793696 -8599260 -3777133 3160029 5035437
4902 5035437 5553843 1993722 225017 3373036 4220268 5342250 7725143 10565629 7925884
4893 7925884 4707466 1170510 -898256 1432530 2422727 -91910 -2625358 -3034430 -2024937
4884 -2024937 -1132471 -2386586 -9264126 -13383740 -8077781 1170736 5080900 4663478 4924025
4875 4924025 5771486 6342486 6655136 3933977 -1838702 -6020614 -9107956 -9428907 -8557583
4866 -8557583 -6281674 -4769983 -3716659 -3567005 -6317470 -7541207 -6542291 -3764940 -2212325
$$ packed form
4926a2822687n344486j307507K515865N651088K671030J405038J091716k005584
4918h145527J475000J658500J783450K777278k965154o553310J093227K419926
4910f456610K635866L52612j695444j630120j805564M822127O937162J875408
4902E035437N18406l560121j768705L148019Q47232J121982K382893K840486k639745
4893G925884l218418l536956k068766K330786R90197k514637k533448m09072J009493
4884b024937Q92466j254115o877540m119614N305959R248517L910164m17422K60547
4875D924025Q47461N71000L12650k721159n772679m181912l087342l20951Q71324
4866h557583K275909J511691J053324J49654k750465j223737R98916K777351J552615
$$ plain form
4857 -2212325 -2817557 -5396195 -7281967 -5489416 -372052 6417520 8073145 3390835
4849 3390835 -1301697 -450125 5410600 11954700 14535095 14158705 13859450 11157840 8005607
4840 8005607 4879926 726814 -2985901 -1914945 3871544 7728863 7327790 3482030
4832 3482030 -2854319 -4065798 -1310181 2736835 3383607 6051815 8293751 6989352
4824 6989352 10189880 14383528 13098140 8075035 8299397 11487288 10927069 8839959 8190985
4815 8190985 6214134 5383675 4556045 2535957 5813408 11912094 14553667 10756428 5879868
4806 5879868 2703143 1786594 2635472 3144465 4769887 1234180 -3052342 -4573176 -4884197
4797 -4884197 -5807657 -7576618 -3230482 -769472 -2630309 -2992457 298290 3585518 2813385
$$ packed form
4857b212325o05232k578638j885772J792551N117364O789572J655625m682310
4849C390835m692532Q51572N860725O544100K580395l76390k99255k701610l152233
4840H005607l125681m153112l712715J070956N786489L857319m01073l845760
4832C482030o336349j211479K755617M047016O46772K668208K241936j304399
4824F989352L200528M193648j285388n023105K24362L187891n60219k087110o48974
4815H190985j976851q30459q27630k020088L277451O098686K641573l797239m876560
4806E879868l176725r16549Q48878N08993J625422l535707m286522j520834l11021
4797d884197r23460j768961M346136K461010j860837l62148L290747L287228p72133
$$ plain form
4788 2813385 2215455 5235735 4757111 4064319 4323478 8092677 12325971 9740759 3706364
4779 3706364 3015851 2371804 -4370793 -8764190 -9696376 -13197158 -16461910 -13888859 -4992582
4770 -4992582 851180 878998 4203343 8253890 13299943 15384791 10806337 6429849 3845164
4761 3845164 6755030 12179394 10625346 7797691 6597879 4203385 1617055 1503084
4753 1503084 1704052 -1962138 -5518858 -5796126 -3759391 -4259880 -5195420 -1412237 2799249
4744 2799249 2047404 -707812 -3607242 -4470614 -4359005 -2388975 270420 -816077 -1349114
4735 -1349114 -2856741 -10471561 -14499867 -13347481 -7118299 -3332662 -2075646 -1465263
4727 -1465263 983216 133508 1241089 4284142 2714087 -66975 -4152718 -8266874
$$ packed form
4788B813385n97930L020280m78624o92792K59159L769199M233294k585212o034395
4779C706364o90513o44047o742597m393397r32186l500782l264752K573051Q896277
4770d992582N843762K7818L324345M050547N046053K084848m578454m376488k584685
4761C845164K909866N424364j554048k827655j199812k394494k586330j13971
4753A503084K00968l666190l556720k77268K036735n00489r35540L783183M211486
4744B799249p51845k755216k899430q63372J11609J970030K659395j086497n33037
4735a349114j507627p614820m028306J152386O229182L785637J257016O10383
4727a465263K448479q49708J107581L043053j570055k781062m085743m114156
$$ plain form
4719 -8266874 -10331081 -12707883 -14732345 -14215587 -9919355 -4562472 -2102735 -124359
4711 -124359 700800 546463 -1050274 -3848455 -4510528 -5244530 -6029816 -5273761 -1407230
4702 -1407230 -115086 -2317144 -1384268 1946355 -533587 273915 4986248 6219693 1295086
4693 1295086 -2835263 -4446196 -7450626 -7401199 -4771733 -2521457 -1673289 1154277 819209
4684 819209 -1091595 -2165576 -1231740 665019 4910534 8711650 13137867 16156551 11942697
4675 11942697 4234657 -3294898 -5828080 -3434841 -1631964 1302697 5180099 4423834
4667 4423834 482784 -3117768 -1896579 55021 33744 -3568503 -4895198 -3401438 -635773
4658 -635773 -1170553 -238630 -2237448 -6798199 -7321618 -7489470 -10050641 -12742956 -11226565
$$ packed form
4719h266874k064207k376802k024462N16758M296232N356883K459737J978376
4711a24359Q25159j54337j596737k798181o62073p34002p85286P56055L866531
4702a407230J292144k202058R32876L330623k479942Q07502M712333J233445m924607
4693A295086m130349j610933l004430M9427K629466K250276Q48168K827566l35068
4684H19209j910804j073981R33836J896759M245515L801116M426217L018684m213854
4675A1942697p708040p529555k533182K393239J802877K934661L877402p56265
4667D423834l941050l600552J221189J951600k1277l602247j326695J493760K765665
4658f35773n34780R31923j998818m560751n23419j67852k561171k692315J516391
$$ plain form
4649 -11226565 -6693580 -2804230 2495199 5898039 6451103 6401195 5224009 8750889 13431826
4640 13431826 15875340 15256076 12986630 8104303 2781765 -930148 -1900723 -761320
4632 -761320 -510067 -2459098 -2240327 601538 -803893 915019 2708520 3166447 6744408
4623 6744408 11681637 10287921 6292333 3777004 390515 -3473226 -5715088 -4795264
4615 -4795264 -705933 1146127 -1221151 -8611453 -12580857 -11554490 -11898031 -11254392 -7977192
4606 -7977192 -7994375 -8757191 -4536362 -2816706 -4448817 -5614647 -3437088 882132 5748276
4597 5748276 5392655 5218919 9253880 11166429 5409601 -882060 -2505005 -2288259 31096
4588 31096 2258586 4151865 4136141 3521869 1582663 -1281517 -3472150 -3927061 2640756
$$ packed form
4649a1226565M532985L889350N299429L402840N53064m9908j177186L526880M680937
4640A3431826K443514o19264k269446m882327n322538l711913r70575J139403
4632g61320K51253j949031K18771K841865j405431J718912J793501M57927L577961
4623F744408M937229j393716l995588k515329l386489l863741k241862R19824
4615d795264M089331J852060k367278p390302l969404J026367l43541O43639L277200
4606g977192j7183p62816M220829J719656j632111j165830K177559M319220M866144
4597E748276l55621j73736M034961J912549n756828o291661j622945K16746K319355
4588C1096K227490J893279j5724o14272j939206k864180k190633m54911O567817
$$ plain form
4579 2640756 9944994 11751452 9149940 6505086 5958255 5547090 5896844 2566462 1672827
4570 1672827 1205544 -1407511 -1617477 1550751 3110333 2459512 -463827 766761 1913133
4561 1913133 1867548 2743250 2585291 -665937 166951 3816659 7656018 6920235 3138168
4552 3138168 -1787096 601157 5778392 5177486 2694988 1457909 -634966 990665
4544 990665 5809986 8284799 8006082 5329871 3319372 214653 -1456282 -54222 -701611
4535 -701611 -4199177 -8945285 -12581108 -12766169 -7904789 -1685978 938074 -2498557 -5907375
4526 -5907375 -5964693 -5191143 -5346437 -4939758 -4051429 -1406088 -1518582 -4117764 -5073065
4517 -5073065 -4520057 -5672369 -4752909 -3992877 -1798832 -457589 -4296399 -9290270 -10522485
$$ packed form
4579B640756P304238J806458k601512k644854n46831m11165L49754l330382q93635
4570A672827m67283k613055k09966L168228J559582o50821k923339J230588J146372
4561A913133m5585Q75702j57959l251228Q32888L649708L839359p35783l782067
4552C138168m925264K388253N177235o00906k482498j237079k092875J625631
4544I90665M819321K474813k78717k676211k010499l104719j670935J402060o47389
4535g01611l497566m746108l635823j85061M861380O218811K624052l436631l408818
4526e907375n7318P73550j55294M06679Q88329K645341j12494k599182r55301
4517e073065N53008j152312R19460P60032K194045J341243l838810m993871j232215
$$ plain form
4508 -10522485 -8355039 -4425762 -3189662 -4355445 296011 6553770 7256829 1504251
4500 1504251 -2472779 532517 3002838 3178458 2042810 -191447 -2818590 -4149945
4492 -4149945 -2060257 1299094 7223972 10982286 8190542 747223 -5340582 -3997512
4484 -3997512 -743586 -3454532 -8445815 -9246981 -11252418 -11638401 -9501213 -12501999 -13128227
4475 -13128227 -8420556 -4338700 -5771722 -6465332 -7878782 -10538623 -9170955 -5703874
4467 -5703874 -3441957 -2105450 1971758 6141188 6427331 6886448 8748265 10406667 4135074
4458 4135074 -1281368 -518499 1182056 -72461 -3431331 -6215186 -6804889 -5863245 -8555226
4449 -8555226 -9586106 -4788383 -1541663 436903 2927047 3408536 3360291 6761800 9742497
$$ packed form
4508a0522485K167446L929277J236100j165783M651456O257759P03059n752578
4500A504251l977030L005296K470321J75620j135648k234257k627143j331355
4492d149945K089688L359351N924878L758314k791744p443319o087805J343070
4484c997512L253926k710946m991283q01166k005437l85983K137188l000786o26228
4475a3128227M707671M081856j433022o93610j413450k659841J367668L467081
4467e703874K261917J336507M077208M169430K86143M59117J861817J658402o271593
4458D135074n416442P62869J700555j254517l358870k783855n89703R41644k691981
4449h555226j030880M797723L246720J978566K490144M81489m8245L401509K980697
$$ plain form
4440 9742497 8025883 5531920 4081580 1182778 -1133633 -2581668 -6158172 -9769014
4432 -9769014 -10766113 -8204200 -4418373 2175725 8273333 4791929 -2294988 -5218089
4424 -5218089 -1780694 1349281 4280692 7607811 4707296 -455970 -1235037 -2271857
4416 -2271857 -2845932 -1658013 -1501611 -3490251 -4105067 -4855421 -1632667 1686921 2156767
4407 2156767 3283059 3751865 423029 -1436614 1042138 -711282 -6432996 -5265039
4399 -5265039 2530358 10995901 11807443 8335631 5377366 1718440 -363427 -1940582
4391 -1940582 -846458 -2561051 -6035392 -5690228 -4629754 -1769216 2503975 2484745 -534828
4382 -534828 -1952016 -2331074 -398582 2022876 4410815 5998302 10852980 12883539 10323461
$$ packed form
4440I742497j716614k493963j450340k898802k316411j448035l576504l610842
4432i769014r97099K561913L785827O594098O097608l481404p086917k923101
4424e218089L437395L129975K931411L327119k900515n163266p79067j036820
4416b271857n74075J187919J56402j988640o14816p50354L222754L319588M69846
4407B156767J126292M68806l328836j859643K478752j753420n721714J167957
4399e265039P795397Q465543Q11542l471812k958265l658926k081867j577155
4391a940582J094124j714593l474341L45164J060474K860538M273191j9230l019573
4382e34828j417188l79058J932492K421458K387939J587487M854678K030559k560078
$$ plain form
4373 10323461 3506865 -249182 1395099 41131 443125 1072422 -608827 -1232004 1203608
4364 1203608 4192370 796596 -2788968 -3503859 847228 983385 -1750911 -1950583 622347
4355 622347 1206248 -2396812 -3525880 -4439014 -6247567 -6189250 -6233887 -9758261 -11672139
4346 -11672139 -11291296 -11711852 -10047883 -8831941 -10516002 -7927668 -7472383 -9027628 -6883629
4337 -6883629 -4833388 -3912480 -991422 -1276824 -2134248 -4625483 -9500284 -10173538 -7542182
4328 -7542182 -3378588 -2719635 -8660803 -10878446 -7374449 -3668962 -3051122 -5416989 -8006920
4319 -8006920 -7913912 -7559019 -6106780 -4851789 -1998917 2721971 5881054 5737865 4813778
4310 4813778 2592524 1056797 3370194 6621576 11959365 12017661 5040020 -1428022 -5954531
$$ packed form
4373A0323461o816596l756047J644281j353968M01994O29297j681249o23177K435612
4364A203608K988762l395774l585564p14891M351087J36157k734296j99672K572930
4355F22347N83901l603060j129068r13134j808553N8317m4637l524374j913878
4346a1672139L80843m20556J663969J215942j684061K588334M55285j555245K143999
4337f883629K050241R20908K921058k85402q57424k491235m874801o73254K631356
4328g542182M163594O58953n941168k217643L503997L705487O17840k365867k589931
4319h006920R3008L54893J452239J254991K852872M720888L159083j43189r24087
4310D813778k221254j535727K313397L251382N337789N8296o977641o468042m526509
$$ plain form
4301 -5954531 -6359559 -6298097 -7504223 -6436629 -7081327 -9466776 -8446923 -6330702 -4838207
4292 -4838207 -2891132 -3002038 -8499270 -9936901 -6580776 -3966839 -2040962 -1188550 3530619
4283 3530619 10616946 12635932 11229434 8394311 8426984 11701546 14638795 14414511 10784646
4274 10784646 8311115 5866606 2440751 5383701 5494520 1484414 -293475 736784
4266 736784 3852105 2719843 5237006 9276567 8019135 106863 -4079414 -6862613
4258 -6862613 -9103973 -9209432 -4097711 1760778 2622501 1449614 -2379487 -3842122 -4388248
4249 -4388248 -3727759 -4423145 -3679501 93302 3750531 3269752 -1757800 -3960153 -1386181
4240 -1386181 -1408951 -3395986 -2442162 -724997 2406753 3422721 1255073 3247974 3809795
$$ packed form
4301e954531m05028O1462j206126J067594o44698k385449J019853K116221J492495
4292d838207J947075j10906n497232j437631L356125K613937J925877Q52412M719169
4283C530619P086327K018986j406498k835123L2673L274562K937249k24284l629865
4274A0784646k473531k444509l425855K942950J10819m010106j777889J030259
4266G36784L115321j132262K517163M039561j257432p912272m186277k783199
4258f862613k241360j05459N111721N858489Q61723j172887l829101j462635n46126
4249d388248O60489o95386P43644L772803L657229m80779n027552k202353K573972
4240a386181k2770j987035R53824J717165L131750J015968k167648J992901N61821
$$ plain form
4231 3809795 5347855 5927086 3279681 2521681 3261807 4982791 3545512 -1119615 -4241637
4222 -4241637 -6759496 -6372133 -5375609 -9444683 -12177990 -10133174 -10416770 -7572197 -4202466
4213 -4202466 -4534210 -2884922 -2930910 -670181 1931722 1442386 -747985 -1996950 -4904929
$$ packed form
4231C809795J538060N79231k647405p58000P40126J720984j437279m665127l122022
4222d241637k517859L87363R96524m069074k733307K044816k83596K844573L369731
4213d202466l31744J649288m5988K260729K601903m89336k190371j248965k907979
$$ [...]
##END NTUPLES=NMR SPECTRUM
##END=
