##TITLE=C13DEPT135
##JCAMPDX= 6.0         $$ Bruker NMR JCAMP-DX V2.0
##DATA TYPE= NMR SPECTRUM
##DATA CLASS= NTUPLES
##ORIGIN= UXNMR, Bruker Analytische Messtechnik GmbH
##OWNER= root
$$ XWIN-NMR		Version 3.5
$$ Sun Feb 16 10:03:46 2025 Russian Standard Time (UT+4h)  servis@DPX200
##.OBSERVE FREQUENCY= 50.3277607988526
##.OBSERVE NUCLEUS= ^13C
##.ACQUISITION MODE= SIMULTANEOUS
##.ACQUISITION SCHEME= undefined
##.AVERAGES= 537
##.DIGITISER RES= 17
##SPECTROMETER/DATA SYSTEM= spect
##.PULSE SEQUENCE= dept135
##.SOLVENT NAME= DMSO
##.SHIFT REFERENCE= (INTERNAL, DMSO, 0, 219.126)
##AUDIT TRAIL= $$ (NUMBER, WHEN, WHO, WHERE, WHAT)
$$ ##TITLE= Audit trail, XWIN-NMR		Version 3.5
$$ ##JCAMPDX= 5.01
$$ ##ORIGIN= Bruker BioSpin GmbH
$$ ##OWNER= servis
$$ F:\spectra/data/av/nmr/C13DEPT135/1/pdata/1/auditp.txt
$$ ##AUDIT TRAIL=  $$ (NUMBER, WHEN, WHO, WHERE, WHAT)
(   1,<2025-02-16 10:03:01.20 +0400>,<servis>,<DPX200>,
      <created by zg, POWCHK disabled, PULCHK disabled
       terminated by command 'halt'
       configuration hash MD5:
       00 E9 B6 7A A2 85 ED C7 34 08 36 98 17 FE 4E 26
       data hash MD5: 64K
       6A 35 22 25 E6 3F B6 C8 80 A1 1D 14 85 D6 BC 27>)
(   2,<2025-02-16 10:03:03.21 +0400>,<servis>,<DPX200>,
      <Start of raw data processing
       efp BC_mod = 2 LB = 1 FT_mod = 6 PKNL = 1 PHC0 = 394.607 PHC1 = 5.268371 SI = 32K 
       data hash MD5: 32K
       F8 61 BB 60 6E 97 CE D0 50 A5 EA 73 20 F8 49 FD>)
(   3,<2025-02-16 10:03:20.79 +0400>,<servis>,<DPX200>,
      <pk PHC0 = -10.8 PHC1 = 0 
       data hash MD5: 32K
       1D EA 04 84 53 44 38 89 7C DD 01 49 36 17 85 4C>)
$$ ##END=
$$ 
$$ hash MD5
$$ A3 C9 D1 8B DC F4 F1 69 31 91 16 FD 94 27 AB 72
##$RELAX= 
##$RELAX= 
##$RELAX= 
##$RELAX= 
##$RELAX= 
##$RELAX= 
##$RELAX= 
$$ Bruker specific parameters
$$ --------------------------
##$DU= <F:\spectra>
##$EXPNO= 1
##$NAME= <C13DEPT135>
##$PROCNO= 1
##$TYPE= <nmr>
##$USER= <av>
##$AMP= (0..31)
100 100 100 100 100 100 100 100 100 100 100 100 100 100 100 100 100 100 
100 100 100 100 100 100 100 100 100 100 100 100 100 100 
##$AQSEQ= 0
##$AQ_mod= 1
##$AUNM= <au_zg>
##$AUTOPOS= <>
##$BF1= 50.322729
##$BF2= 200.13
##$BF3= 50.322729
##$BF4= 50.322729
##$BF5= 500.13
##$BF6= 500.13
##$BF7= 500.13
##$BF8= 500.13
##$BYTORDA= 1
##$CFDGTYP= 0
##$CFRGTYP= 5
##$CHEMSTR= <none>
##$CNST= (0..31)
1 1 145 1 1 1 1 1 1 1 1 1 1 1 1 1 1 1 1 1 1 1 1 1 1 1 1 1 1 1 1 1 
##$CPDPRG= <waltz16>
##$CPDPRG1= <>
##$CPDPRG2= <waltz16>
##$CPDPRG3= <>
##$CPDPRG4= <mlev>
##$CPDPRG5= <mlev>
##$CPDPRG6= <mlev>
##$CPDPRG7= <mlev>
##$CPDPRG8= <mlev>
##$CPDPRGB= <>
##$CPDPRGT= <>
##$D= (0..31)
0 2 0.003448276 0 0 0 0 0 0 0.06 0 0.03 2e-05 4e-06 0 0 0.0002 0 0 0 0 
0 0 0 0 0 0 0 0 0 0 0 
##$DATE= 1739685780
##$DBL= (0..7)
120 120 120 120 120 120 120 120 
##$DBP= (0..7)
150 150 150 150 150 150 150 150 
##$DBP07= 0
##$DBPNAM0= <>
##$DBPNAM1= <>
##$DBPNAM2= <>
##$DBPNAM3= <>
##$DBPNAM4= <>
##$DBPNAM5= <>
##$DBPNAM6= <>
##$DBPNAM7= <>
##$DBPOAL= (0..7)
$$ [...]
##$SUBNAM2= <"">
##$SUBNAM3= <"">
##$SUBNAM4= <"">
##$SUBNAM5= <"">
##$SUBNAM6= <"">
##$SUBNAM7= <"">
##$SUBNAM8= <"">
##$SUBNAM9= <"">
##$SW= 238.246396889851
##$SWIBOX= (0..15)
0 1 3 0 0 0 0 0 0 0 0 0 0 0 0 0 
##$SW_h= 11990.4076738609
##$TD= 65536
##$TD0= 1
##$TE= 0
##$TE2= 300
##$TE3= 300
##$TEG= 300
##$TL= (0..7)
0 120 120 120 120 120 120 120 
##$TP= (0..7)
150 150 150 150 150 150 150 150 
##$TP07= 0
##$TPNAME0= <>
##$TPNAME1= <>
##$TPNAME2= <>
##$TPNAME3= <>
##$TPNAME4= <>
##$TPNAME5= <>
##$TPNAME6= <>
##$TPNAME7= <>
##$TPOAL= (0..7)
0.5 0.5 0.5 0.5 0.5 0.5 0.5 0.5 
##$TPOFFS= (0..7)
0 0 0 0 0 0 0 0 
##$TUNHIN= 0
##$TUNHOUT= 0
##$TUNXOUT= 0
##$USERA1= <user>
##$USERA2= <user>
##$USERA3= <user>
##$USERA4= <user>
##$USERA5= <user>
##$V9= 5
##$VALIST= <valist>
##$VCLIST= <CCCCCCCCCCCCCCC>
##$VD= 0
##$VDLIST= <DDDDDDDDDDDDDDD>
##$VPLIST= <PPPPPPPPPPPPPPP>
##$VTLIST= <TTTTTTTTTTTTTTT>
##$WBST= 1024
##$WBSW= 4
##$XGAIN= (0..3)
0 0 0 0 
##$XL= 0
##$YL= 0
##$YMAX_a= 1699004
##$YMIN_a= -2211909
##$ZGOPTNS= <>
##$ZL1= 120
##$ZL2= 120
##$ZL3= 120
##$ZL4= 120
##$ABSF1= 0
##$ABSF2= 0
##$ABSG= 0
##$ABSL= 0
##$ALPHA= 0
##$AQORDER= 0
##$ASSFAC= 0
##$ASSFACI= 0
##$ASSFACX= 0
##$ASSWID= 0
##$AUNMP= <proc_1d>
##$AZFE= 0.1
##$AZFW= 0.5
##$BCFW= 0
##$BC_mod= 2
##$BYTORDP= 0
##$COROFFS= 0
##$CY= 12.5
##$DATMOD= 1
##$DC= 0
##$DFILT= <>
##$DTYPP= 0
##$F1P= 215.000008851289
##$F2P= -4.99998459219978
##$FCOR= 0.5
##$FTSIZE= 32768
##$FT_mod= 6
##$GAMMA= 0
##$GB= 0
##$INTBC= 1
##$INTSCL= 1
##$ISEN= 30
##$LB= 1
##$LEV0= 0
##$LPBIN= 0
##$MAXI= 10000
##$MC2= 0
##$MEAN= 0
##$ME_mod= 0
##$MI= 0
##$NCOEF= 0
##$NC_proc= -1
##$NLEV= 6
##$NOISF1= 0
##$NOISF2= 0
##$NSP= 0
##$NTH_PI= 0
##$NZP= 0
##$OFFSET= 219.1257
##$PC= 1.4
##$PHC0= 383.807
##$PHC1= 5.268371
##$PH_mod= 1
##$PKNL= yes
##$PPARMOD= 0
##$PSCAL= 4
##$PSIGN= 0
##$REVERSE= no
##$SF= 50.322729
##$SI= 32768
##$SIGF1= 0
##$SIGF2= 0
##$SINO= 80
##$SIOLD= 32768
##$SREGLST= <13C.CDCl3>
##$SSB= 0
##$STSI= 32768
##$STSR= 0
##$SW_p= 11990.4076738609
##$SYMM= 0
##$S_DEV= 0
##$TDeff= 65536
##$TDoff= 0
##$TI= <>
##$TILT= no
##$TM1= 0
##$TM2= 0
##$TOPLEV= 0
##$USERP1= <user>
##$USERP2= <user>
##$USERP3= <user>
##$USERP4= <user>
##$USERP5= <user>
##$WDW= 1
##$XDIM= 32768
##$YMAX_p= 282980550
##$YMIN_p= -166855586
$$ End of Bruker specific parameters
$$ ---------------------------------
##NTUPLES= NMR SPECTRUM
##VAR_NAME=  FREQUENCY,     SPECTRUM/REAL,   SPECTRUM/IMAG
##SYMBOL=    X,             R,               I
##VAR_TYPE=  INDEPENDENT,   DEPENDENT,       DEPENDENT
##VAR_FORM=  AFFN,          ASDF,            ASDF
##VAR_DIM=   32768,         32768,           32768
##UNITS=     HZ,            ARBITRARY UNITS, ARBITRARY UNITS
##FACTOR=    0.365929370215793, 1,           1
##FIRST=     11027.0033138647, 0,            0
##LAST=      -963.404359996184, 0,           0
##MIN=       -963.404359996184, -166855586,  0
##MAX=       11027.0033138647, 282980550,    0
$$ Real data points
##PAGE= N=1
##DATA TABLE= (X++(R..R)), XYDATA
$$ [...]
$$ plain form
9463 -6993151 -5921221 -6190212 -6100510 -5663518 -4864499 -3676311 -3600522 -5361019 -5349220 -2420222
9453 -2420222 -851627 226540 -545736 -1269265 -2481812 -3168948 -2750726 -1776455 -724842
9444 -724842 -209518 -1569290 -2796860 -2735993 -3493939 -3968516 -3719362 -1723511 676719
9435 676719 717988 -2500388 -2971815 -1631012 -1077124 -1332003 -2359654 -2924244 -2762349
9426 -2762349 -3628571 -4013990 -2624981 -1392148 -193342 1016278 473704 -1384201 -918929
9417 -918929 -1490139 -1697896 -397698 435163 526305 494828 -169211 -1231926 -992402 -871692
9407 -871692 558750 1277460 509890 903360 699762 470839 201984 -377778 136150 2957880
9397 2957880 5596416 7641873 9999912 13699788 18374013 23942035 30384243 39192935
$$ packed form
9463f993151J071930k68991Q9702M36992P99019J188188P5789j760497J1799K928998
9453b420222J568595J078167p72276p23529j212547o87136M18222R74271J051613
9444g24842N15324j359772j227570O0867p57946m74577K49154J995851K400230
9435F76719M1269l218376m71427J340803N53888k54879j027651n64590J61895
9426b762349q66222l85419J389009J232833J198806J209620n42574j857905M65272
9417i18929n71210k07757J300198Q32861R1142l1477o64039j062715K39524J20710
9407h71692J430442P18710p67570L93470k03598k28923k68855n79762N13928K821730
9397B957880K638536K045457K358039L699876M674225N568022O442208Q808692
$$ plain form
9389 39192935 52729989 73408957 94854444 103139018 89400392 64663777 44498505
9382 44498505 31670342 24316700 18668318 13584388 9418650 5697508 4481147 3722969
9374 3722969 3476148 3101887 1890205 1062162 562075 452439 718583 1769447 3228024
9365 3228024 4146845 4136348 3313211 1116278 -1292828 -1177345 733303 1208631 711412
9356 711412 -572762 -1201098 917491 2319062 1119235 9562 399747 319578 527851
9347 527851 430925 -514157 -1659020 -1348741 -3367527 -5594647 -5582045 -4820236 -4402080 -4169030
9337 -4169030 -2584088 -745788 -613853 -1510747 -2403468 -2105920 -2582347 -3395174 -3163568
9328 -3163568 -2319910 -2129507 -3041409 -5491380 -6124368 -4694194 -4154637 -3833344 -2312235
$$ packed form
9389C9192935J3537054K0678968K1445487Q284574j3738626k4736615k0165272
9382D4498505j2828163p353642n648382n083930m165738l721142j216361p58178
9374C722969k46821l74261j211682q28043n00087j09636K66144J050864J458577
9365C228024R18821j0497q23137k196933k409106J15483J910648M75328m97219
9356G11412j284174o28336K118589J401571j199827j109673L90185q0169K08273
9347E27851r6926r45082j144863L10279k018786k227120J2602P61809M18156K33050
9337d169030J584942J838300J31935q96894q92721K97548m76427q12827K31606
9328c163568Q43658J90403r11902k449971o32988J430174N39557L21293J521109
$$ plain form
9319 -2312235 -1482059 -859368 -2327 231996 695983 2836444 3227103 3104992 3962321
9310 3962321 2920677 2115137 906080 -424951 -387086 -613651 -579047 -1058 -1584068
9301 -1584068 -4017164 -4736607 -3842640 -2292976 -789026 1178542 1193051 356276 344219
9292 344219 1096242 903347 -447835 -249206 1320771 2342500 1964310 18933 -1270029
9283 -1270029 -3140858 -5573373 -5861863 -5060675 -4360761 -2832754 -1099916 -757081 -990376
9274 -990376 -1877778 -1296548 505317 742067 577751 1240089 59114 -322838 48072
9265 48072 586711 1302796 1843381 2919749 1918351 -109331 -876610 -459498 575286
9256 575286 1768351 2162618 769081 -959477 -2367377 -2474961 -871392 -1566371 -2681655
$$ packed form
9319b312235Q30176O22691Q57041K34323M63987K140461L90659j22111Q57329
9310C962321j041644q05540j209057j331031L7865k26565L4604N77989j583010
9301a584068k433096p19443Q93967J549664J503950J967568J4509q36775j2057
9292C44219P52023j92895j351182J98629J569977J021729l78190j945377j288962
9283a270029j870829k432515k88490Q01188O99914J528007J732838L42835k33295
9274i90376q87402N81230J801865K36750j64316O62338j180975l81952L70910
9265D8072N38639P16085N40585J076368j001398k027682p67279M17112J034784
9256E75286J193065L94267j393537j728558j407900j07584J603569o94979j115284
$$ plain form
9247 -2681655 -1843782 -2393477 -4020795 -4661620 -4247547 -3246484 -2260079 -1190744 875872
9238 875872 2036764 2005150 1751842 2667406 2881509 1724467 753771 305562 894708 2277566
9228 2277566 4521414 6106063 5885852 5399701 4255583 3053037 2423117 3112927 4494250
9219 4494250 2955915 376203 -707983 -947885 -339464 -69367 -551814 -347240 150980
9210 150980 -2088369 -2679242 -2704076 -3620028 -3664078 -3466063 -3999682 -3244142 31381 2669213
9200 2669213 2215739 2819020 3223840 4876782 6213065 6695465 6591655 5908748 5775130
9191 5775130 6544565 6387665 3986995 1593176 518796 -147008 -1544432 -2077965 -2543499
9182 -2543499 -3078933 -4208263 -4808513 -4070967 -4168418 -3986831 -4045808 -4276920 -3665116 -3219936
$$ packed form
9247b681655Q37873n49695j627318o40825M14073J001063R86405J069335K066616
9238H75872J160892l1614k53308R15564K14103j157042r70696m48209N89146J382858
9228B277566K243848J584649k20211m86151j144118j202546o29920O89810J381323
9219D494250j538335k579712j084186k39902O08421K70097m82447K04574M98220
9210A50980k239349n90873k4834r15952m4050J98015n33619P55540L275523K637832
9200B669213m53474O03281M04820J652942J336283M82400j03810o82907j33618
9191E775130P69435j56900k400670k393819j074380o65804j397424n33533m65534
9182b543499n35434j129330o00250P37546r7451J81587n8977k31112O11804M45180
$$ plain form
9172 -3219936 -2187474 -1176119 -1109668 -1643275 -2823171 -4658835 -5437871 -5448209 -4745311
9163 -4745311 -4209288 -3274880 -2593552 -2330107 -1843499 -1794581 -1560958 -909498 -287241 -647120
9153 -647120 -956169 -728884 -1128247 -1481413 -1816402 -1582000 -989066 -1049743 -1652775 -2305434
9143 -2305434 -2519104 -1801077 -1699398 -2457540 -2799622 -2095650 -1643020 -1687105 -1352675 -1348793
9133 -1348793 24489 88874 -1190518 -1436865 -694222 816644 1187624 703761 -121066
9124 -121066 631306 1545499 267345 -2103283 -3500633 -2263308 -48070 1545510 1661712
9115 1661712 -54727 -544224 -7844 316317 591509 428413 -926047 -2678311 -2865770
9106 -2865770 -1464347 -103440 1003385 234813 -2179476 -4144918 -4777921 -5571631 -4967873
$$ packed form
9172c219936J032462J011355O6451n33607j179896j835664p79036j0338P02898
9163d745311N36023R34408O81328K63445M86608M8918K33623O51460O22257l59879
9153f47120l09049K27285l99363l53166l34989K34402N92934o0677o03032o52659
9143b305434k13670P18027J01679p58142l42082P03972M52630m4085L34430L882
9133a348793J373282O4385j279392k46347P42643J510866L70980m83863q24827
9124a21066P52372R14193j278154k370628j397350J237325K215238J593580J16202
9115A661712j716439m89497N36380L24161K75192j63096j354460j752264j87459
9106b865770J401423J360907J106825p68572k414289j965442o33003p93710O03758
$$ plain form
9097 -4967873 -2764798 -1344332 -2665646 -4635259 -4641494 -4560033 -4272140 -2251554 -106180
9088 -106180 1060599 1347152 1630349 1474818 -750197 -1577612 -881911 -620084 -1389611
9079 -1389611 -2416440 -2987205 -2932202 -1745961 -1308868 -1839662 -2433215 -2163431 -1876419
9070 -1876419 -1602148 -794339 221950 821645 848310 235776 -954008 -1148528 -1489200
9061 -1489200 -3743548 -6361025 -6497644 -4641088 -2675273 -719539 942536 389505 -2609640
9052 -2609640 -5088886 -6299103 -6514026 -4303055 -2672629 -1547758 -62408 -56329 -397939
9043 -397939 -767673 -1544754 -2882522 -2830810 -3102830 -2353312 -1201132 -731598 -1687641 -1617249
9033 -1617249 -888089 -261506 -680029 -2087037 -2438049 -1134477 -508872 287981 1208801
$$ packed form
9097d967873K203075J420466j321314j969613o235Q1461K87893K020586K145374
9088a06180J166779K86553K83197j55531k225015q27415O95701K61827p69527
9079a389611j026829n70765N5003J186241M37093n30794n93553K69784K87012
9070a876419K74271Q07809J016289N99695K6665o12534j189784j94520l40672
9061a489200k254348k617477j36619J856556J965815J955734J662075n53031k999145
9052b609640k479246j210217k14923K210971J630426J124871J485350O079l41610
9043c97939l69734p77081j337768N1712k72020P49518J152180M69534r56043P0392
9033a617249P29160O26583m18523j407008l51012J303572O25605P96853R20820
$$ plain form
9024 1208801 1366246 653421 98826 1108288 2037583 2027595 2996062 4190896 3886457 2179242
9014 2179242 1087082 887037 1793583 2498460 1829279 2328737 3569543 2909642 2752815
9005 2752815 4195265 2850941 20611 -3370994 -5153334 -5064291 -5169003 -4867878 -4932171
8996 -4932171 -4169190 -3053621 -1306913 -2062816 -3332930 -3278362 -1750806 56300 928065
8987 928065 -392252 -1339959 -1422931 -2535234 -3266744 -4309141 -4355105 -2200984 -1586291
8978 -1586291 -4080931 -6249178 -6306860 -5993460 -5065959 -3926917 -1525177 763904 3030039
8969 3030039 3288632 1783203 732916 590619 1234702 1512002 125399 -1741357 -3634914
8960 -3634914 -5000282 -6277155 -7015136 -6596622 -6221424 -6125314 -6635546 -7328277 -6195526
$$ packed form
9024A208801J57445p12825n54595J009462R29295r988R68467J194834l04439j707215
9014B179242j092160k00045R06546P04877o69181M99458J240806o59901j56827
9005B752815J442450j344324k830330l391605j782340Q9043j04712L01125o4293
8996d932171P62981J115569J746708p55903j270114N4568J527556J807106Q71765
8987I28065j320317r47707q2972j112303p31510j042397m5964K154121O14693
8978a586291k494640k168247n7682L13400R27501J139042K401740K289081K266135
8969C030039K58593j505429j050287j42297O44083K77300j386603j866756j893557
8960c634914j365368j276873p37981M18514L75198R6110n10232o92731J132751
$$ plain form
8951 -6195526 -4572319 -4300306 -4285800 -4320683 -3486543 -3069295 -2937102 -1402997 -96619
8942 -96619 -948147 -1325893 268646 1412987 1088464 1174800 1443718 486492 -276221 65012
8932 65012 950036 1148270 278619 335749 304512 1503946 2900924 3020837 2606524 1737494
8922 1737494 1244414 -20937 -1202460 -15431 597772 72526 98566 -232557 -1137712
8913 -1137712 -334341 -499030 -1983803 -2676034 -2704855 -3062925 -2676889 -2194732 -1929919 -2298139
8903 -2298139 -2922168 -2814910 -2088042 -233183 1155015 -164576 -625535 845770 273679
8894 273679 -1217344 -2389835 -1318771 -90347 253874 701950 -509501 -1604179 -1516237
8885 -1516237 -1342562 -2447219 -3201855 -2605106 -2330412 -1693040 -684459 -1817943 -2158393
$$ packed form
8951f195526J623207K72013J4506l4883Q34140M17248J32193J534105J306378
8942i6619q51528l77746J594539J144341l24523Q6336K68918r57226p62713L41233
8932F5012Q85024J98234q69651N7130l1237J199434J396978J19913m14313q69030
8922A737494m93080j265351j181523J187029O13203n25246K6040l31123r05155
8913a137712Q03371j64689j484773o92231k8821l58070L86036M82157K64813l68220
8903b298139o24029J07258P26868J854859J388198j319591m60959J471305n72091
8894B73679j491023j172491J071064J228424L44221M48076j211451j094678Q7942
8885a516237J73675j104657p54636N96749K74694O37372J008581j133484l40450
$$ plain form
8876 -2158393 -1974055 -1453453 -1045157 -1320663 -2636074 -3353275 -4573203 -6234672 -6614373
8867 -6614373 -6112964 -4870330 -3421987 -2914661 -2599869 -3431438 -4504159 -2917446 -210402
8858 -210402 1117179 283120 -1188565 -1551867 -1772871 -1195873 -553039 -1218978 -1430164
8849 -1430164 -616047 -1054297 -2459302 -1588217 -160510 1244877 714919 969855 861265
8840 861265 -650725 -1112861 -2053671 -3055431 -957538 1459412 1540922 1953793 2271319
8831 2271319 889205 -1080323 -1458003 -906529 -1022893 -697147 98891 136636 682696
8822 682696 1059572 1703051 2014532 1008410 -1249260 -3072170 -1720093 242933 -487810
8813 -487810 -2140388 -2419414 -2349338 -3585068 -4188741 -4004486 -3440671 -3259150 -3143862 -5218003
$$ packed form
8876b158393J84338N20602M08296k75506j315411p17201j219928j661469l79701
8867f614373N01409J242634J448343N07326L14792q31569j072721J586713K707044
8858b10402J327581q34059j471685l63302k21004N76998O42834o65939k11186
8849a430164Q14117m38250j405005Q71085J427707J405387n29958K54936j08590
8840H61265j511990m62136r40810j001760K097893K416950Q1510M12871L17526
8831B271319j382114j969528l77680N51474j16364L25746P96038L7745N46060
8822F82696L76876O43479L11481j006122k257670j822910J352077J963026p30743
8813d87810j652578k79026P0076j235730o03673J84255N63815J81521J15288k074141
$$ plain form
8803 -5218003 -6267396 -6561097 -5004305 -2340198 -362323 662381 370478 -1124138 -1716497
8794 -1716497 -1954758 -2907991 -4611094 -5369372 -4049726 -2490545 -1100460 464841 342470
8785 342470 -859958 -755060 -1020180 -1289769 -1537195 -2123782 -2147405 -1483091 360061 1107521
8775 1107521 424980 -1788908 -3275217 -3254303 -2156309 -1666264 -715255 -900314 -429084
8766 -429084 -210243 -1698280 -3596888 -4293296 -4764093 -3990200 -2782731 -1578662 -2518231
8757 -2518231 -2417444 -987643 -744740 -412586 803572 763511 -706750 -982675 -1356916
8748 -1356916 -835540 -421727 -655539 -771788 -923513 -2179851 -3113471 -2210193 -1346040
8739 -1346040 -1265666 -1286792 -1051867 607068 1600142 -263886 -1676651 -2355726 -2440503 -2687172
$$ packed form
8803e218003j049393k93701J556792K664107J977875J024704k91903j494616n92359
8794a716497k38261r53233j703103p58278J319646J559181J390085J565301j22371
8785C42470j202428J04898k65120k69589k47426n86587k3623O64314J843152P47460
8775A107521o82541k213888j486309K0914J097994M90045R51009j85059M71230
8766d29084K18841j488037j898608o96408m70797P73893J207469J204069r39569
8757b518231J00787J429801K42903L32154J216158m0061j470261k75925l74241
8748a356916N21376M13813k33812j16249j51725j256338r33620R03278Q64153
8739a346040Q0374k1126K34925J658935R93074j864028j412765o79075q4777k46669
$$ plain form
8729 -2687172 -3232501 -2767613 -2909554 -4560747 -4019686 -1830873 -805042 -1374938 -2383299
8720 -2383299 -3912873 -5559731 -4044293 -2466993 -2455031 -2484153 -1824268 -539528 -233511
8711 -233511 -572309 -1404030 -1935306 -2157762 -2189251 -1799540 -1253841 -2305329 -3031954 -3178050
8701 -3178050 -4685285 -5237508 -4770298 -4953610 -5237419 -5325965 -5471280 -4598479 -2962648
8692 -2962648 -2257955 -3404042 -5858890 -5519147 -4669888 -3891351 -2782717 -3919265 -4313317
8683 -4313317 -2728703 -1559726 -1313876 -1522555 -2454286 -2817009 -2894108 -4064273 -5968508
8674 -5968508 -7350078 -7429759 -6343110 -6775429 -7098789 -7229330 -6623313 -6334593 -6111367
8665 -6111367 -5802912 -5493548 -6223364 -7262194 -7959201 -8491527 -9970089 -9499362 -8156930
$$ packed form
8729b687172n45329M64888j41941j651193N41061K188813J025831n69896j008361
8720b383299j529574j646858J515438J577300J1962k9122O59885J284740L06017
8711b33511l38798q31721n31276k22456l1489L89711N45699j051488p26625j46096
8701c178050j507235n52223M67210j83312k83809q8546j45315Q72801J635831
8692b962648P04693j146087k454848L39743Q49259P78537J108634j136548l94052
8683d313317J584614J168977K45850k08679r31731l62723p7099j170165j904235
8674e968508j381570p9681J086649m32319l23360j30541O06017K88720K23226
8665f111367L08455L09364p29816j038830o97007n32326j478562M70727J342432
$$ plain form
8656 -8156930 -8903863 -10225316 -9852389 -8356950 -8636537 -8890571 -9880364 -12407171 -14390415
8647 -14390415 -13917719 -12211762 -11668058 -11462178 -11365003 -11585520 -12961986 -13281117 -13400823
8638 -13400823 -14202330 -16117090 -16987690 -16630654 -17820510 -19369604 -21308918 -23190080 -26174046
8629 -26174046 -28583831 -30683108 -33341189 -36238443 -40129763 -44496464 -49425215 -54104705
8621 -54104705 -57944952 -62328474 -68221642 -75660721 -84644107 -96764361 -110181751 -123543289
8613 -123543289 -137126389 -150403183 -161206201 -166855586 -166605744 -162237739 -154715199 -145230421
8605 -145230421 -133386149 -120426930 -108387543 -96751408 -86721258 -78885958 -71071232
8598 -71071232 -62882311 -54861932 -50148460 -46202088 -40154918 -33926088 -30255973 -28434496
$$ packed form
8656h156930p46933j321453L72927J495439k79587k54034r89793k526807j983244
8647a4390415M72696J705957N43704K05880R7175k20517j376466l19131j19706
8638a3400823q01507j914760q70600L57036j189856j549094j939314j881162k983966
8629b6174046k409785k099277k658081k897254l891320m366701m928751m679490
8621e4104705l840247m383522n893168p439079q983386j2120254j3417390j3361538
8613a23543289j3583100j3276794j0803018n649385K49842M368005P522540R484778
8605a45230421J1844272J2959219J2039387J1636135J0030150P835300P814726
8598g1071232Q188921Q020379M713472L946372O047170O228830L670115J821477
$$ plain form
8590 -28434496 -27492233 -26492355 -25595782 -25013220 -23334554 -22118471 -21376837 -20790520 -20817556
8581 -20817556 -21871100 -21392472 -20986240 -21282401 -22264228 -23548728 -23483954 -23119728 -23693003
8572 -23693003 -26996977 -29855988 -34389287 -41333519 -48974351 -55620252 -63171291 -70561429
8564 -70561429 -77522407 -87189266 -98567384 -109673751 -118627400 -124077692 -127131478 -125934636
8556 -125934636 -119805286 -110895496 -100038512 -90570586 -82202223 -75512313 -69732008 -63682747
8548 -63682747 -57882770 -52977292 -48303977 -42656676 -38427566 -33337174 -28146867 -24299512
8540 -24299512 -21558612 -19409230 -17627114 -16880630 -16477800 -14774973 -12294567 -11123859
8532 -11123859 -10242995 -9489220 -9531996 -9253842 -7951549 -5994413 -4755796 -4852635 -3794915
$$ packed form
8590b8434496R42263R99878Q96573N82562J678666J216083P41634N86317k7036
8581b0817556j053544M78628M06232k96161r81827j284500O4774L64226n73275
8572b3693003l303974k859011m533299o944232p640832o645901p551039p390138
8564g0561429o960978r666859j1378118j1106367q953649n450292l053786J196842
8556a25934636O129350Q909790J0856984R467926Q368363O689910N780305O049261
8548f3682747N799977M905478M673315N647301M229110N090392N190307L847355
8540b4299512K740900K149382J782116P46484M02830J702827K480406J170708
8532a1123859Q80864P53775m2776K78154J302293J957136J238617r6839J057720
$$ plain form
8523 -3794915 -3608193 -3799660 -3014268 -3523610 -5137498 -5641388 -6105592 -5250609 -2170481
8514 -2170481 86423 70804 -1163078 -2994184 -2896606 -1748485 -2208605 -2445114 -2158967
8505 -2158967 -1818358 -1374297 -859573 -753599 -886403 -1687928 -1904012 -1217410 -841473 -1318665
8495 -1318665 -759752 1097823 214293 -1626891 -3026428 -2538596 -1235950 516333 553833
8486 553833 -1203677 -2360940 -3185897 -2631713 -2162911 -1650904 -1092468 -905190 -634158
8477 -634158 463507 1829083 1395038 -8239 -2592584 -3041956 -245937 2375772 995189
8468 995189 -673270 262676 977341 -234652 -1510592 -840310 -5360 -383133 -535289
8459 -535289 -743843 -2041477 -3542955 -5501724 -6589533 -5121313 -2784065 -2336012 -3391898
$$ packed form
8523c794915J86722j91467P85392n09342j613888n03890m64204Q54983L080128
8514b170481K256904j5619j233882j831106R7578J148121m60120k36509K86147
8505b158967L40609M44061N14724J05974j32804q01525k16084O86602L75937m77192
8495a318665N58913J857575q83530j841184j399537M87832J302646J752283L7500
8486E53833j757510j157263q24957N54184M68802N12007N58436J87278K71032
8477f34158J097665J365576m34045j403277k584345m49372K796019K621709j380583
8468I95189j668459R35946P14665j211993j275940O70282Q34950l77773j52156
8459e35289k08554j297634j501478j958769j087809J468220K337248M48053j055886
$$ plain form
8450 -3391898 -3787801 -4859959 -7754858 -7752164 -6021349 -6966867 -8127022 -8075606 -8605912
8441 -8605912 -8779613 -7023791 -6744165 -7476939 -7440762 -7448025 -8218753 -9244768 -10644956 -11821266
8431 -11821266 -11842151 -12011768 -11762743 -12071242 -12962222 -13101297 -14120945 -15154590 -16916820
8422 -16916820 -19559692 -20750365 -21057728 -21288125 -22911224 -25273610 -26558080 -27677291
8414 -27677291 -29903782 -35457539 -42467597 -49445009 -56258532 -63643923 -72730933 -82523331
8406 -82523331 -95671380 -109720697 -122819193 -133621269 -143003123 -151470690 -156732196 -159703152
8398 -159703152 -159234681 -153352762 -144665683 -134675850 -122832199 -111032258 -100522051 -92012225
8390 -92012225 -82695442 -71673129 -62036437 -54861950 -47373075 -40742336 -36271282 -31541272
$$ packed form
8450c391898l95903j072158k894899K694J730815r45518j160155N1416n30306
8441h605912j73701J755822K79626p32774L6177p263p70728j026015j400188j176310
8431a1821266k0885j69617K49025l08499q90980j39075j019648j033645j762230
8422a6916820k642872j190673l07363k30397j623099k362386j284470j119211
8414b7677291k226491n553757p010058o977412o813523p385391r087010r792398
8406h2523331j3148049j4049317j3098496j0802076r381854q467567n261506k970956
8398a59703152M68471N881919Q687079R989833J1843651J1799941J0510207Q509826
8390i2012225R316783J1022313R636692P174487P488875O630739M471054M730010
$$ plain form
8382 -31541272 -25752044 -22937766 -22317127 -21153013 -20588182 -19892727 -18601654 -16955958 -15308763
8373 -15308763 -13784353 -12447422 -11778731 -10239397 -8432405 -8209446 -8241731 -7934167 -7332577
8364 -7332577 -6735488 -7747172 -9144084 -8578321 -6168208 -2658573 -2284843 -5136829 -7224230
8355 -7224230 -6280037 -5975588 -7774846 -8661833 -6895050 -4634709 -3388041 -4776224 -6711559
8346 -6711559 -8304045 -8511050 -8245675 -7660902 -6642071 -5703445 -5759328 -7221924 -8004149
8337 -8004149 -7363262 -6364982 -4390022 -4990708 -6435254 -5830135 -4812935 -4520182 -4848793
8328 -4848793 -4945502 -3015977 -2080194 -1240045 -973322 -1360532 -1653313 -1769243 -1932817 -1351136
8318 -1351136 -743259 -1566106 -2251213 -1796411 -1771293 -1320414 -421956 -788312 -1811764 -2134938
$$ packed form
8382c1541272N789228K814278O20639J164114N64831O95455J291073J645696J647195
8373a5308763J524410J336931O68691J539334J806992K22959l2285L07564O01590
8364g332577N97089j011684j396912N65763K410113L509635L73730k851986k087401
8355g224230R44193L04449j799258q86987J766783K260341J246668j388183j935335
8346f711559j592486k07005K65375N84773J018831R38626n5883j462596p82225
8337h004149O40887R98280J974960o00686j444546O05119J017200K92753l28611
8328d848793r6709J929525R35783Q40149K66723l87210k92781j15930j63574N81681
8318a351136O07877q22847o85107M54802K5118M50879Q98458l66356j023452l23174
$$ plain form
8308 -2134938 -2844679 -2827933 -2348215 -1936135 -2835149 -4204487 -2872963 -1238044 403449
8299 403449 635799 -217413 -476940 340226 1299433 1324107 2132946 2938131 3223475 5316195
8289 5316195 7196829 6907544 5268310 4036233 4473691 4742359 4385887 3320587 1043429
8280 1043429 177116 669260 395021 -250255 -531985 -253145 1430420 3783825 4692266
8271 4692266 5052437 4953182 4973425 3752019 1969697 1265092 599983 -471314 -696502
8262 -696502 742915 2670548 3988874 5521643 5931467 3655531 1957546 1838587 2459644
8253 2459644 2726343 3001536 3174350 4105198 4471194 3757525 5425512 5752091 4929070
8244 4929070 3858547 2979349 2661390 2303483 2987029 3930924 5178451 6340793 7898742
$$ packed form
8308b134938p09741J6746M79718M12080q99014j369338J331524J634919J641493
8299D03449K32350q53212k59527Q17166R59207K4674Q08839Q05185K85344K092720
8289E316195J880634k89285j639234j232077M37458K68668l56472j065300k277158
8280A043429q66313M92144k74239o45276k81730K78840J683565K353405R08441
8271D692266L60171r9255K0243j221406j782322p04605o65109j071297k25188
8262f96502J439417J927633J318326J532769M09824k275936j697985j18959O21057
8253B459644K66699K75193J72814R30848L65996p13669J667987L26579q23021
8244D929070j070523q79198l17959l57907O83546R43895J247527J162342J557949
$$ plain form
8235 7898742 8503637 7019468 6510616 7185057 5896505 4593805 4427564 4784543 4693992
8226 4693992 4823684 6044939 5036988 3288952 3180103 3050909 3649010 4205562 3754813
8217 3754813 3229170 3225483 3461786 4465237 4811761 4863910 5322588 4678338 3138422 3422669
8207 3422669 4319018 4978773 3716914 2709189 2634051 2158720 2759107 2835470 2187378 1782312
8197 1782312 1357955 1955297 3548941 3162678 2934240 3206252 3634432 3648334 4730865
8188 4730865 5706123 5756845 6589460 8090710 8952315 9134870 9587012 9027794 6898123
8179 6898123 5583181 6061597 7525569 8924840 11056374 13175157 13418393 11713851 9885962
8170 9885962 10340413 11379047 11240094 10279451 9514289 7666311 6035967 3350894 1421910
$$ packed form
8235G898742O04895j484169n08852O74441j288552j302700j66241L56979r0551
8226D693992J29692J221255j007951j748036j08849j29194N98101N56552m50749
8217C754813n25643l687K36303J003451L46524N2149M58678o44250j539916K84247
8207C422669Q96349O59755j261859j007725p5138m75331O00387P6363o48092m05066
8197A782312m24357N97342J593644l86263k28438K72012M28180J3902J082531
8188D730865R75258N0722Q32615J501250Q61605J82555M52142n59218k129671
8179F898123j314942M78416J463972J399271K131534K118783K43236j704542j827889
8170I885962M54451J038634j38953r60643p65162j847978j630344k685073j928984
$$ plain form
8161 1421910 864298 1028441 1993420 2648773 2272248 1577895 1835031 1090651 -264860
8152 -264860 -331685 725486 536920 1556390 2272045 2026079 2798291 3134763 3295074 4442782
8142 4442782 5174607 5147519 5245172 5655216 5035560 3533023 3133958 2402754 2373524 1823470
8132 1823470 1999142 3269359 3842217 3565190 2940936 2579575 2298744 3864509 5484306
8123 5484306 5279524 4691030 6128535 8992146 9874381 7495412 6211086 5371928 6210075
8114 6210075 6278534 4354794 3848341 5660075 7180888 6232104 5824608 7275111 9188194
8105 9188194 9036763 7327327 6515899 6014761 5398490 5497908 4669285 2974415 720961
8096 720961 -253356 -1317426 -2383474 -1168355 572355 1358473 1247281 441034 23270
$$ packed form
8161A421910n57612J64143R64979O55353l76525o94353K57136p44380j355511
8152b64860o6825J057171j88566J019470P15655k45966P72212L36472J60311J147708
8142D442782P31825k7088R7653M10044o19656j502537l99065p31204k9230n50054
8132A823470J75672J270217N72858k77027o24254l61361k80831J565765J619797
8123E484306k04782n88494J437505K863611Q82235k378969j284326q39158Q38147
8114F210075O8459j923740n06453J811734J520813r48784m07496J450503J913083
8105I188194j51431j709436q11428n01138o16271R9418q28623j694870k253454
8096G20961r74317j064070j066048J215119J740710P86118j11192q06247m17764
$$ plain form
8087 23270 706212 528291 197467 1514502 1012794 -252868 -933341 -1159610 545125
8078 545125 2338347 3000331 2577328 337895 -642197 -530972 -550886 -704436 -1181165 -2086721
8068 -2086721 -3468510 -2826829 -1810930 -85329 1051224 576613 600498 -357134 -1248747
8059 -1248747 -1714524 -1645708 -1367180 -296648 458534 -214002 -2067909 -4910754 -5467833
8050 -5467833 -3094731 -2160881 -4100319 -7280051 -7227162 -7364940 -7328250 -7993462 -9036143
8041 -9036143 -8197818 -6810841 -8164871 -10113518 -11177382 -14161317 -16651921 -17835565
8033 -17835565 -19305644 -21654693 -23940569 -26855054 -32243675 -38745838 -45172489 -50396531
8025 -50396531 -55928690 -62783847 -70597937 -79325535 -86896921 -90905687 -93594558 -94050800
$$ packed form
8087B3270O82942j77921l30824J317035n01708j265662o80473k26269J704735
8078E45125J793222O61984m23003k239433r80092J11225j9914j53550m76729r05556
8068b086721j381789O41681J015899J725601J136553m74611K3885r57632q91613
8059a248747m65777O8816K78528J070532P55182o72536j853907k842845n57079
8050e467833K373102R33850j939438l179732N2889j37778L6690o65212j042681
8041i036143Q38325J386977j354030j948647j063864k983935k490604j183644
8033a7835565j470079k349049k285876k914485n388621o502163o426651n224042
8025e0396531n532159o855157p814090q727598p571386m008766k688871m56242
$$ plain form
8017 -94050800 -89583419 -83390728 -79008598 -72736366 -65125206 -57394555 -51211682 -46126128
8009 -46126128 -42028756 -37164091 -32882243 -29276435 -26115437 -23787332 -21663903 -20704287
8001 -20704287 -19306228 -18297190 -16966271 -15566161 -16014586 -15144687 -12989927 -12559857 -11436746
7992 -11436746 -8961852 -7414161 -6461305 -6386509 -7119611 -6960234 -5168967 -2487604 -1372611
7983 -1372611 -1530606 -1759795 -1212575 -2046282 -3433241 -4409001 -5000473 -3642510 -2410431
7974 -2410431 -776661 277285 971099 2068531 111057 -2535602 -3642374 -5308267
7966 -5308267 -5738974 -5500822 -3968724 -1959818 -448789 -258135 -2290857 -3935251 -3304927
7957 -3304927 -3437038 -3708156 -3831799 -3417668 -1432252 404929 203110 399969 -292431
$$ packed form
8017i4050800M467381O192691M382130O272232P611160P730651O182873N085554
8009d6126128M097372M864665M281848L605808L160998K328105K123429R59616
8001b0704287J398059J009038J330919J400110m48425Q69899K154760M30070J123111
7992a1436746K474894J547691R52856P4796p33102J59377J791267K681363J114993
7983a372611j57995k29189N47220q33707j386959r75760n91472J357963J232079
7974b410431J633770J053946O93814J097432j957474k646659j106772j665893
7966e308267m30707K38152J532098K008906J511029J90654k032722j644394O30324
7957c304927j32111k71118j23643M14131J985416J837181k01819J96859o92400
$$ plain form
7948 -292431 -2077576 -1417423 -183742 27008 321981 1476832 1441453 -827665 -3102856
7939 -3102856 -3528948 -3274119 -2555402 -2467356 -1604075 -125104 804768 751421 256063 265282
7929 265282 804059 1486082 1422852 899777 970669 1292566 641779 892965 1874437 2704831
7919 2704831 1729583 176661 686849 1650730 1458715 1553382 1274213 955319 1253895 1421838
7909 1421838 1052993 735114 215052 64949 -319380 -443404 1030608 2853128 4207169
7900 4207169 4422208 3772595 2350322 1593482 1896661 3619513 4854482 6022251 5598872
7891 5598872 5345534 6155658 6058348 4639969 2614000 2044069 1789720 245915 -527853
7882 -527853 -1318059 -2930885 -3887528 -2841078 111068 1879592 3060671 3954329 4503560
$$ packed form
7948b92431j785145O60153J233681K10750K94973J154851l5379k269118k275191
7939c102856m26092K54829P18717Q8046Q63281J478971R29872n3347m95358R219
7929B65282N38777O82023o3230n23075P0892L21897o50787K51186R81472Q30394
7919B704831r75248j552922N10188R63881j92015R4667k79169l18894K98576J67943
7909A421838l68845l17879n20062j50103l84329j24024J474012J822520J354041
7900D207169K15039o49613j422273p56840L03179J722852J234969J167769m23379
7891E598872k53338Q10124r7310j418379k025969n69931k54349j543805p73768
7882e27853p90206j612826r56643J046450K952146J768524J181079Q93658N49231
$$ plain form
7873 4503560 2203632 -576168 -1725438 -1023896 729985 2191651 2791809 1914880 845471
7864 845471 -183524 -839995 1441905 4622845 3506504 11147 -1123897 -1355596 -1278993
7855 -1278993 383362 1611050 2350114 1288022 174291 951323 934674 -811223 -139991
7846 -139991 1524821 3430543 5924310 6209283 5215434 3746850 1651474 1511270 741399
7837 741399 29053 -995067 -2641667 -1356417 2468992 2927007 2203026 1848945 2068575
7828 2068575 2326213 3105180 5192528 5348668 3878192 2979996 3508415 4937581 3630605
7819 3630605 1289911 -845738 -2313871 -1928376 -1578281 -2615959 -2204187 -971532 -1832269
7810 -1832269 -3332278 -4133397 -3447765 -2233718 -1807262 -1719329 -1876427 -1785564 -647845
$$ packed form
7873D503560k299928k779800j149270P01542J753881J461666O00158q76929j069409
7864H45471j028995o56471K281900L180940j116341l495357j135044k31699P6603
7855a278993J662355J227688P39064j062092j113731P77032j6649j745897O71232
7846a39991J664812J905722K493767K84973r93849j468584k095376j40204p69871
7837G41399p12346j024120j646600J285250L825409M58015p23981l54081K19630
7828B068575K57638P78967K087348J56140j470476q98196N28419J429166j306976
7819C630605k340694k135649j468133L85495L50095j037678M11772J232655q60737
7810a832269j500009q01119O85632J214047M26456Q7933j57098R0863J137719
$$ plain form
7801 -647845 142639 -466810 -1968098 -1371028 -1400851 -700328 429737 -327671 -105547 63739
7791 63739 53013 511734 290914 -150337 878792 1489650 878696 -838983 -694884 -113061
7781 -113061 -1151267 -1411110 -1377624 -906940 -652408 -1714256 -1603671 -832925 -234179 1049472
7771 1049472 2475560 3668904 4765809 4174651 2320276 726478 228111 -718226 -889068
7762 -889068 291168 639018 -1022018 -1414520 -1778260 -3096189 -2895729 -1066477 -117153
7753 -117153 -234302 97007 1876603 3230627 3451874 2238822 -512908 -2114384 -1270903
7744 -1270903 116157 1311608 2601480 3799597 5328246 5120766 3823714 887901
7736 887901 -1189438 -178576 -523570 -543591 455968 1470160 1535011 1275615 1098842 437872
$$ packed form
7801f47845P90484o09449j501288N97070k9823P00523J130065p57408K22124J69286
7791F3739j0726M58721k20820m41251J029129O10858o10954j717679J44099N81823
7781a13061j038206k59843L3486M70684K54532j061848J10585P70746N98746J283651
7771A049472J426088J193344J096905n91158j854375j593798m98367r46337j70842
7762h89068J180236L47850j661036l92502l63740j317929K00460J829252R49324
7753a17153j17149L31309J779596J354024K21247j213052k751730j601476Q43481
7744a270903J387060J195451J289872J198117J528649k07480j297052k935813
7736H87901k077339J010862l44994k0021R99559J014192O4851k59396j76773o60970
$$ plain form
7726 437872 -1301141 -1657371 -1214423 346596 1691636 1091653 721107 1073738 1841156
7717 1841156 3218058 3177932 2987942 2257772 2018032 508404 -31539 720582 1032046
7708 1032046 405590 -565312 -1737609 -3601433 -4156748 -2563245 -1248386 -1268198 -1232822
7699 -1232822 -546510 -34969 -1255604 -1222419 -1144104 -1499812 -1551623 -657383 227222 146983
7689 146983 -197189 1005845 3028691 5291034 5427046 4244268 3265241 3209294 2435305
7680 2435305 262995 -1084499 -1213679 -414837 -481618 93538 1537280 1538067 193065 -1239393
7670 -1239393 -2783072 -2352414 -1620688 -1626784 -1826745 -2453339 -2357007 -1645201 -1193556 811992
7660 811992 2342500 2119066 920022 -544348 341440 868227 -748007 -2107176 -1470872
$$ packed form
7726D37872j739013l56230M42948J561019J345040n99983l70546L52631P67418
7717A841156J376902m0126j89990p30170k39740j509628n39943P52121L11464
7708A032046o26456r70902j172297j863824n55315J593503J314859j9812L5376
7699a232822O86312N11541j220635L3185P8315l55708n1811Q94240Q84605q0239
7689A46983l44172J203034K022846K262343J36012j182778r79027n5947p73989
7680B435305k172310j347494j29180P98842o6781N75156J443742P87j345002j432458
7670a239393j543679M30658P31726o096j99961o26594R6332P11806M51645K005548
7660H11992J530508k23434j199044j464370Q85788N26787j616234j359169O36304
$$ plain form
7651 -1470872 -1143028 -834110 -346220 -418479 -934212 -1192048 -2522149 -4729681 -6302126
7642 -6302126 -7704991 -6094817 -4646977 -4585616 -3879172 -2998827 -1822169 -1124288 -3342714
7633 -3342714 -6585457 -9306002 -10351193 -11602781 -13552473 -15931179 -18648513 -20110056
7625 -20110056 -20806364 -20473673 -21683273 -26260016 -32126535 -38245088 -43757536 -49518396
7617 -49518396 -56563419 -61809534 -67332875 -72864485 -78200935 -82250703 -82082003 -78317809
7609 -78317809 -75527189 -72847514 -66985217 -59665481 -53258394 -47772601 -42240496 -37730309
7601 -37730309 -34788660 -31646436 -28571925 -24862054 -20232645 -13852153 -9794848 -8077732
7593 -8077732 -6747810 -5882357 -5717206 -5765294 -6456812 -6577356 -5462593 -3955051 -2145698
$$ packed form
7651a470872L27844L08918M87890p2259n15733k57836j330101k207532j572445
7642f302126j402865J610174J447840O1361P06444Q80345J176658O97881k218426
7633c342714l242743k720545j045191j251588j949692k378706k717334j461543
7625b0110056o96308L32691j209600m576743n866519o118553n512448n760860
7617d9518396p045023n246115n523341n531610n336450m049768J68700L764194
7609g8317809K790620K679675N862297P319736O407087N485793N532105M510187
7601c7730309K941649L142224L074511L709871M629409O380492M057305J717116
7593h077732J329922Q65453J65151m8088o91518j20544J114763J507542J809353
$$ plain form
7584 -2145698 -2968049 -4149084 -4251408 -3896686 -5339909 -5792093 -4951403 -3963543 -2159848
7575 -2159848 -1564571 -2007728 -2152016 -1559791 -576017 -1575784 -2479837 -1894656 -1148050 -2399139
7565 -2399139 -3344497 -3523480 -2864947 -2951551 -3669501 -4561443 -5031563 -4316188 -2804464 -2335709
7555 -2335709 -2049825 -1316118 -578763 -537288 -1198772 -2985123 -3208627 -2719507 -2062874 -2439739
7545 -2439739 -2662604 -1834322 -1248618 -1449490 -2424916 -2783388 -2589189 -2715999 -2851559 -2372819
7535 -2372819 -2327759 -2121149 -3197380 -2886146 -1375936 -681397 235063 1002043 848708
7526 848708 156144 895060 68807 -194203 429511 1692451 1813277 665544 -62159
7517 -62159 -676013 -692334 -610396 -594737 -2267537 -1457068 455439 1358187 1346882 1397306
$$ packed form
7584b145698q22351j181035j02324L54722j443223m52184Q40690R87860J803695
7575b159848N95277m43157j44288N92225R83774r99767r04053N85181P46606j251089
7565b399139r45358j78983O58533q6604p17950q91942m70120P15375J511724M68755
7555b335709K85884P33707P37355M1475o61484j786351k23504M89120O56633l76865
7545b439739k22865Q28282N85704k00872r75426l58472J94199j26810j35560M78740
7535b372819M5060K06610j076231L11234J510210O94539R16460P66980j53335
7526H48708o92564P38916q26253k63010O23714J262940J20826j147733p27703
7517f2159o13854j6321Q1938J5659j672800Q10469J912507R02748j1305N0424
$$ plain form
7507 1397306 2425654 1613489 140093 -802596 -585177 -799628 -1099192 -1246318 -272612
7498 -272612 264109 -745604 -1791708 -3458522 -4180360 -3191005 -1840714 -1426727 -1898153
7489 -1898153 -2684301 -3184137 -3044109 -1554333 -1525920 -1164748 614965 1454294 673418
7480 673418 -866383 -2185245 -1252270 -1057962 -2082668 -1802283 -2283365 -967464 856431
7471 856431 1732885 360754 772707 1760017 1558975 2434710 3090215 3003163 2103816 228986
7461 228986 -261562 2224246 4235026 2807303 135570 -157912 328904 -461931 511281
7452 511281 3308983 4144585 2454296 -397604 -1225838 493828 1166795 405452 -158805
7443 -158805 -494187 -7844 -409990 -146099 993270 1660192 2263529 2974127 3903201 5094956
$$ packed form
7507A397306J028348q12165j473396r42689K17419k14451k99564j47126R73706
7498b72612N36721j009713j046104j666814p21838R89355J350291M13987m71426
7489a898153p86148m99836J40028J489776K8413L61172J779713Q39329p80876
7480F73418j539801j318862R32975J94308j024706K80385m81082J315901J823895
7471H56431Q76454j372131M11953R87310k01042Q75735O55505q7052q99347j874830
7461B28986m90548K485808K010780j427723k671733k93482M86816p90835R73212
7452E11281K797702Q35602j690289k851900q28234J719666O72967p61343n64257
7443a58805l35382M86343m02146K63891J139369O66922O03337P10598R29074J191755
$$ plain form
7433 5094956 6375149 5122129 2280427 -184477 -3227255 -3447286 -1409933 -903527 -1241898
7424 -1241898 -514084 547639 -235909 -2306856 -3959943 -4603814 -4572838 -4484082 -3745131
7415 -3745131 -1603426 -308865 96773 351026 217193 -71293 -1261497 -964865 663258
7406 663258 9853 -1488067 181457 2380093 3345724 4529275 3763719 1728821 99462
7397 99462 -949579 -1800865 -775789 462641 933088 1668027 2990349 2930799 1867054
7388 1867054 423612 -933309 -1877985 -1758374 -68000 1435830 611125 1210275 3568728
7379 3568728 5868653 7607459 6569691 3248700 1167479 1933698 2956495 2762858 2019961
7370 2019961 -250112 -3688456 -4896382 -4628139 -4220051 -2461133 -1415253 -859040 -290151
$$ packed form
7433E094956J280193j253020k841702k464904l042778k20031K037353N06406l38371
7424a241898P27814J061723p83548k070947j653087o43871L0976Q8756P38951
7415c745131K141705J294561M05638K54253j33833k88486j190204K96632J628123
7406F63258o53405j497920J669524K198636R65631J183551p65556k034898j629359
7397I9462j049041q51286J025076J238430M70447P34939J322322n9550j063745
7388A867054j443442j356921r44676J19611J690374J503830q24705N99150K358453
7379C568728K299925J738806j037768l320991k081221P66219J022797j93637p42897
7370B019961k270073l438344j207926K68243M08088J758918J045880N56213N68889
$$ plain form
7361 -290151 1068704 2619112 2606622 2138772 837042 407670 657349 192218 -1061160
7352 -1061160 -2621600 -1995918 -1162049 -2707755 -3871779 -4296338 -3616992 -3003262 -1485612
7343 -1485612 -757739 -384082 -556720 -2011839 -2655164 -2799964 -2808794 -687101 -225672 -1181349
7333 -1181349 -868877 523526 645838 543103 721923 1124035 2119993 1859061 -241390
7324 -241390 411645 704619 -788576 -2674735 -4261827 -3791409 -3468212 -3727446 -2251177
7315 -2251177 -110035 341212 -1144341 -1568729 -1693802 -904485 -464324 -1996404 -3100198
7306 -3100198 -2819870 -1775216 -1142792 -2474161 -3830244 -4312292 -3808615 -3596808 -2585493
7297 -2585493 -1594943 -152645 970168 1924355 1651345 1149840 -425105 -3492908 -3868188
$$ packed form
7361b90151J358855J550408j2490m67850j301730m29372K49679m65131j253378
7352a061160j560440O25682Q33869j545706j164024m24559O79346O13730J517650
7343a485612P27873L73657j72638j455119o43325j44800q830K121693M61429r55677
7333a181349L12472J392403J22312j02735J78820M02112R95958k60932k100451
7324b41390O53035K92974j493195j886159j587092M70418L23197k59234J476269
7315b251177K141142M51247j485553m24388j25073P89317M40161j532080j103794
7306c100198K80328J044654O32424j331369j356083m82048N03677K11807J011315
7297b585493R90550J442298J122813R54187k73010n01505j574945l067803l75280
$$ plain form
7288 -3868188 -2048936 -453739 1576822 2436646 1668634 1225207 212034 -789740 -1228543
7279 -1228543 -319549 999301 2022802 2606044 3246897 2667447 2517595 1013077 -343547
7270 -343547 -639153 175361 1113390 2058119 2513914 3459849 3357549 2527029 2709076 2488309
7260 2488309 1073377 -760545 -941643 -142741 -538684 -949083 1085113 2257610 1715082
7251 1715082 8978 -1076806 -1392474 -1688382 -280222 1702845 2221296 1203576 1450370
7242 1450370 3587626 3664450 3555835 4447603 4342033 2356824 814600 178513 -1183890
7233 -1183890 -3348135 -3303250 -2915216 -1911891 -736636 -95581 455421 1188376 606323
7224 606323 -55868 1770321 2808698 2458233 1914764 1551103 1577379 1603954 1735411 2105612
$$ packed form
7288c868188J819252J595197K030561Q59824p68012m43427j013173j001774m38803
7279a228543R08994J318850J023501N83242O40853n79450j49852j504518j356624
7270c43547k95606Q14514R38029R44729M55795R45935j02300q30520J82047k20767
7260B488309j414932j833922j81098P98902l95943m10399K034196J172497n42528
7251A715082j706104j085784l15668k95908J408160J983067N18451j017720K46794
7242A450370K137256P6824j08615Q91768j05570j985209j542224o36087j362403
7233a183890k164245M4885L88034J003325J175255O41055N51002P32955n82053
7224F06323o62191J826189J038377l50465n43469l63661K6276K6575J31457L70201
$$ plain form
7214 2105612 2123489 1707481 -580063 -1861170 -649191 763477 746768 -526563 -2999236
7205 -2999236 -2859621 -2807620 -3843011 -3974479 -3177842 -3688809 -3868940 -3489046 -1554792
7196 -1554792 -442072 958539 1824413 -114382 -333387 1626958 1885415 1801217 2067382
7187 2067382 1296346 272784 880026 1793783 1748491 2792196 2300193 159420 -674414
7178 -674414 496444 2394409 3878770 5415936 7931540 9221306 7833589 4823012
7170 4823012 2338677 1503242 2095455 2208356 1728121 2364553 2129871 1726545 2419774
7161 2419774 2740497 3228944 4735437 5525274 3705531 1979253 1858606 2185370 3473805
7152 3473805 1899798 -132971 432047 3002871 4403782 3178558 2770807 4142898 4123214
$$ packed form
7214B105612J7877m16008k287544j281107J211979J412668j6709j273331k472673
7205b999236J39615N2001j035391j31468P96637n10967j80131L79894J934254
7196a554792J112720J400611Q65874j938795k19005J960345K58457q4198K66165
7187B067382p71036j023562O07242R13757m5292J043705m92003k140773q33834
7178f74414J170858J897965J484361J537166K515604J289766j387717l010577
7170D823012k484335q35435N92213J12901m80235O36432k34682m03326O93229
7161B419774L20723M88447J506493P89837j819743j726278j20647L26764J288435
7152C473805j574007k032769N65018K570824J400911j225224m07751J372091j9684
$$ plain form
7143 4123214 3188022 3233979 4039894 4396215 5040553 6244131 5156583 4016464 4683076
7134 4683076 4145307 4585565 6470243 7679968 7613573 7179586 4882153 2857690 2842943
7125 2842943 3744145 3937395 3362815 2993947 3934354 4447497 4170565 3979500 2813055
7116 2813055 1975282 1471667 317349 402113 873571 1189856 348543 -198282 428680 1928580
7106 1928580 1554442 531759 191687 804149 1058005 1258933 1570333 1468523 1701317
7097 1701317 2697993 4902544 5151639 4785769 4893740 5941548 7801136 8411356 7401683
7088 7401683 6639773 6321303 5691821 6347362 5290199 4414160 3597068 1873679 1682800
7079 1682800 3502154 2362719 622933 -341851 554056 2528213 3639134 3583973 4350952
$$ packed form
7143D123214r35192M5957Q05915L56321O44338J203578j087548j140119O66612
7134D683076n37769M40258J884678J209725o6395m33987k297433k024463j4747
7125B842943R01202J93250n74580l68868R40407N13143k76932j91065j166445
7116B813055q37773n03615j154318Q4764M71458L16285q41313n46825O26962J499900
7106A928580l74138j022683l40072O12462K53856K00928L11400j01810K32794
7097A701317R96676K204551K49095l65870J07971J047808J859588O10220j009673
7088G401683p61910l18470o29482O55541j057163q76039q17092j723389j90879
7079A682800J819354j139435j739786r64784Q95907J974157J110921n5161P66979
$$ plain form
7070 4350952 5441190 5064456 2524488 1430156 1629587 1669919 1432711 2516498 2983064
7061 2983064 2286889 500701 -655101 -253001 1045719 2202247 4039223 6590981 8045422
7052 8045422 6847158 5835383 4489582 3234013 5812464 5795967 3183560 2917656 3343656
7043 3343656 3136932 2111338 1954383 3045331 2295632 1038819 237533 535841 3192981
7034 3192981 4182003 3049985 2879112 2812167 2242204 2231816 2367534 1710987 1911014 3516518
7024 3516518 4369271 4433694 3465134 3529020 4520160 5188202 4300568 2689300 1523223 1014268
7014 1014268 2312811 5808427 6840188 5007385 3685838 2536983 1796835 2346958 2646209
7005 2646209 2245664 1855094 2336236 1600120 1212876 1402088 3953651 5413216 4068526
$$ packed form
7070D350952J090238l76734k539968j094332J99431M0332k37208J083787M66566
7061B983064o96175j786188j155802M02100J298720J156528J836976K551758J454441
7052H045422j198264j011775j345801j255569K578451j6497k612407k65904M26000
7043C343656k06724j025594j56955J090948p49699j256813q01286K98308K657140
7034C192981R89022j132018j70873o6945n69963j0388J35718o56547K00027J605504
7024C516518Q52753O4423r68560O3886R91140O68042q87634j611268j166077n08955
7014A014268J298543L495616J031761j832803j321547j148855p40148N50123K99251
7005B646209m00545l90570M81142p36116l87244J89212K551563J459565j344690
$$ plain form
6996 4068526 2319518 183548 -1126191 -989553 -4339 460047 -368432 -8048 789035
6987 789035 1169956 1023419 499672 430629 -15757 -389914 1160864 1586699 -518868 -508885
6977 -508885 396207 157481 -2238622 -3148543 -2367524 -3124217 -3630595 -5407007 -6610526
6968 -6610526 -9604816 -15174015 -21095973 -27308292 -33878529 -39107944 -37607406 -28778146
6960 -28778146 -20089693 -13227515 -7783707 -4306416 -198984 2672521 3791125 4259879
6952 4259879 5047546 5532798 4287475 3221480 4291170 4099590 4024734 4177356 3603868
6943 3603868 5117523 7057194 7372507 7510494 7118329 5837499 6097475 6956519 8259571
6934 8259571 9635516 10790198 11783250 14415094 17290311 21600610 28432199 36811113
$$ packed form
6996D068526j749008k135970j309739J36638R85214M64386q28479L60384P97083
6987G89035L80921j46537n23747o9043m46386l74157J550778M25835k105567R983
6977e08885R05092k38726k396103r09921P81019p56693n06378j776412j203519
6968f610526k994290n569199n921958o212319o570237n229415J500538Q829260
6960b8778146Q688453O862178N443808L477291M107432K871505J118604M68754
6952D259879P87667M85252j245323j065995J069690j91580p4856J52622n73488
6943C603868J513655J939671L15313J37987l92165j280830K59976Q59044J303052
6934H259571J375945J154682R93052K631844K875217M310299O831589Q378914
$$ plain form
6926 36811113 48257130 63080741 72443380 67128667 52322319 37305924 24501585
6919 24501585 15924821 12571385 11028077 8829180 6733536 3856604 2567436 3459698
6911 3459698 5548457 7972436 8732500 7370690 7519636 9574270 9973206 7852707 5898966
6902 5898966 5318810 4550323 4095544 4003224 4366829 3629865 2692780 1240481 -446465
6893 -446465 109314 1502932 2039913 2627412 2551908 2003653 308026 -589948 -657406 -4724
6883 -4724 1935798 2944643 2981148 3636348 4130150 3027885 1544762 3200510 5082946
6874 5082946 6004601 6988042 7118688 5516502 3834493 3887864 5910998 6412734 6202547
6865 6202547 6066711 6014470 5080886 5365205 6334264 5396511 5144998 5787470 5365438 2903902
$$ packed form
6926C6811113J1446017J4823611R362639n314713j4806348j5016395j2804339
6919B4501585q576764l353436j543308k198897k095644k876932j289168Q92262
6911C459698K088759K423979P60064j361810J48946K054634L98936k120499j953741
6902E898966n80156p68487m54779r2320L63605p36964r37085j452299j686946
6893d46465N55779J393618N36981N87499p5504n48255j695627q97974o7458O52682
6883d724J940522J008845L6505O55200M93802j102265j483123J655748J882436
6874E082946R21655R83441J30646j602186j682009N3371K023134N01736k10187
6865F202547j35836n2241r33584K84319R69059r37753k51513O42472m22032k461536
$$ plain form
6855 2903902 2171689 3694908 4600407 5693761 6730391 5782595 4821533 5888057 6189964
6846 6189964 6051191 6436783 7295812 6376738 4629486 5017120 5307728 5090089 4611652
6837 4611652 4921620 5796600 5438785 4980146 4252279 3737536 3613020 2888208 3457866 5384094
6827 5384094 5404431 4977939 6544556 7403962 6578894 5667390 5834696 7514638 10422918
6818 10422918 11909832 11268310 8698821 6017972 5138997 6866927 7499184 8124730 10611701
6809 10611701 13221697 13008205 12966085 12760605 13085338 15236958 15840634 16270184 17742190
6800 17742190 19978912 22485547 24183545 25317358 25486309 26720757 29251282 32586256
6792 32586256 36412363 40600607 44844123 50158368 57398737 65756800 73921761 83909115
$$ packed form
6855B903902p32213J523219R05499J093354J036630r47796r61062J066524L01907
6846F189964j38773L85592Q59029r19074j747252L87634K90608k17639m78437
6837D611652L09968Q74980l57815m58639p27867n14743j24516p24812N69658J926228
6827E384094K0337m26492J566617Q59406q25068r11504J67306J679942K908280
6818A0422918J486914o41522k569489k680849q78975J727930O32257O25546K486971
6809A0611701K609996k13492m2120k05480L24733K151620O03676M29550J472006
6800A7742190K236722K506635J697998J133813J68951J234448K530525L334974
6792C2586256L826107M188244M243516N314245P240369Q358063Q164961R987354
$$ plain form
6784 83909115 96521342 112610525 132631052 156845134 186321726 217310192 247256349
6777 247256349 271422065 282980550 276434173 252589469 219439351 186682698 158211379
6770 158211379 133029078 111483213 92304594 76467389 63838364 53403145 45602735
6763 45602735 38734051 32233430 27340802 24594680 22031518 20266775 18417739 15620901
6755 15620901 13884746 13174769 11939470 10458291 9783248 9726168 8515616 7694325 8508577
6746 8508577 9906648 9596162 8600786 6859872 5873818 6204182 7099892 6124610 4709788
6737 4709788 3645295 2870592 3864928 3036114 1371153 1345462 1514894 1466076 2639040
6728 2639040 2830305 2497497 2146526 2424495 4211985 5895885 7832643 9215305 9275910
$$ packed form
6784H3909115J2612227J6089183K0020527K4214082K9476592L0988466K9946157
6777B47256349K4165716J1558485o546377k3844704l3150118l2756653k8471319
6770A58211379k5182301k1545865j9178619j5837205j2629025j0435219p800410
6763D5602735o868684o500621m892628k746122k563162j764743j849036k796838
6755A5620901j736155p09977j235299j481179o75043n7080j210552q21291Q14252
6746H508577J398071l10486r95376j740914r86054L30364Q95710r75282j414822
6737D709788j064493p74703R94336q28814j664961k5691J69432m8818J172964
6728B639040J91265l32808l50971K77969J787490J683900J936758J382662O0605
$$ plain form
6719 9275910 10129984 12244923 13437356 14118117 15645778 16431012 16356051 17518189 19458011
6710 19458011 22569716 25644861 29016588 33819718 41086246 50852934 60935367 70647510
6702 70647510 80927004 90044894 95393173 96181003 93396736 87301664 78902727 68590160
6694 68590160 56908948 46993625 38992669 31787779 27370561 25275809 23448965 20548911
6686 20548911 16931754 13344448 11080410 10798232 10407255 9229049 7787993 5894396
6678 5894396 3296578 250430 -1562376 -313986 233143 -34229 -3040 140432 618538
6669 618538 2254475 3168178 1160300 -481037 1321909 2801946 3764084 4473445 4005187
6660 4005187 3524166 2135563 281648 195279 633786 785902 -347603 -878554 -850745
$$ packed form
6719I275910Q54074K114939J192433O80761J527661P85234p4961J162138J939822
6710A9458011L111705L075145L371727M803130P266528R766688J0082433R712143
6702G0647510J0279494R117890N348279P87830k784267o095072q398937j0312567
6694F8590160j1681212r915323q000956p204890m417218k094752j826844k900054
6686B0548911l617157l587306k264038k82178l90977j178206j441056j893597
6678E894396k597818l046148j812806J248390N47129k67372L1189J43472M78106
6669F18538J635937R13703k007878j641337J802946J480037R62138P09361m68258
6660D005187m81021j388603j853915q6369M38507J52116j133505n30951K7809
$$ plain form
6651 -850745 -807034 -1942959 -2404861 -1413552 -329554 -729783 -602484 397640 1807344
6642 1807344 2954140 1532219 -72574 -1263063 -227436 2427732 2531962 2328069 1443759
6633 1443759 132912 -125408 -940555 -1075054 -1261095 -1878707 -2149337 -1418516 -390574
6624 -390574 92721 617467 1218049 606352 546038 56875 1422513 2549907 1386155
6615 1386155 -1178825 -2494867 -2104091 -2249120 -2871024 -3648376 -5342253 -5877348 -4806806
6606 -4806806 -3681763 -2138782 -637154 -1680961 -938300 378519 1811527 2864575
6598 2864575 3720760 4561925 4668609 4091736 2572380 2541757 3060218 2724733 2516311 1497978
6588 1497978 569624 1111550 2005356 1588951 58350 -2120838 -4420916 -4854920 -4261357
$$ packed form
6651h50745M3711j135925m61902R91309J083998m00229J27299J000124J409704
6642A807344J146796j421921j604793j190489J035627K655168J04230k03893q84310
6633A443759j310847k58320q15147j34499j86041o17612k70630P30821J027942
6624c90574M83295N24746O00582o11697o0314m89163J365638J127394j163752
6615A386155k564980j316042L90776j45029o21904p77352j693877n35095J070542
6606d806806J125043J542981J501628j043807P42661J316819J433008J053048
6598B864575Q56185Q41165J06684n76873j519356l0623N18461l35485k08422j018333
6588A497978r28354N41926Q93806m16405j530601k179188k300078m34004N93563
$$ plain form
6579 -4261357 -3806250 -3713976 -4277496 -3180064 -2470035 -2312543 -1054359 362040 -139749
6570 -139749 -1408792 -1986339 -3888488 -6762789 -6778102 -3478413 -1665983 -3300857 -3486243
6561 -3486243 -1422926 -1317761 -1583486 -278462 1173538 2147160 2392114 1131112 -650217
6552 -650217 -763685 1378572 2021465 774396 -1076734 -3138589 -3981585 -1821366 921076
6543 921076 4104507 5513505 4759955 3990852 2629517 848025 449751 96279 834424
6534 834424 806917 -1417112 -1590212 -57101 102772 -763097 -1073113 66395 2241309
6525 2241309 3021626 1456085 690003 1191785 1313539 447634 -1641090 -3008280 -2143164
6516 -2143164 -126636 2042041 2164763 2820066 2904168 1664673 306722 -252197 1308081
$$ packed form
6579d261357M55107R2274n63520J097432P10029J57492J258184J416399n01789
6570a39749j269043n77547j902149k874301j5313L299689J812430j634874j85386
6561c486243K063317J05165k65725J305024J452000R73622K44954j261002j781329
6552f50217j13468K142257O42893j247069j851130k061855q42996K160219K742442
6543I21076L183431J408998p53550p69103j361335j781492l98274l53472P38145
6534H34424k7507k224029j73100J533111J59873q65869l10016J139508K174914
6525B241309P80317j565541p66082N01782J21754q65905k088724j367190Q65116
6516b143164K016528K168677J22722O55303Q4102j239495j357951n58919J560278
$$ plain form
6507 1308081 3653178 3650500 2299452 608857 -113598 646271 1865030 1877867 970554
6498 970554 534128 -713703 -1867195 -3046648 -3002947 -2040983 -1364613 -1024838 -928161 -927351
6488 -927351 -278972 1021903 1686569 -270521 -1366280 -168741 1519898 306650 -609957
6479 -609957 67129 2131390 3654003 5246625 5819503 6456995 4808617 1560593 -602289
6470 -602289 -485380 1173709 2064919 2258602 1050763 -32702 392465 1262045 760766
6461 760766 -106501 -1440497 -3146845 -2613266 -1999046 -1297592 -3222674 -5133022 -4413117
6452 -4413117 -2570030 -261009 1198196 803625 -188326 503908 1607437 454702 -1654993
6443 -1654993 -1944796 -3577759 -3037795 850051 2168219 1095941 -203546 -485330 -37134
$$ packed form
6507A308081K345097k678j351048j690595p22455P59869J218759J2837r07313
6498I70554m36426j247831j153492j179453M3701R61964O76370L39775R6677Q10
6488i27351O48379J300875O64666j957090j095759J197539J688639j213248r16607
6479f09957O77086K064261J522613J592622N72878O37492j648378l248024k162882
6470f02289J16909J659089Q91210J93683j207839j083465M25167Q69580n01279
6461G60766q67267j333996j706348N33579O14220P01454j925082j910348P19905
6452d413117J843087K309021J459205l94571r91951O92234J103529j152735k109695
6443a654993k89803j632963N39964L887846J318168j072278j299487k81784M48196
$$ plain form
6434 -37134 -338706 -631144 -723131 32320 945055 974749 519020 -271899 390829 1397943
6424 1397943 1363811 300829 36523 361025 1299349 658858 -294096 -716565 -1230346 -2950175
6414 -2950175 -4990756 -5897961 -4476632 -3307371 -2265212 -1521817 -958873 -223742 617393
6405 617393 -41439 -540342 -88277 -1045735 -2245871 -2546476 -2680589 -3009401 -3044608 -1800090
6395 -1800090 -474275 424856 746709 327386 -309403 -302228 145216 370174 980576 1161045
6385 1161045 1458694 454050 -869224 -1313072 -1201864 -1758731 -2436162 -2926829 -2309246
6376 -2309246 -893497 51272 -173229 -1500115 -1641376 -897741 -1880577 -2392747 -3031536
6367 -3031536 -2950611 -4233851 -5934591 -5901610 -3181327 -851527 96141 -591302 -2389095
$$ packed form
6434c7134l01572k92438r1987P55451R12735K9694m55729p90919O62728J007114
6424A397943l4132j062982k64306L24502R38324o40491r52954m22469n13781j719829
6414b950175k040581r07205J421329J169261J042159P43395N62944P35131Q41135
6405F17393o58832m98903M52065r57458j200136l00605j34113l28812l5207J244518
6395a800090J325815Q99131L21853m19323o36789P175M47444K24958O10402J80469
6385A161045K97649j004644j323274m43848J11208n56867o77431m90667O17583
6376b309246J415749R44769k24501j326886j41261P43635r82836n12170o38789
6367c031536Q0925j283240j700740L2981K720283K329800R47668o87443j797793
$$ plain form
6358 -2389095 -1664166 -1500943 -2505388 -2173236 -1970644 -2872626 -3270717 -2935795 -1904550
6349 -1904550 -468919 423879 320238 336915 -46127 659186 1277233 -288192 28922
6340 28922 980029 489307 290013 440165 1667706 1531529 1218843 593446 411718 1086194
6330 1086194 954605 335090 1297582 2895146 3396317 1155139 -721424 -41417 768698
6321 768698 793481 2309269 3236233 2256966 716433 45557 391951 453158 302055 -20001
6311 -20001 -579112 -597518 705966 2479834 3745877 2566784 1636164 1157559 450114
6302 450114 -748736 -1665394 -1037811 422540 600323 50690 -2485067 -3817317 -3079105
6293 -3079105 -3566268 -4921003 -4755244 -3339110 -3299076 -2806014 -1575018 167673 773073
$$ packed form
6358b389095P24929J63223j004445L32152K02592r01982l98091L34922J031245
6349a904550J435631Q92798j03641J6677l83042P05313O18047j565425L17114
6340B8922R51107m90722j99294J50152J227541j36177l12686o25397j81728O74476
6330A086194j31589o19515R62492J597564N01171k241178j876563O80007Q10115
6321G68698K4783J515788R26964r79267j540533o70876L46394O1207j51103l22056
6311b0001n59111j8406J303484J773868J266043j179093r30620m78605p07445
6302D50114j198850r16658O27583J460351J77783n49633k535757j332250P38212
6293c079105m87163j354735J65759J416134M0034M93062J230996J742691O05400
$$ plain form
6284 773073 1810642 2633401 3487220 3248230 1894445 370598 -70048 -1514241 -1652958
6275 -1652958 -78316 1128487 605289 374447 -559574 -1697202 -1488921 -1135552 -1829734
6266 -1829734 -3001479 -2938957 -3491430 -5259005 -4849218 -4741609 -4310641 -3201328 -2649748
6257 -2649748 -2685316 -2430108 -2742329 -3453289 -3387475 -2557086 -2527587 -2176886 -2188657 -2392069
6247 -2392069 -2435514 -932097 681619 1953176 3150516 2476287 1970696 1439311 233701
6238 233701 -1798250 -2315596 -2172523 -1632579 1172503 4377363 6148456 4960686 4273175
6229 4273175 4825344 4823659 3643979 4212736 5493399 5118399 4940517 4054976 4027895 4181516
6219 4181516 3245273 1561180 2403798 3425993 3504904 2487609 49205 -1860436 -3294068
$$ packed form
6284G73073J037569Q22759Q53819k38990j353785j523847m40646j444193j38717
6275a652958J574642J206803n23198k30842r34021j137628K08281L53369o94182
6266a829734j171745O2522n52473j767575M09787J07609M30968J109313N51580
6257b649748l5568K55208l12221p10960O5814Q30389K9499L50701j1771k03412
6247b392069m3445J503417J613716J271557J197340o74229n05591n31385j205610
6238B33701k031951n17346J43073N39944K805082L204860J771093j187770o87511
6229D273175N52169j685j179680N68757J280663l75000j77882q85541k7081J53621
6219D181516r36243j684093Q42618J022195P8911j017295k438404j909641j433632
$$ plain form
6210 -3294068 -3155504 -1697846 -1215273 -216212 833620 1900600 1922078 53970 -538018
6201 -538018 -590979 -844094 -409664 -948307 -1455281 -451597 1363071 1648787 1748290 2369508
6191 2369508 2476163 1749244 -98068 -160242 1551957 1273802 -76577 -960271 -1106795
6182 -1106795 -1211684 -1537244 -867446 103692 -393863 -1693326 -1505234 -1022419 -1785253
6173 -1785253 -2512906 -1169047 2041493 3339959 3331011 3197522 4007798 4605677 3607724
6164 3607724 1312261 -709037 -1454056 -1986472 -1445730 502649 2548730 3890179 4670118
6155 4670118 4261000 296593 -2788828 -1234544 1809293 2936234 2562087 3751108 4703405
6146 4703405 5175563 4485703 3492888 512089 -1505781 -2865481 -2510972 -1224191 -361059
$$ packed form
6210c294068J38564J457658M82573R99061J049832J066980K1478j868108n91988
6201e38018n2961k53115M34430n38643n06974J003684J814668K85716R9503O21218
6191B369508J06655p26919j847312o2174J712199k78155j350379q83694j46524
6182a106795j04889l25560O69798R71138m97555j299463J88092M82815p62834
6173a785253p27653J343859L210540J298466q948j33489Q10276N97879r97953
6164C607724k295463k021298p45019n32416N40742J948379K046081J341449P79939
6155D670118m09118l964407l085421J554284L043837J126941l74147J189021R52297
6146D703405M72158o89860r92815k980799k017870j359700L54509J286781Q63132
$$ plain form
6137 -361059 -218173 208899 322584 -957699 -2896420 -2899328 -936681 693607 1814840
6128 1814840 1786553 635264 768635 1091284 260579 222881 1913880 1477719 1166459 1450929
6118 1450929 819208 305318 690890 1655309 1796925 1351605 404206 -397991 -1064669 -1670268
6108 -1670268 -1126240 -674070 -2228345 -3891530 -3567460 -2156909 -624279 93383 1330153
6099 1330153 2047056 2534418 2494106 1675429 650433 -655078 -1326686 -1815910 -531390
6090 -531390 1029669 1473447 1114921 -1044306 -1365319 -494702 -1012311 -2004119 -1969326 -582210
6080 -582210 1057845 358294 -1218370 -2086836 -907688 729256 1249341 15 -2382159
6071 -2382159 -2301722 -1002186 213109 -575128 -1706408 -1565160 -492115 435401 882166
$$ packed form
6137c61059J42886M27072J13685j280283j938721k908J962647J630288J121233
6128A814840k8287j151289J33371L22649q30705l7698J690999m36161l11260K84470
6118A450929o31721n13890L85572R64419J41616m45320r47399q02197o66678o05599
6108a670268N44028M52170j554275j663185L24070J410551J532630P17662J236770
6099A330153P16903M87362m0312q18677j024996j305511o71608m89224J284520
6090e31390J561059M43778l58526k159227l21013Q70617n17609r91808L4793J387116
6080e82210J640055o99551j576664q68466J179148J636944N20085j249326k382174
6071b382159Q0437J299536J215295p88237j131280J41248J073045R27516M46765
$$ plain form
6062 882166 1393744 1850446 885161 -141628 -167667 495334 712831 -765595 -2209508
6053 -2209508 -2577992 -3079045 -3437217 -1086776 762687 1136108 1688273 1975226 2045420
6044 2045420 2069640 2423322 1434820 2095254 3884356 4395484 3951001 3210503 4084648 5330627
6034 5330627 5069395 4261974 2462517 1398529 543936 -1541316 -2827439 -2982864 -3452301
6025 -3452301 -2622935 -726378 -805980 -2152663 -3286928 -4373205 -4923956 -3507556 -1634764
6016 -1634764 1299357 1780093 -139772 151951 1113329 1349463 -495672 -2130359 -1918232
6007 -1918232 -937350 675237 2597962 3251135 1642934 68522 -1463466 -1670627 -1188821
5998 -1188821 -1038839 336939 2437094 3244342 2264648 796258 -543009 -365254 1494157
$$ packed form
6062H82166N11578M56702r65285j026789k6039O63001K17497j478426j443913
6053b209508l68484n01053l58172K350441J849463L73421N52165K86953P0194
6044B045420K4220L53682r88502O60434J789102N11128m44483p40498Q74145J245979
6034E330627k61232q07421j799457j063988q54593k085252j286123j55425m69437
6025c452301Q29366J896557p9602j346683j134265j086277n50751J416400J872792
6016a634764K934121M80736j919865K91723R61378K36134j845135j634687K12127
6007a918232R80882J612587J922725O53173j608201j574412j531988k07161M81806
5998a188821J49982J375778K100155Q07248r79694j468390j339267J77755J859411
$$ plain form
5989 1494157 3166891 3474342 1716695 -456771 -3216474 -3777845 -2359952 -2426453 -3152304
5980 -3152304 -2256135 -2330854 -3784028 -4280933 -3057417 -800402 -197994 -364342 -1183754
5971 -1183754 -2921845 -4522458 -4782953 -2890552 -3130424 -2506266 -1080355 745709 1564952
5962 1564952 2554461 2937385 2813901 2008432 844442 -1102375 -1251781 -266276 -505381
5953 -505381 -212445 -195143 -575220 -882236 -1917773 -2054435 -1677913 -1796279 -2156891 -1595712
5943 -1595712 -191548 1427640 799679 1004492 2278599 2080637 1572361 1344382 2959187
5934 2959187 3605757 2624563 884735 1166078 2348939 1922406 539402 -581715 -1008726
5925 -1008726 -340176 1902616 3131939 3283254 3190064 3625433 3357503 2313583 2126006
$$ packed form
5989A494157J672734L07451j757647k173466k759703n61371J417893o6501p25851
5980c152304Q96169p4719j453174m96905J223516K257015O02408j66348q19412
5971a183754j738091j600613k60495J892401k39872O24158J425911J826064Q19243
5962A564952R89509L82924j23484q05469j163990j946817j49406R85505k39105
5953e05381K92936J7302l80077l07016j035537j36662L76522j18366l60612N61179
5943a595712J404164J619188o27961K04813J274107j97962n08276k27979J614805
5934B959187O46570r81194j739828K81343J182861m26533j383004j121117m27011
5925a008726O68550K242792J229323J51315r3190M35369k67930j043920j87577
$$ plain form
5916 2126006 2256224 1096491 415033 744936 1252674 2118795 2876904 658453 -1454613
5907 -1454613 -54866 1953655 3683370 4588358 4049778 3197709 2855117 3043635 3305835
5898 3305835 2578502 1995415 1786867 1994587 2025430 1467199 -263050 -1071268 213566
5889 213566 667070 112823 -1160885 -2922262 -3581812 -3502576 -1586526 1124559 1944567
5880 1944567 -223733 -681751 1181376 1451597 616381 -459548 -36305 45314 1042274
5871 1042274 2380808 2703874 2430546 2620379 4169035 3555904 846346 -682785 573951
5862 573951 -504987 -3275788 -3820864 -1118446 -781633 -1587788 -2987170 -5277736 -7252156
5853 -7252156 -7300823 -5432396 -4043048 -4250118 -3927312 -1835152 -1210882 -1639560 -2042744
$$ packed form
5916B126006J30218j159733o81458L29903N07738Q66121P58109k218451k113066
5907a454613J399747K008521J729715R04988n38580q52069l42592J88518K62200
5898C305835p27333n83087k08548K07720L0843n58231j730249q08218J284834
5889B13566M53504n54247j273708j761377o59550P9236J916050K711085Q20008
5880A944567k168300m58018J863127K70221q35216j075929M23243Q1619R96960
5871A042274J338534L23066k73328J89833J548656o13131k709558j529131J256736
5862E73951j078938k770801n45076K702418L36813q06155j399382k290566j974420
5853g252156m8667J868427J389348k07070L22806K092160O24270m28678m03184
$$ plain form
5844 -2042744 -1399074 -1384568 -1508048 -1574941 -1822500 -3639282 -4190860 -4006183 -4424797 -4968520
5834 -4968520 -4464968 -3934006 -2888348 -2276272 -799556 196949 -33095 -174091 19252
5825 19252 495630 -432402 -2607654 -3690137 -1625532 343062 734248 333226 -692484
5816 -692484 -702833 -2005722 -4691061 -5247622 -5125676 -3160701 1106583 2539304 2154477
5807 2154477 861875 -442297 628793 2401628 3661327 2852414 1187011 -168368
5799 -168368 -495971 -21433 994822 1792830 2195048 2974257 2237473 -496138 -2616016
5790 -2616016 -2930486 -3764170 -4255808 -3453589 -2363328 -1405903 -1132011 -1290239 -754890
5781 -754890 580391 598565 -559372 -1927107 -2414039 -1390618 -300115 -170876 -326850
$$ packed form
5844b042744O43670J4506j23480o6893k47559j816782n51578J84677m18614n43723
5834d968520N03552N30962J045658O12076J476716R96505k30044j40996J93343
5825A9252M76378r28032k175252j082483K064605J968594L91186m01022j025710
5816f92484j0349j302889k685339n56561J21946J964975M267284J432721l84827
5807B154477j292602j304172J071090J772835J259699q08913j665403j355379
5799a68368l27603M74538J016255P98008M02218P79209p36784k733611k119878
5790b616016l14470q33684m91638Q02219J090261R57425K73892j58228N35349
5781g54890J335281J8174j157937j367735m86932J023421J090503J29239j55974
$$ plain form
5772 -326850 -744623 -792687 -194110 -141126 -597812 -945314 -232273 976674 2158452 3403567
5762 3403567 5271424 5019066 2309419 419021 -19621 60670 -314940 -1082352 -2103923
5753 -2103923 -3744016 -4554364 -4373173 -4278152 -4488274 -5297154 -5002857 -6496430 -10072169
5744 -10072169 -16372834 -24276371 -33165532 -43029253 -48346895 -43564169 -32369778 -22680942
5736 -22680942 -16412995 -10359220 -6348012 -5128785 -4942053 -2962547 -980422 -37736
5728 -37736 -221334 49508 -686932 -1753304 -267236 1393146 1712295 1912913 3192127
5719 3192127 3419423 2946998 4447374 4858126 3263098 1820061 1945823 1657491 1711442
5710 1711442 1442634 -338770 -1339477 -324929 1531705 2733959 2354557 2217610 2109885
$$ packed form
5772c26850m17773m8064N98577N2984m56686l47502P13041J208947J181778J245115
5762C403567J867857k52358k709647j890398m38642Q0291l75610p67412j021571
5753b103923j640093q10348J81191R5021k10122q08880K94297j493573l575739
5744a0072169o300665p903537q889161r863721n317642M782726J1194391R688836
5736b2680942O267947O053775M011208J219227J86732J979506J982125R42686
5728c7736j83598K70842p36440j066372J486068J660382L19149K00618J279214
5719C192127K27296m72425J500376M10752j595028j443037J25762k88332N3951
5710A711442k68808j781404j000707J014548J856634J202254l79402j36947j07725
$$ plain form
5701 2109885 1328961 567687 -405148 -1079817 -2114834 -2207716 -2387814 -1202447 -1010946
5692 -1010946 -891951 -491957 -1538946 -1374256 -645138 -140398 -115125 429681 -90924 -1773344
5682 -1773344 -2470846 -2116359 -2747006 -3078802 -1880129 -1555285 -1348891 278667 459685
5673 459685 127804 241665 -376232 23424 -242899 -102205 1219543 1190852 708984 974163
5663 974163 1688796 2507504 1492748 -94618 -1030474 -702835 -351166 -568653 44244
5654 44244 1004053 1525864 874045 140195 -1351136 -1991226 -2199040 -2685907 -2602797 -2860088
5644 -2860088 -1496286 419107 1347243 1413735 879774 357712 -78349 176504 709127
5635 709127 -268540 -2051434 -4228064 -4819314 -3519155 -1815197 -255717 -1013669 -1576320
$$ packed form
5701B109885p80924p61274r72835o74669j035017r2882j80098J185367J91501
5692a010946J18995L99994j046989J64690P29118N04740K5273N44806n20605j682420
5682a773344o97502L54487o30647l31796J198673L24844K06394J627558J81018
5673D59685l31881J13861o17897L99656k66323J40694J321748k8691m81868K65179
5663I74163P14633Q18708j014756j587366r35856L27639L51669k17487O12897
5654D4244R59809N21811o51819p33850j491331o40090k07814m86867Q3110k57291
5644b860088J363802J915393R28136O6492n33961n22062m36061K54853N32623
5635G09127r77667j782894k176630n91250J300159J703958J559480p57952n62651
$$ plain form
5626 -1576320 -1241195 -123621 281131 -222136 1164762 3445999 4400749 4655685 3198327
5617 3198327 2094776 3208422 3866401 4980753 6601061 6118527 5569760 4123067 1901931
5608 1901931 728618 1020965 2015711 3747132 3855037 1568440 -176822 -751308 -1398319
5599 -1398319 -2524307 -2873604 -1831477 -535161 -1139941 -1825915 -1728660 -840323 893672
5590 893672 2172174 3056072 4225271 5683006 5126921 2481133 -126326 -1028362 -1521130
5581 -1521130 -1738022 -1390258 -399395 1054473 411148 218166 3044869 4316422 3001151
5572 3001151 2157684 2060060 3186691 5244245 5676891 4028435 1670357 97523 -298082
5563 -298082 -718051 457686 1890783 1076365 571028 1791854 3403279 2685710 1825687
$$ packed form
5626a576320L35125J117574M04752n03267J386898K281237R54750K54936j457358
5617C198327j103551J113646O57979J114352J620308m82534n48767j446693k221136
5608A901931j173313K92347R94746J731421J07905k286597j745262n74486o47011
5599a398319j125988l49297J042127J296316o04780o85974R7255Q88337J733995
5590H93672J278502Q83898J169199J457735n56085k645788k607459r02036m92768
5581a521130k16892L47764R90863J453868o43325j92982K826703J271553j315271
5572C001151q43467r7624J126631K057554M32646j648456k358078j572834l95605
5563b98082m19969J175737J433097q14418n05337J220826J611425p17569q60023
$$ plain form
5554 1825687 -773774 -2094875 -1157057 -634842 -1232689 -1621641 -1016654 -304013 270146
5545 270146 675664 1005873 812987 1465267 1596166 963205 646379 1437238 3116013 3570830
5535 3570830 3179513 2441258 1822101 16851 -648491 981358 1522197 245562 -808463
5526 -808463 -1181959 -62663 713196 772854 54143 -69371 483904 2160998 3497478
5517 3497478 5139784 5865965 4599701 3581550 2181936 946014 -310403 -1810832
5509 -1810832 -1454976 -452309 -1205656 -2779959 -4067857 -5215030 -4707635 -3233152 -2656134
5500 -2656134 -1840086 -1017889 -1145221 -1217858 -3165847 -5099947 -4170327 -2528466 -1862647
5491 -1862647 -1495014 -1756574 -1881824 -1918997 -75805 843845 380750 -111296 -1342569
$$ packed form
5554A825687k599461j321101R37818N22215n97847l88952O04987P12641N74159
5545B70146M05518L30209j92886O52280J30899o32961l16826P90859J678775M54817
5535C570830l91317p38255o19157j805250o65342J629849N40839j276635j054025
5526h08463l73496J119296P75859N9658p18711j23514N53275J677094J336480
5517C497478J642306P26181j266264j018151j399614j235922j256417j500429
5509a810832L55856J002667p53347j574303j287898j147173N07395J474483N77018
5500b656134Q16048Q22197j27332p2637j947989j934100R29620J641861O65819
5491a862647L67633k61560j25250l7173J843192R19650m63095m92046j231273
$$ plain form
5482 -1342569 -1327753 -1515686 -2287865 -1756452 -1091938 250997 1650871 1323284 676864
5473 676864 1108242 1179548 1665971 691619 -1326585 -1430102 -862055 449891 2593777
5464 2593777 4650934 5317192 4092957 2836176 2594827 2916882 4055409 2688977 1642019
5455 1642019 2949403 1994618 1622896 1446009 1344834 1261508 -145554 -1291402 -17297
5446 -17297 2643538 3517486 3092256 2672933 1375604 722706 117259 -444903 -508310 -1046966
5436 -1046966 -2161651 -3624216 -5200905 -4976279 -3869231 -3229209 -3805859 -3234509 -2778477
5427 -2778477 -2149823 -1280924 -2569597 -3869354 -2433312 -1874889 -3337034 -4390862 -3016141
5418 -3016141 -930361 -761874 -1032151 91531 2077022 2118052 2264245 2725034 2423300
$$ packed form
5482a342569J4816j87933p72179N31413O64514J342935J399874l27587o46420
5473F76864M31378P1306M86423r74352k018204j03517N68047J311946K143886
5464B593777K057157O66258j224235j256781k41349L22055J138527j366432j046958
5455A642019J307384r54785l71722j76887j01175q3326j407062j145848J274105
5446a7297K660835Q73948m25230m19323j297329o52898o05447n62162o3407n38656
5436a046966j114685j462565j576689K24626J107048O40022n76650N71350M56032
5427b778477O28654Q68899j288673j299757J436042N58423j462145j053828J374721
5418c016141K085780J68487k70277J123682J985491M1030J46193M60789l01734
$$ plain form
5409 2423300 2295000 2064630 1746548 2050670 2931688 2435485 1443609 1213190 501756 -486004
5399 -486004 -1328870 -824324 -782207 -818213 -372958 194812 506074 -623621 -2548971 -3045090
5389 -3045090 -2938323 -1254280 799277 881078 -590280 -335736 -91411 334231 1035694
5380 1035694 1042495 -284002 -2161895 -3485654 -3266762 -3546650 -4546361 -3948025 -3042090
5371 -3042090 -1753854 -1041918 -2943437 -4223075 -4647605 -4153517 -4537635 -3787625 -1388289
5362 -1388289 1511128 3043331 2245645 1428345 1927400 3422182 3135938 2780228 3431915
5353 3431915 2647118 511780 -519661 165199 983588 890499 343451 161457 -586273
5344 -586273 -1620639 -2337053 -2960851 -3065153 -1393348 913780 2033149 2997731 4010483
$$ packed form
5409B423300j28300k30370l18082L04122Q81018m96203r91876k30419p11434r87760
5399d86004q42866N04546M2117l6006M45255N67770L11262j129695j925350m96119
5389c045090J06767J684043K053557Q1801j471358K54544K44325M25642P01463
5380A035694O801j326497j877893j323759K18892k79888r99711N98336R05935
5371c042090J288236P11936j901519j279638m24530M94088l84118P50010K399336
5362a388289K899417J532203p97686q17300M99055J494782k86244l55710O51687
5353C431915p84797k135338j031441O84860Q18389r3089n47048j81994p47730
5344e86273j034366p16414o23798j04302J671805K307128J119369R64582J012752
$$ plain form
5335 4010483 4363247 4473422 3688719 3615452 3085878 1983221 3105604 3072018 1074766
5326 1074766 59103 1013039 3223152 4126628 3631243 2053712 2149799 3341958 3715041
5317 3715041 3928962 4356392 3256145 1912552 681112 -685467 -1360834 -11757 2763606
5308 2763606 3706125 3510201 3929369 4375970 4563170 2819639 327689 -1443440 -1327727
5299 -1327727 559618 1591846 1042301 -1154833 -1914247 -706425 1283307 2252781 1762633
5290 1762633 373481 -855503 199953 1117494 -546784 -619117 750142 2023126 1452501
5281 1452501 44978 -1018785 -1274367 42712 1484829 1235378 919051 142664 -655838
5272 -655838 -1223510 -2351953 -2127753 488569 1714343 958250 -466494 -357238 649210
$$ packed form
5335D010483L52764J10175p84703p3267n29574j102657J122383l3586j997252
5326A074766j015663R53936K210113R03476m95385j577531R6087J192159L73083
5317C715041K13921M27430j100247j343593j231440j366579o75367J349077K775363
5308B763606R42519j95924M19168M46601J87200j743531k491950j771129J15713
5299a327727J887345J032228n49545k197134p59414J207822J989732R69474m90148
5290A762633j389152j228984J055456R17541j664278p2333J369259J272984n70625
5281A452501j407523j063763k55582J317079J442117k49451l16327p76387p98502
5272f55838n67672j128443K24200K616322J225774p56093j424744J09256J006448
$$ plain form
5263 649210 1123467 390995 -902210 -453027 1602661 158400 -1360458 -305344 1901508
5254 1901508 4130535 5159593 3605693 2450112 1900118 1653740 930705 -46750 765379
5245 765379 2088453 1907175 579238 -1430604 -3292481 -5164940 -4567297 -2895875 -1014249
5236 -1014249 -1293704 -2012873 -1775208 -1043639 -1144873 -1391378 -1041607 -649271 56933 1443449
5226 1443449 2561644 3575271 2332023 105342 -1412304 -1446750 -141659 -252026 191556
5217 191556 438269 452564 -284399 -1195615 452731 2062533 2624526 1429260 386616
5208 386616 -1040453 -2347040 -3540898 -3661638 -1771877 -1302175 -1044875 1568005 2261871
5199 2261871 1186846 1620023 2783655 2705366 2994803 1434277 -1816877 -3265406 -2101416
$$ packed form
5263F49210M74257p32472j293205M49183K055688j444261j518858J055114K206852
5254A901508K229027J029058j553900j155581n49994k46378p23035r77455Q12129
5245G65379J323074j81278j327937k009842j861877j872459N97643J671422J881626
5236a014249k79455p19169K37665P31569j01234k46505L49771L92336P06204J386516
5226A443449J118195J013627j243248k226681j517646l4446J305091j10367M43582
5217A91556K46713J4295p36963r11216J648346J609802N61993j195266j042644
5208C86616j427069j306587j193858j20740J889761M69702K57300K612880O93866
5199B261871j075025M33177J163632p8289K89437j560526l251154j448529J163990
$$ plain form
5190 -2101416 -723654 -194123 -38143 232029 -330349 -2260014 -2893195 -2058659 -121332
5181 -121332 2534103 3563305 1973286 2358558 3700745 2152020 -265845 -381910 -1245846
5172 -1245846 -1787793 -1746087 -3020220 -3977021 -4268877 -3616498 -3566555 -3015827 -2091266 -759382
5162 -759382 -598665 -1629104 -2672345 -2362532 -1742505 -54485 1273162 648679 904031
5153 904031 1527805 1344591 903761 -243174 -564747 -1110861 -1741569 -2687324 -2240387 -961568
5143 -961568 886003 1133215 68570 -1512542 -1243742 600308 1199175 557052 -454804
5134 -454804 -1923114 -2740629 -4102480 -3075859 195831 2191120 2621663 1993239 1471512
5125 1471512 415605 -776360 -18581 1153319 2388324 2428560 2444476 3122737 3154161
$$ packed form
5190b101416J377762N29531J55980K70172n62378j929665o33181Q34536J937327
5181a21332K655435J029202j590019L85272J342187j548725k417865j16065q63936
5172a245846n41947M1706j274133r56801k91856O52379M9943N50728R24561J331884
5162g59382J60717j030439j043241L09813O20027J688020J327647o24483K55352
5153I04031O23774j83214m40830j146935l21573n46114o30708r45755M46937J278819
5143i61568J847571K47212j064645j581112K68800J844050N98867o42123j011856
5134d54804j468310q17515j361851J026621L271690J995289M30543o28424n21727
5125A471512j055907j191965P57779J171900J235005M0236J5916O78261L1424
$$ plain form
5116 3154161 1953297 661993 608678 415754 -707336 -58995 -1001485 -2614810 -2629965
5107 -2629965 -1413845 -1169292 -1951871 -2303564 -994811 330465 -38124 -1203461 496360
5098 496360 3011388 2492316 529074 -712910 -818386 -562634 1420700 2438472 1457269
5089 1457269 -798107 -2489832 -3401331 -4466250 -3411599 -1926470 -219033 987023
5081 987023 1664163 2007706 1563403 1552511 1520033 1620207 2771978 3626441 2496686 1402555
5071 1402555 2109817 3133317 2501944 159627 -1644157 -2276119 -2379815 -994992 506139
5062 506139 759817 1043695 1537534 1378360 1020137 192310 -1444409 -1855260 -1061536 -107030
5052 -107030 1794405 3190256 1849888 -533820 -124308 3941673 6346104 4803230 1819855
$$ packed form
5116C154161j200864j291304n3315j92924j123090O48341r42490j613325j5155
5107b629965J216120K44553p82579l51693J308753J325276l68589j165337J699821
5098D96360K515028n19072j963242j241984j05476K55752J983334J017772r81203
5089A457269k255376j691725r11499j064919J054651J485129J707437J206056
5081I87023O77140L43543m44303j0892l2478J00174J151771Q54463j129755j094131
5071A402555P07262J023500o31373k342317j803784o31962j03696J384823J501131
5062E06139K53678K83878M93839j59174l58223q27827j636719m10851P93724R54506
5052a07030J901435J395851j340368k383708M09512M065981K404431j542874k983375
$$ plain form
5043 1819855 1585597 2355623 2065233 2093071 2618401 1898658 772356 -482330 -703050
5034 -703050 -597082 230204 837687 2131364 2294440 1817548 1698698 2540474 3711580
5025 3711580 4193204 4509279 4494177 3738817 3951889 4976867 5982032 4643020 3290873
5016 3290873 3470904 2273640 781041 -7099 -1268814 -3345140 -3860019 -2412115 -975469
5007 -975469 -726988 -1405598 -1295296 -1238952 -2180498 -3514059 -3834116 -2899618 -1846453 -926646
4997 -926646 -1320702 -1576727 -2235486 -2482420 -1380094 -546648 -1316621 -2360723 -1767627
4988 -1767627 -668073 219417 1405486 3038520 3948812 4647854 3695991 1908023 -102733
4979 -102733 -2447695 -2294967 -35479 2318697 4556410 6668508 5913014 3612335 2403708
$$ packed form
5043A819855k34258P70026k90390K7838N25330p19743j126302j254686k20720
5034g03050J05968Q27286O07483J293677J63076m76892j18850Q41776J171106
5025C711580M81624L16075j5102p55360K13072J024978J005165j339012j352147
5016C290873J80031j197264j492599p88140j261715k076326n14879J447904J436646
5007i75469K48481o78610J10302N6344r41546j333561l20057R34498J053165R19807
4997i26646l94056k56025o58759k46934J102326Q33446p69973j044102N93096
4988a767627J099554Q87490J186069J633034R10292O99042r51863j787968k010756
4979a02733k344962J52728K259488K354176K237713K112098p55494k300679j208627
$$ plain form
4970 2403708 1763056 209100 -574139 -511859 -567658 -649447 154845 -105763 -677383 289897
4960 289897 1546478 3816118 6378045 6308094 3808140 789432 -388142 -1575377 -3077423
4951 -3077423 -3299467 -168384 2139228 3351320 4547500 4706784 4082643 3308898 2875860
4942 2875860 3753769 3283082 1927333 2245008 1895722 3288888 4006138 3139755 1696469
4933 1696469 514780 -872164 -2154417 -2161966 -1175799 1277010 2533189 1834212 1938797
4924 1938797 2178326 1418192 367955 -478407 -298888 2702922 5324857 5295905 4318625
4915 4318625 2676996 1549117 32312 -1659333 -2781076 -2828768 -3333435 -2634138 -840682
4906 -840682 48414 -207680 171808 625134 950535 2044280 1895608 2121108 2352721 3326511
$$ packed form
4970B403708o40652j553956p83239O2280n5799q1789Q04292k60608n71620R67280
4960B89897J256581K269640K561927o9951k499954l018708j177574j187235j502046
4951c077423k22044L131083K307612J212092J196180J59284o24141p73745m33038
4942B875860Q77909m70687j355749L17675l49286J393166P17250q66383j443286
4933A696469j181689j386944j282253p549R86167K452809J256179o98977J04585
4924A938797K39529p60134j050237q46362J79519L001810K621935k8952r77280
4915D318625j641629j127879j516805j691645j121743m7692n04667O99297J793456
4906h40682Q89096k56094L79488M53326L25401J093745j48672K25500K31613R73790
$$ plain form
4896 3326511 3867292 4665088 4967941 5459322 3787144 -170217 -1753834 -1939324 -2696499
4887 -2696499 -2706920 -1640282 -1445591 -1226165 75158 1895637 3644579 3670383 1386958
4878 1386958 -512485 -624829 -409688 -62258 661623 438920 -688058 -300656 -515448
4869 -515448 -1341627 -395820 -229153 -1101628 -840302 444670 1398837 3514666 3259593
4860 3259593 839604 -828948 -1084176 -405568 -590534 -1004413 95467 932537 1500101
4851 1500101 2810144 3522824 2472445 1235899 1887462 2525387 730438 -401020 -1264186
4842 -1264186 -1377372 -1734017 -2824584 -1641966 -782707 -549158 -325839 -520424 -2061992
4833 -2061992 -2219096 -1816403 -1528235 -1781057 -3118395 -3601750 -2453033 -836171 181347
$$ packed form
4896C326511N40781P97796L02853M91381j672178l957361j583617j85490p57175
4887b696499j0421J066638J94691K19426J301323J820479J748942K5804k283425
4878A386958j899443j12344K15141L47430P23881k22703j126978L87402k14792
4869e15448q26179R45807J66667q72475K61326J284972R54167K115829k55073
4860C259593k419989j668552k55228O78608j84966m13879J099880Q37070N67564
4851A500101J310043P12680j050379j236546O51563O37925j794949j131458q63166
4842a264186j13186l56645j090567J182618Q59259K33549K23319j94585j541568
4833b061992j57104M02693K88168k52822j337338m83355J148717J616862J017518
$$ plain form
4824 181347 394201 109673 627480 614088 -807236 -1338879 -1489809 -481880 525708
4815 525708 537830 390818 223793 552223 1838035 2215817 684546 -758710 450574
4806 450574 2424926 3073822 4033531 2522780 1182138 1730708 2212303 1523199 -578278
4797 -578278 -739477 948457 1382080 1072343 365979 -493851 602911 2799875 4003288
4788 4003288 3892698 3657796 4200033 2753949 1124876 1562509 2283483 1958847 768632
4779 768632 -1350232 -2238368 -1624422 -503409 4535 698604 2412308 2095929 1460081
4770 1460081 485543 -707915 605910 2360573 1842594 912474 440965 1132791 758501
4761 758501 305742 1373909 2568579 2094024 1012987 221687 -499888 -1012390 -1187451
$$ packed form
4824A81347K12854k84528N17807j3392j421324n31643j50930J007929J007588
4815E25708J2122j47012j67025L28430J285812L77782j531271j443256J209284
4806D50574J974352O48896R59709j510751j340642N48570M81595o89104k101477
4797e78278j61199J687934M33623l09737p06364q59830J096762K196964J203413
4788D003288j10590k34902N42237j446084j629073M37633P20974l24636j190215
4779G68632k118864q88136O13946J121013N07944O94069J713704l16379o35848
4770A460081r74538j193458J313825J754663n17979r30120m71509O91826l74290
4761G58501m52759J068167J194670m74555j081037p91300p21575n12502j75061
$$ plain form
4752 -1187451 -223967 -27616 -546915 -427810 1088348 1700904 645769 530428 -3843
4743 -3843 -525497 -250725 -1586529 -2309313 -1332126 -1233774 -1210835 -1104814 502814 1531914
4733 1531914 1648450 808171 -249276 -1763528 -2592343 -1945476 -795042 762480 1641824
4724 1641824 -217502 -2730579 -3790123 -4635514 -5188791 -5153092 -4261020 -2287996 365045
4715 365045 1992048 1568310 772958 176638 -1030502 -1842520 -2654727 -2464053 -404236
4706 -404236 479613 693912 2833463 3904162 2365891 1593563 1469992 1405487 1267521
4697 1267521 1346909 483218 81732 373725 -554623 -1428491 -1138311 210226 2085206
4688 2085206 3179977 1767188 -347368 -1162471 -2528018 -2951284 -416789 2247827 3425013
$$ packed form
4752a187451R63484J96351n19299J19105J516158O12556j055135j15341n34271
4743c843n21654K74772j335804p22784R77187R8352K2939J06021J607628J029100
4733A531914J16536q40279j057447j514252q28815O46867J150434J557522Q79344
4724A641824j859326k513077j059544q45391n53277L5699Q92072J973024K653041
4715C65045J627003m23738p95352n96320j207140q12018q12207J90674K059817
4706d04236Q83849K14299K139551J070699j538271p72328j23571o4505j37966
4697A267521P9388q63691m01486K91993r28348q73868K90180J348537J874980
4688B085206J094771j412789k114556q15103j365547m23266K534495K664616J177186
$$ plain form
4679 3425013 4607315 3436372 2365093 1484666 676125 -437135 -1089790 -1520197 -1370063
4670 -1370063 -1721109 -3202104 -3779058 -4079547 -4796657 -5678656 -4858437 -3315253 -3138928
4661 -3138928 -2532984 -1765293 -1072297 823046 2283536 4491465 6834736 7398769 6482586
4652 6482586 5261982 4221660 3036448 3292617 2941279 3063182 3610497 4825063 4629306
4643 4629306 2853207 1543445 343034 510197 990708 756166 2291816 6171293 8972900
4634 8972900 9495851 9250376 11258441 13834274 16310102 19632431 25182874 36112899
4626 36112899 51072437 62456282 60964532 47778669 33693003 23843093 15982484 9553514
4618 9553514 4660079 2620227 2512125 2275678 2902159 3677687 3500395 4076024 3308560
$$ packed form
4679C425013J182302j170943j071279q80427q08541j113260o52655m30407J50134
4670a370063l51046j480995n76954l00489p17110q81999Q20219J543184J76325
4661c138928O05944P67691O92996J895343J460490K207929K343271N64033r16183
4652F482586j220604j040322j185212K56169l51338J21903N47315J214566j95757
4643D629306j776099j309762j200411J67163M80511k34542J535650L879477K801607
4634H972900N22951k45475K008065K575833K475828L322329N550443J0930025
4626C6112899J4959538J1383845j491750j3185863j4085666r849910p860609o428970
4618I553514m893435k039852j08102k36447O26481P75528j77292N75629p67464
$$ plain form
4609 3308560 1082407 -1964609 -2103221 -553532 198758 1193566 3264574 3208339 1634484
4600 1634484 1124385 861137 272355 -516531 -849978 -969034 -275757 558965 1632707
4591 1632707 2543038 3129208 2454202 2092243 2238369 1429502 1105186 1084454 2167383 1454881
4581 1454881 -1010347 -2141342 -2400822 -3523702 -3974867 -3653131 -3279638 -2167017 -1168713
4572 -1168713 -262110 -742456 748732 1055528 -441646 -1357699 87207 2191104 2684469
4563 2684469 1226834 876326 1304070 382813 -417939 -523887 -635886 -589273 -148664 774415
4553 774415 14287 -356794 -863852 -1204497 -500333 487450 -76424 -998269 -557376 648623
4543 648623 2315691 3088217 3035063 2563870 106925 -1254333 -278158 -4025 -417561
$$ packed form
4609C308560k226153l047016j38612J549689P52290R94808K071008n6235j573855
4600A634484n10099k63248n88782p88886l33447j19056O93277Q34722J073742
4591A632707R10331N86170o75006l61959J46126q08867l24316k0732J082929p12502
4581A454881k465228j130995k59480j122880m51165L21736L73493J112621R98304
4572a168713R06603m80346J491188L06796j497174r16053J444906K103897M93365
4563B684469j457635l50508M27744r21257q00752j05948j11999M6613M40609R23079
4553G74415p60128l71081n07058l40645P04164R87783n63874r21845M40893J205999
4543F48623J667068P72526n3154m71193k456945j361258R76175K74133m13536
$$ plain form
4534 -417561 -1192169 -1757466 -1967437 -901738 -518009 -1915040 -2029429 -940343 1013514
4525 1013514 2991782 3727206 2305497 554748 2007959 4192585 5247417 4668367 3243748
4516 3243748 2762443 1009230 -428516 -869087 -249178 -175327 37690 2862 71044 897514
4506 897514 1356304 2653088 2443841 1219239 1492237 2234156 2256685 1738098 1827735 2589384
4496 2589384 2272736 1023698 962373 824735 812491 643470 -483774 -1205644 -2638075
4487 -2638075 -5323314 -4739547 -2680861 -333875 50496 -522937 1583498 4179775 3611173
4478 3611173 1181241 -653842 -1620088 -2374628 -964025 1300238 1351442 451846 245047
4469 245047 1047454 355439 -1983841 -4477735 -3598165 -702599 576440 892412 760691
$$ packed form
4534d17561p74608n65297k09971J065699L83729j397031j14389J089086J953857
4525A013514J978268P35424j421709j750749J453211K184626J054832n79050j424619
4516C243748m81305j753213j437746m40571O19909P3851K13017l4828O8182Q26470
4506H97514M58790J296784k09247j224602K72998P41919K2529n18587Q9637P61649
4496B589384l16648j249038o1325j37638j2244j69021j127244p21870j432431
4487b638075k685239N83767K058686K346986L84371n73433K106435K596277n68602
4478C611173k429932j835083r66246p54540J410603K264263N1204q99596k06799
4469B45047Q02407o92015k339280k493894Q79570K895566J279039L15972j31721
$$ plain form
4460 760691 568777 1277673 1842674 2357795 2393607 889022 -888249 -2400006 -3920156
4451 -3920156 -5374487 -5850749 -4653713 -2103975 -2025887 -2430043 -2101144 -2029122 -2558614
4442 -2558614 -3999669 -5303172 -4519194 -2537165 -710114 150126 1058065 2073328 1967026
4433 1967026 1267943 383428 -739168 -2897563 -4095754 -2782746 -2040106 -1226986 -871547
4424 -871547 -695773 435579 739739 -371400 -939324 -802641 -1703052 -2269428 -3062205
4415 -3062205 -3575505 -3630430 -2976711 -514146 611744 53547 -569706 -872047 -400276
4406 -400276 -394705 198939 1151511 2483493 4240563 4157751 2898238 1265193 -598910
4397 -598910 -663205 1050335 2562778 3164026 3051877 3071257 3500028 4066455 4555740 4190656
$$ packed form
4460G60691j91914P08896N65001N15121L5812j504585j777271j511757j520150
4451c920156j454331m76262J197036K549738P8088m04156L28899P2022n29492
4442b558614j441055j303503P83978J982029J827051Q60240R07939J015263j06302
4433A967026o99083q84515j122596k158395j198191J313008P42640Q13120L55439
4424h71547J75774J131352L04160j111139n67924J36683r00411n66376p92777
4415c062205n13300n4925O53719K462565J125890n58197o23253l02341M71771
4406d00276N571N93644R52572J331982J757070q2812j259513j633045j864103
4397e98910o4295J713540J512443O01248j12149J9380M28771N66427M89285l65084
$$ plain form
4387 4190656 2475900 1255261 771472 -1016222 -1339591 363091 3654427 3978143 3058857
4378 3058857 2255725 1485170 528783 -193403 -82738 -339247 562510 685474 -1425550
4369 -1425550 -2167856 -1933255 -1832596 -1380135 -838343 14047 256400 337244 153148 -154254
4359 -154254 624773 868194 167903 -202368 -167977 -1378086 -3896849 -5777937 -4808184
4350 -4808184 -3925615 -3795389 -2329637 -697999 -767673 -1429309 1598625 4861490 6266291
4341 6266291 5681936 4159473 2397641 1403886 759775 -1006976 -3428029 -5817658 -5404684
4332 -5404684 -2856228 -1934787 -2954912 -2335518 -292800 264880 -570609 -861172 -898689
4323 -898689 -2409257 -5064257 -4684723 -2725298 -1865031 -1819670 -3170708 -4270162 -2285755
$$ packed form
4387D190656j714756j220639m83789j787694l23369J702682L291336L23716r19286
4378C058857q03132p70555r56387p22186J10665k56509R01757J22964k111024
4369a425550p42306K34601J00659M52461N41792Q52390K42353Q0844j84096l07402
4359a54254P79027K43421p00291l70271L4391j210109k518763j881088R69753
4350d808184Q82569J30226J465752J631638o9674o61636L027934L262865J404801
4341F266291n84355j522463j761832r93755o44111j766751k421053k389629M12974
4332e404684K548456R21441j020125O19394K042718N57680q35489k90563l7517
4323h98689j510568k655000L79534J959425Q60267M5361j351038j099454J984407
$$ plain form
4314 -2285755 -802138 223136 1620565 3135731 2902070 -15819 -1137381 520500
4306 520500 1429093 1831944 1710951 -233909 -2372073 -3169550 -2843882 -1606037 -1169745
4297 -1169745 -1274990 -630121 39338 -429309 279359 843567 1175944 458360 -327494 -768353
4287 -768353 -1603888 -2798307 -1379934 -41771 -42694 -5681 -949158 54532 2003787 1958032
4277 1958032 252186 -1659238 -1931241 -1917108 -1325090 -957225 -469995 -505153 -198342 1289720
4267 1289720 1743737 468428 -3096 -80903 110200 -366726 613210 1983282 3427700
4258 3427700 2970910 1055732 -262732 151718 1569492 2681755 2518938 1944329 147000
4249 147000 -1941071 -2228773 -1408307 285479 574329 100873 420672 385156 190891 -756963
$$ packed form
4314b285755J483617J025274J397429J515166k33661k917889j121562J657881
4306E20500R08593M02851j20993j944860k138164p97477L25668J237845M36292
4297a169745j05245O44869O69459m68647P08668N64208L32377p17584p85854m40859
4287g68353q35535j194419J418373J338163r23L7013r43477J003690J949255m5755
4277A958032j705846j911424k72003J4133N92018L67865M87230l5158L06811J488062
4267A289720M54017j275309m71524p7807J91103m76926R79936J370072J444418
4258C427700m56790j915178j318464M14450J417774J112263j62817n74609j797329
4249A47000k088071k87702Q20466J693786K88850m73456L19799l5516j94265r47854
$$ plain form
4239 -756963 -580783 -1348746 -2388781 -1984627 -357796 505451 983543 533899 -398686
4230 -398686 -174349 1769757 2777358 3101044 3707679 4140589 3137933 467362 -1847543
4221 -1847543 -1943488 -437947 -101392 -1229032 -2293592 -2568864 -1393843 -1398119 -1548948
4212 -1548948 -741958 178740 1333908 1598725 1393366 1497214 861523 763039 2222897
4203 2222897 1912747 383423 1396759 3347670 4364431 4082856 2878413 1414435 1405692
4194 1405692 1791848 1832908 2813724 3902372 3837893 5405196 5225423 2636311 690916
4185 690916 -126329 -484619 -1063377 -1070153 -2056346 -2970093 -906247 1257861 1220680 369632
4175 369632 1017918 1674064 2594543 2427794 2401231 2550202 1709347 999106 1306924 1657323
$$ packed form
4239g56963J76180p67963j040035M04154J626831Q63247M78092m49644r32585
4230c98686K24337J944106J007601L23686O06635M32910j002656k670571k314905
4221a847543r5945J505541L36555j127640j064560k75272J175021m276j50829
4212a548948Q06990R20698J155168K64817k05359J03848o35691r8484J459858
4203B222897l10150j529324J013336J950911J016761k81575j204443j463978q743
4194A405692L86156M1060R80816J088648o4479J567303j79773k589112j945395
4185F90916q17245l58290n78758o776r86193r13747K063846K164108l7181q51048
4175C69632O48286O56146R20479j66749k6563J48971q40855p10241L07818L50399
$$ plain form
4165 1657323 1943980 2891808 3752193 4365132 3081630 1515888 867903 961246 1904465
4156 1904465 2942504 3991908 4869506 3129852 1171083 1560622 1391608 1556040 3260293
4147 3260293 2734996 4523 -1648317 -1246248 -844829 -1436801 -2197596 -3037261 -3049352
4138 -3049352 -3273020 -1061154 -788833 -3254327 -4091413 -2536557 -1828808 -1259864 -1113968
4129 -1113968 -1280818 -1436884 -635248 -1136481 -1209864 -1066170 -905927 -1152420 -1163065 -677995
4119 -677995 -1165186 -1474259 -3244687 -5057238 -5650164 -3122714 -818861 -1028689 -1432932
4110 -1432932 -2132947 -2780636 -3405626 -2559207 -1917965 -1616371 -1795917 -3933353 -6822481
4101 -6822481 -6088225 -3055421 -3143818 -4017274 -4394361 -4659654 -4539170 -3362328 -2054211
$$ packed form
4165A657323K86657R47828Q60385O12939j283502j565742o47985R3343R43219
4156A904465J038039J049404Q77598j739654j958769L89539j69014J64432J704253
4147C260293n25297k730473j652840M02069M01419n91972p60795q39665j2091
4138c049352k23668K211866K72321k465494q37086J554856P07749N68944J45896
4129a113968j66850j56066Q01636n01233p3383J43694J60243k46493j0645M85070
4119f77995m87191l09073j770428j812551n92926K527450K303853k09828m04243
4110a432932p00015o47689o24990Q46419O41242L01594j79546k137436k889128
4101f822481P34256L032804q8397q73456l77087k65293J20484J176842J308117
$$ plain form
4092 -2054211 -407113 928283 1276588 420404 -629022 -1623358 -2094080 -1108280 -466966
4083 -466966 -1191430 -865068 984085 380127 95639 1760992 2919602 2009383 434365
4074 434365 -544526 -1574046 -1312859 245655 1088890 810333 404818 -857033 -1773155
$$ packed form
4092b054211J647098J335396L48305q56184j049426r94336m70722R85800O41314
4083d66966p24464L26362J849153o03958k84488J665353J158610r10219j575018
4074D34365r78891j029520K61187J558514Q43235k78557m05515j261851r16122
$$ [...]
##END NTUPLES=NMR SPECTRUM
##END=
