##TITLE=C13DEPT135
##JCAMPDX= 6.0         $$ Bruker NMR JCAMP-DX V2.0
##DATA TYPE= NMR SPECTRUM
##DATA CLASS= NTUPLES
##ORIGIN= UXNMR, Bruker Analytische Messtechnik GmbH
##OWNER= root
$$ XWIN-NMR		Version 3.5
$$ Sat Feb 22 10:22:29 2025 Russian Standard Time (UT+4h)  servis@DPX200
##.OBSERVE FREQUENCY= 50.3277607988526
##.OBSERVE NUCLEUS= ^13C
##.ACQUISITION MODE= SIMULTANEOUS
##.ACQUISITION SCHEME= undefined
##.AVERAGES= 807
##.DIGITISER RES= 17
##SPECTROMETER/DATA SYSTEM= spect
##.PULSE SEQUENCE= dept135
##.SOLVENT NAME= DMSO
##.SHIFT REFERENCE= (INTERNAL, DMSO, 0, 219.126)
##AUDIT TRAIL= $$ (NUMBER, WHEN, WHO, WHERE, WHAT)
$$ ##TITLE= Audit trail, XWIN-NMR		Version 3.5
$$ ##JCAMPDX= 5.01
$$ ##ORIGIN= Bruker BioSpin GmbH
$$ ##OWNER= servis
$$ F:\spectra/data/av/nmr/C13DEPT135/1/pdata/1/auditp.txt
$$ ##AUDIT TRAIL=  $$ (NUMBER, WHEN, WHO, WHERE, WHAT)
(   1,<2025-02-22 10:21:50.34 +0400>,<servis>,<DPX200>,
      <created by zg, POWCHK disabled, PULCHK disabled
       terminated by command 'halt'
       configuration hash MD5:
       00 E9 B6 7A A2 85 ED C7 34 08 36 98 17 FE 4E 26
       data hash MD5: 64K
       C9 2A 64 94 FE C0 09 DE 5E 1A 4F 1C EC 87 10 DE>)
(   2,<2025-02-22 10:21:52.85 +0400>,<servis>,<DPX200>,
      <Start of raw data processing
       efp BC_mod = 2 LB = 1 FT_mod = 6 PKNL = 1 PHC0 = 383.807 PHC1 = 5.268371 SI = 32K 
       data hash MD5: 32K
       34 E9 74 71 FD CC 6E 59 2B 67 29 51 A0 6C A5 A4>)
$$ ##END=
$$ 
$$ hash MD5
$$ B0 55 40 69 44 38 E4 C6 6A 78 C1 43 08 6A DC A4
##$RELAX= 
##$RELAX= 
##$RELAX= 
##$RELAX= 
##$RELAX= 
##$RELAX= 
##$RELAX= 
$$ Bruker specific parameters
$$ --------------------------
##$DU= <F:\spectra>
##$EXPNO= 1
##$NAME= <C13DEPT135>
##$PROCNO= 1
##$TYPE= <nmr>
##$USER= <av>
##$AMP= (0..31)
100 100 100 100 100 100 100 100 100 100 100 100 100 100 100 100 100 100 
100 100 100 100 100 100 100 100 100 100 100 100 100 100 
##$AQSEQ= 0
##$AQ_mod= 1
##$AUNM= <au_zg>
##$AUTOPOS= <>
##$BF1= 50.322729
##$BF2= 200.13
##$BF3= 50.322729
##$BF4= 50.322729
##$BF5= 500.13
##$BF6= 500.13
##$BF7= 500.13
##$BF8= 500.13
##$BYTORDA= 1
##$CFDGTYP= 0
##$CFRGTYP= 5
##$CHEMSTR= <none>
##$CNST= (0..31)
1 1 145 1 1 1 1 1 1 1 1 1 1 1 1 1 1 1 1 1 1 1 1 1 1 1 1 1 1 1 1 1 
##$CPDPRG= <waltz16>
##$CPDPRG1= <>
##$CPDPRG2= <waltz16>
##$CPDPRG3= <>
##$CPDPRG4= <mlev>
##$CPDPRG5= <mlev>
##$CPDPRG6= <mlev>
##$CPDPRG7= <mlev>
##$CPDPRG8= <mlev>
##$CPDPRGB= <>
##$CPDPRGT= <>
##$D= (0..31)
0 2 0.003448276 0 0 0 0 0 0 0.06 0 0.03 2e-05 4e-06 0 0 0.0002 0 0 0 0 
0 0 0 0 0 0 0 0 0 0 0 
##$DATE= 1740205309
##$DBL= (0..7)
120 120 120 120 120 120 120 120 
##$DBP= (0..7)
150 150 150 150 150 150 150 150 
##$DBP07= 0
##$DBPNAM0= <>
##$DBPNAM1= <>
##$DBPNAM2= <>
##$DBPNAM3= <>
##$DBPNAM4= <>
##$DBPNAM5= <>
##$DBPNAM6= <>
##$DBPNAM7= <>
##$DBPOAL= (0..7)
0.5 0.5 0.5 0.5 0.5 0.5 0.5 0.5 
##$DBPOFFS= (0..7)
0 0 0 0 0 0 0 0 
##$DE= 6
##$DECBNUC= <off>
##$DECIM= 12
##$DECNUC= <off>
##$DECSTAT= 4
##$DIGMOD= 1
##$DIGTYP= 9
##$DL= (0..7)
$$ [...]
##$SUBNAM2= <"">
##$SUBNAM3= <"">
##$SUBNAM4= <"">
##$SUBNAM5= <"">
##$SUBNAM6= <"">
##$SUBNAM7= <"">
##$SUBNAM8= <"">
##$SUBNAM9= <"">
##$SW= 238.246396889851
##$SWIBOX= (0..15)
0 1 3 0 0 0 0 0 0 0 0 0 0 0 0 0 
##$SW_h= 11990.4076738609
##$TD= 65536
##$TD0= 1
##$TE= 0
##$TE2= 300
##$TE3= 300
##$TEG= 300
##$TL= (0..7)
0 120 120 120 120 120 120 120 
##$TP= (0..7)
150 150 150 150 150 150 150 150 
##$TP07= 0
##$TPNAME0= <>
##$TPNAME1= <>
##$TPNAME2= <>
##$TPNAME3= <>
##$TPNAME4= <>
##$TPNAME5= <>
##$TPNAME6= <>
##$TPNAME7= <>
##$TPOAL= (0..7)
0.5 0.5 0.5 0.5 0.5 0.5 0.5 0.5 
##$TPOFFS= (0..7)
0 0 0 0 0 0 0 0 
##$TUNHIN= 0
##$TUNHOUT= 0
##$TUNXOUT= 0
##$USERA1= <user>
##$USERA2= <user>
##$USERA3= <user>
##$USERA4= <user>
##$USERA5= <user>
##$V9= 5
##$VALIST= <valist>
##$VCLIST= <CCCCCCCCCCCCCCC>
##$VD= 0
##$VDLIST= <DDDDDDDDDDDDDDD>
##$VPLIST= <PPPPPPPPPPPPPPP>
##$VTLIST= <TTTTTTTTTTTTTTT>
##$WBST= 1024
##$WBSW= 4
##$XGAIN= (0..3)
0 0 0 0 
##$XL= 0
##$YL= 0
##$YMAX_a= 1272367
##$YMIN_a= -1472587
##$ZGOPTNS= <>
##$ZL1= 120
##$ZL2= 120
##$ZL3= 120
##$ZL4= 120
##$ABSF1= 0
##$ABSF2= 0
##$ABSG= 0
##$ABSL= 0
##$ALPHA= 0
##$AQORDER= 0
##$ASSFAC= 0
##$ASSFACI= 0
##$ASSFACX= 0
##$ASSWID= 0
##$AUNMP= <proc_1d>
##$AZFE= 0.1
##$AZFW= 0.5
##$BCFW= 0
##$BC_mod= 2
##$BYTORDP= 0
##$COROFFS= 0
##$CY= 12.5
##$DATMOD= 1
##$DC= 0
##$DFILT= <>
##$DTYPP= 0
##$F1P= 215.000008851289
##$F2P= -4.99998459219978
##$FCOR= 0.5
##$FTSIZE= 32768
##$FT_mod= 6
##$GAMMA= 0
##$GB= 0
##$INTBC= 1
##$INTSCL= 1
##$ISEN= 30
##$LB= 1
##$LEV0= 0
##$LPBIN= 0
##$MAXI= 10000
##$MC2= 0
##$MEAN= 0
##$ME_mod= 0
##$MI= 0
##$NCOEF= 0
##$NC_proc= -2
##$NLEV= 6
##$NOISF1= 0
##$NOISF2= 0
##$NSP= 0
##$NTH_PI= 0
##$NZP= 0
##$OFFSET= 219.1257
##$PC= 1.4
##$PHC0= 383.807
##$PHC1= 5.268371
##$PH_mod= 1
##$PKNL= yes
##$PPARMOD= 0
##$PSCAL= 4
##$PSIGN= 0
##$REVERSE= no
##$SF= 50.322729
##$SI= 32768
##$SIGF1= 0
##$SIGF2= 0
##$SINO= 80
##$SIOLD= 32768
##$SREGLST= <13C.CDCl3>
##$SSB= 0
##$STSI= 32768
##$STSR= 0
##$SW_p= 11990.4076738609
##$SYMM= 0
##$S_DEV= 0
##$TDeff= 65536
##$TDoff= 0
##$TI= <>
##$TILT= no
##$TM1= 0
##$TM2= 0
##$TOPLEV= 0
##$USERP1= <user>
##$USERP2= <user>
##$USERP3= <user>
##$USERP4= <user>
##$USERP5= <user>
##$WDW= 1
##$XDIM= 32768
##$YMAX_p= 376684835
##$YMIN_p= -392217910
$$ End of Bruker specific parameters
$$ ---------------------------------
##NTUPLES= NMR SPECTRUM
##VAR_NAME=  FREQUENCY,     SPECTRUM/REAL,   SPECTRUM/IMAG
##SYMBOL=    X,             R,               I
##VAR_TYPE=  INDEPENDENT,   DEPENDENT,       DEPENDENT
##VAR_FORM=  AFFN,          ASDF,            ASDF
##VAR_DIM=   32768,         32768,           32768
##UNITS=     HZ,            ARBITRARY UNITS, ARBITRARY UNITS
##FACTOR=    0.365929370215793, 1,           1
##FIRST=     11027.0033138647, 0,            0
##LAST=      -963.404359996184, 0,           0
##MIN=       -963.404359996184, -392217910,  0
##MAX=       11027.0033138647, 376684835,    0
$$ Real data points
##PAGE= N=1
##DATA TABLE= (X++(R..R)), XYDATA
$$ [...]
10371B874316j133732l30523K255674J362108M19635r02871k589910l978095k577053
10362d600451J686253N960151O30537n212163j411608p68547l749311k59979O74241
10353g050877O97781K098104P02932N58517k214732k57834J150719J946861J318499
10344a050030L613775N761444N736637K41367n41957l513173n255406l186691
10336A805966K532926K413485p0830j007601j753931j047701J884301K298315
10328G054930q33514j675869k502959j479452k754820J607667L316594M012621
10320F745198j821305n611643m490959l146649P37881K017562L62517J629942
10312c577456L454082q39463l846764l039114r32965k052252l8772O285667P214367
$$ y = [2874316, 1740584, 1410061, 3665735, 5027843, 5447478, 4544607, 1954697, -2023398, -4600451, -2914198, 3045953, 3676490, -1535673, -2947281, -3715828, -7465139, -7725118, -7050877, -6353096, -4254992, -3552060, -2993543, -5208275, -5466109, -4315390, -2368529, -1050030, 2563745, 8325189, 14061826, 14303193, 13761236, 10248063, 4992657, 1805966, 4338892, 6752377, 6681547, 5673946, 3920015, 2872314, 4756615, 7054930, 6221416, 4545547, 2042588, 563136, -2191684, -584017, 2732577, 6745198, 4923893, -687750, -5178709, -8325358, -7587477, -5569915, -5207398, -3577456, -123374, -962837, -4809601, -7848715, -8781680, -10833932, -10872704, -4587037, 2627330]
10303B627330L389875k506936m663722j424677N08888j171984k703959l14289
10295f259474j166571n56845l93605k310889M27723K352314R7613L13272J453550
10286f042912k89188k998327k37472K036468L948696J456608p21821P8718L15233
10277b453997J054897Q07430k064475m078976N24371J797791N694276M166720
10269E448037m295172n165384l943830M68976J508395R09799P11603L00787j013187
10260e069976r36438k164086l95704j051107j70553M71487r57314L333674L142845
10251c797172l92430M13923J632317q92391L173984L914944K245346K753631j249942
10242G802210m908658m271778k511957j94287J165659K178323K002989j570893
$$ y = [2627330, 6017205, 3510269, -1153453, -2578130, -2069242, -3241226, -5945185, -6259474, -7426045, -7982890, -8376495, -10687384, -10259661, -7907347, -7809734, -7496462, -6042912, -6332100, -9330427, -9567899, -7531431, -3582735, -2126127, -2847948, -2769230, -2453997, -1399100, -591670, -2656145, -6735121, -6210750, -4412959, 1281317, 5448037, 1152865, -4012519, -7956349, -7487373, -5978978, -5069179, -4357576, -4056789, -5069976, -6006414, -8170500, -8566204, -9617311, -9787864, -9316377, -10273691, -6940017, -3797172, -4189602, -3775679, -2143362, -3035753, 138231, 4053175, 6298521, 9052152, 7802210, 2893552, -1378226, -3890183, -4084470, -2918811, -740488, 1262501, -308392]
10234c08392k94987J010575o92488l28510r88475N75385K435069L73772n71003
10225A210946p7277j605218q00868J076415K480465j577441l744829j337554O68775
10216c706586L809525M250418n59077l583345m45546M728137L629426L508159
10208A1631111M666880L590300q33080m532928o585204k045854q68080l610735
10200A412410n84639R5971r59652j723545j361849K332446R16049Q35713J268396
10191B231300L196299K199412o96744R7006J22119m184182m512123l923485J235598
10182d234800M513847L187108j67714j660457L21206p89189l907116k259183j260286
10173f256584k845717m80893J533506P06677L450827m51744q75n13715m763098
$$ y = [-308392, -603379, 407196, -285292, -613802, -1602277, -1026892, 1408177, 1781949, 1210946, 1133669, -471549, -1272417, -196002, 2284463, 707022, -3037807, -4375361, -3706586, 102939, 4353357, 3794280, 210935, -234611, 4493526, 8122952, 11631111, 16297991, 19888291, 19055211, 14522283, 7937079, 5891225, 5023145, 1412410, 827771, 923742, -35910, -1759455, -3121304, -788858, 127191, 962904, 2231300, 5427599, 7627011, 6930267, 7027273, 7149392, 2965210, -1546913, -5470398, -4234800, 279047, 3466155, 3298441, 1637984, 1959190, 1170001, -2737115, -4996298, -6256584, -9102301, -9583194, -8049688, -7343011, -3892184, -4343928, -4344803, -4858518, -9621616]
10164i621616J808273M288619L02462Q16358J712607P46437L332366k482792p213299
10155f310585k88815J257693M69327O86942K273396L27770k88906l581812m250565
10146i705555J879671K704803K166021M243348Q06001k872905k911517J63578
10138c526555j108647k536834k04533J799600l152005j139343L129485r33286
10130g672118P73830N532666M943595J510422k527933j843096j976848j823874
10122c083356p95178k325219j622370K019565L321464J017616o87493o10447m139989
10113f905407k230687L583645O666611J346359l45134J04763K812863K15369k12210
10104E036172n98803j332941l809972p6900J922565J571115J945544J342802k08526
$$ y = [-9621616, -7813343, -3524724, -3222262, -2405904, -693297, 53140, 3385506, 902714, -6310585, -6599400, -5341707, -4872380, -4185438, -1912042, -1584272, -1873178, -5454990, -9705555, -7825884, -5121081, -2955060, 1288288, 2094289, -778616, -3690133, -3526555, -4635202, -7172036, -7376569, -5576969, -8728974, -9868317, -6738832, -7672118, -6898288, -1365622, 3577973, 5088395, 2560462, 717366, -1259482, -3083356, -3878534, -6203753, -7826123, -5806558, -2485094, -1467478, -2154971, -2765418, -6905407, -9136094, -5552449, 1114162, 2460521, 2115387, 2220150, 5033013, 5248382, 5036172, 4437369, 3104428, -705544, -782444, 1140121, 2711236, 4656780, 5999582, 5791056]
10095E791056k680192Q70622J559895l528177m016120K63489K372764P16108J696633
10086C046078J992380j31653J382258j669511n408517j997612J84237P53449j60568
10077b009459n36425K823791J780625j191772j402698n388437l635268r52661
10069a0512304Q13538N074816Q314234M940367K03955n97766l477369l638721
10061A120750M70046j958985j890134K503761J224065M96380K43628k44533L54171
10052B319149K52249k893257k309971J58415j170782k856655j986381q125j422381
10043i917739K002979N497298J976154j842886m263504o279996m110832L597965
10035a3340561P238346L071736j300232J12045M610956L388348n7849r8807J545489
$$ y = [5791056, 3110864, 3981486, 5541381, 2013204, -2002916, -1739427, 633337, 1349445, 3046078, 5038458, 4906805, 6289063, 4619552, -788965, -2786577, -2602340, -1848891, -2009459, -2545884, 277907, 2058532, 866760, -535938, -5924375, -9559643, -10512304, -9698766, -4623950, 3690284, 8630651, 8834606, 8236840, 4759471, 1120750, 1590796, -368189, -2258323, 245438, 1469503, 1965883, 2209511, 1964978, 2319149, 2571398, -321859, -2631830, -2473415, -3644197, -6500852, -8487233, -8495358, -9917739, -7914760, -2417462, -441308, -2284194, -6547698, -12827694, -16938526, -13340561, -6102215, -3030479, -4330711, -4218666, 392290, 3780638, 3722789, 3623982, 5169471]
10026E169471k010922j699815j942829k462845j071538k467649l268449l962331
10018a3716907r68702K945857J825745J497174J83515J842201O104030l83789
10010f70876m995227j718978N73834R07510K467436L265179J655290k888196l830744
10001e234772m305786k648468j106764J464645L812411m92212L36399q45637P20061
9992h300123K110606R34005J952186Q26910K35377J971753L254590O96715p768127
9983d086108m354590J266390M78618k34378J49850J262647J193528J560599P95514
9974a967930j956638J346877L089896L532884j506566n405888N41198o63866j04106
9965c094139P00472L345663L717352J397386l341358n623399k487420j846395
$$ y = [5169471, 3158549, 1458734, -484095, -2946940, -4018478, -6486127, -9754576, -13716907, -14685609, -11739752, -9914007, -8416833, -8233318, -6391117, -287087, -670876, -5666103, -7385081, -6811247, -5903737, -3436301, -171122, 1484168, -1404028, -5234772, -9540558, -12189026, -13295790, -11831145, -8018734, -8510946, -8174547, -9020184, -8300123, -6189517, -5255512, -3303326, -2476416, -2241039, -269286, 2985304, 3682019, -4086108, -8440698, -7174308, -6695690, -6930068, -6780218, -5517571, -4324043, -2763444, -1967930, -3924568, -2577691, 512205, 4045089, 2538523, -2867365, -2326167, -2990033, -3094139, -2393667, 951996, 4669348, 6066734, 2725376, -2898023, -5385443, -7231838]
9957g231838q51179J615825R17762r51478k395602K468289p1728k13145j242547
9948g955641q21494J081114K029294L203061J385882l205088m388916k690120
9940a1361908l45703M23721K762661M739334N319325L640759p79312K111848o352
9931F504373l631505k690602o079630n483760l717274k40078J544408L002457
9923a0791611L342599O04115K176627K099912n98791l09542L143278L159102P465
9914B833154J398997j83798j352054j591973j407216J824617m67250j437510N46331
9905A63298k205906J959110K470057J153389j949496k924474k846746l584319
9897g765087j244341J700184J437014J121834J519583J623811l271650k403102
$$ y = [-7231838, -8083017, -6467192, -5549430, -6500908, -8896510, -6428221, -6499949, -6713094, -7955641, -8777135, -7696021, -5666727, -2463666, -1077784, -4282872, -8671788, -11361908, -11707611, -11283890, -8521229, -3781895, 1537430, 5178189, 4398877, 6510725, 6504373, 2872868, 182266, -5897364, -11381124, -15098398, -15338476, -13794068, -10791611, -7449012, -6844897, -4668270, -2568358, -3167149, -3476691, -333413, 2825689, 2833154, 4232151, 4048353, 2696299, 1104326, -302890, 1521727, 1054477, -383033, 163298, -2042608, -83498, 2386559, 3539948, 1590452, -1334022, -4180768, -7765087, -9009428, -7309244, -5872230, -4750396, -3230813, -1607002, -4878652, -7281754]
9889g281754j197085L60972K98504R66999N535289M440920J933404L43313j874516
9880C526046l225741k870517l683409J159085K246394K413014R63541m272426
9872c744013m459520J989673M210810J124180M14709K975203j193778k935393
9864a618129J054829J983899R19134N17086m05381l201465j824730r21225L191124
9855c04858K655026p28778o17800J530557L064501K895811N77666j915550o26188
9846F530387k764571n973637l811146k232815L042697O817464O817678M920356
9838A3346413j004614m717317k441874o34460J334329k128055l100241K154908
9830B809089L690131k312537o894414m496114o92333J373781K776844K930397
$$ y = [-7281754, -8478839, -8117867, -7819363, -6852364, -1317075, 3123845, 5057249, 5400562, 3526046, 300305, -2570212, -6253621, -5094536, -2848142, -435128, 528413, -3744013, -8203533, -6213860, -2003050, -878870, -464161, 2511042, 1317264, -1618129, -563300, 1420599, 2339733, 2856819, 2451438, -750027, -2574757, -3495982, -304858, 2350168, 1621390, 1003590, 2534147, 5598648, 8494459, 9072125, 7156575, 6530387, 3765816, -2207821, -6018967, -8251782, -5209085, 1608379, 8426057, 13346413, 12341799, 7624482, 5182608, 4548148, 5882477, 3754422, 654181, 2809089, 6499220, 4186683, -2707731, -7203845, -7896178, -6522397, -3745553, -815156]
9822h15156J090193Q84590n0633j371498l005974M81999N3921k723643m399774
9813i855975k762055K582652O924224L222871J039687k62225K398187M264475
9805G551841m04209n723009l058396N14019o65249r64861Q10649K166481J526288
9796A753554Q94990L949456l303487n682983L08713L742013J897029J008057o47465
9787C919877P15246j601159m309438l888974k747452j525527j1334M975787L867718
9778f05256K341799m70497M77588J713077k443528q47452J188450k62727l9191
9769A052263P47796L492709J997217j844445m586324l616541k55804L210261M326003
9760D523135J226883J055252k185092j156723M72174O72369q80675k510704k630248
$$ y = [-815156, 275037, 1159627, 1108994, -262504, -3268478, -2786479, -2732558, -5456201, -9855975, -12618030, -10035378, -3111154, 111717, 1151404, 889179, 3287366, 7551841, 7147632, 1424623, -1633773, -1119754, -1785003, -2749864, -1939215, 227266, 1753554, 2648544, 6598000, 3294513, -2388470, -2079757, 1662256, 3559285, 4567342, 3919877, 4635123, 3033964, -1275474, -5164448, -7911900, -9437427, -9448761, -4472974, -605256, 1736543, 1266046, 1743634, 3456711, 1013183, 165731, 1354181, 1091454, 1052263, 1800059, 5292768, 7289985, 5445540, 859216, -2757325, -3013129, 197132, 4523135, 5750018, 6805270, 4620178, 3463455, 3935629, 4607998, 3727323, 1216619, -1413629]
9751a413629j524950k041397J122337M889799K081434n62324j401823l869921
9743b720474r46441L628947L761088j174578l195800j802652L439494J633744
9735B623328n16846K33172P10445k86626L613086j123740m844839k873822K182950
9726b82892L429321o94172l692730n411674l132710l06171R00892K373810K254669
9717d561657M49782K071095L932211J85020j18630P90679P23276l119531J269514
9708A621759M600452k225858l055178m538056m84125K502501Q64499R91832M724232
9699E002058J802389j784812k47142K000113J843195j243422n290176k327390
9691b45187l242682m554237k839700J378179M667443J721365M85444j115219m63895
$$ y = [-1413629, -2938579, -4979976, -3857639, 1032160, 3113594, 2551270, 1149447, -2720474, -3666915, -37968, 3723120, 2548542, -647258, -2449910, 989584, 2623328, 2106482, 2339654, 3050099, 2763473, 6376559, 5252819, 407980, -2465842, -282892, 3146429, 2452257, -1240473, -6652147, -9784857, -10091028, -9190136, -6816326, -4561657, -4111875, -2040780, 1891431, 2076451, 1957821, 2748500, 3471776, 352245, 1621759, 6222211, 3996353, 941175, -3596881, -4081006, -1578505, -714006, 277826, 5002058, 6804447, 5019635, 4772493, 6772606, 8615801, 7372379, 2082203, -245187, -3487869, -8042106, -10881806, -9503627, -4836184, -3114819, -2629375, -3744594, -4208489]
9682d208489j894457j643330j112897M96074M230073K554903J034666N030247
9674D486790K582805n44576k397694k448173q82238p97713n64954o70509J127700
9665a08562p29843k644816K871835K426320j709235l215315q29390p4718n74307
9656d588031M98398J388164O99158j894432n65605q80728L311955P32857J886991
9647E88727L795894m39784o480193k761245P85384k5762K390069K369448J416390
9638A638928j220971O92646J488994P593K464282J718188m312259n022536J89054
9629b356081M86746p80576k472793J71275O75643M320838M798813L888397m252526
9620D479736o549876j113918O398756O465267K332721k827812l135548p922015
$$ y = [-4208489, -6102946, -7746276, -8859173, -8363099, -4133026, -1578123, -543457, 4486790, 7069595, 6525019, 4127325, 1679152, 796914, -799, -565753, -1236262, -108562, -838405, -3483221, -611386, 1814934, 105699, -3109616, -3939006, -4013724, -4588031, -4089633, -2701469, -2002311, -3896743, -4462348, -5343076, -2031121, -1298264, 588727, 4384621, 3944837, -2535356, -5296601, -4511217, -4536979, -2146910, 222538, 1638928, 417957, 1110603, 2599597, 2607190, 5071472, 6789660, 2477401, -2545135, -2356081, -1869335, -2649911, -5122704, -4951429, -4275786, 45052, 4843865, 8732262, 4479736, -2070140, -3184058, 3214698, 9679965, 12012686, 9184874, 6049326, -1872689]
9612a872689k368412N155811N56336k693289j256479J512084j092633j922068
9604c981339m74634r7892J320541L924553L904578o69443J58413j628830j243035
9595A212912K465712j704919m764506J234193q3371m092000m224984K939064L947831
9586c070068J465571K227133r73088n1841J43463j70735L89519r65536j465902
9577b471484m598528k464271k13288l717247k804505L670034M774325J181594
9569f643370l447732j441829K099312J593762j297997j979060L758915K668961
9561d689038k276989j027786K611286L501982l76273K6646L34411q01855K975659
9552B78043M024536M57226l857021n86860j090675K219619R41971l594102J093631
$$ y = [-1872689, -4241101, 914710, 1471046, -1222243, -2478722, -966638, -2059271, -3981339, -4455973, -4553865, -3233324, 691229, 4595807, 3926364, 4084777, 2455947, 1212912, 3678624, 1973705, -2790801, -1556608, -1639979, -5731979, -9956963, -7017899, -3070068, -1604497, 622636, -350452, -402293, -258830, -429565, -40046, -1005582, -2471484, -7070012, -9534283, -9747571, -13464818, -16269323, -12599289, -7824964, -6643370, -10091102, -11532931, -9433619, -7839857, -9137854, -11116914, -7357999, -4689038, -6966027, -7993813, -5382527, -1880545, -2256818, -2230172, -1895761, -2697616, 278043, 4302579, 4759805, 902784, 315924, -774751, 1444868, 2386839, -1207263, -113632]
9543a13632Q06484n325754m113522O85058O29794J659025J273786Q30292K232995
9534a435474L04626R43196K241654l098562l090287K44080P15919K94607P46756
9525b133485N793006Q640190J822397k688141R67484J724562m109695p264547
9517B751771m254467k450658j11967J674736n09211j206346J742532J995786M9111
9508c18713k57884K134373M622769m68710k542602j805825m265169r83956O86216
9499c199501J763768R51464k164905l049596j653850j631512j336245j250299
9491a1570676k436657K339350O800686L504426R0613l85957l21280m564772k361799
9482h906066K635612J857382J900480j38520l417748l636435l56313N326493M026112
$$ y = [-113632, 692852, -4632902, -8746424, -8061366, -7431572, -5772547, -4498761, -3668469, -1435474, -1130848, -187652, 2054002, -1044560, -4134847, -3890767, -3174848, -2880241, -2133485, 3659521, 12299711, 14122108, 11433967, 12401451, 14126013, 10016318, 2751771, -1502696, -3953354, -4065321, -2390585, -2899796, -4106142, -2363610, -367824, -318713, -576597, 1557776, 6180545, 5711835, 3169233, 1363408, -2901761, -3885717, -3199501, -1435733, -484269, -2649174, -5698770, -7352620, -8984132, -10320377, -11570676, -14007333, -11667983, -4867297, -1362871, -1272258, -1658215, -1979495, -6544267, -8906066, -6270454, -4413072, -2512592, -2651112, -6068860, -9705295, -10061608, -4735115, -709003]
9473g09003K040734l33332P74931p78866J40871N32116n8048j947974l438958
9464c777529j798895j376586K513694R470467L634878k229148j331699O10537
9456E715719k280543m99182N68709J156851P46809M99464k981821j734797l436390
9447b245181J071672J953666k174452P9660K962523K993882j977373k213965m427109
9438c976677p460459n795111J46225N312261O987999O836045K565393j626070
9430B989606j694843L839226l011051m955872l26571K636186L144519L552865
9422F174065K703588J873840k484512n428087k117227l509317l212961J79623
9414e820988L85664K6636J836538K126165L538207j417294m424202p21660N29771
$$ y = [-709003, 1331731, 998399, 1773330, 994464, 1135335, 1667451, 1609403, -338571, -3777529, -5576424, -6953010, -4439316, 5031151, 8666029, 6436881, 5105182, 5715719, 3435176, 2935994, 3504703, 4661554, 5408363, 5907827, 2926006, 1191209, -2245181, -1173509, 780157, -1394295, -1314635, 1647888, 4641770, 2664397, 450432, -3976677, -11437136, -17232247, -17086022, -11773761, -4785762, 2050283, 4615676, 2989606, 1294763, 5133989, 2122938, -2832934, -3159505, -523319, 2621200, 6174065, 8877653, 10751493, 8266981, 2838894, 721667, -2787650, -6000611, -5820988, -5435324, -5408688, -3572150, -1445985, 2092222, 674928, -3749274, -4470934, -3941163]
9405c941163J925271L034033J581423n624891n781149L88255P025798N316539
9397C924116o43824m017095l920897j137780j46779K902649K252411j316470l428879
9388e532548j252922L19837J673519L66076J110515J718351k734465l085025j39838
9379g556500K401107J622633N48218M169612P039399L417169J20160n694713l891885
9370B175200K707500N158472p97621j350570l02507j071528m782351l682859k46361
9361b192625K381028J067476j328415J129529q09828l157326L96556M577150N594767
9352G658312J48740k219852j373619j488265J392215q9898J411723K27393K697310
9343H364059j455726l582617N93254J611960L81381k687071l186148m90507p6310
$$ y = [-3941163, -2015892, 1018141, 2599564, -3025327, -8806476, -8418221, -1392423, 3924116, 3280292, -736803, -4657700, -5795480, -5942259, -3039610, -787199, -2103669, -5532548, -6785470, -6465633, -4792114, -4426038, -3315523, -1597172, -4331637, -7416662, -7556500, -5155393, -3532760, -2984542, 1185070, 8224469, 11641638, 11761798, 6067085, 2175200, 4882700, 10041172, 9243551, 7892981, 7590474, 6518946, 1736595, -1946264, -2192625, 188403, 1255879, -72536, 1056993, 247165, -2910161, -2513605, 2063545, 7658312, 7807052, 5587200, 4213581, 2725316, 4117531, 4027633, 5439356, 5666749, 8364059, 6908333, 3325716, 3918970, 5530930, 5912311, 3225240, 39092, -451415, -527725]
9334e27725J514135K196596L932500N654892K637188l564737k85129o59330n259330
9325E639060m080489K846709M223621L809204K37764k271516k509067n417220
9317B478066o059833j415357R64947k346806l786618j678907k269662k255934
9309a6370104j001949J550959N570840O584953L637720O89339p70663j166783
9301a275688l668094Q38740L339508J734128j708544n254199m143667j204370
9293a1342186L922523M842586J872417O02512j237085r42081L728599J812684
9285C259969J467101K3682N33072J410082j641741l797603n210040n932925k759515
9276a2647918J776837O137921M916282L296967M122341m06183k369374J10788
$$ y = [-527725, 986410, 3183006, 7115506, 12770398, 15407586, 11842849, 11557720, 10898390, 5639060, 1558571, 4405280, 8628901, 12438105, 12675869, 10404353, 7895286, 2478066, -3581767, -4997124, -4032177, -6378983, -10165601, -11844508, -14114170, -16370104, -17372053, -15821094, -10250254, -3665301, -27581, 661758, -108905, -1275688, -4943782, -4105042, -765534, 968594, -739950, -5994149, -10137816, -11342186, -7419663, -2577077, -704660, -102148, -1339233, -2281314, 1447285, 3259969, 4727070, 4750752, 5283824, 6693906, 5052165, 1254562, -3955478, -9888403, -12647918, -10871081, -4733160, 183122, 3480089, 7602430, 7196247, 4826873, 4937661]
9268D937661k533124k449541k321139L032022N490915R91832j235379R0470j59595
9259E844122Q85910J747639k690566l859769p37154J338075L190418L341541q4527
9250H975689k066747j510150n60961p45526J834980J71928l343634j457244j555401
9241b57066Q20334m47508O54489O65479n436926m064569N057195M873828J012437
9232B877693j127555k22839P89823o82918R22913J206747k023257k384895k181499
9223b825787j240964j291115j034469O18328K752260L366719j046730R6878J666400
9214A061520P22987j318798N91439O73839j290699l207719k988995m226426M543214
9205e439638P888631J438771J676394Q7744l310914k856064j627449l211146j412333
$$ y = [4937661, 2404537, -45004, -2366143, 665879, 6156794, 7148626, 5913247, 6003717, 5844122, 6730032, 8477671, 5787105, 1927336, 1190182, 2528257, 5718675, 9060216, 8975689, 6908942, 5398792, 4837831, 4092305, 5927285, 6099213, 2755579, 1298335, -257066, 563268, 115760, 770249, 1435728, -4001198, -8065767, -3008572, 1865256, 2877693, 1750138, 1527299, 2317122, 1634204, 2557117, 3763864, 1740607, -644288, -2825787, -4066751, -5357866, -6392335, -5774007, -3021747, 344972, -701758, -604880, 1061520, 1784507, 465709, 1057148, 1730987, 440288, -2767431, -5756426, -9982852, -5439638, 2448993, 3887764, 5564158, 5651902, 2340988, -515076, -2142525, -5353671, -6766004]
9196f766004j350228J528485K907678K291442J411078j38278J23674j051476k369556
9187c413185k000963J169834M250050L599637K06771j615357J113552n93558l109324
9178c92543j077418j506083K770613J525749m930049k407655M97232L102195J636465
9169g81494R57727P58734k01458k766941k907875l57548K059528J744255j096312
9160b591384k706251J985173L249624M219506J906090l129799j744483j804197
9152f15721o15529j088350k21369j323194l534204K99482L891823L110862J765771
9143A669571R16764K062905M15721k574003m870375k942033K495266L613723K240427
9134C027966N17427J650793l290889m042399q68790l05026j014204N904509O845915
$$ y = [-6766004, -8116232, -6587747, -3680069, -1388627, 22451, -115827, 7847, -1043629, -3413185, -5414148, -4244314, 5736, 3605373, 3812144, 2196787, 3310339, 2716781, -392543, -1469961, -2976044, -205431, 1320318, -3609731, -6017386, -5520154, -2417959, -781494, 176233, 934967, 733509, -2033432, -4941307, -5298855, -3239327, -1495072, -2591384, -5297635, -3312462, -62838, 4156668, 6062758, 2932959, 1188476, -615721, -1231250, -2319600, -2540969, -3864163, -7398367, -7098885, -3207062, -96200, 1669571, 2586335, 4649240, 5064961, 2490958, -2379417, -5321450, -2826184, 787539, 3027966, 3545393, 5196186, 1905297, -2137102, -3005892, -3310918, -4325122, 1579387, 8425302]
9125H425302j554533l555938m563259k787497l91354j084235K450947J868609
9117a191958m883407k144549J445520J111083j432089P00071J428956J766110
9109c200263M73734J544194J300072M103017R92451m249929N33305L568091m006574
9100A058098l505610p54605m175252j869892K085811o65276m49293J627433j234454
9091g883040j75406j485818Q3898K020913R23586k32148J380315L521924J988819
9082A43043L358561k471696l546060j306728M97505J199883J585730O15477p14449
9073f38734Q13881j588797m81523N02146K459660N12307J244265p80560P97617
9064B840262K716546q89521l32416J24734l920820j665491M61934R64300L73761
$$ y = [8425302, 6870769, 3314831, -1248428, -4035925, -4427279, -5511514, -3060567, -1191958, -6075365, -8219914, -6774394, -5663311, -7095400, -6395329, -4966373, -3200263, -2726529, -1182335, 117737, 4220754, 5213205, 963276, 1496581, 5064672, 1058098, -2447512, -3202117, -7377369, -9247261, -7161450, -7826726, -8276019, -6648586, -7883040, -8058446, -9544264, -9460366, -7439453, -6515867, -6748015, -5367700, -1845776, 143043, 3501604, 1029908, -2516152, -3822880, -3325375, -2125492, -539762, 75715, -638734, 175147, -1413650, -1895173, -1393027, 1066633, 1578940, 2823205, 2042645, 2840262, 5556808, 4667287, 4334871, 4459605, 538785, -1126706, -664772, 299528, 673289]
9055F73289p50328p10985m94359m33328J637390L061637r86300o059610m103350
9046h165944l46035j873399j403582K1353K592849K451521L716837K251119K186261
9037A430980J156789l098613k274522j486188k254832j033631K381005K32163
9029d946849j919643j892151k38984k204461M6531K239743O112476O848508J848884
9020E894054L09773k246348k203728J190081J241461J765364m64866n75445l72232
9011D538114p39296k149627k943908j475967P353r63316k120441J040112O45739
9002d161237M09955L561350L712647J579296m633923m567795j536902n49496K09275
8993e976830j854746j922210o53857j455217J267530J923538N90936M27073M026327
$$ y = [673289, -77039, -788024, -1282383, -1715711, -78321, 2983316, 1997016, -4062594, -8165944, -8511979, -10385378, -11788960, -11767607, -9174758, -6723237, -3006400, -755281, 1430980, 2587769, -510844, -2785366, -4271554, -6526386, -7560017, -5179012, -4946849, -6866492, -8758643, -8997627, -11202088, -11155557, -8915814, -2803338, 4045170, 5894054, 6203827, 3957479, 1753751, 2943832, 4185293, 5950657, 5485791, 4910346, 4538114, 3798818, 1649191, -1294717, -2770684, -2763331, -3726647, -5847088, -4806976, -4161237, -3751282, -189932, 3522715, 5102011, 468088, -4099707, -5636609, -6186105, -5976830, -7831576, -9753786, -10407643, -11862860, -10595330, -8671792, -8080856, -7653783, -3627456]
8984c627456L382122K672262N47733J426038k494936k881440j621359o41348k919528
8975f157912P46483L736723O577252K714886O14750m604422l959809P59146M266260
8966D693357J048763m985597m322906N15488l70684q8350N86142j772921o03191
8957e299899K613628K875265J265442k377512n758054l840388N63645M040765
8949e917108J370777l877319J682620N029644L869491J884155K783301K549157
8941I374718q09253l069936m065286J283779J028045r48632J763097N164635K13874
8932I935041k082889j801980N62137J351065J660738N76141L47735K62908l405216
8923G405680n666262n607469j629521J766306M284983L651005p57948k588747
$$ y = [-3627456, -245334, 2426928, 2974661, 4400699, 1905763, -975677, -2597036, -3238384, -6157912, -5411429, -1674706, 4902546, 7617432, 8232182, 3627760, -332049, 427097, 4693357, 5742120, 756523, -3566383, -3050895, -3421579, -3509929, -2923787, -4696708, -5299899, -2686271, 188994, 1454436, -923076, -6681130, -10521518, -9957873, -5917108, -4546331, -8423650, -6741030, -1711386, 2158105, 4042260, 6825561, 9374718, 8565465, 5495529, 1430243, 2714022, 3742067, 2793435, 4556532, 9721167, 9935041, 7852152, 6050172, 6612309, 7963374, 9624112, 10200253, 10547988, 10810896, 7405680, 1739418, -3868051, -5497572, -3731266, 553717, 4204722, 3446774, 858027]
8915H58027j093148Q17045j712464K018730K053543j508943m036699l517782Q52173
8906e269518L515164J838755j137998r11666l49471J124778N332747N595721k002371
8897G736141m800083l548812p654J038442j695621j465506O35507j089802n98694
8888c796082m004125l345449J702997M161839L595647L093086p3496n50601L398969
8879D182785P74112m114538n411996k709177j686409q89876l253184O67351M736502
8870g704430M282119J934089j029548M37808J046086k545392j765485M744380
8862f00373Q164509L439198l792733n835534n758298k694344M379344L632188
8854I33957K990574O77438m19674K580457L137071m956160n895259l720530j323620
$$ y = [858027, -235121, 581924, -1130540, 888190, 2941733, 1432790, -2603909, -6121691, -5269518, -1754354, 84401, -1053597, -1965263, -2314734, -1189956, 4142791, 9738512, 7736141, 2936058, -612754, -620408, 418034, -1277587, -2743093, -2107586, -3197388, -3796082, -7800207, -11145656, -9442659, -5280820, -1685173, 1407913, 1334417, 783816, 4182785, 4956897, 842359, -4569637, -7278814, -8965223, -9855099, -13108283, -12440932, -7704430, -3422311, -1488222, -2517770, -2079962, -1033876, -3579268, -5344753, -600373, 7564136, 11003334, 7210601, 1375067, -4383231, -7077575, -2698231, 933957, 3924531, 4601969, 4182295, 6762752, 9899823, 4943663, -951596, -4672126, -5995746]
8845e995746j917189m44935Q72651J734453L646696N473607l81791k012138p59624
8836B15984N58739j510283j056579J251580q21797j895758K34305q67950R55056
8827b936703j26479j284595n76232J542781k497286k023562K620490O30352k5481
8818d676715K084476N51914L220909J841527n65130l363276q21048J206064n96214
8809a117493j591967L41723L145063J945180M34139O20242K36093K049947K22326
8800F285253j944641O41337l433844l537040k497386k9837J272798p76212M22886
8791c596686r90212n49625K899034N843812L816478n121927o436693j821464k897669
8782h854952q01056K025297J432599p25913m49697n395J612336K055532L205519
$$ y = [-5995746, -7912935, -8357870, -7485219, -5750766, -2104070, 3369537, 2987746, 975608, 215984, 774723, -735560, -1792139, -540559, -1362356, -3258114, -3023809, -3891759, -2936703, -3063182, -4347777, -4924009, -3381228, -5878514, -7902076, -5281586, -4651234, -4676715, -2592239, -2040325, 1180584, 3022111, 2456981, -906295, -1727343, -521279, -1117493, -2709460, -2367737, 777326, 2722506, 3156645, 3776887, 4012980, 6062927, 6285253, 4340612, 4981949, 1548105, -1988935, -4486321, -4516158, -3243360, -4019572, -3596686, -4586898, -5136523, -2237489, 3606323, 7422801, 2300874, -4135819, -5957283, -8854952, -9656008, -7630711, -6198112, -6924025, -7373722, -7379117, -5766781, -3711249, -505730]
8773e05730L72021l14954j117271k729801j053507K584679K000340k862900j514983
8764e142106R56954k06539J950433J958502k462738o515917j544797N667470N491089
8755A52351p0992q52893j901398l307780j942353j31831K717555J313438J500034
8746b523869R43615J457810j719651j048305l58486L8412O02823j306030l011140
8737f924821n64788K938754K461354p10276r58367l208201J698977L814506J856880
8728D04018k667841j349350j721022k899705K93302j502611l681259j646603K122396
8719a2648675P64000j749642J005328J250620k36036m98958L742755M411006R79602
8710b980000r46156k260359k119647p70282j526823N39983M172796K556509p93597
$$ y = [-505730, -133709, -448663, -1565934, -4295735, -5349242, -2764563, -764223, -3627123, -5142106, -4185152, -4391691, -2441258, -482756, -2945494, -9461411, -11006208, -5338738, 152351, 81359, -771534, -2672932, -5980712, -7923065, -8054896, -5337341, -4023903, -2523869, -1580254, -122444, -1842095, -2890400, -3248886, -3210474, -2607651, -3913681, -6924821, -7489609, -4550855, -2089501, -2799777, -3758144, -6966345, -5267368, -1452862, 404018, -2263823, -3613173, -5334195, -8233900, -7940598, -9443209, -13124468, -14771071, -12648675, -11884675, -13634317, -12628989, -11378369, -11614405, -12113363, -8370608, -3959602, -2980000, -3926156, -6186515, -8306162, -9076444, -10603267, -10063284, -5890488, -3333979, -4127576]
8701d127576j669374j687734k906420m37742R81246j008653j361762j015808O40760
8692a2593063J704257R80941J759787M984750N233845k050782k962349k959813
8684e902427j550955p19759p17931l825760j975390R44490k682046J54223M636146
8675a1639409J136822m686759n581744K261873O118407P959422M449919L113367
8667C131898K643279K048847k603641j729350l258458n218462M58251K291081
8659b236555o42244j898647j870217l61045K778412J791578m17019R92750l593438
8650e456425k270862l1047L00312K46477P69811L69109k408720k375495j626090
8641a2482930j534430o039365o131153p95218O780276O513631L867441K340808
$$ y = [-4127576, -5796950, -7484684, -10391104, -10828846, -9847600, -10856253, -12218015, -13233823, -12593063, -10888806, -9907865, -8148078, -3163328, 2070517, 19735, -2942614, -5902427, -7453382, -8173141, -8891072, -12716832, -14692222, -13747732, -16429778, -16275555, -11639409, -10502587, -15189346, -20771090, -18509217, -12390810, -4431388, 18531, 3131898, 5775177, 7824024, 5220383, 3491033, 232575, -4985887, -4527636, -2236555, -2878799, -4777446, -6647663, -7008708, -4230296, -2438718, -2855737, -1862987, -5456425, -7727287, -7758334, -7458022, -7211545, -6441734, -6072625, -8481345, -10856840, -12482930, -14017360, -20056725, -26187878, -26983096, -20202820, -13689189, -9821748, -7480940]
8633g480940k242665m301097n713329n847275j935185J406803k763646q32702
8625b9710036k297655m450204l503879n406191o743195k911422J758410J563534
8617e1700638J622363n692481p860585p563930p968452j1700791j2840262q691162
8609a12395938l050224o899248o103304N64601M817898O416032Q285790J2870059
8601i5494334J6021472J2788264N830494M777676L115435L174194K284460L369468
8593d4132871Q86759L863761Q427582P541737K938349m05235K092914K387094
8585a6399910J153941K074912l159L188079M106761J201085O25526j511867n233595
8576a0798227j634366p70705j745567L662267K848268j688044J030865L086012
$$ y = [-7480940, -9723605, -14024702, -19738031, -25585306, -27520491, -26113688, -28877334, -29710036, -32007691, -36457895, -39961774, -45367965, -52111160, -55022582, -53264172, -51700638, -50078275, -55770756, -63631341, -71195271, -79163723, -90864514, -103704776, -112395938, -115446162, -122345410, -128448714, -127884113, -123066215, -116650183, -108364393, -95494334, -79472862, -66684598, -60854104, -56076428, -52960993, -49786799, -47502339, -44132871, -43246112, -39382351, -30954769, -23413032, -20474683, -20879918, -18787004, -16399910, -15245969, -13171057, -13174216, -9986137, -5879376, -4678291, -4052765, -5564632, -10798227, -12432593, -13203298, -14948865, -11286598, -8438330, -10126374, -9095509, -6009497]
8568f009497j382868j117091k310123k603877p87756P79088K90563P29063M902375
8559g510123M586573J10090j097228N73407L615953J962332N91561O34795J447548
8550D914908q79805m709313m015432L09536R14419l498702J600977M521140M434044
8541C591772K186303k510534m64721R28160k905630m184692k968223j651058K408935
8532e569688L333836L266612J351689K457396L245225L896844J804451m213025
8524I573340n477183n634168l275302j604239K598112L208001k89781Q2977K183707
8515A365464L538262j222686n553598l774474R3688K062466K090998n88288P0452
8506a917716R91005J359921j905943o82555o20005j324866m21329L757512M746139
$$ y = [-6009497, -7392365, -8509456, -10819579, -13423456, -14211212, -13432124, -13141561, -12412498, -7510123, -2923550, -2813460, -3910688, -3337281, 278672, 2241004, 2832565, 3467360, 4914908, 4035103, -674210, -4689642, -4380106, -3465687, -6964389, -5363412, -842272, 3591772, 5778075, 3267541, 2802820, 3730980, 825350, -3359342, -6327565, -7978623, -5569688, -2235852, 1030760, 2382449, 4839845, 8085070, 11981914, 13786365, 9573340, 4096157, -1538011, -4813313, -6417552, -3819440, -611439, -901220, -818243, 1365464, 4903726, 3681040, -1872558, -5647032, -5553344, -3490878, -1399880, -1988168, -1917716, -926711, 433210, -1472733, -2155288, -2775293, -4100159, -4521488, -763976, 3982163]
8497C982163N92149l091550j726111N32551J050673k229379k793251J484771K13413
8488a984571j985796M534263P297614L117193q16831k825981P84957j38898k295805
8479E686145j507939K044281J833388j03512j865172l070235k878577j753282
8471a614903L242393M930574m71093j187107J726441p56967J204414k529011k38545
8462D306196j186391m086959k633331m70082J504995L202948K67436k910524j162702
8453c168414M067102M547023J752147k231088m180551j979045N47437K548577
8445A903188L188966R31742L80174k032461J67211J235738K995561k45449n890678
8436B633992o229705k252536K420029K277373r88298l564688j910823M53011K396521
$$ y = [3982163, 4574312, 1482762, -243349, 289202, 1339875, -889504, -3682755, -2197984, -1984571, -3970367, 563896, 7861510, 10978703, 10161872, 7335891, 8120848, 7981950, 5686145, 4178206, 6222487, 8055875, 7952363, 6087191, 3016956, 138379, -1614903, 1627490, 6558064, 6086971, 4899864, 6626305, 5869338, 7073752, 4544741, 4306196, 3119805, -967154, -3600485, -4070567, -2565572, 637376, 904812, -2005712, -3168414, 898688, 5445711, 7197858, 4966770, 786219, -1192826, -645389, 1903188, 5092154, 6023896, 6404070, 4371609, 4538820, 5774558, 8770119, 8524670, 2633992, -3595713, -5848249, -3428220, -1150847, -2139145, -5703833, -7614656, -7161645, -4765124]
8427d765124K197741L179037N391965K526054q78311k720596K928866r91363j940346
8418D927923l361660m184751k639702k602991l223818j150014K401283J294672
8410h539058K022295N783926P23850q4510L113727M431873j833417m31392L92630
8401E579924k798945k125410r42331j766523q54375K097801O093744K594793m256253
8392C622425l928743n85383K584357N843749L297698j109934n686187l691194
8384C46788j998409j854937L318087K858090n89208l538883j641016l93205J694488
8375a798205J683777m32586m263782j358534N449J645877l39016K489427K715682
8366C48089j507046p70484J557409m15838k376771L25185J789111L751835L935751
$$ y = [-4765124, -2567383, 611654, 6003619, 8529673, 7651362, 4930766, 7859632, 6868269, 4927923, 1566263, -2618488, -5258190, -7861181, -11084999, -12235013, -9833730, -8539058, -6516763, -732837, -8987, -93497, 3020230, 7452103, 5618686, 5187294, 5579924, 2780979, 655569, -286762, -2053285, -2907660, -809859, 5283885, 7878678, 3622425, -306318, -891701, 1692656, 7536405, 10834103, 9724169, 4037982, 346788, -1651621, -3506558, -188471, 2669619, 2080411, -1458472, -3099488, -3492693, -1798205, -114428, -547014, -4810796, -6169330, -6163881, -4518004, -4857020, -2367593, 348089, -1158957, -1929441, -372032, -787870, -3164641, -2839456, -1050345, 2701490, 6637241]
8357F637241K132226k823308n786863k829029J423359M931823N20301k754441
8349A451309j011908R20616J554621j018138l309166j377949P34489L549932N652808
8340G146614L060785l57965k399162k417066j994665j414378Q0418K618425J607791
8331E930797R32089j659557o299801m516489J434094M833565J628912j656934
8323F26676M37235j49023j59506k527026l368794k584944q61575K317683o43407
8314f912681R27238J000513M67048N42704l012493K937577O996382K319001o1633
8305E203656O84672j419440o653566o046385J415700J140426k614149M343709
8297c945377K694939k786625l428808j474471O464864M436885p88605q02608l05610
$$ y = [6637241, 8769467, 5946159, 159296, -2669733, -1246374, 3685449, 4205750, 1451309, 439401, 1360017, 2914638, 1896500, -1412666, -2790615, -2056126, 1493806, 7146614, 10207399, 9849434, 7450272, 5033206, 3038541, 1624163, 1704581, 4323006, 5930797, 6862886, 5203329, -1096472, -5612961, -4178867, 654698, 2283610, 626676, 1063911, 914888, 755382, -1771644, -5140438, -7725382, -8586957, -6269274, -6912681, -5985443, -4984930, -4517882, -3975178, -6987671, -4050094, 2946288, 5265289, 5203656, 5888328, 4468888, -2184678, -8231063, -6815363, -5674937, -8289086, -3945377, -1250438, -4037063, -7465871, -8940342, -2475478, 1961407, 1172802, 370194, 64584]
8288F4584l676188k562355J863503l98501l869211K38818P65515j64273R2195
8279g645913L692598L681887J508293J507226K935988L000014K825119L003064
8271A4508276K383770N11853r17680l059453l261180n358753n143104k163605
8263b499876J832317K840390j942653k014238J453950K65031M085060L860608
8255G880589M099775K674009j539880l900034R58582k906793m667544m41359j041743
8246A115602J846745L041951J471378M6207j874014p07516K543327M285780J118344
8237A2887804q056734p776249j256519j466112k364248j075358K784358M445796
8229a877262M571498N732027J302825k688881k305811J724937M712152M62814
$$ y = [64584, -3611604, -6173959, -4310456, -4708957, -8578168, -8339350, -7573835, -7738108, -7645913, -3953315, -271428, 1236865, 2744091, 5680079, 8680093, 11505212, 14508276, 16892046, 17403899, 16486219, 13426766, 10165586, 4806833, -336271, -2499876, -667559, 2172831, 230178, -1784060, -330110, -65079, 4019981, 7880589, 11980364, 14654373, 13114493, 9214459, 10173041, 7266248, 2598704, 2157345, 1115602, 2962347, 6004298, 7475676, 7521883, 5647869, 4940353, 7483680, 11769460, 12887804, 4831070, -2945179, -4201698, -5667810, -8032058, -9107416, -6323058, -1877262, 2694236, 8426263, 9729088, 7040207, 4734396, 6459333, 11171485, 11634299]
8221A1634299J352564J114627o37186L583894M622340K470947j637093n273283
8213A7231109n719854k532364k654679o028654q808252k069303J402921M019713
8205e159363M367464K073489n40798j02519K783313K278534L123892R42806k428220
8196G338598m953533j537458N99192J178503r85373j387989J00096l703203l196273
8187f547440L004796L569459K840666M20068m630995m038180q43869K879824M352157
8178A006486L907933Q04454M77334k90407O42631K300385J657035K073040K803156
8169A5382047K455815l217206k510608o9299M424366L939700J335564R69914L204473
8160B5914766J983449j165572j367972Q33270k88177k344576n275338p749626
$$ y = [11634299, 12986863, 14101490, 13464304, 17048198, 21670538, 24141485, 22504392, 17231109, 11511255, 8978891, 6324212, 295558, -8512694, -10581997, -9179076, -5159363, -791899, 1281590, 740792, 638273, 3421586, 5700120, 8824012, 9766818, 7338598, 2385065, 847607, 1446799, 2625302, 1639929, 251940, 352036, -3351167, -6547440, -3542644, 26815, 2867481, 3287549, -1343446, -5381626, -6225495, -3345671, 1006486, 4914419, 5718873, 6196207, 5905800, 6548431, 8848816, 10505851, 12578891, 15382047, 17837862, 14620656, 12110048, 12040749, 16465115, 20404815, 21740379, 22710293, 25914766, 27898215, 26732643, 25364671, 26197941, 25909764, 23565188, 18289850, 10540224]
8152A0540224k678947l06283l722167l701716j981646J61009M362398r17286l355427
8143a599841k075567K139653L629357K495901K52292o88261m922401m262375j053655
8134f084897L131963K950427M738301M173142R56594l118893n679027m113916
8126c046306j316955k104287K31978K26270k327446N61099J478607K12753J969276
8117d115011J628167K854826K2245m334881k50133L373691K281925j663377j7299
8108b19847M972313Q205701J386096K814424L471143k71775k592659l683010m374094
8099I708292q452789l050087N24276J722844O711362L37489k177014j554509n613170
8090a843306l186851O35458N83576P01442Q3133M37919j823297j176377p00550
$$ y = [10540224, 7861277, 7554994, 3832827, 131111, -1850535, -1689526, 2672872, 1755586, -1599841, -3675408, -1535755, 2093602, 4589503, 4841795, 4153534, -768867, -5031242, -6084897, -2952934, -2507, 4735794, 8908936, 9865530, 6746637, 1067610, -3046306, -4363261, -6467548, -6235570, -6009300, -8336746, -7775647, -6297040, -6084287, -4115011, -2486844, 367982, 390227, -3944654, -4194787, -821096, 1460829, -202548, -219847, 4752466, 12958167, 14344263, 17158687, 20629830, 20358055, 17765396, 14082386, 9708292, 1255503, -1794584, -1270308, 452536, 7163898, 7501387, 5324373, 3769864, -1843306, -5030157, -4394699, -3811123, -3109681, -3026548, -2588629, -4411926, -5588303, -6288853]
8081f288853k032377O70418M790925K727144R49061l952797o994116q80694P523815
8072c487474O706700j162862m042744l854875L42389L681023L998736K650020
8064D830913O41719j687869k430620P20363L25793r68135k680280k96846K789517
8055A244555j750056l772203o02932J205870K316415J557162K787002M076708
8047G062521J151275j052716n71902L12681k666379j219530j035067m767923l098794
8038e885834J45660N535877M944962J306340j538526l043457n294654l47657L374496
8029h02793J973552m62327l137101k375545k607148Q15884K961001k237083L17705
8020e553855o30960k985729l639930k251382k913939l38928j020769k486470J996098
$$ y = [-6288853, -8321230, -7650812, -2859887, -132743, 816318, -3136479, -10130595, -11011289, -3487474, 3219226, 2056364, -1986380, -5841255, -5498866, -1817843, 2180893, 4830913, 5472632, 3784763, 1354143, 2074506, 2400299, 1432164, -1248116, -1544962, 1244555, -505501, -4277704, -4880636, -3674766, -1358351, 198811, 2985813, 7062521, 8213796, 7161080, 6589178, 6901859, 4235480, 3015950, 1980883, -2787040, -5885834, -5740174, -204297, 4740665, 6047005, 4508479, 1465022, -3829632, -4177289, -802793, 1170759, 708432, -2428669, -4804214, -7411362, -6595478, -3634477, -5871560, -5553855, -6184815, -9170544, -12810474, -15061856, -17975795, -18314723, -19335492, -21821962, -19825864]
8011a9825864J211270m422165k951062m69933m95510J476669L843364J19818J310997
8002b0202416j764341l908563l489859n627449n810546m624269n557920j110278
7994e2095641k994687r769139r612472r096343p483405o289485p127369n716491
7986a10185032n733042p847351j0219282r203525n995516k919391J783774P559297
7978a42760068P370613L151457P623081J2144671J1554353R565396P325879Q829243
7970g5195375J0503659R307374N388351M447016N619619R207980O810398J431239
7962b2479739Q74381K207742l08665l186193n68463K412341J961532J681767K691952
7953a4713345K847148K718394M28289m33543k104861q69984J767461K7918n81695
$$ y = [-19825864, -18614594, -23036759, -25987821, -26457754, -26953264, -25476595, -21633231, -21513413, -20202416, -21966757, -25875320, -29365179, -34992628, -40803174, -45427443, -50985363, -52095641, -55090328, -64859467, -74471939, -83568282, -91051687, -97341172, -104468541, -110185032, -115918074, -123765425, -133984707, -143188232, -149183748, -152103139, -150319365, -142760068, -135389455, -132237998, -124614917, -112470246, -100915893, -91350497, -84024618, -75195375, -64691716, -55384342, -49995991, -45548975, -39929356, -30721376, -23910978, -22479739, -21605358, -19397616, -19706281, -22892474, -23460937, -21048596, -19087064, -17405297, -14713345, -11866197, -9147803, -8719514, -9153057, -11257918, -12127902, -10360441, -10332523, -10914218]
7944a0914218J474013J319602K189743P70740J244909j892456m206445K15128
7936i798984L207052J628462k23338L48801Q95588J394305j415908p832354m725511
7927a6521887J422825O192175K822676J361761o16561l561959j11361K334848
7919f677483r13169o017792l134131j844760M16343L163531K609084j019561k493879
7910a5911817k285250J157995K901414K875957m59862j645770J406767K071884
7902i888682J732367k114084l907208K748073p40971j913821P89362K6130K49147
7893a3019687j028775j648836L729584n96161j480259P20696r06243k58218Q3405
7884a4404494J077578K658656M248006n58807l679907n200001m963000k359498
$$ y = [-10914218, -9440205, -8120603, -5930860, -5160120, -3915211, -5807667, -10014112, -9798984, -6591932, -4963470, -5186808, -4838007, -3942419, -2548114, -3964022, -11796376, -16521887, -15099062, -8906887, -6084211, -4722450, -5339011, -8900970, -9012331, -6677483, -7590652, -13608444, -16742575, -18587335, -18170992, -15007461, -12398377, -13417938, -15911817, -18197067, -17039072, -14137658, -11261701, -11721563, -13367333, -11960566, -9888682, -8156315, -10270399, -14177607, -11429534, -12170505, -14084326, -13294964, -13268834, -13019687, -14048462, -15697298, -11967714, -12563875, -14044134, -13323438, -14229681, -14487899, -14404494, -13326916, -10668260, -6420254, -6979061, -10658968, -15858969, -20821969, -23181467]
7876b3181467L73138L17208K023807J207373K580674M404724M74087l393142k733621
7867a7927219J579905P30642l357908K442743L234301k038942p708757m504398
7859b7549633J897245K578810J011719L643817N028380K407351j420444l555339
7851a5958094n961973k775586j899429m287234l998468k529362j462220M1401
7843c8830965J536172J352387J43991P2763j315364l749450k381235k754682m020105
7834d9946488p10804q4978k462191M77446J624219r52166n289992k574726n217130
7825f5136810p798013l555451m069866p685908j0133533q358019p367410p742778
7817a21847788j4821323j9161639j9530179k2357329j9509407j8485727k2922308
$$ y = [-23181467, -22808329, -22491121, -20467314, -19259941, -16679267, -12274543, -11800456, -15193598, -17927219, -16347314, -15616672, -18974580, -16531837, -13297536, -15336478, -23045235, -27549633, -25652388, -23073578, -22061859, -18418042, -13389662, -10982311, -12402755, -15958094, -21920067, -24695653, -26595082, -30882316, -34880784, -37410146, -38872366, -38830965, -37294793, -35942406, -35798415, -35725652, -37041016, -40790466, -43171701, -45926383, -49946488, -50657292, -50742270, -53204461, -52727015, -51102796, -52054962, -57344954, -59919680, -65136810, -72934823, -76490274, -80560140, -88246048, -98379581, -106737600, -114105010, -121847788, -136669111, -155830750, -175360929, -197718258, -217227665, -235713392, -258635700]
7810b58635700k9415188k9976915k7723976k4108286j4964858p013047l79940
7803c92217910N403708J4323049K5185296L2078957L6933207L5669847L2166415
7796b10457431K4663584K1165313K0635414J8774536J8049205J3424557R812007
7789h3932815J2011289J0970703P906638R062465N938581M669617J443712K350044
7781b9579766l223924j590093L234371N717602L984445L225985L432061J46167
7773a4653152k888224l122343J810030N896796M370330J810002L222234L014158
7765e40169l18986K16188m59426k822569o97680l565296j024465L927578N622325
7756C37500L307115j249786o178953n337666K0638K445969J321534k978466l321548
$$ y = [-258635700, -288050888, -318027803, -345751779, -369860065, -384824923, -391837970, -392217910, -386814202, -372491153, -347305857, -315226900, -278293693, -242623846, -210457431, -185793847, -164628534, -143993120, -125218584, -107169379, -93744822, -83932815, -71921526, -60950823, -53044185, -43981720, -38043139, -33373522, -31929810, -29579766, -32803690, -34393783, -31159412, -25441810, -21457365, -18231380, -14799319, -14653152, -17541376, -20663719, -18853689, -12956893, -8586563, -6776561, -3554327, -540169, -859155, -642967, -1102393, -3924962, -4622642, -8187938, -9212403, -5284825, 337500, 3644615, 2394829, -3784124, -9121790, -9101152, -6655183, -5333649, -8312115, -11633663]
7747a1633663j594323m84334O01742M270847j041442l814465j444944J502937
7739a3637645M629415K715316j017482O25804J472950m56082M050584M449261
7731B832121j185548k823766j682546N73836Q68048k659741l051938J724209L016459
7722b388866J656218j498366j305306m84712L396118J683970j11558l146107j140154
7713c338763M695798K762452L613217Q55807k711237k668432k221568j208240
7705b20966L167164L503361J018907o26385q94277k892981o708873m380458o55094
7696h689602L279687K400302J492768O29858O34663M071722K281711J847621J802195
7687I750925k326485k662011j340936k292063k667491k740253J84299K177549
$$ y = [-11633663, -13227986, -13712320, -13110578, -8839731, -9881173, -13695638, -15140582, -13637645, -9008230, -6292914, -7310396, -6684592, -5211642, -5667724, -1617140, 2832121, 1646573, -1177193, -2859739, -2285903, -1417855, -4077596, -7129534, -5405325, -2388866, -732648, -2231014, -3536320, -4021032, -624914, 1059056, 947498, -2198609, -3338763, 1357035, 4119487, 7732704, 8588511, 5877274, 3208842, 987274, -220966, 2946198, 6449559, 7468466, 6842081, 5947804, 3054823, -3654050, -8034508, -8689602, -5409915, -3009613, -1516845, -886987, -252324, 3819398, 6101109, 7948730, 9750925, 7424440, 4762429, 3421493, 1129430, -1538061, -4278314, -4094015, -1916466]
7679a916466L162060L035100J169107k391977j106232k383285r70336m03638j627772
7670c433439K613782N531079L472302r49539k34709j460697o058125q145779k058916
7661a0724041M063454K155541J303446K303361M00925N53075K887287q55798j139860
7652I47390K161362j54453J106921L560055K080160l399875l783626k914942m759435
7643e156443j852825M573149N807074r27968l205308j066346l001998m192233
7635i022898k337654J707522N012896M610003P82778K279898j260902k640825
7627h69182q07914k399547k78168L146385J968975l43363L211070N019373J031265
7618I678894n494183m124289j500742M468215P67386l406298J13267M325000J957354
$$ y = [-1916466, 1245594, 4280694, 5449801, 3057824, 1951592, -431693, -1402029, -1805667, -3433439, -819657, 4711422, 8183724, 7234185, 6999476, 5538779, -519346, -8665125, -10724041, -6660587, -4505046, -3201600, -898239, -497314, 55761, 2943048, 2087250, 947390, 3108752, 2954299, 4061220, 7621275, 9701435, 6301560, 2517934, -397008, -5156443, -7009268, -2436119, 3370955, 2442987, -762321, -1828667, -4830665, -9022898, -11360552, -9653030, -4640134, -30131, 752647, 3032545, 1771643, -869182, -1677096, -4076643, -4354811, -1208426, 760549, 417186, 3628256, 8647629, 9678894, 4184711, 60422, -1440320, 3027895, 3795281, 388983, 502250, 4827250, 6784604]
7609F784604n738757o507424n76215M09416Q36311J491903M15373Q95034j157448
7600c147203l760851m9465L177834K326543K280453J463966k898850l608486n667772
7591i883831n312580k425338n97757j355140k154507o10061J623023M413649K096847
7582a4205695k128901J50549q1455j180705R9259M714408L052484j52539K078914
7573g653681N88796J104180J465625j318149n466413n370872o622893k077815
7565b5351222k189367m524694l832589k634345l123658n510200m239504j580986
7557e2986565l490842o301335m048849n730052j1771361j0173978p302536r110108
7549a10915626j2746228r583588j2282569j4914403j6691933j8698858k5442381
$$ y = [6784604, 1045847, -5461577, -6037792, -5628376, -4792065, -3300162, -2884789, -1989755, -3147203, -6908054, -6957519, -3779685, -1453142, 827311, 2291277, -607573, -4216059, -9883831, -15196411, -17621749, -18219506, -19574646, -21729153, -22339214, -20716191, -16302542, -14205695, -16334596, -16184047, -16265502, -17446207, -17346948, -12632540, -9580056, -9732595, -7653681, -7064885, -5960705, -4495080, -5813229, -11279642, -16650514, -23273407, -25351222, -27540589, -32065283, -35897872, -38532217, -41655875, -47166075, -51405579, -52986565, -56477407, -62778742, -66827591, -72557643, -84329004, -94502982, -101805518, -110915626, -123661854, -133245442, -145528011, -160442414, -177134347, -195833205, -221275586]
7542b21275586k7360180k3845012k3061437k2798265k2253205j8082828j0190499
7535c68867012j037852P282781J7558632K5998725L1485898L0709395K6148520
7528b30720913K5044359K6088631K6068267K1224058J1516442J3811166J6721915
7521i0246075J2539968J0114939M773048N271256M805716M368064P309572N044802
7513c6018710j68112O12813K056588J117077J768994L854180L931829J674035
7505b1171306n86322J231039K01396P48871M036118J628731k485209j450006J81623
7496a7665065K026199J655597P86065K53319j001627j356641L30434J084178q34143
7487a4721684k85130M436317N971807N76292k255931J416571J674765J974032
$$ y = [-221275586, -248635766, -272480778, -295542215, -318340480, -340593685, -358676513, -368867012, -369904864, -362622083, -345063451, -319064726, -287578828, -256869433, -230720913, -205676554, -179587923, -153519656, -132295598, -120779156, -106967990, -90246075, -77706107, -67591168, -62818120, -57546864, -52741148, -48373084, -41063512, -36018710, -36186822, -35574009, -33517421, -32400344, -30631350, -26777170, -22845341, -21171306, -21757628, -20526589, -20325193, -19576322, -15540204, -13911473, -16396682, -17846688, -17665065, -15638866, -13983269, -13197204, -12943885, -13945512, -15302153, -14971719, -13887541, -14721684, -15006814, -10570497, -4598690, -4022398, -6278329, -4861758, -3186993, -1212961]
7479a212961m63985j266779J512346R15655p39878j223433l655344j320630J081588
7470f373421r51396K20931J359010K522991J238212J771500K430822M235282L379795
7461I833726N49531l483157r118252l333156j798997j627765L744067L210501
7453b023502j398999m61248n89751J420481L959657J674507k733999k897998J37730
7444b913122P59487j204538Q84420L790715P755000K751691o329928l712484K385052
7435D166293K543865j22456n25739J065397J837329L90727o08740m31866n212118
7426C102692k168302q01126N43467K262683L833927m057300q291696k712832J059646
7417g228841J576559L188412M428015J737116N70867J3108k70122K371821j410802
$$ y = [-1212961, -1676946, -2943725, -1431379, -515724, -1255602, -2479035, -6134379, -7455009, -6373421, -7324817, -7103886, -5744876, -3221885, -1983673, -212173, 2218649, 6453931, 9833726, 10383257, 6900100, -2218152, -5551308, -7350305, -8978070, -5234003, -2023502, -3422501, -3883749, -4473500, -3053019, 906638, 2581145, -152854, -3050852, -2913122, -2153635, -3358173, -2473753, 1316962, 9071962, 11823653, 5493725, 1781241, 4166293, 6710158, 6587702, 6061963, 7127360, 8964689, 9355416, 8746676, 8314810, 3102692, 934390, 133264, 676731, 2939414, 6773341, 2716041, -5575655, -8288487, -7228841, -5652282, -2463870, 1964145, 3701261, 4272128, 4285236, 4015114, 6386935, 4976133]
7408D976133p230750o794154m597062q95413M091829L960904J878936K401231
7400b208346J833675l162012N59801k646926m737361q77852M193265L787916j723206
7391d981046r74492K738353M197965J947055K123379N811652J269196Q80857o34344
7382A2378575l981724l029800Q22942O54388J13038M080299m34045m013482m012042
7373B578149J999437Q967753O261978l085247p983123m932241j930460j776970
7365I9276N0351M25171J683931L102948J130843K121345N09996n617931n82980
7356B922950K901075K588914l236618p60767J358719o23142M87620K843151k88121
7347H193781k838987K6473K919352K590737r41672N18813j543968k768200l691918
$$ y = [4976133, -2254617, -9048771, -13645833, -14541246, -10449417, -6488513, -4609577, -2208346, -374671, -3536683, -2976882, -5623808, -10361169, -11239021, -7045756, -3257840, -4981046, -5955538, -3217185, 980780, 2927835, 5051214, 10862866, 12132062, 13012919, 12378575, 8396851, 5367051, 6189993, 6844381, 6957419, 11037718, 10603673, 6590191, 2578149, 4577586, 13545339, 19807317, 16722070, 8738947, 3806706, 1876246, 99276, 149627, 574798, 2258729, 5361677, 6492520, 8613865, 9123861, 3505930, 2922950, 5824025, 8412939, 5176321, 4415554, 5774273, 5151131, 5638751, 8481902, 8193781, 5354794, 5381267, 8300619, 10891356, 9949684, 10468497, 8924529, 6156329, 2464411]
7338B464411l658504k494268k035192n19720L006878M225362K236153J090291
7330D315411Q68858o39162j158963k069962p46345k982726n804982j973170K996342
7321g194699R53166j153498K177759J518651J59750J267719N85589l469129p32496
7312e887188J087735J298456q50743l597249n12804k280732l186865K326566M056825
7303g545999l143184j524987L564753J199790M788145M603533K131639J735652
7295E809342m352344K06337M575334J527434j290960j561998l238983P4772K845443
7286D594377L5599k408349m143847k126451j334673J723298L623910p07895k156355
7277b900386j297055L699031K762344Q9783k932018k110661l665559n366952r4279
$$ y = [2464411, -1194093, -3688361, -5723553, -6243273, -3236395, 988967, 3225120, 4315411, 5184269, 4545107, 3386144, 1316182, 569837, -2412889, -8217871, -10191041, -7194699, -6241533, -7395031, -5217272, -3698621, -3538871, -2271152, -1685563, -5154692, -5887188, -4799453, -3500997, -4351740, -7948989, -8461793, -10742525, -13929390, -11602824, -7545999, -10689183, -12214170, -8649417, -7449627, -2661482, 1942051, 4073690, 5809342, 1456998, 1663335, 6238669, 7766103, 6475143, 4913145, 1674162, 1748934, 4594377, 4629976, 2221627, -1922220, -4048671, -5383344, -3660046, -36136, -744031, -2900386, -4197441, -498410, 2263934, 2353717, -578301, -2688962, -6354521, -11721473, -11815752]
7268a1815752O390963L543529L445960J861790K345235K657630L56095k242446
7260F543004m847572j808840J198414K406657J117340L648684J245947o918457
7252B585177m643613K080963K266972R35962M90431l597021j226052J598018r40409
7243d49572M08097o44826l273812r67221O180850Q827306L028260o819235l773369
7234B516478l489379o30612L534670O292651N238195K057345J412609k399216
7226A4532741l774993j510205M61334K237021q19180m64302m939870l726046n65619
7217A430881m34884j27779m18765n89905P24541K091565l01555l739597k788176
7208d153674L328266L483792J398113k951871k003828L022401L657512k22794
$$ y = [-11815752, -5424789, -1881260, 1564700, 3426490, 5771725, 8429355, 8785450, 6543004, 1695432, -113408, 1085006, 3491663, 4609003, 8257687, 9503634, 2585177, -2058436, 22527, 2289499, 3225461, 3715892, 118871, -1107181, 490837, -449572, -41475, -686301, -3960113, -4927334, 1253516, 10080822, 13109082, 6289847, 2516478, -972901, -1603513, 1931157, 8223808, 13462003, 15519348, 16931957, 14532741, 10757748, 9247543, 9708877, 11945898, 11126718, 10662416, 5722546, 1996500, 1430881, 995997, 868218, 449453, -140452, 584089, 2675654, 2374099, -1365498, -4153674, -825408, 2658384, 4056497, 1104626, -899202, 2123199, 5780711, 5557917]
7200E557917q53583J756241N2336j797042q33637J614217L47078o56783k566025
7191B620719k225456J629960L78959l146676l43111M123844R60408l033360l206257
7182b240970K572816L854397J716841J95053J4269j681530j739130K260700M530604
7173I483050L600090J653374j759659L45221K83425j999597k990802o634717l848370
7164a867985L892942J616609j318711J79351k461165J030745M911625m81348j235364
7155D266699J220642L405367J349653p62928j53520r51996k735917l228742k654689
7146b45431k99556P79295k124704p71967K446176K464791j11804m558686m892651
7137g314537J051295O859076M023812q25550m01724K101591k357918m396683j740812
$$ y = [5557917, 4704334, 6460575, 6512911, 4715869, 3882232, 5496449, 5843527, 5186744, 2620719, 395263, 2025223, 2404182, -742494, -1085605, 3038239, 3998647, 965287, -2240970, 331846, 4186243, 5903084, 6098137, 6112406, 4430876, 2691746, 4952446, 9483050, 13083140, 14736514, 12976855, 13322076, 13605501, 11605904, 8615102, 1980385, -1867985, 2024957, 3641566, 2322855, 2502206, 41041, 1071786, 5983411, 5502063, 4266699, 5487341, 8892708, 10242361, 9479433, 9325913, 8373917, 5638000, 2409258, -245431, -544987, 234308, -1890396, -2662363, -216187, 2248604, 2136800, -2421886, -7314537, -6263242, 595834, 4619646, 3794096, 3392372, 5493963, 3136045, -1260638, -3001450]
7128c001450K780711L006117l180651q60261K189845K744475K648199j576105
7120D750880k136863M050933m12642J59406L425663J688913l061130j705150j603297
7111E156713o41277J626116l914430o093773j641811j7064J240825R50783J147054
7102b186864j617111P18674L406501K265840q75764J641341J021939K045994K585253
7093I005803J8766j711306k485257J348902l11035o46371J884719o15684j117793
7084E370744L358530l49372j995429k970986k460564j061921j416931J893872
7076C67943J958394J698146N50871r5528K238550K191246l069493m059414K194875
7067C975590J341607l968616j424110K755542O2882l425798m65554J391062K236625
$$ y = [-3001450, -220739, 2785378, -395273, -1255534, 934311, 3678786, 6326985, 4750880, 2614017, 6664950, 6252308, 6411714, 9837377, 11526290, 8465160, 6760010, 5156713, 4515436, 6141552, 2227122, -3866651, -5508462, -5525526, -4284701, -3333918, -2186864, -3803975, -3085301, 321200, 2587040, 1711276, 3352617, 4374556, 6420550, 9005803, 9024569, 7313263, 4828006, 6176908, 5865873, 5219502, 7104221, 6488537, 5370744, 8729274, 8379902, 6384473, 3413487, 952923, -108998, -1525929, 367943, 2326337, 4024483, 4575354, 4479826, 6718376, 8909622, 5840129, 1780715, 3975590, 5317197, 1348581, -75529, 2680013, 2742895, -682903, -1148457, 242605, 2479230]
7058B479230K513464J578459l892764l084754L083094L021331j05705j840609
7050C751746l740506k784492J149725L808233P73701j119012m322103k202184
7042d684892K431481l38011k331955l329177k310978q96108R34810K583173J345229
7033f596428j322100J939189M914673M335418J724027l84495n950453q612418
7025i952587l356374L493045L381660L340771L910084M05699j806921L80341M183514
7016C979232p43142k95531O34734j487290j756668n33367K30594J998405J843365
7007C870332l178119j683226j195265j216701J690302N02066k223157j208769
6999d642537j16295J324830M772530q85189q89725N17375J73239J089007l384884
$$ y = [2479230, 4992694, 6571153, 2678389, -406365, 2676729, 5698060, 5592355, 3751746, 11240, -2773252, -1623527, 2184706, 2958407, 1839395, -2482708, -4684892, -2253411, -2591422, -4923377, -8252554, -10563532, -11459640, -10524830, -7941657, -6596428, -7918528, -5979339, -1064666, 3270752, 4994779, 4610284, -1340169, -9952587, -13308961, -9815916, -6434256, -3093485, 816599, 1222298, -584623, -204282, 3979232, 3236090, 2940559, 3575293, 2088003, 331335, -202032, 28562, 2026967, 3870332, 692213, -991013, -2186278, -3402979, -1712677, -1210611, -3433768, -4642537, -4758832, -3434002, 1338528, 453339, -436386, 80989, 254228, 1343235, -2041649]
6990b041649k991732l024470l364195J064202M825478M956107J063121q72794
6982c85932j323392J887069j588684l410463m255849j344789k740866m183436
6974a7346342K80067O424356M002739m51988N09562L88899l629233l230399J248061
6965a1804278K905727k874595j553461L553271L488180L973280J474387N188212
6957D350723M201581J178293j432009m458807n502405K24037M223815L442100
6949F227328L728555J152201l693994j878182j155201k060273k081664k740462
6941b501692j827231J907462M377422L617060K165090m882021l980330k089777
6933c214017r39600K512524L33422K297442N40566k013428O5674k112922m152843
$$ y = [-2041649, -5033381, -8057851, -11422046, -10357844, -5532366, -576259, 486862, -385932, -1709324, 177745, -1410939, -4821402, -9077251, -10422040, -13162906, -17346342, -17066275, -10641919, -6639180, -7091168, -6581606, -6192707, -9821940, -13052339, -11804278, -8898551, -11773146, -13326607, -9773336, -6285156, -2311876, -837489, 4350723, 8552304, 9730597, 8298588, 3839781, -1662624, -1438587, 2785228, 6227328, 9955883, 11108084, 7414090, 5535908, 4380707, 2320434, 238770, -2501692, -4328923, -2421461, 1955961, 5573021, 7738111, 2856090, -1124240, -3214017, -4153617, -1641093, -1307671, 989771, 1530337, -483091, -417417, -2530339, -6683182]
6924f683182m16590L129966J798509m25193k02917J88079j379595m727216n56309
6915i274448K090503J136488J917257j226050j293816R24536N184182O108725
6907E567377J012629p09560r83826q79229r58063k302465k276372m31474m200444
6898f161427m163200m26450K100905N531524K345176P79530K023947K430279l87898
6889D072386m529726l451344J073127k269968k926105L355761M152319M057819
6881C534269l122124m649028N16914J397890K441666K536527L01440l180855j889474
6872b112775K467168L565745K33079n053009n253863p05042J792972J695420K542547
6863h27758j108914j663607K386127J216121k911910m855339Q71364M094166K910201
$$ y = [-6683182, -7099772, -3969806, -2171297, -2596490, -2799407, -2611328, -3990923, -8718139, -9274448, -7183945, -6047457, -4130200, -5356250, -6650066, -5725530, -541348, 5567377, 6580006, 5870446, 4886620, 4007391, 3049328, 746863, -1529509, -1960983, -6161427, -10324627, -10751077, -8650172, -3118648, -773472, 6058, 2030005, 4460284, 4072386, -457340, -3908684, -2835557, -5105525, -8031630, -4675869, -523550, 3534269, 412145, -4236883, -3719969, -2322079, 119587, 2656114, 2957554, -223301, -2112775, 354393, 3920138, 4153217, -899792, -6153655, -6858697, -5065725, -3370305, -827758, -1936672, -3600279, -1214152, 1969, -2909941, -7765280, -6893916, -2799750, 110451]
6854A10451K877282M922147J052424m476987J739536M85287l068718o116817j584087
6845d059482l097834j263159M175193Q73507Q42063J265158L440587M304082j289794
6836E190321n982441o211666j451589K160902K898815J876669M388084R27128
6828C796223q00283j093593J7969L483962r16404l028420J29007L591915L129765
6819H310141J716274K278221j058796k653955l525104O97779o66135m048242o55338
6810C94845K601782j293009o31876K787041K379194j05629J934429L748225j89368
6801A1625634k419520m422500k966870M96187j375168k965098M347363M936610
6793G256638n37162k105938j451148k008125J349226J477203L830467K433631
$$ y = [110451, 2987733, 7909880, 8962304, 4485317, 6224853, 6710140, 3641422, -2475395, -4059482, -7157316, -8420475, -4245282, -3371775, -2529712, -1264554, 2176033, 6480115, 5190321, -792120, -7003786, -8455375, -6294473, -3395658, -1518989, 2869095, 3796223, 2995940, 1902347, 1920316, 5404278, 4487874, 1459454, 1588461, 5180376, 8310141, 10026415, 12304636, 11245840, 8591885, 5066781, 5764560, 5098425, 1050183, 394845, 2996627, 1703618, 1071742, 3858783, 6237977, 6132348, 8066777, 11815002, 11625634, 9206114, 4783614, 1816744, 2312931, 937763, -2027335, 2320028, 7256638, 6719476, 4613538, 3162390, 1154265, 2503491, 3980694, 7811161, 10244792]
6785A0244792P46736R06190K819083K231188n57300m358840p604056k548211N07647
6776B387229k592907l572343J336374O884416O067728J460p79646n69289l205161
6767E957861j682488j451170l70616J935596k494224l377561k246297P49114L670529
6758F90744L601502K148610j410954n71886N028910K6669k485896r72445k574829
6749C480425k853305m511776m39971k483811k205180K892522L583025j512361
6741d050432O87935J886177J222992q32484r76130Q85382J480398r16254k461519
6732c073935J246803O599110J611165J654800J94614k512273q21674K38678m164661
6723I72627o002209N41639O043723M166727L292342p45859K77175l29425l312235
$$ y = [10244792, 10991528, 11897718, 14716801, 16947989, 16390689, 12031849, 4427793, 1879582, 2387229, -205678, -3778021, -2441647, 4442769, 10510497, 10511957, 9732311, 9163022, 5957861, 4275373, 2824203, 2453587, 4389183, 1894959, -1482602, -3728899, -2979785, 690744, 4292246, 6440856, 5029902, 4458016, 9486926, 9513595, 7027699, 6055254, 3480425, 627120, -3884656, -4324627, -6808438, -9013618, -6121096, -2538071, -4050432, -3362497, -1476320, -253328, -1085812, -2061942, -1176560, 303838, -612416, -3073935, -1827132, 4771978, 6383143, 8037943, 8232557, 5720284, 4898610, 5137288, 972627, -5029582, -4487943, 1555780, 5722507, 9014849, 8268990, 8546165, 8216740, 4904505]
6714D904505K06303K090014K932264K89697M11112k764845n548357k687468k497826
6705b664601j060684K316637L485654M847163J669124j755412j64142M356207
6697A1029946J261648m356261l885415K898604N801225K702424J28793j619325
6689A3961639n432909l589516l86905m98793J996035J651210p04779j311743k907595
6680B776644k192734R2663J840056K626066J362061n06737q12733Q22132K454476
6671H461894O08899K66654l872972p296944Q7284K131860L88600O41809K650376
6662D067460O069340L577973j186141k696027k144397K070653K533J817883M480830
6653A6060107j124951j136240J96995L27684K960571J978108M24003J478856p86564
$$ y = [4904505, 5110808, 7200822, 10133086, 10422783, 10833895, 8069050, 2520693, -166775, -2664601, -3725285, -1408648, 2077006, 6924169, 8593293, 6837881, 6673739, 11029946, 12291594, 7935333, 4049918, 6948522, 12749747, 15452171, 15580964, 13961639, 8528730, 4939214, 4552309, 4053516, 6049551, 7700761, 6995982, 5684239, 2776644, 583910, 676573, 2516629, 5142695, 6504756, 5998019, 5185286, 6007418, 8461894, 9070793, 9337447, 5464475, -1832469, -1745185, 386675, 775275, 1417084, 4067460, 10136800, 13714773, 12528632, 9832605, 7688208, 9758861, 9761394, 11579277, 16060107, 14935156, 13798916, 13995911, 14323595, 17284166, 19262274, 19686277, 21165133, 20378569]
6644B0378569m560386k369046M526717O391504O74473R43617M39309j622934l393612
6635B1408211l367588N77701K944514J082384K740550J220522O1831L677528K993012
6626C3338665J101347P049494Q766980M125774N93551M073170O012464P387382
6618G2448827P752982Q450609J1093781J3335604J4568018J4845343J8467641
6611A60962805K5494207K7823875K9451893K4821323K3218115K7477836K7733865
6604C46983919J9045865J0655051m70580j5977205k8531644l6572897l8241063
6597B56891446l4899431l4454693k9865325k4507462j6949005j3085353j2868008
6590I0262169j0047555n528910l112902n013830n842881n563626o245485n376601
$$ y = [20378569, 15818183, 13449137, 17975854, 24367358, 25041831, 25985448, 26424757, 24801823, 21408211, 18040623, 18618324, 21562838, 22645222, 25385772, 26606294, 26668125, 30345653, 33338665, 34440012, 41489506, 50256486, 54382260, 54975811, 59048981, 65061445, 72448827, 80201809, 88652418, 99746199, 113081803, 127649821, 142495164, 160962805, 186457012, 214280887, 243732780, 268554103, 291772218, 319250054, 346983919, 366029784, 376684835, 376214255, 360237050, 331705406, 295132509, 256891446, 221992015, 187537322, 157671997, 133164535, 116215530, 103130177, 90262169, 80214614, 74685704, 71572802, 66558972, 60716091, 55152465, 48906980, 43530379]
6582D3530379n745835q669155n750140r79864r7584P20880j904184k389958m142170
6573A4572369J925140P569731M275891j959082l277495k060176J039537k38884
6565B1847031m97010l284337J101019J89375l971598K28585M479983j598776l967185
6556A4527087k93725k128743K61140P45377l929669l329855j121197M02356K484123
6547G616894K427743J206633j750009l331191l686779j507676J553783J590097
6539D119495J353347K538832O658589L955066j727168k347040j746805j118428
6531A1685888J025346j144935q37410J475843P96034J068353K113228k583756
6523A3598591k594156l777875j660521k257963M61654k507410m268707J042480
$$ y = [43530379, 37784544, 29115389, 23365249, 22385385, 22287801, 23008681, 21104497, 18714539, 14572369, 16497509, 24067240, 28343131, 26384049, 23106554, 21046378, 22085915, 21847031, 21350021, 18065684, 19166703, 19356078, 15384480, 15613065, 20093048, 18494272, 14527087, 14233362, 12104619, 12365759, 13111136, 9181467, 5851612, 4730415, 5132771, 7616894, 10044637, 11251270, 9501261, 6170070, 2483291, 975615, 2529398, 4119495, 5472842, 8011674, 14670263, 18625329, 16898161, 14551121, 12804316, 11685888, 12711234, 11566299, 10728889, 12204732, 13000766, 14069119, 16182347, 13598591, 11004435, 7226560, 5566039, 3308076, 3769730, 1262320, -3006387, -1963907]
6515a963907L627419Q08016j783908j542245L060055N660223N568257J15406j961209
6506A1588107j258084J910116M41360K90121j986689n377958m655689J577655
6498B528939k197807K017770M748334J102174j683334k748211l450618j193253
6490h76006j754994J808216M231519K423734M498764K732494K78764K948038k841443
6481A3449086j403199K466127M606540J224204m341646n056083l199792l576676
6473D168561o6919j736236k393666j844047p32402j451222j011678J487726M813100
6464A233217K070466L537417L361723j698765j708137k139047l139347l238658
6456a721131l833191q96756L224833K494162K467973M416829J319573p11514o39268
$$ y = [-1963907, 1663512, 2471528, 687620, -854625, 2205430, 7865653, 13433910, 13549316, 11588107, 10330023, 12240139, 12681499, 12971620, 10984931, 5606973, 951284, 2528939, 331132, 2348902, 7097236, 8199410, 6516076, 3767865, 317247, -876006, -2631000, -822784, 3408735, 5832469, 10331233, 13063727, 13342491, 16290529, 13449086, 12045887, 14512014, 19118554, 20342758, 16001112, 10945029, 7745237, 4168561, 4101642, 2365406, -28260, -1872307, -2604709, -4055931, -5067609, -3579883, 1233217, 3303683, 6841100, 10202823, 8504058, 6795921, 4656874, 1517527, -1721131, -5554322, -6451078, -3226245, -732083, 1735890, 6152719, 7472292, 6760778, 6121510]
6447F121510k771657m960285n20349N958472J723624j075396k104483j347861
6439A023575m765681o161910K61J617499N80506j092469j644016M270006J0357040
6430D184811M922635j988092N49769k727096n31629L08667m80160k257775j210951
6421G70179K208489j472506j814084l60710p75789K148406L843999K581145L161739
6412A0290868L045991j104169l643366m870830o72965K193435J550869K399637
6404I189470j156028n513637m921786p125741l732949n74792J787353L009415
6396i038695L488762J581250J432452M438469K955280j696332J116139K323973
6388F601298k430826m312039k859L966713m88076k308741k878345k050577J792787
$$ y = [6121510, 3349853, -1610432, -2130781, 3827691, 5551315, 4475919, 2371436, 1023575, -3742106, -9904016, -9903755, -8286256, -7705750, -8798219, -10442235, -6172229, 4184811, 9107446, 7119354, 7669123, 4942027, 4410398, 4719065, 4238905, 1981130, 770179, 2978668, 1506162, -307922, -668632, -1444421, 703985, 4547984, 7129129, 10290868, 13336859, 12232690, 8589324, 3718494, 3045529, 5238964, 6789833, 9189470, 8033442, 2519805, -2401981, -9527722, -13260671, -13835463, -12048110, -9038695, -5549933, -3968683, -2536231, 1902238, 4857518, 3161186, 4277325, 6601298, 4170472, -141567, -144426, 3822287, 3334211, 1025470, -1852875, -3903452, -2110665]
6379b110665j94447j554484J051276L530346O231084P450818L60823r15609K408245
6370A6257387l502135p304391p845164k160792M598088L359618J641459J503037
6362F547107L674307M254902j738683o484536m521882R82123K910484n22783k94571
6353D806468L86957J958435L772245K28466R87813k03407j026633j929404n972885
6344C008055k439252K801399J193431R97155P43344m39374j828311l013877j902756
6335h80186J987198L816812k284265k185360J481625k470530l432819J129154
6327b838371L483555j008077J490321K590832J66310K124005M356018K454283
6319A2818876J234765m001474m886949J154077l07016n750009m532947n13005
$$ y = [-2110665, -2305112, -3859596, -2808320, 722026, 6953110, 14403928, 14764751, 13849142, 16257387, 12755252, 5450861, -2394303, -4555095, 42993, 3402611, 5044070, 6547107, 10221414, 14476316, 12737633, 6253097, 1731215, 2713338, 5623822, 5101039, 4806468, 5193425, 7151860, 10924105, 11152571, 12140384, 11936977, 10910344, 8980940, 3008055, 568803, 3370202, 4563633, 5560788, 6304132, 5864758, 4036447, 1022570, -880186, 1107012, 4923824, 2639559, 454199, 1935824, -534706, -3967525, -2838371, 645184, -362893, 1127428, 3718260, 3884570, 6008575, 10364593, 12818876, 14053641, 10052167, 5165218, 6319295, 6012279, 262270, -4270677, -4783682]
6311d783682K344855L244126m12731k797037K569007K836753l975818m860352
6303e834879R76072K158968J113255K114712k009615k257658j64831j888350l144234
6294h936560o47231K922700L172712K032416j310814J558689L328327J522036
6286C642275M23166j458432K42216K859482M900190K968885k595291k496914k423849
6277F061728k992605j733933L906365J411946k344401l424691j096805J490329
6269A277933J678371j071113J073686K012628m550754k467092l31340K215457
6261a62224L225835m10313l199828n868048n235934L37903M768939K574116J304309
6252b665245L817872M050057m49756R5251R94257r54077n076393k785371J981365
$$ y = [-4783682, -2438827, 805299, 392568, -2404469, 164538, 3001291, -974527, -5834879, -4858807, -2699839, -1586584, 528128, -1481487, -3739145, -3903976, -5792326, -8936560, -9583791, -6661091, -3488379, -1455963, -2766777, -1208088, 2120239, 3642275, 4065441, 2607009, 2849225, 5708707, 10608897, 13577782, 10982491, 8485577, 6061728, 3069123, 1335190, 5241555, 6653501, 4309100, 884409, -212396, 1277933, 2956304, 1885191, 2958877, 4971505, 420751, -2046341, -2377681, -162224, 3063611, 2653298, -546530, -6414578, -11650512, -11312609, -6543670, -3969554, -2665245, 1152627, 5202684, 4752928, 4848179, 5842436, 4888359, -188034, -2973405, -992040]
6243i92040R11920P68492J593738j060037M38459M377359J158335K169897M934830
6234A4300953K464813m384938n554782l721996k482671o04480k67607K998933
6226B748225K510500l323320l674749R91976K501767N462062K217989J257390
6218A0691840P26715m936159n092692m472906k493054j574520k29677j67613j446446
6209h994512K727786P373758L771992k145851k587683m218945J01989J940820
6201b030646k61509Q25674J09635m14045K139606j304818p24401K380760L463089
6192D183345J459995J509286K117918J105773r37354j455398J146253j290438
6184G839380L3473j826748m248831n962949k212387L366420K694052j92810n86752
$$ y = [-992040, -80120, 688372, 2282110, 1222073, 1660532, 6037891, 7196226, 9366123, 14300953, 16765766, 12380828, 6826046, 3104050, 621379, 16899, -250708, 2748225, 5258725, 1935405, -1739344, -747368, 1754399, 7216461, 9434450, 10691840, 11418555, 6482396, 1389704, -3083202, -5576256, -7150776, -7380453, -7548066, -8994512, -6266726, 1107032, 4879024, 2733173, 145490, -4073455, -3971466, -2030646, -2292155, -1466481, -1356846, -1770891, 368715, -936103, -1660504, 720256, 4183345, 5643340, 7152626, 9270544, 10376317, 9438963, 7983565, 9129818, 7839380, 7872853, 6046105, 1797274, -4165675, -6378062, -3011642, -317590, -510400, -1097152]
6175a097152K742388L49642l836057m393143J702388M842761J376251j794302
6167a07224J78040K301899L163341J883002k425422j603844p08849k021058M11828
6158A071713j800495l208408N83503N824387N99466k135663q86438J194706O93489
6149A936260j525336K178394j356215q26559o53898J16544J847729L265718J441234
6140F423871k886382l964654O87008J382622Q01886J781617j454021m431820k407122
6131d066995K228719J813260J481343O47557p14401j951529K306109J215428j667537
6122A291954O76517k306479j778000j811756J823238L623578k649706l814106
6114d944760M19664J20645j935313k502006J6417R79764n84999j04593J657443
$$ y = [-1097152, 1645236, 1994878, -1841179, -6234322, -4531934, 310827, 1687078, -107224, 70816, 2372715, 5536056, 7419058, 4993636, 3389792, 2680943, 659885, 1071713, -728782, -3937190, -3353687, 2470700, 3070166, 934503, 48065, 1242771, 1936260, 410924, 2589318, 1233103, 406544, -247354, -130810, 1716919, 4982637, 6423871, 3537489, -427165, 259843, 1642465, 2444351, 4225968, 2771947, -1659873, -4066995, -1838276, -25016, 1456327, 2103884, 1389483, -562046, 1744063, 2959491, 1291954, 1968471, -338008, -2116008, -3927764, -2104526, 1519052, -1130654, -4944760, -4525096, -4404451, -6339764, -8841770, -8825353, -7845589, -8430588, -8535181, -6877738]
6105f877738K314272O726001O964054R29743l982193P9722J095890j200361k871288
6096C178102n271106n832327l378955M177008N271366j024206j931095j922727
6088f733940j938448K570565K275441J578553J437515K360281K21442K187684
6080C959093j526312J356528L036560o51889l809883k131205J040106L762751
6072E035749L964155K80537j516430k491046J180948O55286n037634q089962j880281
6063g898678N70311N488601M464856M692830L695938k106568o59171k990156k957687
6054B300276l360084o603029o91856J405087r47177K059165M663607M001593K483200
6045E310782J169058k228374K09775J189727n32023J005210l03422n097724l126643
$$ y = [-6877738, -4563466, 2162535, 9126589, 10056332, 6074139, 6153861, 7249751, 6049390, 3178102, -2093004, -7925331, -11304286, -7127278, -1855912, -2880118, -4811213, -6733940, -8672388, -6101823, -3826382, -2247829, -810314, 1549967, 1771409, 3959093, 2432781, 3789309, 6825869, 6173980, 2364097, 232892, 1272998, 5035749, 8999904, 9280441, 7764011, 5272965, 6453913, 7109199, 2071565, -6018397, -7898678, -7328367, -1839766, 2625090, 7317920, 11013858, 8907290, 8248119, 5257963, 2300276, -1059808, -7662837, -8354693, -6949606, -7896783, -5837618, -1174011, 2827582, 5310782, 6479840, 4251466, 4461241, 5650968, 5118945, 6124155, 5820733, 723009, -2403634]
6036b403634o62686J511051M550705M788903J553439N00207J140060k43147l197953
6027G536945k391771j342753N97912N77240k144079l505820k408183M273257K577521
6018C770269l996997o669197l278334j097560M276999Q073087N172917J393426
6010G644610l01832j372791j676872o85850l772025k698714q66823J867146M147603
6001B284452M870384K519802J135734j202840N12682M33715m148431k634016M75667
5992D247149j562025m605949j764863J360936M756120K743169J003930j269848
5984D908619m536686m662220j938917j167939K88046J492857J967991n07154p28750
5975d884153j783001j191328j021862N10366L470393J571169j793546r12543Q60441
$$ y = [-2403634, -3066320, -1555269, 2995436, 7784339, 9337778, 9837985, 10978045, 10734898, 7536945, 5145174, 3802421, 4400333, 4977573, 2833494, -672326, -3080509, 1192748, 3770269, -226728, -6895925, -10174259, -11271819, -6994820, 1078267, 6251184, 7644610, 7342778, 5969987, 4293115, 3607265, -164760, -2863474, -3730297, -1863151, 2284452, 7154836, 9674638, 10810372, 9607532, 10120214, 10553929, 6405498, 3771482, 4247149, 2685124, -1920825, -3685688, -2324752, 2431368, 5174537, 6178467, 4908619, 371933, -4290287, -6229204, -7397143, -7109097, -5616240, -3648249, -4155403, -4884153, -6667154, -7858482, -8880344, -8369978, -4899585, -3328416, -5121962, -6034505, -5174064]
5966e174064Q55149K175493J67572j607342L20335j562123k248581k230469K014212
5957g289818K663780o83854l23312L960393K269903M64611N23528R46825j433248
5948A098808j427588J535137L418446J295807j579870q75938k826223m283629
5940c645050j022307Q37823N224345M822635J002328k248006k272266l37507k13861
5931B148134L373889M106105P60366l247265l983976k971339j715669J966838
5923D37083Q05211p55090n240733m520588n8497N142082P887943M732277J567806
5914I997494R66618k71773o8478j10734l453381m126422l006757P9092J473934
5905A479593l53657k682735k164153m83375M702343M557421K016991j92177m017043
$$ y = [-5174064, -4318915, -2143422, -1975850, -3583192, -3262857, -4824980, -7073561, -9304030, -7289818, -4626038, -5309892, -5633204, -1672811, 597092, 1061703, 1585231, 2532056, 1098808, -328780, 1206357, 4624803, 5920610, 4340740, 3464802, 638579, -3645050, -4667357, -3829534, 1394811, 6217446, 7219774, 4971768, 2699502, 2361995, 2148134, 5522023, 9628128, 10388494, 7141229, 3157253, 185914, -1529755, 437083, 1242294, 487204, -4753529, -9274117, -9332614, -4190532, 3697411, 8429688, 9997494, 10964112, 10692339, 10623861, 10513127, 7059746, 2933324, -73433, 5659, 1479593, 1125936, -1556799, -3720952, -4204327, 498016, 5055437, 7072428, 6880251, 2863208]
5896B863208k558162k633237j052410J453530J606012k05017j050701q61680R89343
5887a449114J693312J752973j691395r51655L895774K615239P94345j78598j674103
5878D806778j77334l36788j916941l91379k002434k624069l136360R84083L306696
5869a487748K705541L880376J687376j314662Q93386j380145k812796l405885
5861a234557m216039L48819J940850k535866m185658k09204J505371J486909R39706
5852f159669N76187K336343K978081J150128j726073m082149j564317J166896
5844e324573J974438K277502M35456l241367K203355J711107J371119J733554
5836C140591J388580m592171j756058Q20449N58289J77006l681811l227954k165688
$$ y = [2863208, 305046, -2328191, -3380601, -1927071, -321059, -526076, -1576777, -2438457, -1449114, 244198, 1997171, 305776, -645879, 3249895, 5865134, 6659479, 6480881, 4806778, 4629444, 4292656, 2375715, 1984336, -18098, -2642167, -5778527, -4794444, -1487748, 1217793, 5098169, 6785545, 5470883, 6364269, 4984124, 2171328, -1234557, -5450596, -5101777, -3160927, -5696793, -9882451, -10091655, -8586284, -7099375, -6159669, -5583482, -3247139, -269058, 881070, -845003, -4927152, -6491469, -5324573, -3350135, -1072633, -637177, -3878544, -1675189, 35918, 1407037, 3140591, 4529171, -63000, -1819058, -998609, -440320, -263314, -3945125, -7173079, -9338767]
5827i338767m302544k853375O724696O905918K231447J730956K583234L656495
5819G338060j203067l043984K120953K231134j276120m225135l460512J36888
5811a381783J596333O4569r16325Q43705k137302l437315k287165j366141J170970
5802g850454L650079L209073K90326N28946o9483l278219o617432K459303N646755
5793b031106J745974Q01218N65688k520123m469569r8648k650273j379291J864526
5784h171604J736612M090358L912179M475491N411412M463478k756314m195349
5776H966263l328947l144722j069318L635562J179443N80258k915069n31223K072944
5767E445191P58103k052814j4206J470964J519403M70813l18235n51950p48295
$$ y = [-9338767, -13641311, -16494686, -9769990, -2864072, -632625, 1098331, 3681565, 7338060, 6134993, 3091009, 5211962, 7443096, 6166976, 1941841, -1518671, -1381783, 214550, 279119, -637206, 206499, -1930803, -5368118, -7655283, -9021424, -7850454, -4200375, -991302, -700976, -172030, -241513, -3519732, -10137164, -7677861, -2031106, -285132, 516086, 1081774, -1438349, -5907918, -6006566, -8656839, -10036130, -8171604, -6434992, -2344634, 1567545, 6043036, 11454448, 15917926, 13161612, 8966263, 5637316, 2492594, 1423276, 5058838, 6238281, 6818539, 3903470, 3372247, 5445191, 6203294, 4150480, 4136274, 5607238, 7126641, 7597454, 7279219, 6727269, 5978974]
5758E978974j764088k806457l131543l283384J99988M320433L471832K42911k695422
5749E33244j181771P65490N98919q42555j707680j81019J494291p28315m710310
5740e959706o26450r100R40152K620265M434331K387225K17847k428214l922632
5731b346282j166816l66879l372489n497613J523190M189333j612267j877830
5723a0527653J188156l58830m75408P30235J718222J024126L068479K534134L451257
5714B352718L142875K523156K370414l020848r92823L70876M861217L371229P74725
5705A5753539j644532l228134o69414J024877j144711n545448n002315j941611
5697b397749n78652O12084j733664k396136P81265J545141J616432J09806j676314
$$ y = [5978974, 4214886, 1408429, -1723114, -5006498, -4806510, -486077, 2985755, 3228666, 533244, -648527, 116963, 715882, -126673, -1834353, -2015372, -521081, -1249396, -5959706, -6586156, -6595256, -5655104, -3034839, 1399492, 3786717, 4004564, 1576350, -2346282, -3513098, -3879977, -7252466, -12750079, -11226889, -7037556, -8649823, -10527653, -9339497, -9698327, -10173735, -9443500, -7725278, -6701152, -3632673, -1098539, 2352718, 5495593, 8018749, 10389163, 7368315, 6375492, 6746368, 11607585, 14978814, 15753539, 14109007, 10880873, 10211459, 11236336, 10091625, 4546177, -456138, -2397749, -2976401, -2364317, -4097981, -6494117, -5712852, -4167711, -2551279, -2441473, -4117787]
5688d117787n074633l884826M019924M081519K440745N462429M192088N32651
5680G652110j255616l232659R99723J235661n54265j972600m248153M15637k80009
5671a240171J098513L022718P00546k218768j938166l492507l390179k949865
5663a0407879j189850N005892O104442J678769o32187L853364R136179K138692
5655A5687422n500715m816415k40756M361883J74991j566981k199680k259940
5647C639809m92422N32965K74700k274097j920916m07482O80999o26855J15122
5638d78177J906515O44524j900453k360630p93477L704005K297711J206525M02124
5629D628667J203625R24826m425181m206931n131228N04749O862191M850359K788526
$$ y = [-4117787, -9192420, -13077246, -9057322, -4975803, -2535058, 2927371, 7119459, 7652110, 6396494, 3163835, 4163558, 5399219, 4844954, 2872354, -1375799, -960162, -1240171, -141658, 2881060, 3581606, 1362838, -575328, -4067835, -7458014, -10407879, -11597729, -6591837, -487395, 1191374, 559187, 4412551, 13548730, 15687422, 10186707, 5370292, 5129536, 9491419, 9666410, 8099429, 5899749, 3639809, 3147387, 3680352, 3955052, 1680955, -239961, -647443, 33556, -593299, -478177, 1428338, 2072862, 172409, -2188221, -2981698, 722307, 3020018, 4226543, 4628667, 5832292, 6757118, 2331937, -1874994, -7006222, -6501473, 360718, 5211077, 7999603]
5620G999603K380375J521510N50483k614029j589423j425685k490736L08436K325856
5611F966390O23928n044984n423377j904330M370024M327398J941545k65350l023263
5602B567981j789306R88421J208876m18705k476920l096472J153540N697345J365919
5593E200679l843428p113002m822799Q12940N069632K726558k54328j906841N74501
5584c556088J588064J144919j44162k768951l954842j897351J401675K58418m43294
5575h371612J796397j526821p07846K78047j325156J851648M168845K163312l123394
5566d796580j766113J191004r16386J084148J669481J119732L579180K129387
5558C293853M1468P27706K223700K495336J831087m007860o968792o34849J692689
$$ y = [7999603, 10379978, 11901488, 12451971, 9837942, 8248519, 6822834, 4332098, 4640534, 6966390, 7590318, 2545334, -2878043, -4782373, -412349, 3915049, 5856594, 5591244, 2567981, 778675, 1767096, 2975972, 2557267, 80347, -3016125, -1862585, 3834760, 5200679, 1357251, -5755751, -10578550, -9765610, -4695978, -1969420, -2223748, -4130589, -3556088, -1968024, -823105, -967267, -3736218, -7691060, -9588411, -8186736, -7928318, -8371612, -6575215, -8102036, -8809882, -8531835, -9856991, -8005343, -3836498, -1673186, -4796580, -6562693, -5371689, -6288075, -5203927, -3534446, -2414714, 1164466, 3293853, 3335321, 4063027, 6286727, 8782063, 10613150, 6605290, -363502, -998351, 694338]
5549F94338J712304J985526L427150k19967l605925m205579l175878j659213k312101
5540g359345l784259r13371J663861o71937p23914J805026m6949l288020R1734
5531a3227174N345473O071510K851072J699053j167937j584352m437821m991130
5523i441306j126640J065506K38144J02765j06437L095411N941400M228051M897554
5514H894448n7747j280956k255236l673467J8533L007138l85334l21961M380557
5505H325975M751221J077762l166665l821725m185063k531400l25785L216365
5497C340685J817361L01664J78325j465030M78531K405832j713620j092231J796696
5488F048213K36806k069826k128750l212562j232224N96182P33717K68941M507829
$$ y = [694338, 2406642, 4392168, 7819318, 7599351, 3993426, -212153, -3388031, -5047244, -7359345, -11143604, -12056975, -10393114, -11065051, -11788965, -9983939, -10030888, -13318908, -13227174, -7881701, -1810191, 1040881, 2739934, 1571997, -12355, -4450176, -9441306, -10567946, -9502440, -9264296, -9161531, -9267968, -6172557, -231157, 3996894, 8894448, 8836701, 7555745, 5300509, 1627042, 1645575, 4652713, 4267379, 3945418, 8325975, 13077196, 14154958, 10988293, 7166568, 2981505, 450105, 124320, 3340685, 5158046, 5459710, 5638035, 4173005, 4651536, 7057368, 5343748, 4251517, 6048213, 6285019, 4215193, 2086443, -1126119, -2358343, -1762161, -1028444, -759503, 3748326]
5479C748326K400561l967134j021630K704154J840189O19819j301286k197455
5471B825544l47960J769586J804430l9902j679164J725426M45347l494114j662015
5462A347178k243519l052390Q8921M692166J345834J671282l72399j818099k203675
5453e44701m881775k597053K642747K976844L085064L631805j259004j419135
5445A634792K180567K860445K473505j963868l667694J594152K841656K445948
5437A0399503J940066k778617k439631P52269n32155K201875K767873P00761k755930
5428A0256014m802517m851906M74672K926618k022420N48324J489933J137364
5420E156082L635019J829461k711006r34188m85524k622654l800631l139747k584281
$$ y = [3748326, 6148887, 2181753, 1160123, 3864277, 5704466, 6324285, 5022999, 2825544, 2477584, 4247170, 6051600, 6011698, 4332534, 6057960, 6503307, 3009193, 1347178, -896341, -3948731, -3859810, 832356, 2178190, 3849472, 3477073, 1658974, -544701, -5426476, -8023529, -5380782, -2403938, 681126, 4312931, 3053927, 1634792, 3815359, 6675804, 9149309, 7185441, 3517747, 5111899, 7953555, 10399503, 12339569, 9560952, 7121321, 7873590, 7341435, 9543310, 12311183, 13011944, 10256014, 5453497, 601591, 1076263, 4002881, 1980461, 2528785, 4018718, 5156082, 8791101, 10620562, 7909556, 6975368, 6489844, 3867190, 66559, -3073188, -5657469]
5411e657469k700590q11849L13246j092218K132141M210318K745285J510014R49671
5402A598549J135852K42264J35549j789541L412841k37692l805256m045137j289627
5393d642198m226337k240821M410930M018483K437678r84144q21309R60317k736362
5384c823763o699803j384755J242664L651099K501412q87746n085561k050344
5376a2536797L375857P511432N702553M490762J276726l220203o423207k980075
5368b802952j115153j373870M665286N871400K427598j024790j515325R84542
5360F116736J971636J46200l543474o714442p38732K830637M978489K773162j601359
5351F218853R34817J64228k951280l057768j909476J703452J93119J866727L400926
$$ y = [-5657469, -8358059, -9169908, -8856662, -9948880, -7816739, -3606421, -861136, 648878, 1598549, 2734401, 2976665, 3112214, 1322673, 4735514, 4497822, 692566, -3352571, -4642198, -8868535, -11109356, -6698426, -2679943, -242265, -1226409, -2047718, -1087401, -3823763, -10523566, -11908321, -10665657, -7014558, -4513146, -5400892, -10486453, -12536797, -9160940, -1649508, 4053045, 8543807, 9820533, 6600330, 177123, -2802952, -3918105, -5291975, -626689, 5244711, 7672309, 6647519, 5132194, 6116736, 8088372, 8234572, 4691098, -2023344, -2762076, 68561, 5047050, 7820212, 6218853, 7153670, 7317898, 4366618, 1308850, -600626, 1102826, 1295945, 3162672, 6563598]
5342F563598K526025K929859K104954L59555j518430l222678K13876J236655j176911
5333A0016503l130027r96462k070953m484327q05794N061918K849023m581893
5325A857988l953442k71699J69090j946355m621387N72163N109942n59589l898604
5316g541893N71404M468375K229214K411559j570442m13595n10895l69002p1966
5307g97241j162096l540656k116135M167381N271225J970078q68788j727971L25208
5298A521005J180731L108507L03958l684334m349255Q29389J216480j659307m376915
5289e909741k369003J073986J708433M451331J554952J808210K02163q2959L334207
5280E771579k318447n838697k992168L153411O001520J310325j400859n565903
$$ y = [6563598, 9089623, 12019482, 14124436, 14483991, 12965561, 9742883, 9956759, 11193414, 10016503, 6886476, 5890014, 3819061, -665266, -1471060, 3590858, 6439881, 1857988, -2095454, -2367153, -2198063, -4144418, -8765805, -8193642, -3083700, -3643289, -7541893, -6970489, -2502114, -272900, 2138659, 568217, 154622, -356273, -725275, -797241, -1959337, -5499993, -7616128, -3448747, 1822478, 3792556, 2923768, 1195797, 1521005, 2701736, 5810243, 6114201, 2429867, -1919388, -1089999, 126481, -1532826, -5909741, -8278744, -7204758, -5496325, -1044994, 509958, 2318168, 2520331, 2437372, 5771579, 3453132, -2385565, -5377733, -2224322, 3777198, 5087523, 3686664, -1879239]
5272a879239m002076J946746K430767k876736k628495r64855p35251R77263O10383
5263g121493k321943j163034M105360M527957Q76571p39582J268431j783047M13099
5254a937681O444194L284010n321027m870982m430841k509922L99750P49691J404041
5245f788767L396224J587789j582014n275706l721368J507793L039484N015672
$$ y = [-1879239, -5881315, -3934569, -1503802, -4380538, -7009033, -7973888, -8709139, -7731876, -7121493, -9443436, -10606470, -6501110, -1973153, -1096582, -1836164, -567733, -2350780, -1937681, 4506513, 7790523, 2469496, -2401486, -6832327, -9342249, -8942499, -8192808, -6788767, -3392543, -1804754, -3386768, -8662474, -12383842, -10876049, -7836565, -2820893]
$$ [...]
##END NTUPLES=NMR SPECTRUM
##END=
