##TITLE=C13DEPT135
##JCAMPDX= 6.0         $$ Bruker NMR JCAMP-DX V2.0
##DATA TYPE= NMR SPECTRUM
##DATA CLASS= NTUPLES
##ORIGIN= UXNMR, Bruker Analytische Messtechnik GmbH
##OWNER= root
$$ XWIN-NMR		Version 3.5
$$ Sat Feb 22 15:35:12 2025 Russian Standard Time (UT+4h)  servis@DPX200
##.OBSERVE FREQUENCY= 50.3277607988526
##.OBSERVE NUCLEUS= ^13C
##.ACQUISITION MODE= SIMULTANEOUS
##.ACQUISITION SCHEME= undefined
##.AVERAGES= 953
##.DIGITISER RES= 17
##SPECTROMETER/DATA SYSTEM= spect
##.PULSE SEQUENCE= dept135
##.SOLVENT NAME= DMSO
##.SHIFT REFERENCE= (INTERNAL, DMSO, 0, 219.126)
##AUDIT TRAIL= $$ (NUMBER, WHEN, WHO, WHERE, WHAT)
$$ ##TITLE= Audit trail, XWIN-NMR		Version 3.5
$$ ##JCAMPDX= 5.01
$$ ##ORIGIN= Bruker BioSpin GmbH
$$ ##OWNER= servis
$$ F:\spectra/data/av/nmr/C13DEPT135/1/pdata/1/auditp.txt
$$ ##AUDIT TRAIL=  $$ (NUMBER, WHEN, WHO, WHERE, WHAT)
(   1,<2025-02-22 15:34:41.53 +0400>,<servis>,<DPX200>,
      <created by zg, POWCHK disabled, PULCHK disabled
       terminated by command 'halt'
       configuration hash MD5:
       00 E9 B6 7A A2 85 ED C7 34 08 36 98 17 FE 4E 26
       data hash MD5: 64K
       3F 2B 84 88 1E 7C 3C 61 D2 95 E4 AE 14 35 16 4A>)
(   2,<2025-02-22 15:34:43.29 +0400>,<servis>,<DPX200>,
      <Start of raw data processing
       efp BC_mod = 2 LB = 1 FT_mod = 6 PKNL = 1 PHC0 = 383.807 PHC1 = 5.268371 SI = 32K 
       data hash MD5: 32K
       06 53 D0 20 2D B8 A4 EA C7 A2 93 70 DF 61 51 47>)
$$ ##END=
$$ 
$$ hash MD5
$$ 2D 52 23 5F 99 A3 76 18 DD 1D 1B 0E 45 62 C7 AF
##$RELAX= 
##$RELAX= 
##$RELAX= 
##$RELAX= 
##$RELAX= 
##$RELAX= 
##$RELAX= 
$$ Bruker specific parameters
$$ --------------------------
##$DU= <F:\spectra>
##$EXPNO= 1
##$NAME= <C13DEPT135>
##$PROCNO= 1
##$TYPE= <nmr>
##$USER= <av>
##$AMP= (0..31)
100 100 100 100 100 100 100 100 100 100 100 100 100 100 100 100 100 100 
100 100 100 100 100 100 100 100 100 100 100 100 100 100 
##$AQSEQ= 0
##$AQ_mod= 1
##$AUNM= <au_zg>
##$AUTOPOS= <>
##$BF1= 50.322729
##$BF2= 200.13
##$BF3= 50.322729
##$BF4= 50.322729
##$BF5= 500.13
##$BF6= 500.13
##$BF7= 500.13
##$BF8= 500.13
##$BYTORDA= 1
##$CFDGTYP= 0
##$CFRGTYP= 5
##$CHEMSTR= <none>
##$CNST= (0..31)
1 1 145 1 1 1 1 1 1 1 1 1 1 1 1 1 1 1 1 1 1 1 1 1 1 1 1 1 1 1 1 1 
##$CPDPRG= <waltz16>
##$CPDPRG1= <>
##$CPDPRG2= <waltz16>
##$CPDPRG3= <>
##$CPDPRG4= <mlev>
##$CPDPRG5= <mlev>
##$CPDPRG6= <mlev>
##$CPDPRG7= <mlev>
##$CPDPRG8= <mlev>
##$CPDPRGB= <>
##$CPDPRGT= <>
##$D= (0..31)
0 2 0.003448276 0 0 0 0 0 0 0.06 0 0.03 2e-05 4e-06 0 0 0.0002 0 0 0 0 
0 0 0 0 0 0 0 0 0 0 0 
##$DATE= 1740224081
##$DBL= (0..7)
120 120 120 120 120 120 120 120 
##$DBP= (0..7)
150 150 150 150 150 150 150 150 
##$DBP07= 0
##$DBPNAM0= <>
##$DBPNAM1= <>
##$DBPNAM2= <>
##$DBPNAM3= <>
##$DBPNAM4= <>
##$DBPNAM5= <>
##$DBPNAM6= <>
##$DBPNAM7= <>
##$DBPOAL= (0..7)
0.5 0.5 0.5 0.5 0.5 0.5 0.5 0.5 
##$DBPOFFS= (0..7)
0 0 0 0 0 0 0 0 
##$DE= 6
##$DECBNUC= <off>
##$DECIM= 12
##$DECNUC= <off>
##$DECSTAT= 4
##$DIGMOD= 1
##$DIGTYP= 9
##$DL= (0..7)
$$ [...]
##$SUBNAM2= <"">
##$SUBNAM3= <"">
##$SUBNAM4= <"">
##$SUBNAM5= <"">
##$SUBNAM6= <"">
##$SUBNAM7= <"">
##$SUBNAM8= <"">
##$SUBNAM9= <"">
##$SW= 238.246396889851
##$SWIBOX= (0..15)
0 1 3 0 0 0 0 0 0 0 0 0 0 0 0 0 
##$SW_h= 11990.4076738609
##$TD= 65536
##$TD0= 1
##$TE= 0
##$TE2= 300
##$TE3= 300
##$TEG= 300
##$TL= (0..7)
0 120 120 120 120 120 120 120 
##$TP= (0..7)
150 150 150 150 150 150 150 150 
##$TP07= 0
##$TPNAME0= <>
##$TPNAME1= <>
##$TPNAME2= <>
##$TPNAME3= <>
##$TPNAME4= <>
##$TPNAME5= <>
##$TPNAME6= <>
##$TPNAME7= <>
##$TPOAL= (0..7)
0.5 0.5 0.5 0.5 0.5 0.5 0.5 0.5 
##$TPOFFS= (0..7)
0 0 0 0 0 0 0 0 
##$TUNHIN= 0
##$TUNHOUT= 0
##$TUNXOUT= 0
##$USERA1= <user>
##$USERA2= <user>
##$USERA3= <user>
##$USERA4= <user>
##$USERA5= <user>
##$V9= 5
##$VALIST= <valist>
##$VCLIST= <CCCCCCCCCCCCCCC>
##$VD= 0
##$VDLIST= <DDDDDDDDDDDDDDD>
##$VPLIST= <PPPPPPPPPPPPPPP>
##$VTLIST= <TTTTTTTTTTTTTTT>
##$WBST= 1024
##$WBSW= 4
##$XGAIN= (0..3)
0 0 0 0 
##$XL= 0
##$YL= 0
##$YMAX_a= 1083404
##$YMIN_a= -1227345
##$ZGOPTNS= <>
##$ZL1= 120
##$ZL2= 120
##$ZL3= 120
##$ZL4= 120
##$ABSF1= 0
##$ABSF2= 0
##$ABSG= 0
##$ABSL= 0
##$ALPHA= 0
##$AQORDER= 0
##$ASSFAC= 0
##$ASSFACI= 0
##$ASSFACX= 0
##$ASSWID= 0
##$AUNMP= <proc_1d>
##$AZFE= 0.1
##$AZFW= 0.5
##$BCFW= 0
##$BC_mod= 2
##$BYTORDP= 0
##$COROFFS= 0
##$CY= 12.5
##$DATMOD= 1
##$DC= 0
##$DFILT= <>
##$DTYPP= 0
##$F1P= 215.000008851289
##$F2P= -4.99998459219978
##$FCOR= 0.5
##$FTSIZE= 32768
##$FT_mod= 6
##$GAMMA= 0
##$GB= 0
##$INTBC= 1
##$INTSCL= 1
##$ISEN= 30
##$LB= 1
##$LEV0= 0
##$LPBIN= 0
##$MAXI= 10000
##$MC2= 0
##$MEAN= 0
##$ME_mod= 0
##$MI= 0
##$NCOEF= 0
##$NC_proc= -2
##$NLEV= 6
##$NOISF1= 0
##$NOISF2= 0
##$NSP= 0
##$NTH_PI= 0
##$NZP= 0
##$OFFSET= 219.1257
##$PC= 1.4
##$PHC0= 383.807
##$PHC1= 5.268371
##$PH_mod= 1
##$PKNL= yes
##$PPARMOD= 0
##$PSCAL= 4
##$PSIGN= 0
##$REVERSE= no
##$SF= 50.322729
##$SI= 32768
##$SIGF1= 0
##$SIGF2= 0
##$SINO= 80
##$SIOLD= 32768
##$SREGLST= <13C.CDCl3>
##$SSB= 0
##$STSI= 32768
##$STSR= 0
##$SW_p= 11990.4076738609
##$SYMM= 0
##$S_DEV= 0
##$TDeff= 65536
##$TDoff= 0
##$TI= <>
##$TILT= no
##$TM1= 0
##$TM2= 0
##$TOPLEV= 0
##$USERP1= <user>
##$USERP2= <user>
##$USERP3= <user>
##$USERP4= <user>
##$USERP5= <user>
##$WDW= 1
##$XDIM= 32768
##$YMAX_p= 530742946
##$YMIN_p= -521728857
$$ End of Bruker specific parameters
$$ ---------------------------------
##NTUPLES= NMR SPECTRUM
##VAR_NAME=  FREQUENCY,     SPECTRUM/REAL,   SPECTRUM/IMAG
##SYMBOL=    X,             R,               I
##VAR_TYPE=  INDEPENDENT,   DEPENDENT,       DEPENDENT
##VAR_FORM=  AFFN,          ASDF,            ASDF
##VAR_DIM=   32768,         32768,           32768
##UNITS=     HZ,            ARBITRARY UNITS, ARBITRARY UNITS
##FACTOR=    0.365929370215793, 1,           1
##FIRST=     11027.0033138647, 0,            0
##LAST=      -963.404359996184, 0,           0
##MIN=       -963.404359996184, -521728857,  0
##MAX=       11027.0033138647, 530742946,    0
$$ Real data points
##PAGE= N=1
##DATA TABLE= (X++(R..R)), XYDATA
$$ [...]
10362a434703k023226l16255L68723l302657j203914O696180M124920j630738
10354A278330j410133n7915r41633K278577K856945J40750j21294m070914o060000
10345f107287K00082K254954k401098k102011j990250L697312O346607L119798
10337C018107r04898J316722P32481M855015K202732k912230m815747M89776J064367
10328E046325J326194L493944J994086k393474k721867n185051k717593J215579
10320E8143R13561k939088l474180j62586L695385L778267k141611l829660J857554
10311b244215J170181k80668K875825K931868K118085J16738k269L999041K527833
10302A3212419L13877R48120k963849o154077o736377n071627L67758j906246
$$ plain form
10362 -1434703 -3457929 -3774184 -3405461 -6708118 -7912032 -1215852 2909068 1278330
10354 1278330 -131803 -189718 -1131351 1147226 4004171 4144921 4023627 -47287 -6107287
10345 -6107287 -5907205 -3652251 -6053349 -8155360 -10145610 -6448298 -101691 3018107
10337 3018107 2113209 3429931 4162412 9017427 11220159 8307929 3492182 3981958 5046325
10328 5046325 6372519 9866463 11860549 9467075 6745208 1560157 -1157436 58143
10320 58143 971704 -1967384 -5441564 -5604150 -1908765 1869502 -272109 -4101769 -2244215
10311 -2244215 -1074034 -1354702 1521123 4452991 6571076 6687814 6685545 10684586 13212419
10302 13212419 13526296 14474416 11510567 5356490 -1379887 -6451514 -6083756 -7990002
10294g990002k313804k252212J189885L634918M605605M493385O776552Q30150
10286H974477m608469n736262N1966O256384M024682k46500p329914n457790L116995
10277i54431O287212L274870n292956o632852K269649N275653R3343J562978L182516
10268I065982M44610m132693k437482j201273J292101m11162k823686j182721
10260a386324n05265K99728K972738j260686k413137J067320L727610L231425
10252E733409J960577P31967L31431L3286m579151k984066L361088N338136J701640
10243A1628317j288337j486729l23544O88581J832009K250855M829600k617840
10235A5512912n801677m74395j354402n066781q147400n51169O177811M725382
$$ plain form
10294 -7990002 -10303806 -12556018 -11366133 -7731215 -3125610 1367775 8144327 8974477
10286 8974477 4366008 -1370254 -1318288 4938096 8962778 8716278 1386364 -4071426 -954431
10277 -954431 5332781 8607651 3314695 -3318157 -1048508 4227145 4320488 5883466 9065982
10268 9065982 9510592 5377899 2940417 1739144 3031245 2620083 -203603 -1386324
10260 -1386324 -1891589 -1591861 1380877 120191 -2292946 -1225626 2501984 5733409
10252 5733409 7693986 8425953 8757384 8790670 4211519 1227453 4588541 9926677 11628317
10243 11628317 10339980 8853251 8529707 9218288 11050297 13301152 18130752 15512912
10235 15512912 9711235 9236840 7882438 2815657 -5331743 -5882912 294899 5020281
10227E020281O72970r25608j834442j871185q34879l064458k793260K961042L12470
10218b357069k626159J867030K38711J014622K520207j9156J392977l20517n00210
10209A210436L49160L95985M09983k468866n870750k099580L235202M601238K358655
10200B121463J938297l57404j177717r58652K225228L489526J880510m1676m644663
10191D474912q061984l332261L479330Q493271J914327n256545l005894J034032
10183b60812J032075J368723o29833m548304O08653K532478p70845k491689p42038
10174c901592J157385k601054m586631k193679K40583O055096N330401l920538
10166d420029l304609l57043L770734L130118m750590j0559779m587247L611147
$$ plain form
10227 5020281 5693251 4767643 2933201 1062016 227137 -2837321 -5630581 -2669539 -2357069
10218 -2357069 -4983228 -3116198 -2877487 -1862865 657342 638186 2031163 1710646 1210436
10209 1210436 1559596 1955581 2365564 -103302 -5974052 -8073632 -4838430 -237192 2121463
10200 2121463 4059760 3702356 2524639 1565987 3791215 7280741 9161251 9119575 4474912
10191 4474912 -3587072 -6919333 -3440003 5053268 6967595 1711050 -1294844 -260812
10183 -260812 771263 2139986 1510153 -3038151 -2429498 102980 -667865 -3159554 -3901592
10174 -3901592 -2744207 -5345261 -9931892 -12125571 -11884988 -5829892 -499491 -4420029
10166 -4420029 -7724638 -8081681 -4310947 -1180829 -5931419 -16491198 -21078445 -17467298
10158a7467298J342651O509780R380641L425568K63639l382907k998294k318683
10150e244903j597845R9316K562243K603109Q42982P09094K459006P84276J665740
10141D883018L330476O12494m166109l081139J525342K570965R29039R52560K018249
10132I574895K657291K794960k749515l425287k27747m08543k326938k318144
10124C570972L8587J851519q54923l475314m761056q80465J797751K989549P551575
10115G828195L141066m419800n360466q67570L655439K320770q98823L04460M815986
10106A0519257N804755K320978l642539o168231n497068o058778m710130P05211
10098f726545K024640J564047K784091M79563K02369J62451K404297L151272k786504
$$ plain form
10158 -17467298 -16124647 -9614867 -234226 3191342 3454981 72074 -2926220 -5244903
10150 -5244903 -6842748 -6743432 -4181189 -1578080 -735098 -26004 2433002 3217278 4883018
10141 4883018 8213494 8825988 4659879 1578740 3104082 5675047 6604086 7556646 9574895
10132 9574895 12232186 15027146 12277631 8852344 8624597 8216054 5889116 3570972
10124 3570972 3609559 5461078 4606155 1130841 -3630215 -4510680 -2712929 276620 7828195
10115 7828195 10969261 6549461 1188995 321425 3976864 6297634 5398811 5703271 10519257
10106 10519257 16324012 18644990 15002451 8834220 3337152 -2721626 -7431756 -6726545
10098 -6726545 -4701905 -3137858 -353767 125796 328165 490616 2894913 6046185 3259681
10089C259681k604236r27586k785910J125487L914876K068283j085016J175655
10081D141234j962127j986278q20819k573148j534867N872538L806605j185930
10073C757208l065255P98650K106513J61536k740678J919799O388531O22979m582615
10064E366668k181580l69162p18544J566485j920457k296333K504302j003464
10056I47915l989751L23393m45335j832494k214582k564259n040214j944728M050861
10047a2709194J565404k012606J464704P293855K030089j072355k524878L2740
10039e932241j33730J493246M669044J990896L003441r76151m335473j236856
10031a457824K438532j220091o680854k025822N245351M943992j340787j816601
$$ plain form
10089 3259681 655445 -272141 -3058051 -1932564 1982312 4050595 2965579 4141234
10081 4141234 2179107 192829 -627990 -3201138 -4736005 1136533 4943138 3757208
10073 3757208 691953 1490603 3597116 3758652 1017974 2937773 9326304 9949283 5366668
10064 5366668 3185088 2815926 2097382 3663867 1743410 -552923 1951379 947915
10056 947915 -3041836 -2718443 -3163778 -4996272 -7210854 -9775113 -14815327 -16760055 -12709194
10047 -12709194 -11143790 -13156396 -11691692 -4397837 -2367748 -3440103 -5964981 -5932241
10039 -5932241 -6065971 -4572725 96319 2087215 5090656 4114505 -220968 -1457824
10031 -1457824 980708 -239383 -6920237 -8946059 -3700708 1243284 -97503 -1914104
10023a914104K946530K790454L58026k117862n239639k368727k731404k205364
10015a0482090J654976K439098J533676L255226N189830J638545n46366k846939
10007A835956o938530r23725K176164J243442j297842k541407p19053L036945
9999d128050L757963j62268m98849K243514P77269k207909K90769K137222L544925
9990E754586n14123m013037j297889K323942R26382m641433l144506j483556j139181
9981g228815L705161M066104J525556M90595k195539o68259j336603j736124k961030
9972f338954m797052j268483J513810J91225L668945N943315L719216P16007k452010
9963H96019j242751N82395K579416n2138m589631m661246J306598J860143M907530
$$ plain form
10023 -1914104 1032426 3822880 4180906 2063044 -3176595 -5545322 -8276726 -10482090
10015 -10482090 -8827114 -6388016 -4854340 -1599114 3590716 5229261 4682895 1835956
10007 1835956 -5102574 -6026299 -3850135 -2606693 -3904535 -6445942 -7164995 -4128050
9999 -4128050 -370087 -532355 -1031204 1212310 1989579 -218330 72439 2209661 5754586
9990 5754586 5240463 1227426 -70463 2253479 3179861 -1461572 -4606078 -6089634 -7228815
9981 -7228815 -3523654 542450 2068006 2558601 363062 -305197 -1641800 -3377924 -6338954
9972 -6338954 -11136006 -12404489 -10890679 -10699454 -7030509 -1087194 2632022 3348029 896019
9963 896019 -346732 235663 2815079 2762941 -1826690 -6487936 -5181338 -3321195 1586335
9954A586335M816896j339773l489666k216403r37342J948721O29817k428548L96818
9945a033145J634209N61008r98370m047986k622339L726333M632700l74600k872181
9936a394371j89050K52721p87438k101040q54701K562815J607147m70869l395617
9927d770403o319561k573111M22069K332009K080745J106385K745657K342981
9919b633229J743018k273499j066011J96792N02103J187470j909983L256778P41005
9910b55556l631692p93235J803213O188k627892O48308K588169J15838J75922
9901a970737L111607K669247K18755l10966Q49222O09352J561217K030215n38749
9892H229163k876266l664275j171990K714410l93276l969369o064858k618767
$$ plain form
9954 1586335 6403231 5063458 1573792 -642611 -1579953 368768 998585 -1429963 -1033145
9945 -1033145 601064 1162072 163702 -3884284 -6506623 -2780290 1852410 1477810 -1394371
9936 -1394371 -1583421 -1330700 -2118138 -4219178 -5073879 -2511064 -903917 -1374786 -4770403
9927 -4770403 -11089964 -13663075 -13241006 -10908997 -8828252 -7721867 -4976210 -2633229
9919 -2633229 -890211 -3163710 -4229721 -4032929 -3530826 -2343356 -4253339 -996561 -255556
9910 -255556 -3887248 -4680483 -2877270 -2871082 -5498974 -4850666 -2262497 -2146659 -1970737
9901 -1970737 1140870 3810117 4028872 3717906 4567128 5176480 6737697 8767912 8229163
9892 8229163 5352897 1688622 516632 3231042 2837766 -1131603 -7196461 -9815228
9884i815228M456562L950631K454981R2923l59354L42320m475227m946756m47498
9875h746646L226735p1653K88804k883947Q60355K810571L198345J91692J781460
9866F55716q87282o884136n463172J426809k36070R67266L166238K826169L38583
9857d089879J279828j842619K24392K571731K039210K820127Q92280J46703J232869
9848E274642L590740M945374K255807m170418n158621j925594n8872l520862j623081
9839c90885n52530N84112J509756k698411m039630j666780K652597M184078M702556
9830D284863p28597j233712J397308K590987O25014P11722o398010m309409K142062
9821i17772L824078M24219j491338k530116L431984M116981j674041j168749j081583
$$ plain form
9884 -9815228 -5358666 -1408035 1046946 1139869 780515 1122835 -3352392 -8299148 -8746646
9875 -8746646 -5519911 -5591564 -5302760 -8186707 -7326352 -4515781 -1317436 -1125744 655716
9866 655716 -231566 -7115702 -12578874 -11152065 -11388135 -10420869 -7254631 -4428462 -4089879
9857 -4089879 -2810051 -4652670 -4428278 -1856547 182663 3002790 3895070 4041773 5274642
9848 5274642 8865382 13810756 16066563 11896145 6737524 4811930 4753058 1232196 -390885
9839 -390885 -943415 -359303 1150453 -1547958 -5587588 -7254368 -4601771 -417693 4284863
9830 4284863 3556266 2322554 3719862 6310849 6935863 7647585 1249575 -3059834 -917772
9821 -917772 2906306 3330525 1839187 -690929 2741055 6858036 5183995 4015246 2933663
9812B933663j430747J83385j925893k347271M66682J020514k43759k607042j67256
9803d117724M400802L909041r55608k562341J132597l21943l645577l219039j851751
9794g231543L584154M048990K046501k157599k46432N5617n89371n4426n52578
9785a096687J37269J521140P65230p52362k452262l153717p85006J407166L016540
9776a392689J197546p58518K30272J950294L756183K938288N42733K63117K492027
9767A1219253j149459o41858m264704o601371O23229p16412M122074N982117J48614
9758H721483m337237k158548K105346k272635m658332j073846k266925J52839
9750e787855K402251m96855l916485n50065K179641L101723M355097J729661Q06549
$$ plain form
9812 2933663 1502916 1686301 -239592 -2586863 -2120181 -1099667 -1343426 -3950468 -4117724
9803 -4117724 283078 4192119 3236511 674170 1806767 1484824 -2160753 -5379792 -7231543
9794 -7231543 -3647389 401601 2448102 290503 44071 99688 -489683 -544109 -1096687
9785 -1096687 -959418 561722 1326952 574590 -1877672 -5031389 -5816395 -4409229 -1392689
9776 -1392689 -195143 -953661 -723389 1226905 4983088 7921376 8464109 8727226 11219253
9767 11219253 10069794 9427936 5163232 -1438139 -814910 -1531322 2590752 8572869 8721483
9758 8721483 4384246 2225698 4331044 2058409 -2599923 -3673769 -5940694 -5787855
9750 -5787855 -3385604 -3882459 -7798944 -8349009 -6169368 -3067645 1287452 3017113 3823662
9741C823662j219917j008208M667140Q23562l953661m637531J352734K150452
9733A998233N60243j143191j745920K002839K500794L62479j134953k742340l957041
9724c298857j926088m82684j880625M71146J914894j66417J718706K535375K969906
9715A855356q61375k814308m374885m080994k195771L532429N782089L893073
9707G35614j427303k560200o63601j099851j019484J098255N336163P503472Q30903
9698H733968o403957n252364J315805J250585n72971j071926l019440j573567
9690f593867N1392J960227M51331J077331k358279J395342N520108L306219K232430
9681G042234k745327n205682j684883k932069n169404p54294R52372n69546K83467
$$ plain form
9741 3823662 2603745 1595537 6262677 7086239 3132578 -1504953 -152219 1998233
9733 1998233 2558476 1415285 -330635 1672204 4172998 4535477 3400524 658184 -3298857
9724 -3298857 -5224945 -5707629 -7588254 -7117108 -5202214 -5368631 -3649925 -1114550 1855356
9715 1855356 993981 -1820327 -6195212 -10276206 -12471977 -8939548 -3157459 735614
9707 735614 -691689 -3251889 -3915490 -5015341 -6034825 -4936570 399593 7903065 8733968
9698 8733968 2330011 -2922353 -1606548 -355963 -928934 -2000860 -5020300 -6593867
9690 -6593867 -6542475 -4582248 -4130917 -3053586 -5411865 -4016523 1503585 4809804 7042234
9681 7042234 4296907 -908775 -2593658 -5525727 -10695131 -11449425 -10497053 -11066599 -10783132
9672a0783132K454072N531541M210645O260305K370476j736001p92654j88915
9664G326337m067990j843780M026035L948872K332390k767271k011025O81727
9656G625295k967046p587831l071414n19633J644249K639179j197421k359525
9648e794147J859595O722224L434023j207652l719052j045862K368930J185181
9640C803240Q76259m346624n331950j859463K705040J637004o70167j91458L002981
9631c75138K748471J137328m15824N50227q09806n492311l138770l97267p26958
9622f920048M005309N102978K67889k326609m236588k134510n34728J352084j426120
9613f850343j724873K345720N270918N571813J066625j221061k546169l009134
$$ plain form
9672 -10783132 -8329060 -2797519 1413126 7673431 10043907 8307906 7515252 7326337
9664 7326337 3258347 1414567 5440602 9389474 11721864 8954593 6943568 7625295
9656 7625295 4658249 -2929582 -6000996 -6520629 -4876380 -2237201 -3434622 -5794147
9648 -5794147 -3934552 2787672 6221695 5014043 1294991 249129 2618059 3803240
9640 3803240 4679499 332875 -4999075 -6858538 -4153498 -2516494 -3186661 -3378119 -375138
9631 -375138 2373333 3510661 3094837 3645064 2835258 -2657053 -5795823 -6193090 -6920048
9622 -6920048 -2914739 2188239 2456128 129519 -4107069 -6241579 -6776307 -5424223 -6850343
9613 -6850343 -8575216 -6229496 -958578 4613235 5679860 4458799 1912630 -1096504
9605a096504l751400l770875m560672o724485m240134o06644J856420L157481
9597a9736813L265572K443739K467189J433042j01979L310299M078337J957116
9589h83498K80308K68009J427220l241051m832220k533378j620071j269341K427133
9580i976889L021384J216787J878315j349381l21176J778304J492828m76853l205260
9571e941941m012405j290188K384225k85423k39557K949558N441301N236860K507392
9562F749822k558647o937713p168068k820769N218467P106820J412164l311152
9554b309076q52198J789054M147716l6992m324581l154563k87770J514513p94029
9545d307926k613499j661415k742941N84060j419066K23575L110977N272040M356892
$$ plain form
9605 -1096504 -4847904 -8618779 -13179451 -19903936 -24144070 -24750714 -22894294 -19736813
9597 -19736813 -16471241 -14027502 -11560313 -10127271 -10229250 -6918951 -2840614 -883498
9589 -883498 -603190 -335181 1092039 -2149012 -6981232 -9514610 -11134681 -12404022 -9976889
9580 -9976889 -6955505 -5738718 -3860403 -5209784 -5530960 -3752656 -2259828 -2736681 -5941941
9571 -5941941 -9954346 -11244534 -8860309 -9145732 -9385289 -6435731 -994430 4242430 6749822
9562 6749822 4191175 -2746538 -9914606 -12735375 -7516908 -410088 1002076 -2309076
9554 -2309076 -3161274 -1372220 2775496 2738504 -1586077 -4740640 -5028410 -3513897 -4307926
9545 -4307926 -6921425 -8582840 -11325781 -10741721 -12160787 -11937212 -8826235 -3554195 802697
9536H02697j023596l693282J48123j470656N75434M054402J239375j902479k135875
9527c405857n869412k056892M593737m08583m926649K014751M752146j31737j394341
9518f832837j254525J034494J102334k723521j509099p16197k679588m58417L747993
9509a0289363Q146830Q42768j615490p31306K4344L126122M263901M564197Q44462
9500I176465k347942L808621L880235n479643p264771l758977J848574M971838
9492D834400O56363Q73139K775552j736995k72135J700608K306580J162371j81950
9483A2117933l477292o84133L302874J217847r07377l573070p868672p122202
9475f994092m346103P4857N920521L113880M056884m64009n38574J886484k15181
$$ plain form
9536 802697 -220899 -3914181 -3766058 -5236714 -4661280 -606878 632497 -1269982 -3405857
9527 -3405857 -9275269 -11332161 -6738424 -7147007 -12073656 -10058905 -5306759 -5438496 -6832837
9518 -6832837 -8087362 -7052868 -5950534 -8674055 -10183154 -10899351 -13578939 -14037356 -10289363
9509 -10289363 -2142533 -1299765 -2915255 -3646561 -3622217 -496095 3767806 8332003 9176465
9500 9176465 6828523 10637144 14517379 9037736 1772965 -1986012 -137438 4834400
9492 4834400 5490763 6363902 9139454 7402459 7130324 8830932 11137512 12299883 12117933
9483 12117933 8640641 7956508 11259382 12477229 11569852 7996782 128110 -6994092
9475 -6994092 -11340195 -11265338 -5344817 -2230937 1825947 1361938 823364 2709848 2494667
9466B494667j909714N39921J128939p59768K926087L770656K189873r30191n866030
9457C584440n250863j7062q91603M90883O41632m490780j63833N484596L464646
9448B852056j962389J500329m13655k091259J130344L362794r06631K175605K326293
9439G973487k991543k845651M19813p28269k248713k95922J903951J511418R5734
9430B794305K40603K372781n34745j008043j78992q10395J375646M38626k589706
9421B100080p54234M603482J39331m189025j847967l56702m211847l908939K157349
9412f268472K753162J716202K014125j131820k713207m12505M689550O001873
9404F648908L484625K107969L80239l144166r41306j165480j056292K1435r8226
$$ plain form
9466 2494667 584953 1124874 2253813 1494045 4420132 8190788 10380661 9450470 3584440
9457 3584440 -1666423 -1683485 -2575088 -2084205 -1442573 -5933353 -6097186 -612590 2852056
9448 2852056 889667 2389996 1976341 -114918 1015426 4378220 3471589 5647194 7973487
9439 7973487 4981944 2136293 2556106 1827837 -420876 -716798 1187153 2698571 2794305
9430 2794305 3034908 5407689 4872944 3864901 3685909 2875514 4251160 4689786 2100080
9421 2100080 1345846 5949328 6088659 1899634 51667 -305035 -4516882 -8425821 -6268472
9412 -6268472 -3515310 -1799108 215017 -916803 -3630010 -4042515 647035 6648908
9404 6648908 10133533 12241502 12621741 9477575 8536269 7370789 6314497 6335932 6237706
9395F237706n63499m329108o326622P200j737376l757958n45603N753671P071080
9386A809491j945116q477771l101951L496721K999712j338154r67987J260590
9378f264465L067507J412645n1045m554643n78407j28571Q85344O27679J233992
9369d349964L469870J347733o28846l458350j025039K125419Q03980j639723l002729
9360f357649l321692m394138K346022K750292l11012K272254O668376K318049
9352A970502M45551O684828N101318L620363k589663n028232m796226l367421
9344B041020k082551j737578j754701n04437j172700j662730L78043K674163J188908
9335b632563k76290l82786j236873L298985P81186m180160l121006J804431N634338
$$ plain form
9395 6237706 5674207 1345099 -4981523 -4974323 -6711699 -10469657 -11015260 -5261589 1809491
9386 1809491 -135625 -8613396 -11715347 -8218626 -5218914 -6557068 -7525055 -6264465
9378 -6264465 -3196958 -1784313 -1835358 -6390001 -6968408 -7096979 -6211635 -5583956 -4349964
9369 -4349964 -880094 467639 -161207 -3619557 -4644596 -2519177 -1715197 -3354920 -6357649
9360 -6357649 -9679341 -14073479 -11727457 -8977165 -9288177 -7015923 -347547 1970502
9352 1970502 2416053 9100881 14202199 17822562 15232899 10204667 5408441 2041020
9344 2041020 -41531 -1779109 -3533810 -4038247 -5210947 -6873677 -6495634 -3821471 -2632563
9335 -2632563 -2908853 -3291639 -4528512 -1229527 -448341 -4628501 -7749507 -5945076 -310738
9326c10738N299460l20613l904806j507093j730563r23738J847135N457970N079364
9317H986378J768402m425534n460628k072788J523699q99483R89383K922936K680348
9308F012713r04982m919914l295575m595902m69320J844569k507457n74434M640683
9299d769619L839907j185725l192164l833216m23830L090170L438001J830200
9291a206276L11645p1564q79635m140171j858775J104072J805195k416272l598454
9282a0950235m415943j002147j058222J905841M726019M480886N200771L064285
9274A951255J356264L921806N50657k336955l895665l431769l001125L639894
9266a245638J038960m93836O78967M99471J157828l9442O72164k493494l163457
$$ plain form
9326 -310738 4988722 4668109 763303 -743790 -2474353 -3398091 -1550956 3907014 8986378
9317 8986378 10754780 6329246 868618 -1204170 319529 -579954 409429 3332365 6012713
9308 6012713 5107731 187817 -3107758 -7703660 -8172980 -6328411 -8835868 -9410302 -4769619
9299 -4769619 -929712 -2115437 -5307601 -9140817 -9564647 -6474477 -3036476 -1206276
9291 -1206276 -894631 -966195 -1845830 -5986001 -7844776 -6740704 -4935509 -7351781 -10950235
9282 -10950235 -15366178 -16368325 -17426547 -15520706 -10794687 -6313801 -1113030 1951255
9274 1951255 3307519 7229325 7779982 5443027 1547362 -1884407 -4885532 -1245638
9266 -1245638 -206678 -700514 -21547 477924 1635752 1596310 2268474 -225020 -3388477
9257c388477r624N009911L008828k042507l54019j215884k351187K248598M140404
9248E046043J990576k161643j444382J004963M0485p31989N68514j815962n040270
9239b543665m139669J354652L805477L345398L097296k723215n026345k957298
9231e787369k592343J29533J976155P39661n05776J739176k261523M67650M262482
9222a832354J104364L864466J718478m283848K34905M711546M37727n42919j517318
9213C895047l036737n133299j078495K971017j211708J550252K399809m000575
9205c644689j703153K721982L682318M763140N428664o87852k688909p38352j829963
9196E303186m09485O42949m514987o974240j673196J109872o86182J492102K032163
$$ plain form
9257 -3388477 -3398101 1611810 4620638 2578131 2224112 1008228 -1342959 905639 5046043
9248 5046043 7036619 4874976 3430594 4435557 4476042 3744053 4312567 2496605 -2543665
9239 -2543665 -6683334 -5328682 -1523205 1822193 4919489 2196274 -2830071 -5787369
9231 -5787369 -8379712 -8250179 -6274024 -5534363 -6040139 -4300963 -6562486 -6094836 -1832354
9222 -1832354 -727990 3136476 4854954 571106 806011 5517557 5955284 5412365 3895047
9213 3895047 858310 -4274989 -5353484 -2382467 -3594175 -2043923 355886 -3644689
9205 -3644689 -5347842 -2625860 1056458 5819598 11248262 10560410 7871501 7133149 5303186
9196 5303186 4893701 5536650 1021663 -5952577 -7625773 -6515901 -7202083 -5709981 -3677818
9187c677818M59620J086808k608303M8337L867396N033699O21241n589438n522347
9178f280805L72693J451891K754885L599599J484032j959486l597055m164946
9170f339192l429584J89098L69793p07171k570830K820552P112577N455690L033014
9161E933947j731066l775594m650995j049812L625708N552694L971301l332579
9153D543604m51360p13931j655938O0681j169432J012486J825609K843812K104918
9144H400449M58070l01088K10616j99102m194534k250301K715104K547400J747425
9135I134039j190361j03208j304855k339473K701300J064478Q78041P60016n041413
9126D558564j55079M13005k642783l60979K944877K440645j458707k262006Q04626
$$ plain form
9187 -3677818 -3218198 -2131390 -4739693 -4691356 -823960 4209739 4830980 -758458 -6280805
9178 -6280805 -5908112 -4456221 -1701336 1898263 3382295 1422809 -2174246 -6339192
9170 -6339192 -9768776 -9579678 -9209885 -9917056 -12487886 -9667334 -2554757 2900933 5933947
9161 5933947 4202881 427287 -4223708 -5273520 -1647812 3904882 7876183 4543604
9153 4543604 4092244 3378313 1722375 1783056 613624 1626110 3451719 6295531 8400449
9144 8400449 8858519 8557431 8768047 8568945 4374411 2124110 4839214 7386614 9134039
9135 9134039 7943678 7840470 6535615 4196142 6897442 7961920 8839961 9599977 4558564
9126 4558564 4403485 4816490 2173707 1812728 4757605 7198250 5739543 3477537 4282163
9117D282163L531484k239498n120052R33553k003367k573171P57526K062253p52153
9108a121262K15094M640961L225563l373824m341358N86294L807154j97934m104177
9099f63489j86525K244041k675496n288340K38515K677576J796703j246441Q54267
9090b249189j072820l110898m4237L350246K712283J775303K347338q4625j845910
9081A777491j573027k913227m279119p30794O3029K205918R4549j751742J404612
9072e702310J776707J624678k712258o33458K136709k668059m829348l199604
9064a4206943l72584P633445P977248L134754N31781r30441m604342m916131K53093
9055e500120k59554j012147p29979J430444n15427k706349J170269K248946R6917
$$ plain form
9117 4282163 7813647 5574149 454097 1387650 -615717 -3188888 -2431362 -369109 -1121262
9108 -1121262 -906168 3734793 6960356 3586532 -754826 -168532 3638622 3440688 -663489
9099 -663489 -850014 1394027 -1281469 -6569809 -6331294 -3653718 -1857015 -3103456 -2249189
9090 -2249189 -3322009 -6432907 -6477144 -3126898 -414615 1360688 3708026 3623401 1777491
9081 1777491 204464 -2708763 -6987882 -7718676 -7655647 -5449729 -5355180 -7106922 -5702310
9072 -5702310 -3925603 -2300925 -5013183 -5646641 -3509932 -6177991 -11007339 -14206943
9064 -14206943 -14579527 -6946082 1031166 4165920 4697701 3767260 -837082 -5753213 -5500120
9055 -5500120 -5759674 -6771821 -7501800 -6071356 -6586783 -9293132 -8122863 -5873917 -5777000
9046e777000j985944p07621K3270o11464j871481j723446J335883m45426O65804
9037a1097425K518450O70537K338937K855741N11332k192922k862603m68883J989046
9028e737790j193505k661743O94203J441798K731079n84845q72637n48187K052370
9019d679257p51428Q6301r49367K631574M104527l122570m704053R07008L058713
9010c418552J496870l400770n257176l483264J131833K538624N205288J996647
9002c190500j288138l210691m224170l36046N470138N517215L54483K019526L60131
8993A471948n82966p31423J04391J760763J387523J87299k140844p81105k172294
8984a496708k353543J969753L52531J716136K526423J837348J744826j062359
$$ plain form
9046 -5777000 -7762944 -8470565 -8447295 -9058759 -10930240 -12653686 -11317803 -11763229 -11097425
9037 -11097425 -8578975 -7908438 -5569501 -2713760 -2202428 -4395350 -7257953 -7726836 -5737790
9028 -5737790 -6931295 -9593038 -8898835 -7457037 -4725958 -5310803 -6183440 -6731627 -4679257
9019 -4679257 -5430685 -5344384 -6293751 -3662177 442350 -2680220 -7384273 -6477265 -3418552
9010 -3418552 -1921682 -5322452 -10579628 -14062892 -12931059 -10392435 -5187147 -3190500
9002 -3190500 -4478638 -7689329 -11913499 -12249545 -6779407 -1262192 -907709 1111817 1471948
8993 1471948 888982 157559 261950 2022713 3410236 3597535 1456691 675586 -1496708
8984 -1496708 -3850251 -1880498 -1527967 188169 2714592 4551940 6296766 5234407
8976E234407k034837K784242J227279K20718j857894k743559l651237m844833
8968e665714k537697N23935J807984J587291Q44029L41843K057126L405349J19395
8959B483541J233508J694088N44940j078538k204815O14774j139344q3322M08917
8950B473749m97558L656721K247492j616460j666364l592285j643347J947418
8942A309366r93517j735002O17511L136075R15743p53615m448709l017309k718607
8933g688064j143966q2142O56658K322812k87647L311984Q241892L020552m803897
8924C548182m2422J083289n784292l316269k077649r8156K224836L051132L834641
8915B423292J52277k505844j64841L059290l469790n043278P27597q01647R01948
$$ plain form
8976 5234407 3199570 5983812 7211091 7431809 5573915 2830356 -820881 -5665714
8968 -5665714 -8203411 -7679476 -5871492 -4284201 -3440172 -3098329 -1041203 2364146 2483541
8959 2483541 3717049 5411137 5956077 4877539 2672724 3287498 2148154 2064832 2473749
8950 2473749 1976191 5632912 7880404 6263944 4597580 1005295 -638052 1309366
8942 1309366 315849 -1419153 -801642 2334433 3250176 2496561 -1952148 -4969457 -7688064
8933 -7688064 -8832030 -8914172 -8257514 -5934702 -6222349 -2910365 5331527 8352079 3548182
8924 3548182 3505760 4589049 -1195243 -4511512 -6589161 -6687317 -4462481 -1411349 2423292
8915 2423292 2575569 69725 -95116 2964174 -505616 -5548894 -4821297 -5622944 -4720996
8906d720996L18671j89761j096601l281122j763233k262432J235932L041497L797610
8897d920435L721226K366791J802580o46496P01983O83498N99202J496809L13961
8888F119119n68381k735164j528150r99152k176263n624224o77412L676627P097985
8879B584985K304138L3897K53064j345367o77336k009173n670127j999272O618651
8870I3460M192183M17469n03193m432493m032349J979283K016622l097689l772623
8861g139330m87678J485295J608358J369018L922536k22555k386395K719516K553098
8852C421863J349282K664688J408490m931668k760292o06399k368439k197063
8844d019538J930390L58643M89226O6435k627128k459154P54407j882277L11729
$$ plain form
8906 -4720996 -4402325 -4592086 -5688687 -8969809 -10733042 -12995474 -11759542 -8718045 -4920435
8897 -4920435 -1199209 1167582 2970162 2323666 3025649 3709147 4308349 5805158 6119119
8888 6119119 5550738 2815574 1287424 288272 -1887991 -7512215 -8189627 -4513000 2584985
8879 2584985 4889123 4923020 5176084 3830717 3153381 1144208 -4525919 -6525191 93460
8870 93460 4285643 4703112 4199919 -232574 -4264923 -2285640 -269018 -3366707 -7139330
8861 -7139330 -7627008 -6141713 -4533355 -3164337 758199 535644 -1850751 868765 3421863
8852 3421863 4771145 7435833 8844323 3912655 1152363 545964 -1822475 -4019538
8844 -4019538 -2089148 -1730505 -1241279 -1174844 -3801972 -6261126 -5506719 -7388996 -7077267
8835g077267L413601M277594K872149j361944l763165l369245K790779J219981
8827i97517j461529o821877m417087O54416N258934K049204J034693o38540m687762
8818a0027065l393036K456912L611077k159940k38739M533178N474387K345744
8810B602518J66811J342349K177481P98188j329377k571708J092950K068066o4063
8801F283215K167564k168781p998982l898492k38005L934655J779981k329876
8793b468721L67977J706471N82579l321799j533398L063714K767066j636494o7209
8784e39814N444293R4643l989692l347001K632938K095563R81102L514814O16018
8775G502864j483697j395449K832509L10958j848850K558124J89713q69066j795366
$$ plain form
8835 -7077267 -3663666 613928 3486077 2124133 -1639032 -5008277 -2217498 -997517
8827 -997517 -2459046 -9280923 -13698010 -13043594 -7784660 -5735456 -4700763 -5339303 -10027065
8818 -10027065 -13420101 -10963189 -7352112 -9512052 -9750791 -5217613 256774 2602518
8810 2602518 2769329 4111678 6289159 7087347 5757970 3186262 4279212 6347278 6283215
8801 6283215 8450779 6281998 -1716984 -5615476 -5853481 -1918826 -138845 -2468721
8793 -2468721 -2100744 -394273 188306 -3133493 -4666891 -1603177 1163889 -472605 -539814
8784 -539814 4904479 4999122 1009430 -2337571 295367 2390930 3372032 6886846 7502864
8775 7502864 6019167 4623718 7456227 7767185 5918335 8476459 8666172 7797106 6001740
8766F001740j232774k468507j633788J612645j044479n155179L1648K278137J114052
8757d96505J376161N47054j98957j667389k859815p69265n05151L657153K036076
8748A119362o318252j802798L504099L329820l521514n218089n56411r05102J017048
8739i351837Q94217K536730L191186J626221m491608o201548l828859O44501l8310
8730a5019307Q86361K960491K341990K658431k8422L51334p60203k948360R71294
8721h586391M750841L702222K207444K060393r47489l249274k882618m366840
8713g311712k759400j576218K446261J502060J86971k147331p02121N597920K106928
8704b656642J58225J565026J620244L897538J626884j690243m511875o696591
$$ plain form
8766 6001740 4768966 2300459 666671 2279316 1234837 -3920342 -3888694 -1610557 -496505
8757 -496505 879656 1426710 1227753 -439636 -3299451 -4068716 -4573867 -916714 1119362
8748 1119362 -5198890 -7001688 -3497589 -167769 -3689283 -8907372 -9463783 -10368885 -9351837
8739 -9351837 -8457620 -5920890 -2729704 -1103483 -5595091 -11796639 -15625498 -14980997 -15019307
8730 -15019307 -14132946 -11172455 -8830465 -6172034 -6200456 -5849122 -6609325 -9557685 -8586391
8721 -8586391 -3835550 -133328 2074116 4134509 3187020 -62254 -2944872 -7311712
8713 -7311712 -10071112 -11647330 -9201069 -7699009 -7512038 -9659369 -10361490 -4763570 -2656642
8704 -2656642 -2498417 -933391 686853 4584391 6211275 4521032 9157 -6687434
8696f687434j40589K993238L350119o41322n89531J827282O062072Q11602m055476
8687B929961J07702n90341k055364N61344K02935J48039j484774o655847l661588
8678a0497933q47827k254460K389862M791482J444248n245734m589467O580618
8670h229211M543669L066756K233829R21593R48433M671527N331187j557531p522870
8661D407382o298580m854809m413747P60017J327230Q72268j205599J003439M514244
8652c888155P126946J464597j492747m901480k236138K300665P76221j421989
8644b272080k174191R4368J291134J300217j536743m28405j838458l876920r49713
8635a0390791q50266J192046J914592j531616l259214k03020K494171L443971
$$ plain form
8696 -6687434 -6828023 -3834785 -484666 -1125988 -1715519 111763 6173835 6985437 2929961
8687 2929961 3037663 2447322 391958 953302 1156237 1304276 -180498 -6836345 -10497933
8678 -10497933 -11345760 -13600220 -11210358 -6418876 -4974628 -10220362 -14809829 -8229211
8670 -8229211 -3685542 -618786 1615043 2536636 3485069 8156596 13487783 11930252 4407382
8661 4407382 -1891198 -6746007 -11159754 -10399737 -9072507 -8200239 -9405838 -8402399 -3888155
8652 -3888155 3238791 4703388 3210641 -1690839 -3926977 -1626312 -850091 -2272080
8644 -2272080 -4446271 -4351903 -3060769 -1760552 -3297295 -3725700 -5564158 -9441078 -10390791
8635 -10390791 -11241057 -10049011 -8134419 -9666035 -12925249 -13128269 -10634098 -7190127
8627g190127J10070q06508K270838J114638J152211K718041o14502n618993m912817
8618a1777149j53293l303097R09853M376952K641009K99311M46782m123996k060370
8609a2743998J273864L76093r04372q17406j854694R18427l021855p101957m485920
8600b8361818k986801J176223K697443j382330J618799K391429o79435m669129
8592c0195619m588546J31513k130166J372041o02078k944903n410363m619031
8584d8987152j826522m063025m464997o585386j0569726j1121008j2101488j1920590
8576a11639894j3039152j4431677j4639733q975278n026913k114064K831378Q798773
8568a58236560J9037398K0829556J6565068J8477312K0719658J5922475P128129
$$ plain form
8627 -7190127 -7080057 -7886565 -5615727 -4501089 -3348878 -630837 -1245339 -6864332 -11777149
8618 -11777149 -11930442 -15233539 -14323686 -9946734 -7305725 -7006414 -6559632 -10683628 -12743998
8609 -12743998 -11470134 -11094041 -11998413 -12815819 -14670513 -13752086 -16773941 -23875898 -28361818
8600 -28361818 -31348619 -30172396 -27474953 -28857283 -27238484 -24847055 -25526490 -30195619
8592 -30195619 -34784165 -34652652 -36782818 -35410777 -36012855 -38957758 -44368121 -48987152
8584 -48987152 -50813674 -54876699 -59341696 -65927082 -76496808 -87617816 -99719304 -111639894
8576 -111639894 -124679046 -139110723 -153750456 -162725734 -167752647 -169866711 -167035333 -158236560
8568 -158236560 -139199162 -118369606 -101804538 -83327226 -62607568 -46685093 -39556964
8561c9556964L649055O49507p15408M402423J953644R25419M435974Q094979N585909
8552a0575462K852763M202463L258770l806421n031476o19680Q07291K694541
8544f217211O888218O57510n30108J735864p46517l730685m141364m937858k498346
8535a3520497O95827K251871p66108k707143l018744J17690K530184L224746N180576
8526f011598N642175P87973n673000k864686m79234M063K01371k59452k266520
8517a0918908J471763L74071p34978k0513N31572l227539m427363O65684Q137327
8508h148884J1659174L416974O64558J037376j092246l585323j819318o50311
8500A482000o65868k309153o37482K362861K402030K334598j977221L74029J877654
$$ plain form
8561 -39556964 -35907909 -35258402 -35973810 -31571387 -29617743 -28692324 -24256350 -16161371 -10575462
8552 -10575462 -7722699 -3520236 -261466 -4067887 -9099363 -9719043 -8911752 -6217211
8544 -6217211 671007 1328517 798409 2534273 1787756 -1942929 -6084293 -11022151 -13520497
8535 -13520497 -12824670 -10572799 -11338907 -14046050 -17064794 -16947104 -14416920 -11192174 -6011598
8526 -6011598 -369423 418550 -5254450 -8119136 -8598370 -8594307 -8392936 -8652388 -10918908
8517 -10918908 -9447145 -9073074 -9808052 -9828565 -9296993 -12524532 -16951895 -16286211 -8148884
8508 -8148884 3510290 6927264 7591822 8629198 7536952 3951629 2132311 1482000
8500 1482000 816132 -1493021 -2130503 232358 2634388 4968986 2991765 3365794 5243448
8491E243448j649922L77298K779673N272462J677003j477415N750575l197888
8483A4775234j3055578r889060K043204N361029J161918q19467j498834m180897
8475f102451m180479J633885N43614k664038j833488L044110J302153m75143J049834
8466g682003k080261k732864j548412J523170N101228L349526k249134l656121
8458i974871j133710R182k054905k429807N101951P643495K444796L75945M730300
8449D712376P276523L251142q22706p51395k651222n549232o042865l497040m02215
8440d476634J228917J063583k413473j621237K971206K608070j590866q39927
8432c070361J798894j297669k93108q63264l476619j833593o09j216203J08789
$$ plain form
8491 5243448 3593526 3970824 6750497 12022959 13699962 12222547 17973122 14775234
8483 14775234 1719656 -8169404 -6126200 -765171 396747 -422720 -1921554 -6102451
8475 -6102451 -10282930 -8649045 -8105431 -10769469 -12602957 -9558847 -8256694 -8731837 -7682003
8466 -7682003 -9762264 -12495128 -14043540 -12520370 -7419142 -4069616 -6318750 -9974871
8458 -9974871 -11108581 -11099399 -13154304 -15584111 -10482160 -2838665 -393869 -17924 4712376
8449 4712376 11988899 15240041 14417335 13665940 11014718 5465486 -577379 -4074419 -4476634
8440 -4476634 -3247717 -2184134 -4597607 -6218844 -3247638 -639568 -2230434 -3070361
8432 -3070361 -1271467 -2569136 -2862244 -3725508 -7202127 -9035720 -9036329 -10252532 -10143743
8423a0143743J351021J5477j018078M270267O726090L640060J839465j088874
8415E591685j621578l960312l01184K444641J799388k533211l697029k474879
8407d752479J455504K962787m193461o519303k366631M371481P906476N516270
8399D380644k189789n495720k271663j050081j892347J603760M997858K600364
8391F83026n51377M70554L213871J5100k836719j977610k79371Q11831J352593
8382I01898k741401n315581J090912P860420M436122L24835J852413q80912k560749
8373D967957K91847K272825M282823K630274J25283l782829m715444K813568L57647
8364I243951l505125k653333o77824J465808j396818j542671N08783J956834K950220
$$ plain form
8423 -10143743 -8792722 -8777245 -9795323 -5525056 1201034 4841094 6680559 5591685
8415 5591685 3970107 9795 -291389 2153252 3952640 1419429 -2277600 -4752479
8407 -4752479 -3296975 -334188 -4527649 -11046952 -13413583 -9042102 -1135626 4380644
8399 4380644 2190855 -3304865 -5576528 -6626609 -8518956 -6915196 -1917338 683026
8391 683026 131649 602203 3816074 3831174 994455 -983155 -1262526 -450695 901898
8382 901898 -1839503 -7155084 -6064172 1796248 6232370 6557205 8409618 7528706 4967957
8373 4967957 5259804 7532629 11815452 14445726 14571009 10788180 6072736 8886304 9243951
8364 9243951 5738826 3085493 2407669 3873477 2476659 933988 1442771 3399605 6349825
8355F349825k735487n158684R4065L679465M669796m09215L536J808385R19314
8346I221000l244627m472991m83517q54141m05997J74649L352279K149651M16555
8337E852861J144398P75927p34386j003709r58780m483934n232337m800364m159140
8328a3599464l25045M078237M089938j610105j367271R65658J565376K720031
8320c482645K308414j640727m175374n81490J14135l581743j524750N397883N017098
8311b149199L278329Q36440j126911R70748j242648K025014O19472j090125l30466
8302A790654k99872K199960J466687k312996j786400J907128Q21328l722588o25118
8293e61217J54832j305687j200206J827689m0618j806106J272705J473092L71911
$$ plain form
8355 6349825 3614338 -1544346 -1450281 2229184 6898980 6489765 6493301 8301686 9221000
8346 9221000 5976373 1503382 1019865 165724 -240273 -65624 3286655 5436306 5852861
8337 5852861 6997259 7773186 7038800 6035091 5076311 592377 -4639960 -9440324 -13599464
8328 -13599464 -13924509 -9846272 -5756334 -7366439 -8733710 -7768052 -6202676 -3482645
8320 -3482645 -1174231 -2814958 -6990332 -7571822 -7457687 -11039430 -12564180 -7166297 -2149199
8311 -2149199 1129130 1965570 838659 1809407 566759 2591773 3211245 2121120 1790654
8302 1790654 1490782 3690742 5157429 2844433 1058033 2965161 3786489 63901 -561217
8293 -561217 -406385 -1712072 -2912278 -1084589 -1125207 -2931313 -1658608 -185516 186395
8284A86395k54269j039023K378758N004003J952320J752821N232223J515153m794550
8275A1933831q066541m758112Q90175J63844k623586j255104L996964L253857
8267C535328k047842l342113j638440J427299K418756j683080l584720q99413
8259e814225j451779J774667N382436Q570920N336347K591935P775751L979325
8251B8145377k353474q046127r025018k411906n508698o990271K358269P029558
8243C197710K898737k557248L86383J11401j755185M196132K812432j415935L09574
8234H184001j221496k424886j721424l355774k985568N69538L643259K486130
8226C173780N920208Q912224O360447N466715L243010J370835k515645k032185
$$ plain form
8284 186395 -67874 -1106897 1271861 6275864 8228184 9981005 15213228 16728381 11933831
8275 11933831 3867290 -890822 -647 163197 -2460389 -3715493 281471 3535328
8267 3535328 1487486 -1854627 -3493067 -2065768 352988 -1330092 -4914812 -5814225
8259 -5814225 -7266004 -5491337 -108901 8462019 13798366 16390301 24166052 28145377
8251 28145377 25791903 17745776 8720758 6308852 800154 -6190117 -3831848 3197710
8243 3197710 6096447 3539199 3925582 4036983 2281798 6477930 9290362 7874427 8184001
8234 8184001 6962505 4537619 2816195 -539579 -3525147 -2955609 687650 3173780
8226 3173780 9093988 18006212 24366659 29833374 33076384 34447219 31931574 29899389
8218B9899389R4320M28529l370064m821924l683010m326797n741263k670892j186802
8209D621486P93553M543455J523474l952269o404258j036499J710389m21853o733215
8200e355737p479843J26536L268686Q495928R602322K183686k312010j589168
8192F940400p11691L44785l828425k313474J518482N15908L291370K638966j763164
8183F633157k937459Q2961j240891k295371o83866K631295M892139K21725m52437
8174F851253L123210L268189K818007K470343K308753J044255N239126Q635928
8166C5759064O060435J668120J25071N434058L379428l459636k756231j960128
8158D4250181m448275q392056m381290l726660l685458m35341j569679k346872
$$ plain form
8218 29899389 29993709 30422238 27052174 22230250 18547240 14220443 8479180 5808288 4621486
8209 4621486 5415039 9958494 11481968 7529699 1125441 88942 1799331 1377478 -5355737
8200 -5355737 -12835580 -12709044 -9440358 -944430 8657892 10841578 8529568 6940400
8192 6940400 6228709 6573494 2745069 431595 1950077 2465985 5757355 8396321 6633157
8183 6633157 3695698 3778659 2537768 242397 -441469 2189826 7081965 7303690 6851253
8174 6851253 9974463 13242652 16060659 18531002 20839755 21884010 27123136 35759064
8166 35759064 41819499 43487619 43612690 49046748 52426176 48966540 46210309 44250181
8158 44250181 39801906 31409850 27028560 23301900 19616442 19181101 17611422 15264550
8150A5264550j779181l235940l345227l142302j711325K039079K06039J01439
8142D397132j533816m99065Q47412K2614p13491m17956K071098j244495j736766
8133A192667m184796j350848K826248j289824M7319J8322K445915N837144L548854
8124I091001l006534l44929J268115O35560L86260l138728k105381J300111L282366
8115G367841j755561L32639N29389j168508k477917j07053K652378K460414O606346
8106A4439968M121493L139452J691713j895237m876205j641437j005261m473265
8098I501221p206072l567314p43960K80048K562946k008875m071647r05508n85984
8089f745145j484284K445844J577726K541063o77674m13619j553359k03003N701991
$$ plain form
8150 15264550 13485369 10249429 6904202 3761900 2050575 4089654 4295693 4397132
8142 4397132 2863316 2364251 3211663 3234277 2520786 2102830 4173928 2929433 1192667
8133 1192667 -2992129 -4342977 -1516729 -2806553 -2759234 -2740912 -294997 5542147 9091001
8124 9091001 6084467 5739538 7007653 7643213 8029473 4890745 2785364 4085475 7367841
8115 7367841 5612280 5944919 6474308 5305800 2827883 2720830 5373208 7833622 14439968
8106 14439968 18561461 21700913 23392626 21497389 16621184 14979747 13974486 9501221
8098 9501221 2295149 -1272165 -2016125 -1736077 826869 -1182006 -5253653 -6159161 -6745145
8089 -6745145 -8229429 -5783585 -4205859 -1664796 -2342470 -2756089 -4309448 -4512451 1189540
8080A189540j690395m231758m932939l345570k001683J026210L123307J987538
8072h875750j555685r37707J917473J144481K832585P264020N273234J93926j388437
8063E868140m272513l503639o55544N940604O863031K299495l267120J794639
8055A1067093L833143L262261l390700l275362M1428l335606m254936p61344J637898
8046D823875K299559P057221O329705J267818J367799l282491m390704o00308
8038A4872474k662478o850750m060903l147173m191383k690874J554182N153304
8030b023601M694045J590552j164885k639976n034775j858911O26223J382549
8022d428779K383949L51884n657820m051629l064046L52387j81111L53731J175540
$$ plain form
8080 1189540 -500855 -4732613 -9665552 -13011122 -15012805 -13986595 -10863288 -8875750
8072 -8875750 -10431435 -11369142 -9451669 -8307188 -5474603 1789417 7062651 7256577 5868140
8063 5868140 1595627 -1908012 -2563556 3377048 10240079 12539574 9272454 11067093
8055 11067093 14900236 18162497 14771797 11496435 11537863 8202257 3947321 3185977 4823875
8046 4823875 7123434 14180655 20510360 21778178 23145977 19863486 15472782 14872474
8038 14872474 12209996 5359246 1298343 -1848830 -6040213 -8731087 -7176905 -2023601
8030 -2023601 2670444 4260996 3096111 456135 -4578640 -6437551 -5811328 -4428779
8022 -4428779 -2044830 -1692946 -7350766 -11402395 -14466441 -14114054 -14295165 -13941434 -12765894
8013a2765894J819539j679039m698172r096570o683172J154339K430415l351130
8005c2869684m379115j667134l804527o371024l606158n631871r925676p225321
7997g5480510q778856j6412910k0319101k1861605j8145092j4587200r636257
7990a85221531o969288K77974R239131J5040053J8659182J5864978J4810957J7327384
7982a00971160J9809020J5027811J0655624M883432K576303O792084O322049P200562
7974b7704275M647262j85940R32228K673861N972134M685617p8670M97747J177341
7965g382695k181833m425452k478440j441240J665386P643946K778319n92019
7957f414028Q36210L064476M054298N40156R21977K743105K354624k86064J18712
$$ plain form
8013 -12765894 -10946355 -12625394 -17323566 -26420136 -33103308 -31948969 -29518554 -32869684
8005 -32869684 -37248799 -38915933 -42720460 -49091484 -52697642 -58329513 -68255189 -75480510
7997 -75480510 -84259366 -100672276 -120991377 -142852982 -160998074 -175585274 -185221531
7990 -185221531 -192190819 -191912845 -182673714 -167633661 -148974479 -133109501 -118298544 -100971160
7982 -100971160 -81162140 -66134329 -55478705 -50595273 -48018970 -41226886 -34904837 -27704275
7974 -27704275 -23057013 -23242953 -22310725 -19636864 -13664730 -8979113 -9057783 -8560036 -7382695
7965 -7382695 -9564528 -13989980 -16468420 -17909660 -16244274 -8600328 -5822009 -6414028
7957 -6414028 -5577818 -2513342 1540956 2081112 3003089 5746194 8100818 7814754 7933466
7948G933466j086481o056539p722753l706091L792328N635621L697020n39350
7940A947221l933842l343533l707223j332419L275621j138981l315734l328237
7932a4877127j532322J405295M33692J814259P15670m696219k396627M825737
7924a4307642N188576J260211J50287p85398j471809Q40716M508068J981100p17923
7915c353814j316306Q4926M531238L749308p49110n24337o05884l585677m959426
7906f729082n248543k408996L142964L624238K828357J072128J912499M30315
7898a376120J761761m111688j482765K38785k586620k551577J591368P56170K68963
7889g491723J402663j781577R98995K732731Q53520j333105j100892K576175L759473
$$ plain form
7948 7933466 6846985 790446 -6932307 -10638398 -6846070 -1210449 2486571 1947221
7940 1947221 -1986621 -5330154 -9037377 -10369796 -7094175 -8233156 -11548890 -14877127
7932 -14877127 -16409449 -15004154 -14570462 -12756203 -12040533 -16736752 -19133379 -14307642
7924 -14307642 -9119066 -7858855 -7708568 -8493966 -9965775 -9125059 -4616991 -2635891 -3353814
7915 -3353814 -4670120 -4585194 -53956 3695352 2946242 2421905 1816021 -1769656 -6729082
7906 -6729082 -11977625 -14386621 -11243657 -7619419 -4791062 -3718934 -1806435 -1376120
7898 -1376120 385641 -3726047 -5208812 -4970027 -7556647 -10108224 -8516856 -7760686 -7491723
7889 -7491723 -6089060 -7870637 -6871642 -4138911 -3285391 -4618496 -5719388 -3143213 616260
7880F16260m47732n054558l057770k272950j921022J859371o54607j432973j42112
7871a2508093K450874j437402n005274j529727K901573J764896n97208J080736
7863a2879625j648412j851284q61043k299380m529769o115183N24746O660930
7855b2999020L783201l380596j956443O744356M734380N98395m729364j615991
7847a8821082j56292k974303m208128l429913L150710L037553n717749j664718
7839c0783922j11886n087395n453540j416747j102681j481564J376751K818213
7831d1242771k754288j929595k413184n891342r673328q494416j0533700j2712503
7823i5645127j7315313j7436543j6079231k5466529k9183900l3002630m2096017
$$ plain form
7880 616260 168528 -4886030 -7943800 -10216750 -12137772 -10278401 -10933008 -12365981 -12508093
7871 -12508093 -10057219 -11494621 -16499895 -18029622 -15128049 -13363153 -13960361 -12879625
7863 -12879625 -14528037 -16379321 -17240364 -19539744 -24069513 -30184696 -29659950 -22999020
7855 -22999020 -19215819 -22596415 -24552858 -17808502 -13074122 -12475727 -17205091 -18821082
7847 -18821082 -18977374 -21951677 -26159805 -29589718 -26439008 -23401455 -29119204 -30783922
7839 -30783922 -30895808 -35983203 -41436743 -42853490 -43956171 -45437735 -44060984 -41242771
7831 -41242771 -43997059 -45926654 -48339838 -54231180 -63904508 -72398924 -82932624 -95645127
7823 -95645127 -112960440 -130396983 -146476214 -171942743 -201126643 -234129273 -276225290
7816b76225290m8114566n1356166n1302244m5958208l4955250j3817133J4919843
7809e06809014L9378445N2817760N5136530N2183936M8547071M3920385L7275990
7802a77548897L2512190K8015449K1376304J4859038J4110591O272079N611732
7795e4791514P918908Q558047Q651143L560704p98464N204224Q902436N2899l418989
7786a6160606K352571P922642L954559k194225l011094k544246L094035N585032
7778a001332J034824j468822j122418K127871L055283O74675K345068J905018
7770G550167k908816m766357N90257L435612O41900r26051j477152k962908p07334
7761a530682N159233K092827L245770L000015j414987k870775l698797l732752
$$ plain form
7816 -276225290 -324339856 -375696022 -426998266 -472956474 -507911724 -521728857 -506809014
7809 -506809014 -467430569 -414612809 -359476279 -307292343 -258745272 -214824887 -177548897
7802 -177548897 -145036707 -117021258 -95644954 -80785916 -66675325 -60403246 -54791514
7795 -54791514 -46872606 -38314559 -29663416 -26102712 -26901176 -21696952 -12794516 -12741617 -16160606
7786 -16160606 -13808035 -5885393 -1930834 -4125059 -7136153 -9680399 -6586364 -1001332
7778 -1001332 33492 -1435330 -2557748 -429877 2625406 3300081 5645149 7550167
7770 7550167 4641351 -125006 465251 3900863 4542763 3616712 2139560 -823348 -1530682
7761 -1530682 3628551 5721378 8967148 11967163 10552176 7681401 3982604 249852
7753B49852N67911K574426p11455o98249J850724J871875J164464K54521j107532
7744F016537m329030j735798J528441K041385j782444j167985o64119K467793
7736B374780J554067K067572J667190r49412l38231n822303l728687r60579M07897
7727c727706j856973j616595j852506q63588J664294N016874M197361J296885
7719B258046j816153L772512N469405K96854l418873m889252k694482k079269
7711c101212J155318J884139j186690j222377L19498m329141j935079k114815
7703a0530359L413167N008538J45630J109509q27234n351267m720719k627464
7695a4380199p54677N47409L053846N019810K589253K09250K990969K843867k010764
$$ plain form
7753 249852 817763 3392189 2680734 1982485 3833209 5705084 6869548 7124069 6016537
7744 6016537 1687507 -48291 1480150 3521535 1739091 571106 -93013 2374780
7736 2374780 3928847 5996419 7663609 6714197 6375966 553663 -3175024 -4135603 -3727706
7727 -3727706 -5584679 -7201274 -9053780 -9917368 -8253074 -3236200 961161 2258046
7719 2258046 441893 4214405 9683810 9980664 6561791 1672539 -1021943 -3101212
7711 -3101212 -1945894 -61755 -1248445 -2470822 -2151324 -6480465 -8415544 -10530359
7703 -10530359 -7117192 -2108654 -1963024 -853515 -1680749 -7032016 -11752735 -14380199
7695 -14380199 -15134876 -14587467 -11533621 -6513811 -3924558 -3715308 -724339 2119528 108764
7686A08764n37492N99079k288772j637474j705967q77302L111960J458459K203316
7677D34571n89262k251538m550020l863656L116400N486391N787802M958584O47117
7668I176389j783769j105255l475533k438235L385611L635194J077261o0033j856104
7659F555526n26087J318469k586106o486199m445609R98894M62028q08402K037972
7650c479514K58149l148335O58839J515876K192987J122873j85858J727628q4389
7641E78256K703399o92343k445514K172144N43164N6451j19560m945435n279538
7632g428976O13725N100274N513887J425023m228734n905296k294799O96694Q83093
7623e625109K929664L107871j465699k522071K044060J563268o97498l22153Q30323
$$ plain form
7686 108764 -428728 170351 -2118421 -3755895 -5461862 -6339164 -3227204 -1768745 434571
7677 434571 -154691 -2406229 -6956249 -10819905 -7703505 -2217114 3570688 8529272 9176389
7668 9176389 7392620 6287365 2811832 373597 3759208 7394402 8471663 8411630 6555526
7659 6555526 6029439 7347908 4761802 -1724397 -6170006 -5171112 -4709084 -5517486 -3479514
7650 -3479514 -3221365 -6369700 -5710861 -4194985 -2001998 -879125 -1064983 662645 578256
7641 578256 3281655 2589312 143798 2315942 2859106 2915557 2795997 -2149438 -7428976
7632 -7428976 -6815251 -1714977 3798910 5223933 995199 -4910097 -7204896 -6508202 -5625109
7623 -5625109 -2695445 412426 -1053273 -3575344 -1531284 31984 -665514 -987667 -157344
7614a57344j217422k081185K248319P52341o95264p22438k453006m560769k40454
7605i127222J134573j830258l169602O13439L779415M597142N951596J591704
7597C540787o305545l845061K847738L260305k330989j985931j670134l159938
7589i648768q234446m520213P512023M543151K447134K728361J041451l508816
7581g640123j514916m10500P80866J702710R48219m268466o192619l617834r59408
7572b1172071k293486K557095M236870K390029j402417j629566K387911M358069
7564a0567566k38907l962285m538739n228949n097028o647107j886723j68231
7556c8335535L275477J802515J13188J249602p15556k352537l936723n858491
$$ plain form
7614 -157344 -1374766 -3455951 -1207632 -455291 -1150555 -1872993 -4325999 -8886768 -9127222
7605 -9127222 -7992649 -9822907 -12992509 -12379070 -8599655 -4002513 1949083 3540787
7597 3540787 -2764758 -6609819 -3762081 -501776 -2832765 -4818696 -6488830 -9648768
7589 -9648768 -17883214 -22403427 -14891404 -10348253 -7901119 -5172758 -4131307 -7640123
7581 -7640123 -9155039 -9565539 -8784673 -7081963 -6133744 -10402210 -16594829 -20212663 -21172071
7572 -21172071 -23465557 -20908462 -16671592 -14281563 -15683980 -17313546 -14925635 -10567566
7564 -10567566 -10806473 -14768758 -19307497 -24536446 -29633474 -36280581 -38167304 -38335535
7556 -38335535 -35060058 -33257543 -33144355 -31894753 -32610309 -34962846 -38899569 -44758060
7548d4758060m919628m542372l118422o616293j1386263j2059414j6415807j9984047
7540a23800306j5027043j4445446k3920664l1298887l8417904m3196629m4591359
7533c34698238n1706136n4049574m1884051j9447667O606742L1832822M7451709
7526d15894393N3532177N0180185M6061265M3451137L9464737L4555026K4555663
7519a24094203K1300102J9642097R445572O790094J0706118J0262537M820596
7512d1127087M655556O04740K965341N011529L312489L309549M033722N858651
7504a1375510P620211O486276M298612k291256q140693o170482l062779p866566
7496b0502187l558118N893242Q930819K305844L08676k059062l938837j342628
$$ plain form
7548 -44758060 -49677688 -54220060 -57338482 -63954775 -75341038 -87400452 -103816259 -123800306
7540 -123800306 -138827349 -153272795 -177193459 -208492346 -246910250 -290106879 -334698238
7533 -334698238 -386404374 -440453948 -482337999 -501785666 -495178924 -463346102 -415894393
7526 -415894393 -362362216 -312182031 -266120766 -222669629 -183204892 -148649866 -124094203
7519 -124094203 -102794101 -83152004 -73706432 -66916338 -56210220 -45947683 -41127087
7512 -41127087 -36471531 -35866791 -32901450 -27889921 -24577432 -21267883 -17234161 -11375510
7504 -11375510 -3755299 2730977 7029589 4738333 -3402360 -9572842 -12635621 -20502187
7496 -20502187 -24060305 -18167063 -9236244 -6930400 -6621724 -8680786 -12619623 -13962251
7488a3962251K43372J437064J323345L914568L437649L008316P441164M393201
7480A1236428L113404N24891j467036l786571J614942j70221m990010k093950
7472C981877k322136n887390k652054l50670k177550N911M234143J991853j798562
7463d974578m772122j274180N239043M967518M4211M123395N739088j33723m596022
7454D362630m603321l73149k385445L39239L779415j94125o910259N63644N069847
7445c51524P093761L816362m723449p362861m88098K53918K370506M483431M369556
7436I461602j78214j948936k428240k865447M48866N059419K378274J568547R69589
7427A2465460m3382p88917k475121l069406J04358K100901l469267p149882j160113
$$ plain form
7488 -13962251 -13718879 -12281815 -10958470 -7043902 -3606253 -597937 6843227 11236428
7480 11236428 14349832 14874723 13407687 9621116 11236058 11065837 6075827 3981877
7472 3981877 1659741 -4227649 -6879703 -7230373 -9407923 -9402012 -5167869 -3176016 -4974578
7463 -4974578 -9746700 -11020880 -5781837 -814319 -770108 3353287 9092375 8958652 4362630
7454 4362630 -240691 -613840 -2999285 -2660046 1119369 925244 -5985015 -5421371 -351524
7445 -351524 6742237 10558599 5835150 -1527711 -2015809 -1761891 608615 5092046 9461602
7436 9461602 9283388 7334452 4906212 2040765 2489631 7549050 9927324 11495871 12465460
7427 12465460 12422078 11633161 9158040 6088634 6192992 8293893 4824626 -2325256 -3485369
7418c485369N157202J060043k144608N192J279938j141577j503304m181499k531788
7409g485770j217051Q56195J175729M35206J5402L213817K969668K720919L575225
7400F259340M129338n60883l038307j476593M249709L042209l606237r87143J570145
7391I581578J042949J5402J42341k297255p83989J556559Q79387l113946o576113
7382D46913l280446J574822J16286k199230j333248M684105O607558M308450N55516
7373A1480726l186629m137410r02088J132879l004346m333881j349268J031249
7365c268768N94621P67253M76248j165595o17119O93115J42923n06204L030680
7356A47154K358235J107016P78701R145j193954j088369J972778L121597M324870
$$ plain form
7418 -3485369 1671833 2731876 587268 592460 1872398 730821 -772483 -4953982 -7485770
7409 -7485770 -8702821 -7846626 -6670897 -6235691 -6220289 -3006472 -36804 2684115 6259340
7400 6259340 10388678 9827795 6789488 5312895 9562604 12604813 8998576 8011433 9581578
7391 9581578 10624527 10639929 10782270 8485015 7701026 9257585 10136972 7023026 446913
7382 446913 -2833533 -1258711 -1142425 -3341655 -4674903 9202 6616760 10925210 11480726
7373 11480726 8294097 4156687 3254599 4387478 1383132 -2950749 -4300017 -3268768
7365 -3268768 -2674147 -1906894 -1430646 -2596241 -3213360 -2520245 -2377322 -2883526 147154
7356 147154 2505389 3612405 4391106 4400251 3206297 2117928 4090706 7212303 11537173
7347A1537173R72984j102905m427520m098714l656248k027736r40945J284325
7339b459586L13390L483932K617842K266529p79140k876494k078130j631097J361700
7330B18946N033669j334951p651851j841190p01431j009791n55132k359215P46592
7321i454354L088483M810446M553978N009706l456599n338550O54056K503895
7313B371061K069937J125368Q03051n00094n34089q0047m031619l070084L19219
7304a527297j62280J524920J178800O28297J340011K235880J023986j181352J384461
7295F445426j553673k919770j082484r82437k872932p55279J860383k085569n195418
7286i141753k014506p9514L389968K937426L091374J759487K645491k508470m004350
$$ plain form
7347 11537173 12510157 11407252 6979732 2881018 -775230 -2802966 -3743911 -2459586
7339 -2459586 -2146196 1337736 3955578 6222107 5442967 2566473 488343 -1142754 218946
7330 218946 5252615 3917664 -3734187 -5575377 -6276808 -7286599 -7841731 -10200946 -9454354
7321 -9454354 -6365871 -1555425 2998553 8008259 4551660 -786890 -132834 2371061
7313 2371061 4440998 5566366 6369417 5869323 5335234 5255187 1223568 -1846516 -1527297
7304 -1527297 -1689577 -164657 1014143 1642440 2982451 5218331 6242317 5060965 6445426
7295 6445426 4891753 1971983 889499 -92938 -2965870 -3721149 -1860766 -3946335 -9141753
7286 -9141753 -11156259 -11235773 -7845805 -4908379 -1817005 -57518 2587973 79503 -3924847
7277c924847K673056L761264m05599k99446J982912k947488p064220n695779l458645
7268a5378792P36344J81734k51113M717685L893894l81058M795565K946376p47902
7259E12733j302976J746300M668621j387305j163774N116190J850258o343263
7251C696784o373079j26678J044652k818676L39742K329305J631616M390510J850558
7242E964734J000859n09521j477130k85665M908974O729335k975485j589716j146516
7233A0619869k064200Q6903K080042K111195n240336n929513o82132K400460N6605
7224C438893l171745k026466N76095L25950O2961K810760l81031j112552Q50959
7215A373824J532654L04358M652718K766013R05429J391461L128886M90322m099096
$$ plain form
7277 -3924847 -1251791 2509473 2103874 1804428 3787340 839852 -6224368 -11920147 -15378792
7268 -15378792 -14642448 -14460714 -14711827 -9994142 -6100248 -6481306 -1685741 1260635 512733
7259 512733 -790243 956057 5624678 4237373 3073599 8189789 10040047 3696784
7251 3696784 -2676295 -2802973 -1758321 -4576997 -4237255 -1907950 -276334 4114176 5964734
7242 5964734 6965593 6456072 4978942 4693277 9602251 16331586 13356101 11766385 10619869
7233 10619869 8555669 8642572 10722614 12833809 7593473 1663960 981828 3382288 3438893
7224 3438893 267148 -1759318 -1183223 -857273 -794312 2016448 1635417 522865 1373824
7215 1373824 2906478 3210836 7863554 10629567 11534996 12926457 16055343 16545665 12446569
7206A2446569l875101l428756l604679m807741n073471M82004P706037J258195
7198A103057k886255K277624k554102n757332m476210j413635L923817O467277
7190c315759K933226r10258k911485L39986J296792l86453J869371K450002J312219
7181B677641K249140K45960m226366o658600j123110J660118p07236O31377j879482
7172g130558J161627N891014O916495L168757J666096L41805r5391P13146j647304
7163A0985687k870376l14885J730032m51080l63141k95443l541095R23033O06543
7154F409275k536033k605872J752986J2868k495985M91145j497502l031115k095819
7145e596052P87104K413880L222824M152318j827071l805444m08235k42778j375368
$$ plain form
7206 12446569 8571468 5142712 1538033 -3269708 -8343179 -7861175 -155138 1103057
7198 1103057 -1783198 494426 -2059676 -7817008 -12293218 -13706853 -9783036 -3315759
7190 -3315759 -382533 -1292791 -4204276 -3864290 -2567498 -2953951 -1084580 1365422 2677641
7181 2677641 4926781 5172741 946375 -5712225 -6835335 -5175217 -5882453 -5251076 -7130558
7172 -7130558 -5968931 -77917 6838578 10007335 11673431 12015236 11919845 12632991 10985687
7163 10985687 8115311 7800426 9530458 9079378 8716237 8420794 4879699 5802732 6409275
7154 6409275 3873242 1267370 3020356 3033224 537239 1028384 -469118 -3500233 -5596052
7145 -5596052 -4808948 -2395068 827756 4980074 3153003 -652441 -1060676 -1303454 -2678822
7136b678822k236116O65931K53331L136370N387592N131820m65877m636025n277263
7127g19059k943691j365426J941583M157206L966873k94884j375904o89389l429309
7118g52000m91000M510738M444585J023158l337206l251450j696064j546888M318348
7109C222221L636747m28077n798812l039198j619232j350439K92457K732016M043296
7100A690979J719262k45281L076295L281111j98089n50583j869650n73160p73702
7091E557182k67732j242624k279005k459816j64243M484498J37149r75745K519570
7082E309234k712357m554600O96629N290254J690936M41553l056315q132560l428583
7073h455809R66542l44658q25632K94143j374230j860319K137454O394587O250299
$$ plain form
7136 -2678822 -4914938 -4249007 -3995676 -859306 4528286 9660106 9194229 4558204 -719059
7127 -719059 -3662750 -5028176 -3086593 1070613 5037486 4742602 3366698 2677309 -752000
7118 -752000 -1243000 3267738 7712323 8735481 5398275 2146825 450761 -1096127 3222221
7109 3222221 6858968 6430891 632079 -2407119 -4026351 -5376790 -5084333 -2352317 1690979
7100 1690979 3410241 3164960 6241255 9522366 9324277 8773694 6904044 6330884 5557182
7091 5557182 5289450 4046826 1767821 -691995 -856238 3628260 3765409 2789664 5309234
7082 5309234 2596877 -1957723 -1261094 4029160 5720096 6161649 3105334 -5027226 -8455809
7073 -8455809 -7489267 -7833925 -8659557 -8365414 -9739644 -11599963 -9462509 -3067922 3182377
7064C182377J984736J554265k138270j907714l050762k840685r41346P74825P75857
7055b606717M226186N14160L355818M157692J282884k515382l681368p43240k581577
7046A408456k159990R99143j166417k98156P092500N563770N8250P04732j47751
7037A2054537k80255O81148k836957l229014j632409k541102j024950L152700
7029D343698l98250l84885j756779o78141m345648l926680k397046L868083M967548
7020g08100L221127l137585k388132J120325L36429L127959L846425J208707L520165
7011A0147320M232132K354082P79650l996874n892606j83308o57498n740217k895757
7002a853076L69782L564564N23229k555870m781279M90840K05122m629279j436897
$$ plain form
7064 3182377 5167113 6721378 4583108 2675394 -375368 -3216053 -4157399 -3382574 -2606717
7055 -2606717 1619469 2133629 5489447 9647139 10930023 8414641 4733273 3990033 1408456
7046 1408456 -751534 247609 -918808 -1216964 5875536 11439306 11497556 12202288 12054537
7037 12054537 11774282 12455430 9618473 6389459 4757050 2215948 1190998 4343698
7029 4343698 3945448 3560563 1803784 1125643 -3220005 -7146685 -9543731 -5675648 -708100
7020 -708100 2513027 -624558 -3012690 -1892365 -1555936 1572023 5418448 6627155 10147320
7011 10147320 14379452 16733534 17513184 13516310 7623704 7440396 6782898 1042681 -1853076
7002 -1853076 -1483294 2081270 2604499 48629 -4732650 -4241810 -4036688 -8665967 -10102864
6993a0102864R96298J470596M943662N345440o50729l717223j20487k036093j14675
6984c986075N023150N881036P998242j330019j2798876p759608K321862M308867
6976c41421J799343j523680k26087Q54478j465274j77951j391574j000679p48557
6967d221402p82056L730947M333828K399297Q90877L528068L777482M234127m588285
6958A3302883m864287j145228L433523N934849j132220k781603m938195j309210
6950F500512K710144o69043k002505j93799Q05624r10703q24337l394855n768239
6941c747201p269320l458684O504221O783067m2726j561799k07557N50229m46000
6932b895770K556566J686542j361727l78424j876533P73858p24584k95588J486012
$$ plain form
6993 -10102864 -9106566 -7635970 -2692308 2653132 2002403 -1714820 -1835307 -3871400 -3986075
6984 -3986075 1037075 6918111 14916353 13586334 787458 -6972150 -4650288 -341421
6976 -341421 1457922 -65758 -291845 562633 -902641 -1080592 -2472166 -3472845 -4221402
6967 -4221402 -5003458 -1272511 3061317 5460614 6351491 9879559 13657041 17891168 13302883
6958 13302883 8438596 7293368 10726891 16661740 15529520 12747917 7809722 6500512
6950 6500512 9210656 8541613 6539108 6345309 7150933 6240230 5415893 2021038 -3747201
6941 -3747201 -11016521 -14475205 -7970984 -1187917 -1230643 -2792442 -2999999 -2449770 -2895770
6932 -2895770 -339204 1347338 -14389 -392813 -2269346 -1495488 -2220072 -2515660 -1029648
6923a029648N237747N709738J290736k301743O6946j482341k666899l569342J084482
6914B339676L474533J705289n088j932583j850230K543149J507139J185898R48406
6905I916189j922974l140395k23133K186645k649038l853083N371894N650396
6897A1336501m83811m992855k778981K71692p34752j256943J117102M0349M0485
6888B558787k070509l287827j031476L386802M022657k560335l219596k746776
6880d948273l171864k721111L973622Q387279K364878j396343j702050j44505
6872F41633P73520k571942j290946j16842J098475O96325n256940o740626m581975
6863a7349318R54784O534861K908824j035301k29200K180328J61451o000979J220999
$$ plain form
6923 -1029648 4208099 9917837 11208573 8906830 8973776 7491435 4824536 1255194 2339676
6914 2339676 5814209 7519498 7514410 5581827 3731597 6274746 7781885 8967783 9916189
6905 9916189 7993215 4852820 4629687 6816332 4167294 314211 5686105 11336501
6897 11336501 10852690 5859835 3080854 3352546 2617794 1360851 2477953 2518302 2558787
6888 2558787 488278 -2799549 -3831025 -444223 3578434 1018099 -2201497 -4948273
6880 -4948273 -8120137 -10841248 -6867626 1519653 3884531 2488188 786138 641633
6872 641633 1415153 -1156789 -2447735 -2564577 -1466102 -769777 -6026717 -12767343 -17349318
6863 -17349318 -16394534 -9859673 -6950849 -7986150 -8215350 -6035022 -5873571 -11874550 -10653551
6854a0653551M182030M905785N528987L873972l443251n670761k493115J370083
6846b399821k046331m353889m60489j770860k376810M043162O99116P87202K966069
6837d912651R80658L136769p73673k366269M0280J255269n751469o226705K94057
6828a4323734O510039L671111k368180m41200K149953L245535P70193q91588J679465
6819A594N104069K829440P41105l85391P62985o38002m997024j979743K112156
6810C551189o77127j756081j551223J20159q89787l203443J489666M462988q52556
6801F93785j355064L1524J048112N21505K49672j604255j877223J776130m59990
6792i75804n684584k598933J704758N585102N758111o84082j836602l831276L40606
$$ plain form
6854 -10653551 -6471521 -1565736 3963251 7837223 4393972 -1276789 -3769904 -2399821
6846 -2399821 -4446152 -8800041 -9260530 -11031390 -13408200 -9365038 -8665922 -7878720 -4912651
6837 -4912651 -3931993 -795224 -1568897 -3935166 -3894886 -2639617 -8391086 -14617791 -14323734
6828 -14323734 -7813695 -4142584 -6510764 -6951964 -4802011 -1556476 -786283 -1677871 1594
6819 1594 5105663 7935103 8676208 8290817 9053802 8415800 3418776 1439033 3551189
6810 3551189 2874062 1117981 -433242 -313083 -1202870 -4406313 -2916647 1546341 693785
6801 693785 -661279 -629755 418357 939862 1189534 -414721 -2291944 -515814 -975804
6792 -975804 -6660388 -9259321 -7554563 -1969461 3788650 3104568 1267966 -2563310 -2222704
6783b222704M594655k053703m799123o50822j81630P13633O117625L239516J804643
6774F562090K23859M598960M757871k906737m777465j144728K549259O5452m277858
6765E650703r80287K071279K589898j98224J067969j786147J934402N083888K151935
6756A7585416j142233m161429m266944l051577j330733J295211Q12356k739311
6748C000756m614999m450603O17109O358564N808690J459631k202894k132230
6740C844024k008318n798281k558063l238423j053540J620424K815929q26309
6732g202557j934760j189556r48208M472270K109314J101708K550439L552702
6724B511352K587437L09884L91485L424615K441223k976370j920709M189130K607778
$$ plain form
6783 -2222704 2371951 318248 -4480875 -5131697 -5313327 -4599694 1517931 4757447 6562090
6774 6562090 6785949 11384909 16142780 13236043 8458578 7313850 9863109 9928561 5650703
6765 5650703 4670416 6741695 9331593 9133369 10201338 8415191 10349593 15433481 17585416
6756 17585416 16443183 12281754 8014810 4963233 3632500 4927711 5740067 3000756
6748 3000756 -1614243 -6064846 -5447737 910827 6719517 8179148 5976254 3844024
6740 3844024 1835706 -3962575 -6520638 -9759061 -10812601 -9192177 -6376248 -7202557
6732 -7202557 -9137317 -10326873 -11275081 -6802811 -4693497 -3591789 -1041350 2511352
6724 2511352 5098789 5408673 5800158 9224773 11665996 8689626 6768917 10958047 13565825
6715A3565825k709076j514716o17653L893103N53862k559976J273817p51198M013371
6706A5147359L913471k707439o624070j0482694m143558M78904J805311J236409
6698a376307K824768K233083k855874m658753j421950k31932K302307L440123
6690B55465M116877M50994K429290M36074l09450J170825O84530l591139n100790
6681E42676r88189N285057K782453l722638l942343j157077K843712M276339j33052
6672E786938q94774K761723J514704j458703j951880n030815l835710k81198L381855
6663g860K556992k719710n413236J249064O454432K902399k76173L803097O391664
6654A4940669J722462m220247l382248L87944J455074K637403j416989k15285
$$ plain form
6715 13565825 10856749 9342033 8724380 12617483 13171345 10611369 11885186 11133988 15147359
6706 15147359 19060830 16353391 9729321 -753373 -4896931 -4418027 -2612716 -1376307
6698 -1376307 1448461 3681544 825670 -3833083 -5255033 -5486965 -3184658 255465
6690 255465 4372342 4823336 7252626 7688700 7379250 8550075 9234605 5643466 542676
6681 542676 -445513 4839544 7621997 3899359 -42984 -1200061 1643651 5919990 5786938
6672 5786938 4892164 7653887 9168591 7709888 5758008 727193 -3108517 -3389715 -7860
6663 -7860 2549132 -170578 -5583814 -4334750 2119682 5022081 4745908 8549005 14940669
6654 14940669 16663131 12442884 9060636 9448580 10903654 13541057 12124068 11908783
6646A1908783L773074n35975M9681J178066J104837j541122k055619j716373k77532
6637A1887820J346404k497626l614834K92792L305869J596877L437787k43512
6629A5511577Q22109L39195k482657m83049J863066m35918K111755N993869K278308
6620B5518255M440019M572096M204699L693546M030752P952767P220557R562254
6612G1194945J3615868J7368041K0624130K4869011L2617779M2646307M9326738
6605B72262819N9494848P1002430P2404095N1788510L790244m1923499o8007942
6598D20811505p5391980o7978936n2518892l9898269l1995392k5981029k2584988
6591A04462019j7264537j3759207j2861860r651841q230360l177663m579180q265406
$$ plain form
6646 11908783 15681857 15145882 15195563 16373629 17478466 15937344 13881725 12165352 11887820
6637 11887820 13234224 10736598 7121764 7414556 10720425 12317302 15755089 15511577
6629 15511577 16333686 16672881 14190224 13707175 15570241 15134323 17246078 23239947 25518255
6620 25518255 29958274 34530370 38735069 42428615 46459367 54412134 61632691 71194945
6612 71194945 84810813 102178854 122802984 147671995 180289774 222936081 272262819
6605 272262819 331757667 402760097 475164192 526952702 530742946 488819447 420811505
6598 420811505 345419525 277440589 224921697 185023428 153028036 127047007 104462019
6591 104462019 87197482 73438275 60576415 50924574 42694214 39516551 34937371 26671965
6583B6671965j788443J934260q17697k232380k254450q859047q446555K03731
6575D411384O013864r85004n282059j712147j261158l959891K006739N490072
6567D721800K967501L886932q25522k16282K48912k716228m821411m768483J41654
6558a381127O928519M623185P494778M508444n056393m612024m519411q642028
6550f56057l307363J734951J058601L946591R73400j12988j981211J54444K298987
6541D109355r81153J184119O87297k068007n971114l983396O26370K639474M365327
6532F08272N717685J855623j832854k057019l714375k769356k030107K236914
6524a985217N794538N540793L42648j549205M89315j718611j471246k364259j196963
$$ plain form
6583 26671965 24883522 26817782 26000085 23767705 21513255 12654208 4207653 4411384
6575 4411384 10425248 9440244 4158185 2446038 1184880 -2775011 -768272 4721800
6567 4721800 7689301 11576233 10750711 10534429 10783341 8067113 3245702 -1522781 -1381127
6558 -1381127 5547392 10170577 17665355 22173799 17117406 12505382 7985971 -656057
6550 -656057 -3963420 -2228469 -1169868 2776723 3750123 3637135 1655924 1810368 4109355
6541 4109355 3128202 4312321 4999618 2931611 -3039503 -7022899 -6396529 -3757055 608272
6532 608272 6325957 8181580 6348726 4291707 577332 -2192024 -4222131 -1985217
6524 -1985217 3809321 9350114 9692762 8143557 8632872 6914261 5443015 3078756 1881793
6515A881793o05930k877328m420752k739186k329565m49790R79652L977337L952609
6506b631160J392451L546777M182838L835333R9503J415259j884985m898975m368306
6497F88735k307180k546168k80438L578477K613679j653807l234740j404839K780292
6488a765989M152931q46835j367653O38926K84056r94645K749185K214186k267133
6479B797029l354966O26434M378745M089231l836883r732483m052754M360744
6471d724903N531108K725966m33420M473242P2900m637861k918307j458162K409962
6462A040525P340421O372370j388475l252945j735717N94092L393697k32411m827311
6453G304246n342683j362543K129260p09467l084888j685534J312449K556924
$$ plain form
6515 1881793 1275863 -1601465 -6022217 -8761403 -11090968 -11540758 -10561106 -6583769 -2631160
6506 -2631160 -1238709 2308068 6490906 10326239 10425742 11841001 9956016 5057041 688735
6497 688735 -1618445 -4164613 -4445051 -866574 1747105 93298 -3141442 -4546281 -1765989
6488 -1765989 2386942 1540107 172454 811380 1095436 100791 2849976 5064162 2797029
6479 2797029 -557937 68497 4447242 8536473 4699590 -5032893 -9085647 -4724903
6471 -4724903 806205 3532171 3098751 7571993 7644893 3007032 88725 -1369437 1040525
6462 1040525 8380946 14753316 13364841 10111896 8376179 8970271 12363968 12131557 7304246
6453 7304246 1961563 599020 2728280 2018813 -1066075 -2751609 -1439160 1117764
6445A117764m33537l198050l18781O0726j33153L020397j71994m309039m099601
6436h465268j037631q74959J233417O821326P43572o168374L88080r34740p64761
6427i059338P067603O588055n55573p971322m603528N36398k1876L239110N608221
6418H27750j424050m481446q81885K425883O873428Q370290M779949K20566q86483
6409A5824002J135043L65788j559893l939257o334925q282205q57323M099031
6401D50261J721141k608686k778601Q641O32474j800474m143138j113350L581270
6392f050462K097542o90747L467644O395980R75328k846490J30760j89697k800093
6383D89765K93437K037775K615506J773911N12441r2121k164737l998423m214400
$$ plain form
6445 1117764 684227 -2513823 -2832604 -2771878 -2905031 115366 -56628 -4365667 -8465268
6436 -8465268 -9502899 -10377858 -9144441 -2323115 -1579543 -7747917 -7359837 -8294577 -9059338
6427 -9059338 -1991735 4596320 4040747 -3930575 -8534103 -7997705 -8019581 -4780471 827750
6418 827750 -596300 -5077746 -5959631 -3533748 3339680 11709970 16489919 16710485 15824002
6409 15824002 16959045 17324833 15764940 11825683 5490758 -2791447 -3648770 450261
6401 450261 2171402 -437284 -3215885 -3207244 -2574770 -4375244 -8518382 -9631732 -6050462
6392 -6050462 -3952920 -4643667 -1176023 5219957 6195285 3348795 3479555 3289858 489765
6383 489765 783202 2820977 5436483 7210394 7722835 7630714 5465977 1467554 -2746846
6374b746846k850752j750150o09094L408377R582240Q911824J689428m34064k29910
6365A4971053l59744l931747o283809l725748j808264j540826K592482L545642
6357C459039n841931n098285J607877N106391N08280k11662O69411j118534J433422
6348E14008L568495J190027r60627m070841j251894L29428k051354J126983J435643
6339a70132M91010J252990n08745m411607l674623J853015Q61981k426738m82268
6330g215117K403539L188685L139295j21879k925118N97139K107030k144177l773120
6321d743723m639526k429432n93219L954818O084809K892643M2258K033422l104443
6312e02393K280705M976379r30298o685269q693441k910374M142338L686978l937858
$$ plain form
6374 -2746846 -5597598 -7347748 -7956842 -4548465 5033775 13945599 15635027 15200963 14971053
6365 14971053 14611309 10679562 4395753 670005 -1138259 -2679085 -86603 3459039
6357 3459039 -2382892 -7481177 -5873300 -766909 -258629 -470291 199120 -919414 514008
6348 514008 4082503 5272530 4311903 241062 -1010832 -681404 -2732758 -1605775 -170132
6339 -170132 320878 1573868 1065123 -3346484 -7021107 -5168092 -4306111 -6732849 -7215117
6330 -7215117 -4811578 -1622893 1516402 1394523 -1530595 -933456 1173574 -970603 -4743723
6321 -4743723 -9383249 -11812681 -12405900 -8451082 -2366273 526370 568628 2602050 -502393
6312 -502393 1778312 6754691 5824393 -860876 -9554317 -12464691 -8322353 -4635375 -8573233
6303h573233k434427L271410Q684016J253440m430705j151691L866383J724185
6295B209378K01100J521906m125426n129814M973520K600336k974700j976319
6287b700019L935953L625858M54397j413099M47700J458323Q70518L11427K44971
6278G236029l518434m227816j183926r32440l19919K415845P12063N79405K99446
6269A060253m506307m927663j458701j767133L610387M620309M759184J342733
6261B733062r77626J174376r06094J453035r89126m517029M61166J583416r71392
6252i56212l737793k922571j801882J321555L279823K335386N152666P98573j966550
6243A502995J504705j941649k318565o75163L049847M924733N97074k221101L597242
$$ plain form
6303 -8573233 -11007660 -7736250 947766 2201206 -2229499 -3381190 485193 2209378
6295 2209378 2410478 3932384 -193042 -5322856 -349336 2251000 -723700 -2700019
6287 -2700019 1235934 4861792 5316189 3903090 4350790 5809113 6679631 6991058 7236029
6278 7236029 3717595 -510221 -1694147 -2626587 -2946506 -530661 181402 760807 1060253
6269 1060253 -3446054 -8373717 -9832418 -11599551 -7989164 -3368855 1390329 2733062
6261 2733062 1755436 2929812 2023718 3476753 2487627 -2029402 -1568236 15180 -956212
6252 -956212 -4694005 -7616576 -9418458 -8096903 -4817080 -2481694 2670972 3469545 1502995
6243 1502995 3007700 1066051 -1252514 -1927677 1122170 6046903 6643977 4422876 8020118
6234H020118N082212J771627k69570m194990o303188m097490k160224Q82603N499836
6225D230934J776627J267685J26919J317333j655749k598307J691736p081j740947
6216D409150l108444m248077m075781n87780K529289M326643L523204o736702
6208c968498j0646088m966001J26876K622801O139969N273959L066273P34015
6200a616694j320197p03309Q91054J110139J770755N88408l541653k620694J919275
6191c522916L058976J651928k367177o41815J352337M253334M392546K111604
6183A0288817o90429o11442k519822o50972J56169k827167j994753J584134N18703
6174C253238m56758m817736j463978M10850K163615k168j227198p57547L094258
$$ plain form
6234 8020118 13102330 14873957 14604387 10409397 4106209 8719 -2151505 -1268902 4230934
6225 4230934 6007561 7275246 7402165 8719498 7063749 4465442 6157178 6150097 4409150
6216 4409150 1300706 -2947371 -7023152 -7610932 -5081643 -755000 2768204 -3968498
6208 -3968498 -14614586 -19580587 -19453711 -16830910 -10690941 -5416982 -2350709 -1616694
6200 -1616694 -2936891 -3640200 -2749146 -1639007 131748 720156 -2821497 -5442191 -3522916
6191 -3522916 -463940 1187988 -1179189 -1821004 -468667 3784667 8177213 10288817
6183 10288817 9598388 8986946 6467124 5816152 5972321 3145154 1150401 2734535 3253238
6174 3253238 2796480 -2021256 -3485234 -3074384 -910769 -912937 -2140135 -2897682 196576
6165A96576K270072j524345j525876J518473L623425l86440k158144j281293k02435
6156E30013J237395j033057j214778j055855J605634Q58746j63938j946371l084731
6147d266942n338598j498126Q09952K012128J50170K739918L418729N401195K600403
6138F028829r42521j955297J256594J724448K160305j857876l327957l758951
6130f72426l267432j292272J00307j96208K409579M608777O633964r36241n167980
6121B220068p54871K73960j042795p03281k077555K015632J725018j310143j7862
6112C28171J283271J166954K195042J960920n42572K46854k474161m729842j779080
6103b344443q13178K654494K702084l63385j523255j309529J836041k11314n11814
$$ plain form
6165 196576 2466648 942303 -583573 934900 4558325 4171885 2013741 732448 530013
6156 530013 1767408 734351 -480427 -1536282 69352 928098 764160 -1182211 -4266942
6147 -4266942 -9605540 -11103666 -10293714 -8281586 -8131416 -5391498 -1972769 3428426 6028829
6138 6028829 5086308 3131011 4387605 6112053 8272358 6414482 3086525 -672426
6130 -672426 -3939858 -5232130 -5131823 -5328031 -2918452 1690325 8324289 7388048 2220068
6121 2220068 1465197 1739157 696362 -6919 -2084474 -68842 1656176 346033 328171
6112 328171 1611442 2778396 4973438 6934358 6391786 6638640 4164479 -565363 -2344443
6103 -2344443 -3157621 -503127 2198957 1835572 312317 -997212 838829 627515 115701
6094A15701L333072J629650K848165N155244n45413m314428o464209k190410L89300
6085d3328J589594k07482J144811K351057o12502l670219l283791q6128L930169
6076A112181L331324L070334L747218j36714P5071L21733k302815m561897R02211
6067E558646J345186l235841n796793L073807L161285k410190l906669j095771
6059c306340p73696P31249J10740j173702j632970L624049J569790l825123j820572
6050f496575q73024K081605N45606j79139M431906J917432m604200n35918M735166
6041A022859j251220m079283l587972j152769L62388J727578K601304N08709m741627
6032h590033k092211L545476j998001l654016N9251K021123N894627L036920r61793
$$ plain form
6094 115701 3448773 5078423 7926588 13081832 12536419 8221991 1757782 -432628 -43328
6085 -43328 1546266 1338784 2483595 4834652 4222150 551931 -2731860 -2817988 1112181
6076 1112181 4443505 7513839 11261057 11124343 11199414 11521147 9218332 4656435 5558646
6067 5558646 6903832 3667991 -2128802 945005 4106290 1696100 -2210569 -3306340
6059 -3306340 -4080036 -3348787 -3238047 -4411749 -6044719 -2420670 -850880 -4676003 -6496575
6050 -6496575 -7369599 -5287994 -4742388 -4921527 -489621 1427811 -3176389 -3712307 1022859
6041 1022859 -228361 -4307644 -7895616 -9048385 -8685997 -6958419 -4357115 -3848406 -8590033
6032 -8590033 -10682244 -7136768 -9134769 -12788785 -12729534 -10708411 -4813784 -1776864 -2738657
6023b738657m509630n68405N308912N018350L729616l057917l563746l194831
6015c576308K51599L921408J363583l373961k090458M17284k721797o22740M959967
6006a471423L339530K019024L817547N880793K352536J410963o001387j1189571
5998A58012p145043k682269j324181J17874K934708L565990q59734J56851L889586
5989a188206M273328P52142r48838j407787l625789n349334m058673o82822K949093
5980i286886o1453o496763m413890L737921M676962m93970n33017N124431M654706
5971c091959M573934J402140R99661p05992j779786k357332r38410O201632K825557
5962G129445k006570k001636j420401k190440j881316J762815M386522K053016
$$ plain form
6023 -2738657 -7248287 -7816692 -2507780 2510570 6240186 3182269 -381477 -3576308
6015 -3576308 -3324709 596699 1960282 -1413679 -3504137 -3086853 -5808650 -6431390 -1471423
6006 -1471423 1868107 3887131 7704678 13585471 15938007 17348970 11347583 158012
5998 158012 -6987031 -9669300 -10993481 -10875607 -7940899 -4374909 -5234643 -5077792 -1188206
5989 -1188206 3085122 3837264 2888426 1480639 -2145150 -7494484 -11553157 -12235979 -9286886
5980 -9286886 -9348339 -15845102 -20258992 -16521071 -11844109 -12338079 -12871096 -7746665 -3091959
5971 -3091959 1481975 2884115 3883776 3177784 1397998 -959334 -1897744 4303888 7129445
5962 7129445 5122875 3121239 1700838 -489602 -2370918 -608103 3778419 5831435
5954E831435L85165n397289o273686J31414N25683j077402l257154n03046K28553
5945i406327J367804J49327j869052j884594j151243K632382J407619r20555J118491
5936h556148J569110K755408L821175r1389j778336j110730k970467m421176L111580
5927g670973P305523K642717j074840k029362k6421k43693j043793n61978J017336
5918a685484j18339j932688l573734l001388J206633m07913O37707J689543R99202
5909f186461J613189r8409n062406J119315P622875O848606N006964P05232j335994
5900A0232911k004340j89466Q87610p37117J980793j403522n889246r01974P81041
5891B756690K391579K575758M686692O442096P21436m461535m078341N94620M26390
$$ plain form
5954 5831435 6216600 819311 -5454375 -5322961 -4797278 -5874680 -9131834 -9634880 -9406327
5945 -9406327 -8038523 -7889196 -9758248 -11642842 -12794085 -10161703 -8754084 -9674639 -8556148
5936 -8556148 -6987038 -4231630 -410455 -501844 -2280180 -3390910 -6361377 -10782553 -7670973
5927 -7670973 -365450 2277267 1202427 -826935 -853356 -1097049 -2140842 -2702820 -1685484
5918 -1685484 -1803823 -3736511 -7310245 -10311633 -9105000 -9512913 -8875206 -7185663 -6186461
5909 -6186461 -4573272 -4671681 -9734087 -8614772 -991897 5856709 10863673 11568905 10232911
5900 10232911 8228571 8039105 8926715 8189598 10170391 8766869 2877623 1975649 2756690
5891 2756690 5148269 7724027 12410719 18852815 19574251 15112716 11034375 11628995 12055385
5882A2055385j893452j093894k225837n248901o600685l032925L336831P668997
5874B965519O605234P01784o341476n153344m308014l615882p47820N45035j271834
5865a0620798N23177O603696N350847j621573j370205l207091M30351K700809
5857a210787Q35985l083204p957052p172106P91775L300201O482492M935023j523273
5848d600946k497812l177856l056347j420522J340762p07906P89057L195314K178563
5839g957693j703129J019684N042239M718800Q5831o075134o287731M119852M630542
5830b406739J43939n85506j782105j297292K172728K452589j144522j950037r25421
5821e322366M83711J282032L467587m25053j844805l650564j459168N046173K738385
$$ plain form
5882 12055385 10161933 9068039 6842202 1593301 -5007384 -8040309 -4703478 2965519
5874 2965519 9570753 10272537 3931061 -1222283 -5530297 -9146179 -9893999 -9348964 -10620798
5865 -10620798 -10097621 -3493925 1856922 235349 -1134856 -4341947 -3911596 -1210787
5857 -1210787 -374802 -3458006 -11415058 -18587164 -17795389 -14495188 -8012696 -3077673 -4600946
5848 -4600946 -7098758 -10276614 -13332961 -14753483 -13412721 -14120627 -13331570 -10136256 -7957693
5839 -7957693 -9660822 -8641138 -3598899 1119901 1205732 -4869402 -11157133 -7037281 -2406739
5830 -2406739 -2262800 -2848306 -4630411 -5927703 -3754975 -1302386 -2446908 -4396945 -5322366
5821 -5322366 -4838655 -3556623 -89036 -514089 -2358894 -6009458 -7468626 -2422453 315932
5812C15932j368637n55740k390935M88881R90786L84306j65798j328093L220483
5803d08815R68534m669950m046264l909073k540007M605742L829573L790179M217019
5794A836938L671923L133283j827830l285869j081519K161398q40682m918270
5786a150628j625968O01737n175528m367838j033383J776437K383130K657246
5778e934795N632804L644933j451596J485490J466419N97546q77532j173602O4754
5769C454421M718062K313959m112024m018782j880326O29443M00308k317285l486033
5760d298257l461574J954327M547850M750168K167054J970346l431681o963901
5752b765668m816955J020943L198649L962928J832407K7181k151409l104409k530773
$$ plain form
5812 315932 -1052705 -1608445 -3999380 -3510499 -2519713 -2135407 -2301205 -3629298 -408815
5803 -408815 559719 -4110231 -8156495 -12065568 -14605575 -9999833 -6170260 -2380081 1836938
5794 1836938 5508861 8642144 6814314 3528445 2446926 4608324 3767642 -1150628
5786 -1150628 -2776596 -2174859 -7350387 -11718225 -12751608 -10975171 -8592041 -5934795
5778 -5934795 -301991 3342942 1891346 3376836 4843255 5440801 4563269 3389667 3454421
5769 3454421 8172483 10486442 6374418 2355636 475310 1104753 1505061 -812224 -4298257
5760 -4298257 -7759831 -5805504 -1257654 3492514 5659568 7629914 4198233 -2765668
5752 -2765668 -7582623 -6561680 -3363031 599897 2432304 2459485 308076 -2796333 -5327106
5743e327106j77563O2260p14349P40317l961210l711614Q19870J330130J899967
5734i039298L193135M064096K423748J86660j726856K009327K004724l701106
5726e85570J950285N375832J564517j391254l525842k186140o35628n092075l630641
5717h156516K082547N142124J961887j691462l00783K208065K063250m88161J297845
5708D118796j057910l40758l845786l236937R97057K711440K583116o20573o86248
5699F22197O63000R63859M71573L724979J813355j29039k773708q439725m603901
5690g687410P88088O135733O059314K949802M46788l633053j764640P59414q55245
5681C198791k970366l590401R82086L336919m9993k537866k581437P3458M763083
$$ plain form
5743 -5327106 -5504669 -5442409 -6156758 -5416441 -9377651 -13089265 -12269395 -10939265 -9039298
5734 -9039298 -5846163 -1782067 641681 828341 -898515 1110812 3115536 -585570
5726 -585570 1364715 6740547 8305064 6913810 3387968 1201828 566200 -4525875 -8156516
5717 -8156516 -6073969 -931845 1030042 -661420 -962203 1245862 3309112 2820951 4118796
5708 4118796 3060886 2720128 -1125658 -4362595 -3365538 -654098 1929018 1308445 622197
5699 622197 1285197 2249056 2720629 6445608 8258963 8129924 5356216 -3083509 -7687410
5690 -7687410 -6899322 -763589 5295725 8245527 8692315 5059262 3294622 4054036 3198791
5681 3198791 228425 -3361976 -2379890 957029 907036 -1630830 -4212267 -4138809 624274
5672F24274M200413J207167J367939L544697L804997j547401o232989j970193
5664D998904j368511l543345j734857k960553P66636K331604K940503L808792
5656E239173M78751k768801j594430K08275j432440k470279K305982J226519J450072
5647B642822J976936K184500j520834l422175l960931m767536l576328J772622
5639h670924P260091M385327r31889m589414k707968l280333o383458O20659J438010
5630a2859899J830955L969508J817771J879743K798500L043745K771965J048509
5622F300797o8422J327148j10624l946670l101814P18329k70067J490197M35052
5613B773926n764474m561007l426789J434837L476644O997388O080954Q70845
$$ plain form
5672 624274 4824687 6031854 7399793 10944490 14749487 13202086 6969097 4998904
5664 4998904 3630393 87048 -1647809 -4608362 -3841726 -1510122 1430381 5239173
5656 5239173 5717924 2949123 1354693 1562968 130528 -2339751 -33769 1192750 2642822
5647 2642822 4619758 6804258 5283424 1861249 -2099682 -6867218 -10443546 -8670924
5639 -8670924 -1410833 2974494 2042605 -2546809 -5254777 -8535110 -14918568 -14297909 -12859899
5630 -12859899 -11028944 -7059436 -5241665 -3361922 -563422 2480323 5252288 6300797
5622 6300797 6232375 7559523 7448899 3502229 400415 1118744 848677 2338874 2773926
5613 2773926 -2990548 -7551555 -10978344 -9543507 -6066863 930525 7011479 7882324
5605G882324k772382K400907L503606R32360j486243k654625n76777j326519j151204
5596D751447n028917o743380k452855M991263K240365L956707N427540J263611
5588H405781k641021l355301L312762O976327Q59360j771579o677201l679398
5580A429730m334832k656340p07018o21157J397797O729011K951403j432259j778531
5571I77804j538703m083169N15232j424732n215460k65244L704878M034534L247046
5562d7814L408194M284503M18386l224452r84005j522553j404043j012450J724757
5553A640523J673994j458511l84330K769721N33874l067356l521231j042329K527250
5544c28395Q61812p00486O85867K555447K20389k946423r93337k386856j249571
$$ plain form
5605 7882324 5109942 7510849 11014455 11946815 10460572 7805947 7229170 5902651 4751447
5596 4751447 -277470 -7020850 -9473705 -4482442 -2242077 1714630 7142170 8405781
5588 8405781 5764760 2409459 5722221 12698548 13557908 11786329 5109128 1429730
5580 1429730 -2905102 -5561442 -6268460 -6889617 -5491820 1237191 4188594 2756335 977804
5571 977804 -560899 -4644068 -4128836 -5553568 -10769028 -11034272 -7329394 -3294860 -47814
5562 -47814 3360380 7644883 8063269 4838817 3854812 2332259 928216 -84234 1640523
5553 1640523 3314517 1856006 1471676 4241397 4775271 1707915 -1813316 -2855645 -328395
5544 -328395 533417 -167069 518798 3074245 3294634 348211 -645126 -3031982 -4281553
5535d281553K266012L652329J546829k057474l925532n76980L672353J214112
5527A510096K53325K645273K087135l605080m307720l327101O70625M178174L681930
5518C786657K285520q40131m212553m969629k975417P0099K278914N180031M526241
5509E129732k79386l033333l799628j307251l22181q42676Q25020K184376M755839
5500C310512J055455m217038m395913m98118L550109L142910L940474J00936j575218
5491D414109j337935m456936l853568j85841L75914n8495Q15793k487826m190567
5482a0965352j105090J59883K522935L629834N88972k552269p13937k914897o62423
5473a2012344P348662J1865575P782303l966k433003k061168n745263l067366
$$ plain form
5535 -4281553 -2015541 1636788 3183617 1126143 -2799389 -3376369 295984 1510096
5527 1510096 1763421 4408694 6495829 2890749 -1416971 -4744072 -4073447 104727 3786657
5518 3786657 6072177 5232046 1019493 -3950136 -6925553 -6855454 -4576540 603491 5129732
5509 5129732 4850346 1817013 -1982615 -3289866 -3612047 -4454723 -3629703 -1445327 3310512
5500 3310512 4365967 148929 -4246984 -4745102 -1194993 1947917 5888391 5989327 4414109
5491 4414109 3076174 -1380762 -5234330 -5420171 -5044257 -5102752 -4286959 -6774785 -10965352
5482 -10965352 -12070442 -11910559 -9387624 -5757790 -5168818 -7721087 -8435024 -11349921 -12012344
5473 -12012344 -4663682 7201893 14984196 14980230 12547227 10486059 4740796 1673430
5465A673430J662653J552786L038645k716098n537481n515671j60515M516961
5457a485290o00066l420567L62377L181210K276960O46479K462468L557489L650465
5448A0631525p41338l783311k004499k390782k14481j639555l245429l67787m02510
5439d158167k620015p5512L129008j9104o511775k134755P829662R436336K010578
5430F886256o89547M44877J008133j551012k740039J805649K71861l860498N74346
5421B150026L271976J704618q93659p80736m570128k674855k027852n15373J909370
5412b426613j646053m094130l209481l70837l80724k579653J789607K627842o83367
5403a0973409k39505K120544N186210J661345j250147K397719J326105k283307
$$ plain form
5465 1673430 3336083 4888869 7927514 5211416 -326065 -5841736 -6002251 -1485290
5457 -1485290 -2085356 -5505923 -5143546 -1962336 314624 961103 3423571 6981060 10631525
5448 10631525 9890187 6106876 4102377 1711595 1497114 -142441 -3387870 -3755657 -4158167
5439 -4158167 -6778182 -6853694 -3724686 -3743790 -10255565 -12390320 -4560658 4875678 6886256
5430 6886256 6196709 6641586 7649719 6098707 3358668 5164317 5436178 1575680 2150026
5421 2150026 5422002 7126620 6232961 5452225 882097 -1792758 -3820610 -4335983 -2426613
5412 -2426613 -4072666 -8166796 -11376277 -11747114 -12127838 -14707491 -12917884 -10290042 -10973409
5403 -10973409 -11212914 -9092370 -3906160 -2244815 -3494962 -1097243 228862 -2054445
5395b054445J966156L397172M041322N655242j156937n747879n307196p32410
5387F1025K443057M241989j248622J460997j839654l297029j400634k034883m107776
5378e721530J001273K189284j957470j388589J10714K409929J392962J566886
5370c96541K01923J66124j314731l129221n77590j60955j181169J051855K335465
5361c004840J973394L81763J372895o58066m365260l345353K450853J636563J486996
5352b071055L408392K01973l237798k617060M42936p4953k24250N295044M025144
5343E148373J488581O72776j88636j073416l931021p8676K431217J571756l08745
5334E732209r48293j079011n28142J36170J598028K861481K395001k48121j155923
$$ plain form
5395 -2054445 -88289 3308883 7350205 13005447 11848510 6100631 793435 61025
5387 61025 2504082 6746071 5497449 6958446 5118792 1821763 421129 -1613754 -5721530
5378 -5721530 -4720257 -2530973 -4488443 -5877032 -5766318 -3356389 -1963427 -396541
5370 -396541 -194618 -28494 -1343225 -4472446 -5050036 -5210991 -6392160 -5340305 -3004840
5361 -3004840 -1031446 -649683 723212 65146 -4300114 -7645467 -5194614 -3558051 -2071055
5352 -2071055 1337337 1539310 -1698488 -4315548 -3872612 -3947565 -4171815 1123229 5148373
5343 5148373 6636954 7309730 7121094 6047678 2116657 2037981 4469198 6040954 5732209
5334 5732209 4783916 3704905 3176763 3312933 4910961 7772442 10167443 9919322 8763399
5325H763399n12722J456314J647027L488140N7329j742120j646766l66010k477384
5316H667207n216341m367660J136824M210584L268829n68946k263588j642411
5308C224498k822904k26578P91796J048014j182047k368360l754443n914253J554018
5299i650259J785855j699823j826569L428975L704878M045883M880167L920192
5291H589299k467974n931156l553926J718661M554213N16427k035464J98954l726769
5282b137735L146567K920558P68298q19507l385474K609923P0168p059872P89952
5273c097122Q460667m28633o023882m365497N51747O118114O098625M14970l033300
5264D695689M29957K210362K187744k025547n576957n049619J761765K414420
$$ plain form
5325 8763399 8250677 9706991 11354018 14842158 14899487 13157367 11510601 11144591 8667207
5316 8667207 3450866 -916794 220030 4430614 7699443 7130497 4866909 3224498
5308 3224498 401594 175016 966812 2014826 832779 -1535581 -5290024 -11204277 -9650259
5299 -9650259 -7864404 -9564227 -11390796 -7961821 -4256943 -211060 4669107 8589299
5291 8589299 6121325 190169 -3363757 -1645096 2909117 3425544 1390080 1589034 -2137735
5282 -2137735 1008832 3929390 4697688 3878181 492707 3102630 3172798 -3887074 -3097122
5273 -3097122 5363545 4934912 -1088970 -5454467 -4902720 1215394 7314019 7728989 4695689
5264 4695689 5125646 7336008 9523752 7498205 1921248 -3128371 -1366606 1047814
5256A047814L60154l35630j941914j983979j119597L61254O55070J129594J127968
5247f99266N21733j931M772844M339061r01644m086483l116752j103160K942880
5238B667282M796045L491277j902536j601785o65693j664885j004991J262359
$$ plain form
5256 1047814 1407968 1072338 -869576 -2853555 -3973152 -3611898 -2956828 -1827234 -699266
5247 -699266 -177533 -179464 4593380 8932441 8030797 3944314 827562 -275598 2667282
5238 2667282 7463327 10954604 9052068 7450283 6784590 5119705 4114714 5377073
$$ [...]
##END NTUPLES=NMR SPECTRUM
##END=
