##TITLE=C13DEPT135
##JCAMPDX= 6.0         $$ Bruker NMR JCAMP-DX V2.0
##DATA TYPE= NMR SPECTRUM
##DATA CLASS= NTUPLES
##ORIGIN= UXNMR, Bruker Analytische Messtechnik GmbH
##OWNER= root
$$ XWIN-NMR		Version 3.5
$$ Sat Feb 22 13:02:23 2025 Russian Standard Time (UT+4h)  servis@DPX200
##.OBSERVE FREQUENCY= 50.3277607988526
##.OBSERVE NUCLEUS= ^13C
##.ACQUISITION MODE= SIMULTANEOUS
##.ACQUISITION SCHEME= undefined
##.AVERAGES= 1038
##.DIGITISER RES= 17
##SPECTROMETER/DATA SYSTEM= spect
##.PULSE SEQUENCE= dept135
##.SOLVENT NAME= DMSO
##.SHIFT REFERENCE= (INTERNAL, DMSO, 0, 219.126)
##AUDIT TRAIL= $$ (NUMBER, WHEN, WHO, WHERE, WHAT)
$$ ##TITLE= Audit trail, XWIN-NMR		Version 3.5
$$ ##JCAMPDX= 5.01
$$ ##ORIGIN= Bruker BioSpin GmbH
$$ ##OWNER= servis
$$ F:\spectra/data/av/nmr/C13DEPT135/1/pdata/1/auditp.txt
$$ ##AUDIT TRAIL=  $$ (NUMBER, WHEN, WHO, WHERE, WHAT)
(   1,<2025-02-22 13:01:58.15 +0400>,<servis>,<DPX200>,
      <created by zg, POWCHK disabled, PULCHK disabled
       terminated by command 'halt'
       configuration hash MD5:
       00 E9 B6 7A A2 85 ED C7 34 08 36 98 17 FE 4E 26
       data hash MD5: 64K
       D6 7D 72 86 9E 21 34 65 C0 D9 95 97 86 67 7D 95>)
(   2,<2025-02-22 13:01:59.82 +0400>,<servis>,<DPX200>,
      <Start of raw data processing
       efp BC_mod = 2 LB = 1 FT_mod = 6 PKNL = 1 PHC0 = 383.807 PHC1 = 5.268371 SI = 32K 
       data hash MD5: 32K
       B0 40 74 B6 0E D3 55 C2 D1 68 0C 9C AF 46 9D D4>)
$$ ##END=
$$ 
$$ hash MD5
$$ CC 56 5D DE DE 9A D9 24 51 28 EF 5C 04 19 AD 4E
##$RELAX= 
##$RELAX= 
##$RELAX= 
##$RELAX= 
##$RELAX= 
##$RELAX= 
##$RELAX= 
$$ Bruker specific parameters
$$ --------------------------
##$DU= <F:\spectra>
##$EXPNO= 1
##$NAME= <C13DEPT135>
##$PROCNO= 1
##$TYPE= <nmr>
##$USER= <av>
##$AMP= (0..31)
100 100 100 100 100 100 100 100 100 100 100 100 100 100 100 100 100 100 
100 100 100 100 100 100 100 100 100 100 100 100 100 100 
##$AQSEQ= 0
##$AQ_mod= 1
##$AUNM= <au_zg>
##$AUTOPOS= <>
##$BF1= 50.322729
##$BF2= 200.13
##$BF3= 50.322729
##$BF4= 50.322729
##$BF5= 500.13
##$BF6= 500.13
##$BF7= 500.13
##$BF8= 500.13
##$BYTORDA= 1
##$CFDGTYP= 0
##$CFRGTYP= 5
##$CHEMSTR= <none>
##$CNST= (0..31)
1 1 145 1 1 1 1 1 1 1 1 1 1 1 1 1 1 1 1 1 1 1 1 1 1 1 1 1 1 1 1 1 
##$CPDPRG= <waltz16>
##$CPDPRG1= <>
##$CPDPRG2= <waltz16>
##$CPDPRG3= <>
##$CPDPRG4= <mlev>
##$CPDPRG5= <mlev>
##$CPDPRG6= <mlev>
##$CPDPRG7= <mlev>
##$CPDPRG8= <mlev>
##$CPDPRGB= <>
##$CPDPRGT= <>
##$D= (0..31)
0 2 0.003448276 0 0 0 0 0 0 0.06 0 0.03 2e-05 4e-06 0 0 0.0002 0 0 0 0 
0 0 0 0 0 0 0 0 0 0 0 
##$DATE= 1740214917
##$DBL= (0..7)
120 120 120 120 120 120 120 120 
##$DBP= (0..7)
150 150 150 150 150 150 150 150 
##$DBP07= 0
##$DBPNAM0= <>
##$DBPNAM1= <>
##$DBPNAM2= <>
##$DBPNAM3= <>
##$DBPNAM4= <>
##$DBPNAM5= <>
##$DBPNAM6= <>
##$DBPNAM7= <>
##$DBPOAL= (0..7)
0.5 0.5 0.5 0.5 0.5 0.5 0.5 0.5 
##$DBPOFFS= (0..7)
0 0 0 0 0 0 0 0 
##$DE= 6
##$DECBNUC= <off>
##$DECIM= 12
##$DECNUC= <off>
##$DECSTAT= 4
##$DIGMOD= 1
##$DIGTYP= 9
##$DL= (0..7)
$$ [...]
##$SUBNAM2= <"">
##$SUBNAM3= <"">
##$SUBNAM4= <"">
##$SUBNAM5= <"">
##$SUBNAM6= <"">
##$SUBNAM7= <"">
##$SUBNAM8= <"">
##$SUBNAM9= <"">
##$SW= 238.246396889851
##$SWIBOX= (0..15)
0 1 3 0 0 0 0 0 0 0 0 0 0 0 0 0 
##$SW_h= 11990.4076738609
##$TD= 65536
##$TD0= 1
##$TE= 0
##$TE2= 300
##$TE3= 300
##$TEG= 300
##$TL= (0..7)
0 120 120 120 120 120 120 120 
##$TP= (0..7)
150 150 150 150 150 150 150 150 
##$TP07= 0
##$TPNAME0= <>
##$TPNAME1= <>
##$TPNAME2= <>
##$TPNAME3= <>
##$TPNAME4= <>
##$TPNAME5= <>
##$TPNAME6= <>
##$TPNAME7= <>
##$TPOAL= (0..7)
0.5 0.5 0.5 0.5 0.5 0.5 0.5 0.5 
##$TPOFFS= (0..7)
0 0 0 0 0 0 0 0 
##$TUNHIN= 0
##$TUNHOUT= 0
##$TUNXOUT= 0
##$USERA1= <user>
##$USERA2= <user>
##$USERA3= <user>
##$USERA4= <user>
##$USERA5= <user>
##$V9= 5
##$VALIST= <valist>
##$VCLIST= <CCCCCCCCCCCCCCC>
##$VD= 0
##$VDLIST= <DDDDDDDDDDDDDDD>
##$VPLIST= <PPPPPPPPPPPPPPP>
##$VTLIST= <TTTTTTTTTTTTTTT>
##$WBST= 1024
##$WBSW= 4
##$XGAIN= (0..3)
0 0 0 0 
##$XL= 0
##$YL= 0
##$YMAX_a= 1915906
##$YMIN_a= -2348279
##$ZGOPTNS= <>
##$ZL1= 120
##$ZL2= 120
##$ZL3= 120
##$ZL4= 120
##$ABSF1= 0
##$ABSF2= 0
##$ABSG= 0
##$ABSL= 0
##$ALPHA= 0
##$AQORDER= 0
##$ASSFAC= 0
##$ASSFACI= 0
##$ASSFACX= 0
##$ASSWID= 0
##$AUNMP= <proc_1d>
##$AZFE= 0.1
##$AZFW= 0.5
##$BCFW= 0
##$BC_mod= 2
##$BYTORDP= 0
##$COROFFS= 0
##$CY= 12.5
##$DATMOD= 1
##$DC= 0
##$DFILT= <>
##$DTYPP= 0
##$F1P= 215.000008851289
##$F2P= -4.99998459219978
##$FCOR= 0.5
##$FTSIZE= 32768
##$FT_mod= 6
##$GAMMA= 0
##$GB= 0
##$INTBC= 1
##$INTSCL= 1
##$ISEN= 30
##$LB= 1
##$LEV0= 0
##$LPBIN= 0
##$MAXI= 10000
##$MC2= 0
##$MEAN= 0
##$ME_mod= 0
##$MI= 0
##$NCOEF= 0
##$NC_proc= -1
##$NLEV= 6
##$NOISF1= 0
##$NOISF2= 0
##$NSP= 0
##$NTH_PI= 0
##$NZP= 0
##$OFFSET= 219.1257
##$PC= 1.4
##$PHC0= 383.807
##$PHC1= 5.268371
##$PH_mod= 1
##$PKNL= yes
##$PPARMOD= 0
##$PSCAL= 4
##$PSIGN= 0
##$REVERSE= no
##$SF= 50.322729
##$SI= 32768
##$SIGF1= 0
##$SIGF2= 0
##$SINO= 80
##$SIOLD= 32768
##$SREGLST= <13C.CDCl3>
##$SSB= 0
##$STSI= 32768
##$STSR= 0
##$SW_p= 11990.4076738609
##$SYMM= 0
##$S_DEV= 0
##$TDeff= 65536
##$TDoff= 0
##$TI= <>
##$TILT= no
##$TM1= 0
##$TM2= 0
##$TOPLEV= 0
##$USERP1= <user>
##$USERP2= <user>
##$USERP3= <user>
##$USERP4= <user>
##$USERP5= <user>
##$WDW= 1
##$XDIM= 32768
##$YMAX_p= 272523282
##$YMIN_p= -292728154
$$ End of Bruker specific parameters
$$ ---------------------------------
##NTUPLES= NMR SPECTRUM
##VAR_NAME=  FREQUENCY,     SPECTRUM/REAL,   SPECTRUM/IMAG
##SYMBOL=    X,             R,               I
##VAR_TYPE=  INDEPENDENT,   DEPENDENT,       DEPENDENT
##VAR_FORM=  AFFN,          ASDF,            ASDF
##VAR_DIM=   32768,         32768,           32768
##UNITS=     HZ,            ARBITRARY UNITS, ARBITRARY UNITS
##FACTOR=    0.365929370215793, 1,           1
##FIRST=     11027.0033138647, 0,            0
##LAST=      -963.404359996184, 0,           0
##MIN=       -963.404359996184, -292728154,  0
##MAX=       11027.0033138647, 272523282,    0
$$ Real data points
##PAGE= N=1
##DATA TABLE= (X++(R..R)), XYDATA
$$ [...]
10463C758734j999541j923709o63371q93460l04371J055962J072887m77779j024035
10454a398683k22345N45537J699945J615851J675807K729117K1915k359301k507218
10445A800625K38725J882301o4169l652469q88007J950658J543292O78828M70107
10436C959891o00783j769147n23702Q47685j371261k769933P42393K185904q82658
10427a81611j112705J740320J059573n06358M47274O04792K689599k63723j196410
10418C280751L54612J761678q6307j145292k669237k372907K2596J144363J361780
10409A652037K14949k378315j393191J451520J069597p61255k508798l011640
10401e665096k911016J67933p22393r98237K582226K035968J587724n1641o85829
$$ plain form
10463 3758734 1759193 -164516 -827887 -1721347 -2025718 -969756 103131 -374648 -1398683
10454 -1398683 -1621028 -1075491 624454 2240305 3916112 6645229 6667144 4307843 1800625
10445 1800625 2039350 3921651 3857482 205013 -682994 1267664 2810956 3489784 3959891
10436 3959891 3359108 1589961 1066259 1913944 542683 -2227250 -1484857 701047 -181611
10427 -181611 -1294316 446004 1505577 999219 1446493 2051285 4740884 4477161 3280751
10418 3280751 3635363 5397041 5310734 4165442 1496205 -876702 -854106 290257 1652037
10409 1652037 1866986 -511329 -1904520 -453000 616597 -144658 -2653456 -5665096
10401 -5665096 -8576112 -8408179 -9130572 -10128809 -7546583 -5510615 -3922891 -3974532 -4660361
10392d660361R56351J56702j131064M31659L879276J616833p30053m48578J707611
10383A778376K84142j905194j295619Q10398p61689j112494m56491J904106K378970
10374A624505M80007m69571q29567l396214l219144k1653L887608L419424j1123
10365A464272j235370k635032l572821j415770p03411Q49206O75357q38155n66069
10356g977793K057113J496243L40106K435032J476840p90096j46701J010563R44978
10347H46285l4881q17439j236095q20046m23112O0149J586401L38807l96515l42752
10337a239198q7014q49887q19845j627431J246846L705957K12442l107601j764258
10328d329989Q52490L744460J644891k456486j692831p9223j201484m04607K038011
$$ plain form
10392 -4660361 -3704010 -3547308 -4678372 -4246713 -367437 1249396 519343 70765 1778376
10383 1778376 2062518 157324 -1138295 -327897 -1089586 -2202080 -2658571 -754465 1624505
10374 1624505 2104512 1634941 805374 -2590840 -5809984 -5831637 -1944029 1475395 1464272
10365 1464272 228902 -2406130 -5978951 -7394721 -8098132 -7248926 -6573569 -7411724 -7977793
10356 -7977793 -5920680 -4424437 -4084331 -1649299 -172459 -962555 -1109256 -98693 846285
10347 846285 811404 -6035 -1242130 -2062176 -2485288 -2425139 -838738 -499931 -896446 -1239198
10337 -1239198 -1326212 -2176099 -2995944 -4623375 -3376529 329428 541870 -2565731 -4329989
10328 -4329989 -3477499 266961 1911852 -544634 -2237465 -2316688 -3518172 -3922779 -1884768
10319a884768O57512N41024j116119n78977P70448K379406J096219l53704J190884
10310B701925J252172K39026j315253l109003r80864q25765N01939K234576J953400
10301B652153p78508j479671r67238j396172j465198l37744q49201j160788N22174
10292e260193J056843J458418k25846j638065K14750J922917J731001m77817j635933
10283b853925J211926P00518l77675j03325N13482J354549K37106L25467L78210
10274A386333k816402k205667L52706J532154K922758K231431j522452l012028
10266a131167k701330J095736Q31205J47075J398696J569201q15674r73096r14253
10257a493607l58509J287672j404248q95812K206352K263438J247691k97637j913211
$$ plain form
10319 -1884768 -1227256 -686232 -1802351 -2381328 -1610880 768526 1864745 1511041 2701925
10310 2701925 3954097 4193123 2877870 -231133 -1211997 -2037762 -1535823 698753 2652153
10301 2652153 1873645 393974 -573264 -1969436 -3434634 -3772378 -4621579 -5782367 -5260193
10292 -5260193 -4203350 -2744932 -2970778 -4608843 -4394093 -2471176 -740175 -1217992 -2853925
10283 -2853925 -1641999 -941481 -1319156 -1422481 -908999 445550 682656 1008123 1386333
10274 1386333 -1430069 -3635736 -3283030 -1750876 1171882 3403313 1880861 -1131167
10266 -1131167 -3832497 -2736761 -1905556 -1758481 -359785 1209416 393742 -579354 -1493607
10257 -1493607 -1852116 -564444 -1968692 -2864504 -658152 1605286 2852977 2555340 642129
10248F42129j911398K32956L48087J281513J713167N94846J058441m04926l30348
10239C224467k179917l049261k57854J375333j007796O06717K379764O29492p48260
10230I72685J497464P75173j444368j247485M07889K057960J921655N33029k337193
10221C136809k869481j823691M04607Q37865N09637N29017O9459R8863N5656l27558
10211F21183O89866Q71754J920970J173892P13716j87044j478519q40600p61061
10202B724157m34929j377945m76393K084405l67104j009351o15080N79173P6082
10193A183015k77730j54008o29398L61338P47023n09392o80505L57993o09768
10184b11432j6911j875715k169674J578638K984634O85165l77740P24952k13812
$$ plain form
10248 642129 -1269269 -1036313 -688226 593287 2306454 2901300 3959741 3554815 3224467
10239 3224467 1044550 -2004711 -2262565 -887232 -1895028 -1288311 1091453 1720945 972685
10230 972685 2470149 3245322 1800954 553469 961358 3019318 4940973 5474002 3136809
10221 3136809 267328 -1556363 -1151756 -313891 195746 724763 794222 893085 948741 621183
10211 621183 1311049 2182803 4103773 5277665 5991381 5804337 4325818 3485218 2724157
10202 2724157 2289228 911283 434890 2519295 2152191 1142840 527760 1106933 1183015
10193 1183015 905285 751277 121879 483217 1230240 720848 40343 398336 -211432
10184 -211432 -228343 -2104058 -4273732 -2695094 289540 974705 596965 1321917 1108105
10175A108105k490756k041235P38122L065757K324424j597060k983665K43108
10167a633200J832813K708122K331550J349129j440304j604763j952796l822701
10159b232150j793185q95938j79545J522839J200618K371381K348954J52829N81744
10150C077547N84342k233976k021462o08330k51650k36216l9854J967257J650416
10141A888074M06420o94414J023418p0616k452610r05221J671654j424494l137700
10132c695489O13926K803563K284456Q83047j028646j116871m54368o49758j010225
10123a370365j043584j713377r1458k2456J336493K335912j28437N77934L57747
10114B38409k453257q49726K006857Q39771k094816k00227J628576J857621K254320
$$ plain form
10175 1108105 -1382651 -3423886 -2685764 379993 2704417 1107357 -1876308 -1633200
10167 -1633200 199613 2907735 5239285 6588414 5148110 3543347 1590551 -2232150
10159 -2232150 -4025335 -4921273 -5100818 -3577979 -2377361 -5980 2342974 2495803 3077547
10150 3077547 3661889 1427913 -593549 -1201879 -1453529 -1689745 -1729599 237658 1888074
10141 1888074 2294494 1600080 2623498 2552882 100272 -804949 866705 -557789 -3695489
10132 -3695489 -3081563 -278000 2006456 2889503 1860857 743986 289618 -360140 -1370365
10123 -1370365 -2413949 -4127326 -4218784 -4241240 -2904747 -568835 -697272 -119338 238409
10114 238409 -2214848 -3064574 -1057717 -217946 -2312762 -2512989 -884413 973208 3227528
10105C227528k80463n66314L25639n4322j172308n28252N36100n98958Q30257
10096A718907M19470j489970q13445k66744n55222R47079J629974j9385k67789
10087A302875j429631j43451J23197k347698j854377Q49250L439859J251894j204475
10078a2557j173451j261996N88998J35102P01846J769191J179598j067766j712759
10069h53794j016906J061331J576901k96695j934518j074304j878871l34914J641988
10060c109782m5665m53708k14506J501020L821545K514037P39780P33752L163
10051E489636n54425j680162L40963J998269J281299M62868k927842k219789j362605
10042H28212k439911j294616K827132M335214J718564j203393m774138k661519
$$ plain form
10105 3227528 2947065 2380751 2706390 2652068 1479760 951508 1487608 888650 1718907
10096 1718907 2138377 648407 -165038 -431782 -987004 -39925 1590049 1570664 1302875
10087 1302875 -126756 -270207 -147010 -2494708 -4349085 -3499835 -59976 1191918 -12557
10078 -12557 -1186008 -2448004 -1859006 -1723904 -1022058 747133 1926731 858965 -853794
10069 -853794 -1870700 -809369 767532 470837 -1463681 -2537985 -4416856 -4751770 -3109782
10060 -3109782 -3155447 -3609155 -3823661 -2322641 1498904 4012941 4752721 5486473 5489636
10051 5489636 4935211 3255049 3596012 5594281 6875580 7338448 4410606 2190817 828212
10042 828212 -1611699 -2906315 -79183 4256031 5974595 4771202 -2936 -2664455
10034b664455q6479N31650l72621O79435J797411J271256Q94080N68792p60072
10025A858997J231124J687778Q31585M29863j740321k060618j569201K32928J326441
10016B228576Q44793J536689O36797p58434j652237j235820m91875j717885j007643
10007a617039k98200J443361M01418m43830n59832J041923O27254k968433q01875
9998c175253k02982j282948j91453P93600M20588M91871J615600Q68070j284386
9989a947293N727K10816J857550K272069J146542j485951j452315k216613l50328
9980a959796J613897O09592J126511L668704K038577k198272j856115l20951k268933
9971D53214j864961j439152k583361j218945R07788j36066l98144J919085J250330
$$ plain form
10034 -2664455 -2750934 -2219284 -2591905 -1912470 -115059 1156197 2050277 2619069 1858997
10025 1858997 3090121 4777899 5609484 6039347 4299026 2238408 669207 902135 2228576
10016 2228576 3073369 4610058 5246855 4488421 2836184 1600364 1108489 -609396 -1617039
10007 -1617039 -1915239 -471878 -70460 -514290 -1074122 -32199 595055 -2373378 -3175253
9998 -3175253 -3378235 -4661183 -4852636 -4059036 -3638448 -3146577 -1530977 -662907 -1947293
9989 -1947293 -1941566 -1730750 126800 2398869 3545411 2059460 607145 -1609468 -1959796
9980 -1959796 -345899 263693 1390204 5058908 7097485 4899213 3043098 2722147 453214
9971 453214 -1411747 -2850899 -5434260 -6653205 -5745417 -5881483 -6279627 -4360542 -3110212
9962c110212m86902q51143L18681o26787j068071M9190m00462J362507J355127
9953c458072j39264N67689L84643r43718o18632J184688M89816J29944R75866
9944a427040M30298P89652J114939J137108L808144K043807P7706r92795J99248
9935G181067J052548j790042l277132j598516R66808J563837L39875l088270j009412
9926C40763q0329j033094r50049j868671j509595j302388N49939K745640J615476
9917a492308N79358m13769j27838K109839K50601j027800Q16147O06426M56209
9908A756865Q99560k15607m48073j873999j208985j490325K36655k77351r27198
9899c548458J899962J166333J036627K971859L112109j560525j085566N14955
$$ plain form
9962 -3110212 -3597114 -4448257 -4129576 -4756363 -5824434 -5775244 -6175706 -4813199 -3458072
9953 -3458072 -3597336 -3029647 -2645004 -3588722 -4207354 -3022666 -2532850 -2402906 -1427040
9944 -1427040 -996742 -207090 907849 2044957 5853101 7896908 7974614 6981819 7181067
9935 7181067 8233615 6443573 3166441 1567925 2534733 4098570 4438445 1350175 340763
9926 340763 260434 -772660 -1722709 -3591380 -5100975 -6403363 -5853424 -3107784 -1492308
9917 -1492308 -912950 -1326719 -1454557 655282 905883 -121917 694230 1300656 1756865
9908 1756865 2656425 2440818 1992745 118746 -1090239 -2580564 -2343909 -2621260 -3548458
9899 -3548458 -1648496 -482163 554464 3526323 6638432 5077907 3992341 4507296
9891D507296r61874j352118j273462k557550k052115m39869M52596M14939K138294
9882a123863J366150J361767P94708J236103J330954j178026m81396j305885j637403
9873C63109j69060o32782r07953j892564L3016Q04220k82389k276745p3962k28658
9863e263768m52054J402141Q10760l65617J204017K264541M11672R78672J763037
9854B753401N14444M64289J579282J479771j158669l611823l618139k235560J842216
9845a990788J863029m78855q31347l67902J540181M18348L59300M82745N84166
9836A578877K083419j261364l834872k847907Q4759J810406J918564J741099O15211
9827A888192j773375l156461k783383k30253M66020J822773J382313o25034o8916
$$ plain form
9891 4507296 3545422 2193304 919842 -1637708 -3689823 -4129692 -3677096 -3262157 -1123863
9882 -1123863 242287 1604054 2398762 3634865 4965819 3787793 3306397 2000512 363109
9873 363109 194049 -438733 -1346686 -3239250 -3206234 -2402014 -2684403 -4961148 -5035110 -5263768
9863 -5263768 -5715822 -4313681 -3502921 -3868538 -2664521 -399980 11692 990364 2753401
9854 2753401 3267845 3732134 5311416 6791187 5632518 2020695 -1597444 -3833004 -1990788
9845 -1990788 -127759 -606614 -1437961 -1805863 -265682 152666 511966 994711 1578877
9836 1578877 3662296 2400932 -1433940 -4281847 -4197088 -2386682 -468118 1272981 1888192
9827 1888192 114817 -3041644 -5825027 -6055280 -5589260 -3766487 -2384174 -3009208 -3078124
9818c078124Q08749R03615j06632j073278P23362J929780L3704j304855j252134
9809b415813k78453J037019J875314N52413j14968m7143R85490N93538q00348
9800A387049j682286K040478P54963k227485L44072M60424j64172k381758p51175
9791b219890M81612Q62363J966896J879659k222978j479459J09162j156789j614996
9782c394420m04270m73050q4231O86788L331533M637328J109927M32704o20399
9773E221910j738861j619274k249919L92194J805238K647567J496640q59658j454797
9764C641040l604226l663449j647614Q30580M066116K950566R494l62618l8191
9755B181698q71218j116936j509715P51766J493732J302159Q62826J747150J214717
$$ plain form
9818 -3078124 -2269375 -1365760 -1472392 -2545670 -1822308 107472 141176 -1163679 -2415813
9809 -2415813 -2694266 -1657247 218067 770480 655512 608369 1593859 2187397 1387049
9800 1387049 -295237 1745241 2500204 272719 616791 1077215 913043 -1468715 -2219890
9791 -2219890 -1738278 -875915 1090981 2970640 747662 -731797 -622635 -1779424 -3394420
9782 -3394420 -3798690 -4271740 -4355971 -3669183 -337650 4299678 5409605 5842309 5221910
9773 5221910 3483049 1863775 -386144 6050 1811288 4458855 5955495 5095837 3641040
9764 3641040 36814 -3626635 -5274249 -4443669 -377553 2573013 2582507 2219889 2181698
9755 2181698 1310480 193544 -1316171 -564405 929327 2231486 3094312 4841462 6056179
9746F056179N50656J260590n02764l943832l839086j052327p28063k001520j324949
9737e525116J082345M15037q40657J85637J326818P29930k5481l69422l81622
9728c402531k410865J79968K273274J835688J031946L44397m1146J153538K145549
9719C109818O6255l958102k647885Q33566J192310q850j265872o04136J133916
9710b148980J455778Q0649j024259J38566L390561k66309m032301k770098J051750
9701d124643L018901L903740K618051o93638p40164j6868j369911k122939k850361
9692b377832q5896J213200Q47300l71111q96032K97742J363385R80708n57088
9683D14376J590436j81019j927910j75865N13930j059576R19992P88030j355389
$$ plain form
9746 6056179 6606835 7867425 7364661 3420829 -418257 -1470584 -2198647 -4200167 -5525116
9737 -5525116 -4442771 -4027734 -4868391 -4682754 -3355936 -2626006 -2651487 -3020909 -3402531
9728 -3402531 -5813396 -5633428 -3360154 -1524466 -492520 -148123 -189269 964269 3109818
9719 3109818 3176073 -782029 -3429914 -2596348 -1404038 -1412888 -2678760 -3282896 -2148980
9710 -2148980 -693202 -612553 -1636812 -1498246 1892315 1626006 -2406295 -5176393 -4124643
9701 -4124643 -1105742 2797998 5416049 4722411 3982247 3965379 2595468 472529 -2377832
9692 -2377832 -2463728 -1250528 -403228 -774339 -1670371 -1372629 -9244 971464 414376
9683 414376 2004812 1823793 -104117 -279982 233948 -825628 94364 882394 -472995
9674d72995l5022m75505j398869j70667k5491P17738L162258K887528l19182k42271
9664C627522Q99753N67134j426952k236770j375796K98300k87649j27916o06281
9655f68655k563731m8132r5413m87118J028021J427225J118319m63130O55349
9646i7265Q76835K58042L13004Q10600Q35878p65546j277185j775408j947119
9637b768164k90237K434770Q19646R87550j155040k918592j197882K514132J409243
9628a64574r83743j682414J252412J700686j814216M4635K971166K186630m01724
9619C108858K99245Q02985J885555J819586K648708K700704l19877l208539l850394
9610E886831k957383l270237k468972M50142R09413P26143J028221K00723j272650
$$ plain form
9674 -472995 -508017 -983522 -2382391 -2553058 -2578549 -1860811 1301447 4188975 3869793 3627522
9664 3627522 4527275 5094409 3667457 1430687 54891 353191 65542 -62374 -668655
9655 -668655 -3232386 -3280518 -3375931 -3863049 -2835028 -1407803 -289484 -752614 -97265
9646 -97265 779570 1037612 1350616 2161216 2997094 2231548 954363 -821045 -2768164
9637 -2768164 -3058401 -623631 196015 1183565 28525 -2890067 -4087949 -1573817 -164574
9628 -164574 -1148317 -2830731 -1578319 122367 -1691849 -1647214 1323952 3510582 3108858
9619 3108858 3408103 4211088 6096643 7916229 10564937 13265641 12945764 9737225 5886831
9610 5886831 2929448 -340789 -2809761 -2359619 -1450206 -724063 304158 504881 -767769
9601g67769o6332J865728N82522K096005k32909m226837j363472q78202j623395
9592d614661j419960J066336L796358M525665J590490j07859K08057p07882r69405
9583C367139k128517j100439r59910j492091j176013R81985J594929M35471n69130
9574a046576K94187N39604m84610q85479j09347M84406R79509K723225K400593
9565D895512K60676j905761k464381J39729J612624p56794n37770K364821J685453
9556E294109r05460p16348m80809r50418J55267l02554j051176k184221k395558
9547c537168k013733q99556O97633P00084j403590J10592J997714K621604J012091
9538g14329j374954j896308Q36840J367970J175262O62128P81039J46000N0036
$$ plain form
9601 -767769 -834101 1031627 1614149 3710154 3477245 -749592 -2113064 -2991266 -4614661
9592 -4614661 -6034621 -4968285 -1171927 3353738 4944228 4836369 5044426 4336544 3367139
9583 3367139 1238622 138183 -821727 -2313818 -3489831 -2507846 -912917 -477446 -1046576
9574 -1046576 -752389 -212785 -697395 -1582874 -1692221 -1207815 -228306 2494919 4895512
9565 4895512 5156188 3250427 786046 925775 2538399 1781605 1243835 3608656 5294109
9556 5294109 4388649 3672301 3191492 2241074 2396341 2093787 1042611 -1141610 -3537168
9547 -3537168 -5550901 -6450457 -5752824 -5052740 -6456330 -6345738 -4348024 -1726420 -714329
9538 -714329 -2089283 -3985591 -3148751 -1780781 -605519 56609 837648 983648 1033684
9529A033684l285549l103067o49647q40945k80977K998925J788084p3409N80509
9520a832392j30868m30369P07269M04780P78745R65939J30272L88008N80667J186490
9510B748541o97553j673365K25534N65297n26601j276563o499J89304J290582
9501H38677L084493M26375k449155k125188r80717j377325q55380J084193N79639
9492a774388k198539m934112q45210L487470J335684L65744N0867M21508K085700
9483b005276K308754J503988P13277r62218p4012L07081k661924j604650J066694
9474a408286Q83957j008961k320971R13912J914016p87913r15572J16680L61982
9465b251156P66797j010251j117151P76736R61734j34079J048135K941396n14876
$$ plain form
9529 1033684 -2251865 -5354932 -6004579 -6845524 -7126501 -4127576 -2339492 -2412901 -1832392
9520 -1832392 -1963260 -2393629 -1686360 -1281580 -502835 463104 593376 981384 1562051 2748541
9510 2748541 2050988 377623 603157 1168454 641853 -634710 -641209 -451905 838677
9501 838677 3923170 4349545 1900390 -224798 -1205515 -2582840 -3438220 -2354027 -1774388
9492 -1774388 -3972927 -8907039 -9752249 -6264779 -4929095 -4563351 -4512484 -4090976 -2005276
9483 -2005276 303478 1807466 2520743 1558525 1484513 1791594 -870330 -2474980 -1408286
9474 -1408286 -524329 -1533290 -3854261 -2940349 -1026333 -1814246 -2729818 -2613138 -2251156
9465 -2251156 -1484359 -2494610 -3611761 -2835025 -1873291 -2007370 -959235 1982161 1467285
9456A467285j996638L876o90848j356556p73174J6222l01820L34793R47995j07435
9446b456300j053122J367993K958410o27992k078946N03912O87349Q92327m83363
9437b89732p48930M75851R5310J243419M89270P30690k73213o61718L37339m74804
9427I23482j811392j995004J74943R74064p22433j030987j850513Q11234J290224
9418c236382P72176L75422n72620J112035J03131r91795J940958J39669l53620
9409g11026J070989J888698R33074k84600Q66030m86164k209239k77013K846932
9400C637681R97555j658898j301454m30454L7852J750957J113413L48404j327899
9391C167157l228898k183777m22141L45379p13596j523287P72692R95076n57990
$$ plain form
9456 1467285 -529353 -525477 -1216325 -2572881 -3346055 -3329833 -3631653 -3296860 -2348865 -2456300
9446 -2456300 -3509422 -2141429 816981 188989 -1889957 -1386045 -698696 193631 -289732
9437 -289732 -1038662 -562811 -467501 775918 1265188 1995878 1722665 1060947 1398286 923482
9427 923482 -887910 -2882914 -2707971 -1733907 -2456340 -3487327 -5337840 -4526606 -3236382
9418 -3236382 -2464206 -2088784 -2661404 -1549369 -1446238 -2438033 -497075 -357406 -711026
9409 -711026 359963 2248661 3181735 2897135 3763165 3277001 1067762 790749 3637681
9400 3637681 4635236 2976338 1674884 1244430 1282282 3033239 4146652 4495056 3167157
9391 3167157 -61741 -2245518 -2667659 -2322280 -3035876 -4559163 -3786471 -2791395 -3349385
9382c349385R52P8926l98400q81715J024252K346112m07352q07973J920671J510464
9372A036552Q12520J828528j363010l531320r15526O50291J056179J882625n69673
9363H87166M87892L078535K865117J407097j3040N52927R31815j165864k225232
9354F806413l951817k782604M55634K75497Q27742Q83852r14789j20107J202410
9345B682231J988955r77173k735688k403942m83106k25710j044852K09387K565023
9336d24875J357104Q30092J968968P98448j721295k106978k395951N62116L454793
9327B322422O34537m24090L5894K14442R32112J49563j031405k625402j788593
9318a580520j674606j413409M09362Q04819m0491K037406L501073J831977j484005
$$ plain form
9382 -3349385 -3348433 -3269507 -3667907 -4549622 -3525370 -1179258 -1586610 -2394583 -473912 1036552
9372 1036552 1849072 3677600 2314590 -1216730 -2132256 -1481965 -425786 1456839 887166
9363 887166 1375058 4453593 7318710 8725807 8712767 9265694 10197509 9031645 6806413
9354 6806413 2854596 71992 527626 803123 1630865 2514717 1599928 1479821 2682231
9345 2682231 4671186 3694013 958325 -1445617 -1928723 -2154433 -3199285 -2989898 -424875
9336 -424875 932229 1762321 3731289 4529737 2808442 701464 -1694487 -1132371 2322422
9327 2322422 2956959 2532869 2568763 2783205 3715317 3864880 2833475 208073 -1580520
9318 -1580520 -3255126 -4668535 -4259173 -3454354 -3494845 -1457439 2043634 3875611 2391606
9309B391606k528001q74119m41654n77519L87470l85636R19461K84458o21844
9300a445778J306825K161064R40386j354842J244709L18609m549414l091924J616849
9291b853516L031430J037798O20056n98094M18650K388438J5336k754595n893199
9282d587696m762271j77823K038209J931180J277416J429810O98122j275459o07724
9273d036236J889075J068155q88400N77527R89865o52836R841J080701P95201
9264H32893Q58908J461517p80362k013524k824395j794259r79209j77959J097296
9255d319094J613661K955246J754353N2209N36740J817143j28017o80643Q15683
9246D417281J942848r76335j148168N3674r94293q45789N55799J40219J06501
$$ plain form
9309 2391606 -136395 -1010514 -1452168 -2029687 -1642217 -2027853 -1108392 -823934 -1445778
9300 -1445778 -138953 2022111 2962497 1607655 2852364 3170973 -1378441 -4470365 -2853516
9291 -2853516 177914 1215712 1835768 1237674 1656324 4044762 4060098 1305503 -4587696
9282 -4587696 -9349967 -9527790 -7489581 -5558401 -4280985 -2851175 -2153053 -3428512 -4036236
9273 -4036236 -2147161 -1079006 -1967406 -1389879 -400014 -1052850 -1043009 37692 832893
9264 832893 1691801 3153318 2372956 359432 -2464963 -4259222 -5238431 -5416390 -4319094
9255 -4319094 -2705433 249813 2004166 2056375 2593115 4410258 4282241 3601598 4417281
9246 4417281 6360129 5383794 4235626 4289300 3295007 2449218 3005017 3145236 3251737
9237C251737k13105k555204k522338j432427O86476Q52162Q6572p85577k523613
9228e155317q12369J215506J746981j184327j291399j509794J263038Q0024l263887
9219h911544J197778K708173K676992R58819j373634J025638m69330J554112K748826
9210B115830O47018L1009J394133J593104j147498l621878k080726L33602j060250
9201a795656k587854k587089r59943J191576K472010J023437o69911r00703l82251
9192e196384q22556j118620Q08944K804729K521149J302291N22839P04060L79535
9183A905987K029484J830217k199050n47698q0106j083047l74325l69701j301802
9174a90041L05906R11784J63841l542633l307526J13839K025080L507645J635525
$$ plain form
9237 3251737 3038632 483428 -2038910 -3471337 -2784861 -1932699 -1846127 -2631704 -5155317
9228 -5155317 -5967686 -4752180 -3005199 -4189526 -5480925 -6990719 -5727681 -5647657 -8911544
9219 -8911544 -7713766 -5005593 -2328601 -1369782 -2743416 -1717778 -2187108 -632996 2115830
9210 2115830 2762848 2793857 4187990 5781094 4633596 1011718 -1069008 -735406 -1795656
9201 -1795656 -4383510 -6970599 -7930542 -6738966 -4266956 -3243519 -3913430 -4814133 -5196384
9192 -5196384 -6018940 -7137560 -6328616 -3523887 -1002738 299553 822392 1526452 1905987
9183 1905987 3935471 5765688 3566638 3018940 2938834 1855787 1481462 1111761 -190041
9174 -190041 115865 1027649 1191490 -2351143 -5658669 -5544830 -3519750 -12105 1623420
9165A623420K201383L15324k796828j552777p3622J094184k6353k71101M951639
9156E465269K182396l52714j567486r34781r78923k095795m72229P71589N75351
9147B592677K390639N49654l799380l543846k253003k416272O1879K332734K529460
9138a555458L856143J949069r22665Q48645L501209k36146l974935k066692O16653
9129B015823J775971P61820j422589j911130o1803m16914r84594j740420J05050
9120a878786K068481J733266M34557k50750k15375p0390K70406J318368N93167
9111D002944k16538j25465N03385J84063m44780j505637j011676K340221k42598
9102C483919k104580j433035p05998j451907p83151J397813O22093p37362m89860
$$ plain form
9165 1623420 3824803 4140127 1343299 -209478 -283100 811084 784731 513630 5465269
9156 5465269 7647665 7294951 5727465 4792684 3813761 1717966 1245737 2017326 2592677
9147 2592677 4983316 5532970 1733590 -1810256 -4063259 -6479531 -6417652 -4084918 -1555458
9138 -1555458 2300685 4249754 3327089 4175734 7676943 7440797 3465862 1399170 2015823
9129 2015823 3791794 4553614 3131025 1219895 1158092 741178 -243416 -1983836 -1878786
9120 -1878786 189695 1922961 2357518 2106768 1891393 1821003 2091409 3409777 4002944
9111 4002944 3786406 3660941 4164326 4348389 3903609 2397972 1386296 3726517 3483919
9102 3483919 1379339 -53696 -759694 -2211601 -2994752 -1596939 -974846 -1712208 -2202068
9093b202068k615826l620022n42695K623992K622424L66332L85813K906519J578955
9084A503424j00833j80032k416006l483600j671023P16924L653834P65406K03858
9075a008048K259435N97451j817338q83198j877518k429947n32562r6088K218148
9066c569665N143292J791038q97233j713753j333709j204768o6515L95745M23506
9057a032062P17872R25903n90099j476704R22494K702634j188806l770147j249468
9048d038383R61278J506274J185051p53389J209214L406977J840192j676654l441491
9039A99069k790397k129900N67899L328385J989671k461450k778728P83059q91520
9030d183912j113481J330876K060363J920330J554028J144680J712331J382116
$$ plain form
9093 -2202068 -4817894 -8437916 -8980611 -6356619 -3734195 -3367863 -2982050 -75531 1503424
9084 1503424 1402591 1222559 -1193447 -4677047 -6348070 -5631146 -1977312 -1211906 -1008048
9075 -1008048 1251387 1848838 31500 -851698 -2729216 -5159163 -5691725 -5787813 -3569665
9066 -3569665 1573627 3364665 2467432 753679 -580030 -1784798 -1851313 -1455568 -1032062
9057 -1032062 -314190 611713 21614 -1455090 -532596 2170038 981232 -2788915 -4038383
9048 -4038383 -3077105 -1570831 -385780 -1139169 70045 3477022 5317214 3640560 199069
9039 199069 -2591328 -4721228 -4153329 -824944 1164727 -1296723 -4075451 -3292392 -4183912
9030 -4183912 -5297393 -3966517 -1906154 14176 1568204 2712884 4425215 5807331
9022E807331m21901j584549p2890P4702p65649M66292J488163L74406J175019
9013F540924k7252j808935k720549j427707J496787P80691j22335j927929j532939
9004g49244o88430q1550l86767j069984l20220J063351J124782J186281M80590
8995E58809N28075J346888r21645k481213j457759l37386Q6917j037810p52514
8986d467638m16693J113787J493069q97491K102757M09110j533985J606365K515005
8977A924286m93397K74057k52179k131800j203239j668993k783312k321270j142113
8968i797960J113633L169734K598327L97773l390757j786294K400795Q36326m78397
8959d936820l88330L578356K645476M84198k22874n17058P67757J306513l76798
$$ plain form
9022 5807331 5385430 3800881 3727991 3802693 3037044 3503336 4991499 5365905 6540924
9013 6540924 6513672 4704737 1984188 556481 2053268 2833959 2711624 783695 -749244
9004 -749244 -1437674 -1519224 -1905991 -2975975 -3296195 -2232844 -1108062 78219 558809
8995 558809 1086884 2433772 1512127 -969086 -2426845 -2764231 -2677314 -3715124 -4467638
8986 -4467638 -4884331 -3770544 -2277475 -3174966 -1072209 -663099 -2197084 -590719 1924286
8977 1924286 1430889 1704946 1452767 -679033 -1882272 -3551265 -6334577 -8655847 -9797960
8968 -9797960 -8684327 -5514593 -2916266 -2518493 -5909250 -7695544 -5294749 -4458423 -4936820
8959 -4936820 -5325150 -1746794 898682 1382880 1160006 642948 1410705 2717218 2340420
8950B340420M91932J967176J80134k401875j895665n52164J415246K038392P69754
8941D353350R73032j547221l019502R9605K441558O38626j249012Q4670o65160
8932B109946J219843K554197K00412k241511l041774j478194j480374k048181
8924d205636j378015J645731M128714O74560k520363j226802j592115k287762
8916f761688M83377J755576J970212L80504P63682M40372Q69043L34096j413958
8907a178784L5519j53473j76853J15769J696306n3983O03927Q86190j505489j432561
8897a163432M63062J053265J222920p87009j935027j560631j984734M7293K318776
8888b325517Q92562O23847J58099J69620Q72959j53430p28257R7814J416937J859149
$$ plain form
8950 2340420 2832352 4799528 4979662 2577787 682122 129958 1545204 3583596 4353350
8941 4353350 5326382 3779161 759659 859264 3300822 3939448 2690436 2775106 2109946
8932 2109946 3329789 5883986 6084398 3842887 801113 -677081 -2157455 -4205636
8924 -4205636 -5583651 -3937920 190794 865354 -1655009 -2881811 -4473926 -6761688
8916 -6761688 -6278311 -4522735 -2552523 -2172019 -1408337 -967965 -98922 235174 -1178784
8907 -1178784 -1143265 -1296738 -1473591 -1357822 338484 284501 888428 1774618 269129 -1163432
8897 -1163432 -700370 352895 1575815 788806 -1146221 -2706852 -4691586 -4644293 -2325517
8888 -2325517 -1432955 -809108 -651009 -481389 391570 238140 -490117 -392303 1024634 2883783
8878B883783N92791n68356N59505J125617l29613k21900J8196l486404l778517
8869c204898Q5599L132828J243499P4461j030445M14473J821070J329399J50325
8860D016311j376415n52147o82042k888975j820974J659778K877218M38119j40005
8851A530868J250385J410916R98588k20198j382907j044058J32327N01951k873512
8842C04360l412755o74832l20986J531559Q20139J056959K224898M09306M34277
8833B372925J193316r1958j007482M30356K38762K90873l15236q53312j567208
8824F91036k900945j089705O49448J419343J716900K639799n34448j777737j189676
8815c75985m92547O51830K47874r1125Q9263J694403p48104r64684M17899n33280
$$ plain form
8878 2883783 3476574 2908218 3467723 4593340 4263727 4041827 4060023 573619 -3204898
8869 -3204898 -3119299 13529 1257028 1331489 301044 715517 2536587 3865986 4016311
8860 4016311 2639896 2087749 1405707 -1483268 -3304242 -1644464 1232754 1670873 1530868
8851 1530868 2781253 4192169 5190757 4970559 3587652 2543594 2675921 3177872 304360
8842 304360 -3108395 -3783227 -4104213 -2572654 -1752515 -695556 1529342 1938648 2372925
8833 2372925 3566241 3474283 2466801 2897157 3135919 3426792 3111556 2258244 691036
8824 691036 -2209909 -3299614 -2650166 -1230823 486077 3125876 2591428 813691 -375985
8815 -375985 -868532 -216702 31172 -59953 29310 1723713 975609 10925 428824 -104456
8805a04456J102527K443132K82523j839245k125146l92851J472558O14990J047938
8796B501970J431819m68789p05734j484094l512299j149269J632078L13219o23648
8787b064747j448535p67846N70314K962874K69724n06032J948264L18494k370426
8778a087916k599592j64041L756943M103268k48461k447695r77672k647002k145327
8769d457495M72509J703092N3504K056471J626660J684823J684396M62092N83817
8760E869869j53480j750476k444980j025370J256584q02068j793001j149515O36782
8751a355655J731798R61217l59546l99247j173456m7901n99921j54224P89050
8742f07885J346855P73723k58266J251659J757441K28244j445124N68628j430733
$$ plain form
8805 -104456 998071 3441203 3723726 1884481 -240665 -633516 839042 1454032 2501970
8796 2501970 3933789 3465000 2759266 1275172 -2237127 -3386396 -1754318 -1441099 -2064747
8787 -2064747 -3513282 -4281128 -3710814 -747940 -478216 -984248 964016 1282510 -1087916
8778 -1087916 -3687508 -3851549 -94606 4008662 3760201 1312506 334834 -2312168 -4457495
8769 -4457495 -3984986 -2281894 -2228390 -171919 1454741 3139564 4823960 5286052 5869869
8760 5869869 5716389 3965913 1520933 495563 1752147 950079 -842922 -1992437 -1355655
8751 -1355655 376143 1337360 977814 578567 -594889 -642790 -1242711 -1396935 -607885
8742 -607885 738970 1512693 1254427 2506086 4263527 4491771 3046647 3615275 2184542
8733B184542k324451P54978K363494J443537j470433k358342l051879j039548
8725c498102K989988K722374l89916j631172j206801l97077k90780j989804j564802
8716e256092r20299N37546J355794K496933K688340R47002r5702J090686l78546
8707B465662j447442m36135r16866j54940J269241j53946q36976k71663K96071
8698a86994J945376Q95085k08152J20174P20335J086j932163l306789j981711
8689c933753K208836K498355j656066l470456j765140K299933K199313n67030
8681b186008l270668j170817J171208J244382m80103l41731M33273J999918J852182
8672g48364J484402K474226R01962P04011M16610k596470k416047p73011R89998
$$ plain form
8733 2184542 -139909 615069 2978563 4422100 2951667 593325 -2458554 -3498102
8725 -3498102 -508114 2214260 1824344 193172 -1013629 -1410706 -1701486 -3691290 -5256092
8716 -5256092 -6176391 -5638845 -4283051 -1786118 902222 1849224 1753522 2844208 2465662
8707 2465662 1018220 582085 -334781 -489721 779520 625574 -211402 -483065 -186994
8698 -186994 1758382 2653467 2445315 2565489 3285824 3286910 1354747 -1952042 -3933753
8689 -3933753 -1724917 773438 -882628 -4353084 -6118224 -3818291 -1618978 -2186008
8681 -2186008 -5456676 -6627493 -5456285 -4211903 -4692006 -5033737 -4600464 -2600546 -748364
8672 -748364 736038 3210264 4112226 4816237 5232847 2636377 220330 -552681 437317
8663D37317k01224j216317L99696J078301J415158j902545j832254L1312j268365
8654c058921p47994J599868J416937j586657k788680k022864L62822O72982j325756
8645g478263j507214j287518k09499J288178J461852J0723L1051P77822N93441
8636f319427m39155l20424K160667M655746J562397L87837r51312j765686l016633
8627d045990l340919n98053q06533Q17833K216066j72217k125363q27364J973069
8618f909471K480587j008558o6275J298975K054602J521818J538401P91646j457634
8609B44091r88784p37399j965960q9735o22576k072399j95351L26010O56631m8177
8599e493649Q20176J405696Q43219k78301j151756j197676o55184j064826P2347
$$ plain form
8663 437317 236093 -980224 -580528 497773 1912931 10386 -1821868 -1790556 -3058921
8654 -3058921 -3806915 -2207047 -790110 -2376767 -5165447 -7188311 -6825489 -6152507 -7478263
8645 -7478263 -8985477 -10272995 -10482494 -9194316 -7732464 -7721741 -7690690 -6912868 -6319427
8636 -6319427 -6758582 -7079006 -4918339 -262593 1299804 1687641 736329 -1029357 -4045990
8627 -4045990 -7386909 -7984962 -8791495 -7973662 -5757596 -5929813 -8055176 -8882540 -6909471
8618 -6909471 -4428884 -5437442 -5503717 -4204742 -2150140 -628322 910079 1701725 244091
8609 244091 -744693 -1482092 -3448052 -3537787 -4160363 -6232762 -6428113 -6102103 -5445472 -5493649
8599 -5493649 -4673473 -3267777 -2424558 -2702859 -3854615 -5052291 -5707475 -6772301 -6699954
8590f699954p81864k926124j376992j725197j86908M403892K175313O40935O06055
8581e870844m38475P72240J222638O2532Q70498o12017m355289j833826N08974
8572i673569m30933j020978j611922q12651K151281O89640M80896P31333J791354
8563g705549P23629n68791R66699P5486q37713q46795n93241J545060J271747
8554e969468j29683l063862l030015q40962j465367j450392k744391l913951j069698
8545b3677789j44445j23433o50741J54425K822072j858349k966131l26722O81738
8536b6089375r67353j710790k716529l926652l362060j241266m025932n699688
8528d9739645m574479n144972o047310m475033n059550p042914o135217p129393
$$ plain form
8590 -6699954 -7481818 -10407942 -11784934 -13510131 -13697039 -9293147 -7117834 -6476899 -5870844
8581 -5870844 -6309319 -5537079 -4314441 -4251909 -3381411 -3993428 -8348717 -10182543 -9673569
8572 -9673569 -10104502 -11125480 -12737402 -13550053 -11398772 -10709132 -10228236 -9496903 -7705549
8563 -7705549 -6981920 -7550711 -6584012 -6508526 -7346239 -8193034 -8786275 -7241215 -5969468
8554 -5969468 -6099151 -9163013 -12193028 -13033990 -14499357 -15949749 -18694140 -22608091 -23677789
8545 -23677789 -23822234 -23945667 -24596408 -24441983 -21619911 -23478260 -26444391 -26771113 -26089375
8536 -26089375 -27056728 -28767518 -31484047 -35410699 -38772759 -40014025 -44039957 -49739645
8528 -49739645 -54314124 -59459096 -65506406 -69981439 -75040989 -82083903 -88219120 -95348513
8520i5348513o707780p071077p248380l721862o50211J946458L388888M302264
8512a11110213N721457R549968R367298P338429P549365P926625O861674M426545
8504e2368852M055062L950457O292561N647220L254259K616927K456027R05435
8496b3190904J261666L022526K743509J305746K277787J648780k005147j402670
8488a4338707J848257L262700j46651j345582r74020J924978M120522K254097
8480c394406m22343n49126R99374j03337j195643p62003K519631K216768j115789
8471a806874k190215k033667j063604K15688L841584K420172n64528Q4642l24443
8462a421245p56117O57811J609376q54575k857760k008616k474603j67213J156976
$$ plain form
8520 -95348513 -102056293 -109127370 -116375750 -120097612 -120747823 -118801365 -115412477 -111110213
8512 -111110213 -105388756 -95838788 -86471490 -79133061 -71583696 -63657071 -56795397 -52368852
8504 -52368852 -48313790 -44363333 -38070772 -32423552 -29169293 -26552366 -24096339 -23190904
8496 -23190904 -21929238 -18906712 -16163203 -14857457 -12579670 -10930890 -12936037 -14338707
8488 -14338707 -12490450 -9227750 -9374401 -10719983 -11694003 -9769025 -5648503 -3394406
8480 -3394406 -3816749 -4365875 -3366501 -3469838 -4665481 -5427484 -2907853 -691085 -1806874
8471 -1806874 -3997089 -6030756 -7094360 -6878672 -3037088 -616916 -1181444 -1096802 -1421245
8462 -1421245 -2177362 -1519551 89825 -764750 -3622510 -5631126 -8105729 -8272942 -7115966
8453g115966k189160l815426P36340L383098K656434J527570K105041J934289
8445g77780K472250J257755P99469j719574j834976o29539j172363n87939J221960
8436i70737K23482m91247J609095K073610K54484j13500L22628J48107Q675j425485
8426A639112k011852j335092l19892l80633r69020M55287J191811p8903r84488
8417b793670J370160J022407J19295q97207p42303R66904N34080P25397Q09506
8408A114569L75970J234829m88663k247227o38417J186846J643263L60773J171748
8399C713691Q94431k293117l138291j885396r7609L13503n55044k033796K227301
8390b854327L180377M33144n51356j719570l033359O85392K166668J33446n72947
$$ plain form
8453 -7115966 -9305126 -13120552 -12384212 -9001114 -6344680 -4817110 -2712069 -777780
8445 -777780 1694470 2952225 3751694 2032120 197144 -432395 -1604758 -2192697 -970737
8436 -970737 -747255 -1238502 370593 2444203 2698687 2585187 2907815 3055922 3064597 1639112
8426 1639112 -372740 -1707832 -2027724 -2408357 -3377377 -2922090 -1730279 -1809182 -2793670
8417 -2793670 -1423510 -401103 -281808 -1179015 -1921318 -954414 -420334 305063 1114569
8408 1114569 1490539 2725368 2236705 -10522 -648939 537907 2181170 2541943 3713691
8399 3713691 4608122 2315005 -823286 -2708682 -2806291 -2492788 -3047832 -5081628 -2854327
8390 -2854327 326050 759194 207838 -1511732 -4545091 -3859699 -1693031 -1559585 -2132532
8381b132532j48115M19756J841081L039277J382143m224442m188349N69810J120840
8372b320531K072177Q20215q24196j241600o14059j2137K546826J731358J229988
8363C388041M07612P61011j320853k577415k905995k206419J368179J020587j9439
8354b084691l16097J057555j346336j199377K043356K971231J174583k154664
8346A45560j40638R92524m57649j139171Q79947J635858n22936j684408m60312
8337g51225m31359Q73471O98711J30167j190415M39356R99453m60985j54888m42598
8327b90312l5736j094649o37330Q00331J518602J05894J119440J472651J510857
8318D469748k144350l545551k088904J1399k501191k489508J833590L718541K195225
$$ plain form
8381 -2132532 -2280647 -1860891 -19810 3019467 4401610 177168 -4011181 -3441371 -2320531
8372 -2320531 -248354 571861 -252335 -1493935 -2107994 -2120131 426695 2158053 3388041
8363 3388041 3795653 4556664 3235811 658396 -2247599 -4454018 -3085839 -2065252 -2084691
8354 -2084691 -2400788 -1343233 -2689569 -3888946 -1845590 1125641 2300224 145560
8346 145560 4922 997446 539797 -599374 280573 1916431 1393495 -290913 -751225
8337 -751225 -1182584 -309113 389598 519765 -670650 -231294 768159 307174 152286 -290312
8327 -290312 -326048 -1420697 -2058027 -1257696 260906 366800 1486240 2958891 4469748
8318 4469748 2325398 -1220153 -3309057 -3297658 -5798849 -8288357 -6454767 -2736226 -541001
8309e41001J643912Q13480K135532L00015j609673j435157j227336r00773o19613
8300a440614K99656J662653n21842j220410K211923J455264J409379L18163O05921
8291D780093r76103l124170l158429R69024K434788k85276j068620j788885r49996
8282c167574k4853K325602K718479J690967K859632K108387p83420k233973j789396
8273C703851o16862J569928L318128n85367j685829M21843n61799j138607j357782
8264C067504j159486m3469R77879N43843j1598l93585j238613J282596K887348
8255E912419J965264j127207o20590L33216l03806R24306M656522Q7390k694637
8246I132877k267662m030917l526731o17419O37363L8968m17576n41211M72336
$$ plain form
8309 -541001 1102911 1916391 4051923 4351938 2742265 1307108 79772 -821001 -1440614
8300 -1440614 -1140958 521695 -147 -1220557 991366 2446630 3856009 4174172 4780093
8291 4780093 3803990 679820 -2478609 -1509585 925203 639927 -428693 -2217578 -3167574
8282 -3167574 -3192427 -866825 1851654 3542621 6402253 8510640 7727220 5493247 3703851
8273 3703851 3086989 4656917 7975045 7389678 5703849 6125692 5563893 4425286 3067504
8264 3067504 1908018 1864549 2842428 3386271 3374673 2981088 1742475 3025071 5912419
8255 5912419 7877683 6750476 6129886 6463102 6159296 7083602 11740124 11827514 9132877
8246 9132877 6865215 2834298 -692433 -1309852 -672489 -633521 -1051097 -1592308 -1119972
8237a119972m887J26992L28281N67773O96090J28707o26259n02873J708784L022686
8227D325322K712955O55465M67734L78184O94270l65111L92031K064747J767372
8218A3092969K395404L349138o12164k140976j401886m057124m168340m84495
8210E972526J17405j182211k191337q14791J313062O30187j939071k770784m04914
8201a269928Q7718q88671l1956K274302L341282K970559J784385J263384J77539
8192I708614j721317l969307j213421Q15320j63473n58829p69606j02674O56141
8183B681448M17001J241955N93598n21451j848440q13728J923258O521m736922
8174a056760k462423J354336L863547K906315K691340K541082K846708L522059
$$ plain form
8237 -1119972 -1124859 -997867 -669586 -101813 594277 722984 96725 -406148 1302636 4325322
8227 4325322 7038277 7693742 8161476 8539660 9233930 8868819 9260850 11325597 13092969
8218 13092969 15488373 18837511 18225347 16084371 14682485 10625361 6457021 5972526
8210 5972526 6089931 4907720 2716383 1901592 3214654 3844841 1905770 -865014 -1269928
8201 -1269928 -1182210 -2070881 -2102837 171465 3512747 6483306 8267691 9531075 9708614
8192 9708614 7987297 4017990 2804569 3619889 3456416 2897587 2127981 2025307 2681448
8183 2681448 3098449 4340404 4934002 4412551 2564111 1750383 3673641 3680162 -1056760
8174 -1056760 -3519183 -2164847 1698700 4605015 7296355 9837437 12684145 16206204
8166A6206204Q99233j473642q61349O7348L38723M41315K22913r84623M24849
8157A5280971k324162k572000k638508l750595j569921J80454O70254r70220j433879
8148H72394m40430K7265n78190r7953J68450J343845k57792j201783P4940q96941
8138i86195K79045j76209j340992L28932J253837O97900P34550J30372j927043
8129a005803k302835O64674J674101N91442r95734o38218q15620j264795O66299
8120c426489J840587K30914P62286R67508K596521J225394K56253k27193J542435
8111E768216K098818J133133q02218j200710K353248L959672p08082j294117j745482
8102I562478k660959j7975K971695L018112J333971R82028k588314l094737J03438
$$ plain form
8166 16206204 17105437 15631795 14770446 14837794 15176517 15617832 15840745 14856122 15280971
8157 15280971 12956809 10384809 7746301 3995706 2425785 2606239 3276493 2306273 872394
8148 872394 431964 459229 -118961 -216914 -48464 1295381 1037589 -164194 -89254 -986195
8138 -986195 -707150 -883359 -2224351 -1895419 -641582 56318 790868 921240 -1005803
8129 -1005803 -3308638 -2643964 -969863 -378421 -1374155 -2012373 -2827993 -4092788 -3426489
8120 -3426489 -1585902 -1354988 -592702 374806 2971327 4196721 4452974 4225781 5768216
8111 5768216 7867034 9000167 8197949 6997239 9350487 13310159 12602077 11307960 9562478
8102 9562478 6901519 6883544 9855239 12873351 14207322 15189350 12601036 9506299 9609737
8093I609737J387884o5687m164187m409624j068273M51370j252773j03149M51018
8084H36316j513204j753631k550834j190496J073430K342781M29997J08733Q21748
8075a395160p35745J041938N57216j023593J308014J505624q25534q78507j184108
8066a629855o744J445238M567095M196444j366656m120419l285138k98283o39660
8057a137978q81468j08933q48965o03917q37266k38903J686898K344692P97121
8048A71281J453543P68406n32518J241830J428992m30547k735097k901494P42134
8039g93470P63686N33879Q0205m01817q46137j726216j129124j543214j099309
8030f161517O56999J178936r03180l68234j782601k404749j545020m69451J293688
$$ plain form
8093 9609737 10997621 10931934 6767747 2358123 1289850 1741220 488447 385298 836316
8084 836316 -676888 -2430519 -4981353 -6171849 -5098419 -2755638 -2325641 -2216908 -1395160
8075 -1395160 -2130905 -1088967 -531751 -1555344 -247330 1258294 432760 -445747 -1629855
8066 -1629855 -1636599 -191361 4375734 8572178 7205522 3085103 -200035 -498318 -1137978
8057 -1137978 -2019446 -2128379 -2977344 -3581261 -4418527 -4657430 -2970532 -625840 171281
8048 171281 1624824 2393230 1860712 3102542 4531534 4100987 1365890 -1535604 -793470
8039 -793470 -29784 504095 584300 182483 -663654 -2389870 -3518994 -5062208 -6161517
8030 -6161517 -5504518 -4325582 -5228762 -5596996 -7379597 -9784346 -11329366 -11798817 -10505129
8021a0505129n5187n82401o56913j816201R37513K813351N18919n91494K02667
8012i734875j27336o17270K48974j545059k450354k001460j917441l049n93984
8003a8741854j529546k56183k217507j76927K202459j98024j123775j549907k068358
7994b5659622m617876m326747m762190m768516n942945p727400n184857m086123
7986f7076276p204218r156693p984588q252799o777720o562228o538062m972806
7978a24525390j819170P47360L345666M107573L979311O333620R119187R287655
7970h9424188P591397N013458O974539N816090N598819Q179102O717879M963913
7962c8568991M276757J124783K242830K900766J799834Q68964J853442L061362
$$ plain form
8021 -10505129 -10560316 -11142717 -11799630 -13615831 -12678318 -9864967 -9346048 -9937542 -9734875
8012 -9734875 -9862211 -10479481 -10230507 -11775566 -14225920 -16227380 -18144821 -18147870 -18741854
8003 -18741854 -20271400 -20527583 -22745090 -22922017 -20719558 -20917582 -22041357 -23591264 -25659622
7994 -25659622 -30277498 -34604245 -39366435 -44134951 -50077896 -57805296 -62990153 -67076276
7986 -67076276 -74280494 -83437187 -91421775 -99674574 -106452294 -113014522 -119552584 -124525390
7978 -124525390 -126344560 -125597200 -122251534 -118143961 -114164650 -107831030 -98711843 -89424188
7970 -89424188 -81832791 -76819333 -69844794 -64028704 -58429885 -50250783 -43532904 -38568991
7962 -38568991 -34292234 -33167451 -30924621 -28023855 -26224021 -25355057 -23501615 -20440253
7954b0440253K828947J256442N31215M04088J966929J110519J666928K484869
7946h190316K81358r49684L48851m41733m57275n07244j032984j026939J148516
7937a0827450J158529R14580J578674K071479j907295k927059j168218R19981
7929a0186779O54417O13464J680880R22990P57369J992802J79240j943465j95593
7920e524675K047661J113171k026658j712631q99449J19540j751352j5319J684919
7911f964793P29748J76592l91422R0972J528159J121203j714652j505993j907971
7902h838157N8216J092348p1558j644418j479729J408126J946595r39281k279117
7893a0746975n00818L28507J361057n7225q72596o32379K159169K538302M612
$$ plain form
7954 -20440253 -17611306 -16354864 -15823649 -15419561 -13452632 -12342113 -10675185 -8190316
7946 -8190316 -7908958 -8858642 -8509791 -8951524 -9408799 -9916043 -10949027 -11975966 -10827450
7937 -10827450 -9668921 -8754341 -7175667 -5104188 -7011483 -9938542 -11106760 -10186779
7929 -10186779 -9532362 -8918898 -7238018 -6315028 -5557659 -3564857 -3385617 -5329082 -5524675
7920 -5524675 -3477014 -2363843 -4390501 -6103132 -7002581 -6883041 -8634393 -8649712 -6964793
7911 -6964793 -6235045 -6058453 -6449875 -6358903 -4830744 -3709541 -5424193 -6930186 -8838157
7902 -8838157 -8779941 -7687593 -7759151 -9403569 -10883298 -9475172 -7528577 -8467858 -10746975
7893 -10746975 -11247793 -10919286 -9558229 -9615454 -10488050 -11120429 -8961260 -6422958 -6418346
7884f418346r88315N53081L81054k666259m872331k130600R18924K122887J813149
7875a1286756m04455L31450K957549P22168j016302J196958P99166J161204p38342
7866f277360k078105j638889j808350l27327j023154j713066k495655l581192
7858b0943098o06694j120489r96040m02216o36024J621851K157991j006948j486514
7849b3418181j532456j413954r61630j077651n50714j247933j341784P25446J44461
7840c0674396j548673k648986k306356j835927j060471j440702j698517K38661
7832d2975367j157536m791483n593113m633442m432679m090009m120561m157442
7824g5951632m311741o023099p867313r533377j0356111j2490972j3779579j3724597
$$ plain form
7884 -6418346 -7406661 -6853580 -6472526 -9138785 -14011116 -16141716 -15222792 -13099905 -11286756
7875 -11286756 -11691211 -11359761 -8402212 -7680044 -8696346 -7499388 -6700222 -5539018 -6277360
7866 -6277360 -8355465 -9994354 -11802704 -12130031 -13153185 -14866251 -17361906 -20943098
7858 -20943098 -21549792 -22670281 -23666321 -24068537 -24704561 -23082710 -20924719 -21931667 -23418181
7849 -23418181 -24950637 -26364591 -27326221 -28403872 -28954586 -30202519 -31544303 -30818857 -30674396
7840 -30674396 -32223069 -34872055 -37178411 -39014338 -40074809 -41515511 -43214028 -42975367
7832 -42975367 -44132903 -48924386 -54517499 -59150941 -63583620 -67673629 -71794190 -75951632
7824 -75951632 -80263373 -86286472 -94153785 -103687162 -114043273 -126534245 -140313824 -154038421
7816a54038421j3356555j7009898j8466803j9523582j7570999j4985545j4708130
7809b69659933j2825874p348678k893669N65298O478544J1260589J2900124J4978646
7801b46544953J6206965J8349161K1065559K0559829J5964289J3508893J3103058
7794a27787199J1351800J0315461J1601245J2977647R629335Q092265O895236
7787e6924210M100385L245216K553620J520154K360945O680167P296669J828329
7779b7338725O95586L311112L258840J411381Q03628J506936J004562J310303
7771a4036377k85832j268162j49170K154769J457531p01775M08981J216120J667352
7762i536563J722939K118498J852154J089817J05945Q35253P36087r99356j966374
$$ plain form
7816 -154038421 -167394976 -184404874 -202871677 -222395259 -239966258 -254951803 -269659933
7809 -269659933 -282485807 -289834485 -292728154 -292162856 -285684312 -274423723 -261523599 -246544953
7801 -246544953 -230337988 -211988827 -190923268 -170363439 -154399150 -140890257 -127787199
7794 -127787199 -116435399 -106119938 -94518693 -81541046 -71911711 -63819446 -56924210
7787 -56924210 -52823825 -49578609 -47024989 -45504835 -43143890 -36463723 -29167054 -27338725
7779 -27338725 -26643139 -23332027 -20073187 -18661806 -17858178 -16351242 -15346680 -14036377
7771 -14036377 -14322209 -15590371 -15739541 -13584772 -12127241 -12829016 -12420035 -11203915 -9536563
7762 -9536563 -7813624 -5695126 -3842972 -2753155 -2647210 -1811957 -1075870 -2075226 -4041600
7753d041600k019272k446954K0909J550840J823815J706526K189517J290018L20518
7744C94317J31021l31147J217127K004641j339478j321708J0754j263713j532734
7735b030920j812578l19440K758719L005722j52477j290807k641829k303962j097962
7726e885534J169738J256167P79021K059223J611734J512239J284051m74676J6462
7717C328425n0335M87177J489750O24206n42497k333947p88881m0265j309035
7708H64598j625302R79671J206395P87931k97921j993283j709179Q62641J770896
7699H46447J201452O25258J028843l82090o11349m51213j912255j606404o65885
7690a927196M06J13468j85437n69361j679532p35912N07894J507291J960688R87228
$$ plain form
7753 -4041600 -6060872 -8507826 -8486917 -6936077 -5112262 -3405736 -1216219 73799 394317
7744 394317 525338 194191 1411318 3415959 2076481 754773 765527 -498186 -2030920
7735 -2030920 -3843498 -4162938 -1404219 1601503 1449026 158219 -2483610 -4787572 -5885534
7726 -5885534 -4715796 -3459629 -2680608 -621385 990349 2502588 3786639 3311963 3328425
7717 3328425 3278090 3765267 5255017 5879223 5336726 3002779 2213898 2173633 864598
7708 864598 -760704 218967 1425362 2213293 1915372 -77911 -1787090 -924449 846447
7699 846447 2047899 2673157 3702000 3319910 2708561 2257348 345093 -1261311 -1927196
7690 -1927196 -1926790 -1813322 -1998759 -2568120 -4247652 -4983564 -4475670 -2968379 -1007691 -20463
7680b0463J474476Q01240j291867o41871P63815q37937j252490O10307R98283
7671F03493q2110j59363J301909j151094k02111O54971q06337j564705P96749
7662f08598n63291k447474n27828Q4292M56802K785850J775558o95435k953882
7653b694006j275963M43976p17797Q48340K086577J54192o03287N3651J859485
7644A55168K281456K5174N88447Q99464N98455Q76199j527709l056138k625986
7635a785470k080594k002405j769677O36962J556176J474577J176751K424354
7627c69326J245805j09866j83114j089351j296566N85017K168229J455325k092106
7618C14047j583915R0552o61286r23433q62576o17507q3789K085151J457071J48637
$$ plain form
7680 -20463 1454013 2255253 963386 321515 1085330 247393 -1005097 -394790 603493
7671 603493 521383 362020 1663929 512835 310724 965695 159358 -1405347 -608598
7662 -608598 -1171889 -3619363 -4147191 -4062899 -3606097 -820247 955311 259876 -2694006
7653 -2694006 -3969969 -3525993 -4243790 -3395450 -1308873 -1154681 -1757968 -1704317 155168
7644 155168 2436624 2461798 3050245 3949709 4548164 5424363 3896654 840516 -1785470
7635 -1785470 -3866064 -5868469 -7638146 -7001184 -5445008 -3970431 -2793680 -369326
7627 -369326 876479 766613 583499 -505852 -1802418 -1217401 950828 2406153 314047
7618 314047 -1269868 -1179316 -1840602 -2764035 -3626611 -4244118 -4327907 -2242756 -785685 -637048
7608f37048J322459p87695l49487p32497k007619k299529Q86619J894292R47969
7599a762536j818331l239806L76584L741809p73392k039281j923849n01581R72187
7590f968196m02449P0424J763877j505722m59617L0920l134801k904691L16293
7581a3193962J865190P88705l18316j415697o69030k437987j580586K438974K446808
7572a2075901K290616j378516m120787p73937l65607k444343l470828k056568
7564b4395871q58935j528327j596739k667906j621344n98986k243528m005717
7556c9517353m702506k019772k427355k912896k008105k557105j929331j811229
7548e9885652n404336r261981q877167r400220j2833513j3393109j1321790j3654835
$$ plain form
7608 -637048 685411 -102284 -451771 -1184268 -3191887 -5491416 -4604797 -2710505 -1762536
7599 -1762536 -3580867 -6820673 -6444089 -2702280 -3475672 -5514953 -7438802 -7940383 -6968196
7590 -6968196 -7370645 -7300221 -5536344 -7042066 -7501683 -7470763 -10605564 -13510255 -13193962
7581 -13193962 -11328772 -10540067 -10858383 -12274080 -12943110 -15381097 -16961683 -14522709 -12075901
7572 -12075901 -9785285 -11163801 -15284588 -16058525 -16424132 -18868475 -22339303 -24395871
7564 -24395871 -25254806 -26783133 -28379872 -31047778 -32669122 -33268108 -35511636 -39517353
7556 -39517353 -44219859 -46239631 -48666986 -51579882 -53587987 -56145092 -58074423 -59885652
7548 -59885652 -65289988 -74551969 -83429136 -92829356 -105662869 -119055978 -130377768 -144032603
7540a44032603j4748820j4929858j9421915k1194917j9829887j7916534j5172047
7533b67246581j0849329p621684n039201J071062O794194R217561J1988917J6559149
7525b45125912J9695129J9167151J8041874J7509603J8278803J6576315J2432891
7518a23424146J1640536J0494011R818427R865265P690649O921832P410591N686280
7510e3896555M514216N512765N183930K819986K810413O83109P96734J174511
7502c0400891K358921J566355J894573J078805P07119J057078O38446l6443J129867
7493b0006170K290319J556506K165198L16929K36918K529504J953661P3951k028733
7484a0911917j360581o95422J704691O65570p66098o42373J523609R78783k859498
$$ plain form
7540 -144032603 -158781423 -173711281 -193133196 -214328113 -234158000 -252074534 -267246581
7533 -267246581 -278095910 -285717594 -290756795 -289685733 -282891539 -273673978 -261685061 -245125912
7525 -245125912 -225430783 -206263632 -188221758 -170712155 -152433352 -135857037 -123424146
7518 -123424146 -111783610 -101289599 -91471172 -81605907 -73915258 -66993426 -59582835 -53896555
7510 -53896555 -49382339 -43869574 -38685644 -35865658 -33055245 -32372136 -31575402 -30400891
7502 -30400891 -28041970 -26475615 -24581042 -23502237 -22795118 -21738040 -21099594 -21136037 -20006170
7493 -20006170 -17715851 -16159345 -13994147 -13677218 -13440300 -10910796 -8957135 -8883184 -10911917
7484 -10911917 -12272498 -12967920 -11263229 -10597659 -11363757 -12006130 -10482521 -9503738 -12363236
7475a2363236k86500N93144k373683j17972K252278J712447J040051L44735j25300
7466i324036J713833J864848K721444K629985o77006j64271Q41396R5246j724067
7457b022628k606365j214969J62144K959541J535730k30623j965743k591385n75085
7448f549383J140969K117390J242157j146075k151720J012668K120300K69400
7440a944294N82551N50436q12565j283926j81298J57788K664411J622615Q74425
7431B230143J893611r25312k279873k587743j663659k9750o21165J052407J020849
7422a910492l70102j101776l57870R25951K144699K749665J722841j180094j357740
7413A265082O0938j087704n13363L005328K371499O72446k43563j009268j881249
$$ plain form
7475 -12363236 -12649736 -12056592 -14430275 -14548247 -12295969 -10583522 -9543471 -9198736 -9324036
7466 -9324036 -7610203 -5745355 -3023911 -393926 -1070932 -1235203 -393807 -298561 -2022628
7457 -2022628 -4628993 -5843962 -5681818 -2722277 -1186547 -1417170 -3382913 -5974298 -6549383
7448 -6549383 -5408414 -3291024 -2048867 -3194942 -5346662 -4333994 -2213694 -1944294
7440 -1944294 -1361743 -811307 -1623872 -2907798 -3089096 -2931308 -266897 1355718 2230143
7431 2230143 4123754 3198442 918569 -1669174 -3332833 -3362583 -3983748 -2931341 -1910492
7422 -1910492 -2280594 -3382370 -3740240 -2814289 -669590 2080075 3802916 2622822 1265082
7413 1265082 1326020 238316 -275047 2730281 5101780 5774226 5530663 4521395 2640146
7404B640146j639085j203755j004678K70035K913070J557723l368502n164342
7396d999388j207885K240342L540848K718332o88567k309550r80993J264889J91435
7387b30537k939439k578759K58266J236485J520060J01963j212030J395507K341430
7378a07054J673840l06786L24695J490104j194201l93554N67420N98494r19467
7369A733491q92810r67071q3870p89837r08613J385814K472440K170846j782340
7360B338050k945703k102154j962268J121685K522456P83489j267192o35744O40180
7351a507201p3889n31858P37193o0112k148621k72647J014753K485624J93300
7342a63458J391935K032381J144005j118014j141918m9194n9196j610396m023101
$$ plain form
7404 2640146 1001061 -202694 -1207372 -937337 1975733 3533456 164954 -4999388
7396 -4999388 -6207273 -3966931 -426083 2292249 1603682 -705868 -1686861 -421972 -230537
7387 -230537 -3169976 -5748735 -5490469 -4253984 -2733924 -2631961 -3843991 -2448484 -107054
7378 -107054 1566786 1260000 1584695 3074799 1880598 1487044 2054464 2652958 1733491
7369 1733491 840681 -126390 -210260 -1000097 -1908710 -522896 1949544 4120390 2338050
7360 2338050 -607653 -2709807 -4672075 -3550390 -1027934 -244445 -1511637 -2147381 -1507201
7351 -1507201 -1581090 -2112948 -1375755 -1435867 -3584488 -3857135 -2842382 -356758 -163458
7342 -163458 1228477 3260858 4404863 3286849 2144931 2095737 2036541 426145 -3596956
7333c596956k247275J838335J727019J82879K188553L111712Q71751O37477M61676
7324E175171R1353N0489Q87226k232653m233974k067127R41048K474059J701330
7315B786922J430771l73142r49891j688958n48656J321003J578026l3230j00834
7306C422011J089566q19054m86713k74259p91056j728258J127154L619252j2256
7297E146387m75858L49755R3843J365252N65235p97696J17535P32860j242301
7288E855012k70450j75575J348101Q96659P28623p6921q50145K277136J338723
7279A1071163n49497j288898j407212k953896j977779j27381j68612M76505j136532
7270A937861j282742p11619m90586K77481O76422K858423K141054q64951k977868
$$ plain form
7333 -3596956 -5844231 -4005896 -2278877 -2095998 92555 3204267 4076018 4713495 5175171
7324 5175171 5266524 5317013 6204239 3971586 -262388 -2329515 -1388467 1085592 2786922
7315 2786922 4217693 3844551 2894660 1205702 657046 1978049 3556075 3522845 3422011
7306 3422011 4511577 3692523 3205810 2931551 2140495 412237 1539391 5158643 5146387
7297 5146387 4670529 5020284 5114127 6479379 7044614 6246918 6364453 7097313 5855012
7288 5855012 5584562 5408987 6757088 7653747 8382370 8305449 7455304 9732440 11071163
7279 11071163 10521666 9232768 7825556 4871660 2893881 2766500 2597888 3074393 1937861
7270 1937861 655119 -56500 -547086 -269605 406817 3265240 5406294 4541343 1563475
7261A563475k220427K348103J670821j88156O04026N62704m40583K07845j40080
7252C967728n91267j04532J491770J950741j205977k445451J199832J153282j349265
7243D066861J79748j059879j960693j812837k477566J71436L604893N349476J791403
7234G852842l99286O54913o39686j564151k674871j135337K14365P12370K05312
7225C226471j700364q05376m47868j989743k264596j201362N96770K124610J651396
7216h10062r753Q86339J847188K065023J52722k041816k491101j258011J599465
7207f0006J392163p75532M50510J289307K7332j841351k993107k077102n94505
7198e182291J724350K952243J094278J305004K66708m9517j121485o00379O37197
$$ plain form
7261 1563475 -656952 1691151 3361972 3173816 3777842 4340546 3899963 4107808 3967728
7252 3967728 3376461 3271929 4763699 6714440 5508463 3063012 4262844 5416126 4066861
7243 4066861 4246609 3186730 1226037 -586800 -3064366 -2892930 711963 6061439 7852842
7234 7852842 7453556 8108469 7468783 5904632 3229761 2094424 2308789 3021159 3226471
7225 3226471 1526107 720731 272863 -1716880 -3981476 -5182838 -4586068 -2461458 -810062
7216 -810062 -819815 66524 1913712 3978735 4131457 2089641 -401460 -1659471 -60006
7207 -60006 1332157 556625 1007135 2296442 2323774 482423 -2510684 -4587786 -5182291
7198 -5182291 -3457941 -505698 588580 1893584 2160292 2110775 989290 388911 1026108
7189A026108N83922J480328P77293J562215j076497k983904K2629J986878J028541
7180D407513J9486k23142l31650k401819k588301J27101J391802L53032p35573
7171A8449q17456j390468q39916O64541J365797n83585l76747J296969O14780
7162d7636J060545n65293p95689p75875o11155O5834K355719J857192j023914
7153A519728j943874J367998K759942N39126j169505L76305J949648m70566l030641
7144A898161j950027n66807n57143J066831J791012K034515M04780j188953r28789
7135B003580j240289P56682Q27514J312158L74684q77364j614477j241304m69275
7126a68091J65681K08470p6919L73358K024808J119999m21818j212770r22603
$$ plain form
7189 1026108 1610030 3090358 3867651 5429866 4353369 1369465 1392094 3378972 4407513
7180 4407513 4426999 4203857 3872207 1470388 -1117913 -990812 400990 754022 18449
7171 18449 -799007 -2189475 -3029391 -2364850 -999053 -1582638 -1959385 -662416 -47636
7162 -47636 1012909 447616 -348073 -1123948 -1735103 -1669269 686450 2543642 1519728
7153 1519728 -424146 943852 3703794 4242920 3073415 3449720 5399368 4928802 1898161
7144 1898161 -51866 -618673 -1175816 -108985 1682027 3716542 4121322 2932369 2003580
7135 2003580 763291 1519973 2347487 3659645 4034329 3156965 1542488 301184 -168091
7126 -168091 -2410 206060 129141 502499 2527307 3647306 3225488 2012718 1090115
7117A090115j162883M59362K349017J750810J43371l219325r75787j65758j48246
7108A20676j78327J357036J310703n85821l801979k120053J109229L174405K250345
7099B636214j141154j417704K378590J972142J081940j152750p26522m19101J303322
7090D514977j300476j592651p44397J428514K219657K59758k931785j874270J665474
7081A644801K267364O22537j623880k027968j112136p47375l28816j177185m42598
7072b925256J174944J288677K015534M42848o96550j149577j076390j240872j259678
7063c426320L34099n96030M66003L861270J123870j603737j350850k9240R93621
7054b27314l94870J398153K001346r20130m82184o30278L0765J564729J043803
$$ plain form
7117 1090115 -72768 386594 2735611 4486421 4629792 1410467 434680 268922 120676
7108 120676 -57651 1299385 2610088 2024267 -1777712 -3897765 -2788536 385869 2636214
7099 2636214 1495060 77356 2455946 4428088 5510028 4357278 3630756 3211655 4514977
7090 4514977 3214501 1621850 877453 2305967 4525624 4785382 1853597 -20673 1644801
7081 1644801 3912165 4534702 2910822 882854 -229282 -976657 -1305473 -2482658 -2925256
7072 -2925256 -1750312 -461635 1553899 1996747 1300197 150620 -925770 -2166642 -3426320
7063 -3426320 -3092221 -3688251 -3222248 639022 1762892 159155 -1191695 -1220935 -227314
7054 -227314 -622184 775969 2777315 1857185 1375001 744723 775488 2340217 3384020
7045C384020j047425M79944O74179L72304p81418j502905j025142l76510j607951
7036a430904k058594L23471O32422J798052P52809L01371J649332J796142J910000
7027E674101M18949N79774q09672r03834p79719k596779j987936j991448j193310
7018c589874O51601K233354K256574n06903j847024N322K32501j977841m38758
7009b981048O65213J540655J248870J977131J203145J356565J582866O33296n98649
7000F628044J99987j35506n38189k206160j480939l32675m11999k51401k582696
6991a111534l174718n15690O52146J057886J912468j6242o05356j617787j371317
6982d790144M66830K004963J53909j413590M23991R75236r54446N23899J144539
$$ plain form
7045 3384020 2336595 2816539 3490718 3863022 3081604 1578699 553557 177047 -1430904
7036 -1430904 -3489498 -3166027 -2533605 -735553 17256 318627 1967959 3764101 5674101
7027 5674101 6093050 6672824 5863152 4959318 4179599 1582820 -405116 -2396564 -3589874
7018 -3589874 -2938273 -704919 1551655 1044752 -802272 -796950 -564449 -2542290 -2981048
7009 -2981048 -2315835 -775180 473690 2450821 3653966 5010531 6593397 7226693 6628044
7000 6628044 6828031 6692525 6154336 3948176 2467237 2134562 1722563 1471162 -1111534
6991 -1111534 -4286252 -4801942 -4149796 -3091910 -1179442 -1195684 -1801040 -3418827 -4790144
6982 -4790144 -4323314 -2318351 -2164442 -3578032 -3154041 -2178805 -3133251 -2609352 -1464813
6973a464813J469809J142215Q61957Q77070Q16962K824551P22409N46743Q20017
6964H616920m55674J14480j59590l51538k342098k779034k640462j485791j717924
6955c200711j598513q1111J390084J345713R47350q54954M18580K4433j338578
6946b947707J387236J582264J588490J832472J099935J290037M21373q73662o06275
6937D774163o12064j208506r66691O66724l546Q03520J391767M181228M611930
6928A3638525K66469j309115J404967K417647K178062L571428M345314K267169
6920B8780466j611944k630906l193168l323240m583223l039484O0692K039890
6912A2499083r34794o121201k961882k88171M6722j74508j535252k364767J59903
$$ plain form
6973 -1464813 4996 1147211 2009168 2886238 3703200 6527751 7250160 7796903 8616920
6964 8616920 8161246 8275726 8116136 7764598 5422500 2643466 3004 -1482787 -3200711
6955 -3200711 -4799224 -4880335 -3490251 -2144538 -1197188 -2052142 -1633562 -1609129 -2947707
6946 -2947707 -1560471 21793 1610283 3442755 4542690 5832727 6254100 5380438 4774163
6937 4774163 4162099 2953593 1986902 2653626 2650080 3453600 4845367 9026595 13638525
6928 13638525 13904994 12595879 14000846 16418493 18596555 22167983 26513297 28780466
6920 28780466 27168522 24537616 21344448 18021208 13437985 10398501 10459193 12499083
6912 12499083 11564289 5443088 2481206 2193035 2239757 2065249 529997 -1834770 -1674867
6903a674867K254740q6789o44007P91128M227321L955240n37144j90201P52601
6894H848022j264862j260042l494498m936211j106171K058618L12696K72731K5793
6885e43924j18994R04918J686561J041365m91206j261206r56377o61416l21930
6876g22209J836198q80323n24957M25399r47129o44184j23490N26762J482514
6867D28581o14440j172964K142023N38742m86707l29337K840113M231200O27952
6858H205163j130189r85984k170750k244193N62862N94935k243347k698302K40900
6849a868905J800346J178836r16391o17230r53364k374577j781025N83491J997051
6840b951768L357782J685396k232328j680991J953614J904175o04326M58910J19012
$$ plain form
6903 -1674867 579873 493084 -150923 640205 4867526 8822766 8285622 8095421 8848022
6894 8848022 7583160 6323118 2828620 -2107591 -3213762 -1155144 -842448 -569717 -543924
6885 -543924 -662918 242000 1928561 2969926 2478720 1217514 261137 -400279 -722209
6876 -722209 1113989 233666 -291291 134108 -813021 -1457205 -1580695 -1053933 428581
6867 428581 -185859 -1358823 783200 1321942 835235 505898 3346011 7577211 8205163
6858 8205163 7074974 6088990 3918240 1674047 2236909 2831844 588497 -2109805 -1868905
6849 -1868905 -68559 1110277 193886 -423344 -1376708 -3751285 -5532310 -4948819 -2951768
6840 -2951768 406014 2091410 -140918 -1821909 131705 2035880 1431554 1890464 2009476
6831B009476j544104K477454N457785J215752k323922k680650j624049j769846
6823A217896l78287p89190R02418J75715n59893q92605j675312j12019R65718
6814a145559J691360P83601m02985j379995J665924L726361o65374j025380K755593
6805F003546P79289k475321j502884l63538l34533M31645J85829r51168j20713
6796A652152K296530J633455J164655K96988j19649j069366l74238q86333P0775
6787D664969N4310q38596j83008m59844j943030j637428m61626J87007K505723
6778A888477J307105j037739J215702K076532Q94638k85949j033561r78708j49452
6769C897045r11476q68471o39711J544088Q47105k99847K257946J701476j636426
$$ plain form
6831 2009476 465372 2942826 8400611 9616363 7292441 4611791 2987742 1217896
6823 1217896 839609 50419 952837 1128552 568659 -323946 -1999258 -2111277 -1145559
6814 -1145559 545801 1329402 926417 -453578 1212346 4938707 4273333 3247953 6003546
6805 6003546 6782835 4307514 2804630 2441092 2106559 2538204 2724033 1772865 1652152
6796 1652152 3948682 5582137 6746792 7043780 6924131 5854765 5480527 4594194 4664969
6787 4664969 4719279 3880683 3697675 3237831 1294801 -342627 -804253 -617246 1888477
6778 1888477 3195582 2157843 3373545 5450077 6344715 6058766 5025205 4046497 3897045
6769 3897045 2985569 2117098 1477387 3021475 3868580 3568733 5826679 7528155 5891729
6760E891729j821518m22737J49312P33822M21959j050967j902286L44173l16470
6751B027017l9502L64776j159219K80999P91595m7398J042971J502850j239018
6742C525071j620151j21757K133692K401227L124531o060l438407k03617J443945
6733G238474j008167j777685j519424K22586j3495k79902Q04760q41027n05854
6724B320266O65892l59821o46067q85692k9363J470557N7561j947205k218743
6715a572615q28810J148545K815497L433064J948456J098206p79761L16711J602469
6706I181762J10890k48057N64452j051940j663727l241603N83511K747011q79326
6697F102973k48136O84979o86128k302837j836694m72295M4805P82213K281069
$$ plain form
6760 5891729 4070211 3647474 3796786 4530608 4952567 3901600 1999314 2343487 2027017
6751 2027017 1987515 2352291 1193072 1474071 2265666 2218268 3261239 4764089 3525071
6742 3525071 1904920 1783163 3916855 6318082 9442613 9436553 5998146 5794529 7238474
6733 7238474 6230307 4452622 2933198 3155784 3142289 2862387 3667147 2826120 2320266
6724 2320266 2986158 2626337 1980270 1094578 1065215 2535772 2593333 646128 -1572615
6715 -1572615 -2401425 -1252880 1562617 4995681 6944137 8042343 7262582 7579293 9181762
6706 9181762 9292652 9044595 9609047 8557107 6893380 3651777 4235288 6982299 6102973
6697 6102973 5854837 6539816 5853688 3550851 1714157 1241862 1286667 2068880 4349949
6688D349949K068278j099449j002931j55162O90416J667563J187525J947300K095294
6679A1748783q18740j307952j428574l079645j825146J318802J133063p41611
6671D998980j591736l9976O94187L28005o3893J391132J41729K89138N32248P77680
6661G457494K337607j369629P2279P60956M58316J037189Q50259J734493O78811
6652A4017775j034489k107638j068732Q54637j3877n95213k43657L42341J582843
6643A1733990J829554J991461K561358K465376O34288l077457l320669k46766
6635A4571135J332132N14610Q60672J907433J191830K088757L064461R09748j361235
6626B5079543J62489J866981J875630N615866O309534K338627K361743K503511
$$ plain form
6688 4349949 6418227 5318778 4315847 4160685 4851101 6518664 7706189 9653489 11748783
6679 11748783 10930043 9622091 8193517 5113872 3288726 4607528 5740591 4998980
6671 4998980 3407244 3367268 4061455 4389460 4325567 5716699 5858428 6147566 6679814 7457494
6661 7457494 9795101 8425472 8497751 9258707 9717023 10754212 11604471 13338964 14017775
6652 14017775 12983286 10875648 9806916 10661553 10647676 10052463 9808806 10151147 11733990
6643 11733990 13563544 15555005 18116363 20581739 21216027 18138570 14817901 14571135
6635 14571135 15903267 16417877 17278549 19185982 20377812 22466569 25531030 26440778 25079543
6626 25079543 25242032 27109013 28984643 34600509 40910043 43248670 45610413 48113924
6618D8113924L566340O303505O899420O284322Q840438J0974265J1970949J2355013
6610A15308176J4162464J6943213J7816716J9109030K0458540J9685412J9926417
6603B43409968J6975344R166223K971747o92545q246176j4633405j9374707k0045044
6595B09531405j8467947j9177885j8616635j5795664j3991971j1394890j0955331
6588A01131082j2437979j1208029r717213p917656n205835m875286l781286n272970
6580D0714828n160967l134429j178658l617362l617480j708175r73534q31054
6572B0493169k059813k801762j739624j431365K471002K669745m88689k097142
6564A5015521k372345j300772M93448o5702N45669m98231j262897N81836Q21812
$$ plain form
6618 48113924 51680264 57983769 64883189 71167511 80007949 90982214 102953163 115308176
6610 115308176 129470640 146413853 164230569 183339599 203798139 223483551 243409968
6603 243409968 260385312 269551535 272523282 271830737 263584561 248951156 229576449 209531405
6595 209531405 191063458 171885573 153268938 137473274 123481303 112086413 101131082
6588 101131082 88693103 77485074 67767861 59850205 54644370 49769084 45987798 40714828
6580 40714828 35553861 32419432 31240774 27623412 24005932 22297757 21324223 20493169
6572 20493169 18433356 15631594 13891970 12460605 14931607 17601352 17112663 15015521
6564 15015521 12643176 11342404 11835852 11770150 12315819 11817588 10554691 11136527 11958339
6555A1958339j381282q46433j968455j830100K63081n32751j376430J190033J269291
6546F745293J122597P98178n34114j472616o94146r87605l77458j060504k68504
6537C271121K087679j005188k639958M4531n95973k31260J003441R19728K593915
6528E448036K666552j157765j083742j070423j433856j84159J224356J246502
6520E655501N58751j074206j798611k011233j396768j698551j575924o19293j8010
6511c978344J624688L562348J888421J756900K473372o58585k614791j577396
6503B476613j355146R59170J158910j536425k737631Q7368K321944K110470L43094
6494C828367j271456N40076K195947M09513k732965k072386J854864J038987j657214
$$ plain form
6555 11958339 10577057 9730624 7762169 5932069 6195150 5662399 4285969 5476002 6745293
6546 6745293 7867890 8666068 8131954 6659338 5965192 4977587 4600129 3539625 3271121
6537 3271121 5358800 4353612 1713654 1758185 1162212 930952 1934393 2854121 5448036
6528 5448036 8114588 6956823 5873081 4802658 3368802 3184643 4408999 5655501
6520 5655501 6214252 5140046 3341435 1330202 -66566 -1765117 -3341041 -3960334 -3978344
6511 -3978344 -2353656 1208692 3097113 4854013 7327385 6668800 4054009 2476613
6503 2476613 1121467 2080637 3239547 1703122 -1034509 -947141 1374803 3485273 3828367
6494 3828367 2556911 3096987 5292934 5702447 2969482 897096 2751960 3790947 2133733
6485B133733l328289k08905K222755k81864k936666j814071J459077J406655J478764
6476A31189O38996j593344k733633j655741K778872K403075O86722j592315k77790
6467a213969O18116J734477J229405J15185J720396K106420J085354k77963k504850
6458D612571j749941j051663J049797m75116k79391J920306j350580k405944n67003
6449b96964m24658l96216j748336R991Q8722j482147J009692K643404J389291
6440G92779l30404k993208k400203J20454K224307P02758j311008n5094J616473
6431a633146K915186J467733p6520j444771q87457j362701J133706K384293j233337
6422A262986j010439o1533O25751n54470j597945j163744j272678j370896J145645
$$ plain form
6485 2133733 -1194556 -1403461 819294 537430 -2399236 -4213307 -2754230 -1347575 131189
6476 131189 770185 -823159 -3556792 -5212533 -2433661 -30586 656136 -936179 -1213969
6467 -1213969 -595853 1138624 2368029 2483214 4203610 6310030 7395384 7117421 4612571
6458 4612571 2862630 1810967 2860764 2385648 2106257 4026563 2675983 270039 -296964
6449 -296964 -721622 -1117838 -2866174 -2856183 -2767461 -4249608 -3239916 -596512 792779
6440 792779 462375 -2530833 -4931036 -4810582 -2586275 -1883517 -3194525 -3249619 -1633146
6431 -1633146 1282040 2749773 2673253 1228482 341025 -1021676 112030 2496323 1262986
6422 1262986 252547 191014 816765 262295 -1335650 -2499394 -3772072 -5142968 -3997323
6413c997323J757915M59839J255069J444167j745120j265483J207711J892511
6405A009286j398363r06927R18871J108967R96944O99064N26319j077103r00145
6396I76913j568861K18471M09696Q46972l45626L13588J284190L68123o80092
6387A823374j633317R75020P90174n31902R61370j300071k847103k244932J476513
6378b530874K852338O46472j535063R7636K002239N79055J300805J246884P17218
6369E376710L58480k814422j184289R18630J042233q463j179875o3381j008643
6360A436980k651252j989039J100841o70532j09738O73364P16218J198794N55197
6351B60833j226990J130413L507821n96243k108166r10911R69008L100783J748126
$$ plain form
6413 -3997323 -2239408 -1779569 -524500 919667 -825453 -2090936 -883225 1009286
6405 1009286 -389077 -1296004 -377133 731834 1728778 2427842 2954161 1877058 976913
6396 976913 -591948 -373477 36219 883191 537565 851153 2135343 2503466 1823374
6387 1823374 190057 1165077 1955251 1423349 2384719 1084648 -1762455 -4007387 -2530874
6378 -2530874 321464 967936 -567127 -469491 1532748 2111803 3412608 4659492 5376710
6369 5376710 5735190 2920768 1736479 2655109 3697342 3688879 2509004 2445623 1436980
6360 1436980 -1214272 -3203311 -2102470 -2773002 -2882740 -2209376 -1493158 -294364 260833
6351 260833 -966157 164256 3672077 3075834 967668 56757 1025765 4126548 5874674
6342E874674n85146k008036k001603j0243J257546J305364J245316j603475l564906
6333i0509L42615K551989J175038k85239K30460K141512Q71056p30387j024889
6324E181646j544008p6770J127424p65927l84493J46921o95522k76192J325317
6315D038396R07138k572510k025435n18865p83931q96361j412588q01295K270655
6306a794796P38415j369879n97396K611500K849896o35274j840517J29358J826930
6297A918237O50186j966523k053544O78537L52252k903624k08754K536087J029200
6288C2054m54280P86291M92508J564989J142089p26516j708389k360109j4936
6279a246299J717546K281142K262190k14493j887550n81684k106206j345468n01082
$$ plain form
6342 5874674 5289528 3281492 1279889 1269646 2527192 3832556 5077872 3474397 -90509
6333 -90509 252106 2804095 3979133 3693894 3924354 6065866 6936922 6206535 5181646
6324 5181646 3637638 3560868 4688292 3922365 3537872 3684793 2989271 2713079 4038396
6315 4038396 4945534 2373024 347589 -171276 -955207 -1851568 -3264156 -4065451 -1794796
6306 -1794796 -1056381 -2426260 -3023656 -412156 2437740 1802466 -38051 91307 1918237
6297 1918237 2568423 601900 -1451644 -773107 -420855 -3324479 -3533233 -997146 32054
6288 32054 -422226 364065 856573 2421562 3563651 2837135 1128746 -1231363 -1246299
6279 -1246299 471247 2752389 5014579 4800086 2912536 2330852 224646 -1120822 -1621904
6270a621904j665394j946483n08733J242521P11041N41958K243055K294735J245104
6261B535900J202219J27559P14980N29911q08086k169687q08858J516005n12228
6252B327715j298255j497861J20488Q72238k54290J14212J493698R57343j209978
6243A625310j899216n28417k62697n6436N68093r20412j492447L11615j392500
6234d047107k394481j037075L1943J271147p74151j384587R51918J195660n68140
6225f754873R20965K908013K138756K924036K833067l64854l861510l363521J675114
6216i44807K417264K36400o26617J106252j179745j016765k26844j932479k092177
6207d259518M94911R28497O34602L70342P48198l508R00831J746624Q7667j029739
$$ plain form
6270 -1621904 -3287298 -5233781 -5742514 -4499993 -3788952 -3246994 -1003939 1290796 2535900
6261 2535900 3738119 3865678 4580658 5110569 4302483 2132796 1323938 2839943 2327715
6252 2327715 1029460 -468401 -347913 524325 270035 384247 1877945 2835288 1625310
6243 1625310 -273906 -802323 -1065020 -1121456 -553363 -1473775 -2966222 -2654607 -4047107
6234 -4047107 -6441588 -7478663 -7446720 -6175573 -6949724 -8334311 -7382393 -6186733 -6754873
6225 -6754873 -5833908 -2925895 -787139 2136897 4969964 4605110 743600 -2619921 -944807
6216 -944807 1472457 1708857 1082240 2188492 1008747 -8018 -234862 -2167341 -4259518
6207 -4259518 -3764607 -2836110 -2201508 -1831166 -1082968 -1086476 -185645 1560979 1648646 618907
6197F18907N58002r6259L21110R81566nr57973j401976j725437j107932j63355
6187b973352N05847J376260K582562J452910l91690o54189l43164M81051j227974
6178H08261k888156L20027K325858o07552j044118J868760K560069o11235k03417
6169B528497o287O45988Q67590J52907j118421p61137j767686j269385J537003
6160H09069Q39295k178871k461039P38887L129255K649713R43276j506960j099867
6151A862758l73393r31477q39294j091514J116490O88495j598746k083869j329275
6142d579825R75596K422874j02376o16939j455804j760314j117506J135132K387469
6133b711693J439041J976112J0641L22794K465786Q29817j520774j525770r44086
$$ plain form
6197 618907 1176909 1080650 1401760 2383326 2383321 1425348 23372 -1702065 -2809997 -2973352
6187 -2973352 -2467505 -1091245 1491317 2944227 2552537 1898348 1555184 2036235 808261
6178 808261 -2079895 -1759868 565990 -41562 -1085680 783080 3343149 2731914 2528497
6169 2528497 2522210 3168198 4035788 4188695 3070274 2309137 541451 -727934 809069
6160 809069 1648364 -530507 -2991546 -2252659 876596 3526309 4469585 2962625 1862758
6151 1862758 1489365 557888 -281406 -1372920 -256430 432065 -1166681 -3250550 -4579825
6142 -4579825 -3604229 -1181355 -1283731 -1900670 -3356474 -5116788 -6234294 -5099162 -2711693
6133 -2711693 -1272652 703460 714101 1036895 3502681 4332498 2811724 1285954 341868
6124C41868l45592k40065j052079o1694J19843J77170J881119o33729k060290
6115a873449K37707R81881J910663J342226j746696J4703J508806J021226M37033
6106C834100j133211J29504R52395K544257K830452k183015k766767J173010K60403
6097E641128p58598J355897j921065l065806q20029L03387n04761o07948M8974
6088c28821J057267J506009M36090j728432l34184J221815K253255K71530k869673
6079A484856k143665j71786k79244q00355N83132J779164J638604P84345L48872
6070C223923J354590j853678l162953j28154L717925K224148n4021N23278q24
6061E844234R99202N22544n20928K81446m22871k056602j738273n21747m88803
$$ plain form
6124 341868 -3724 -243789 -1295868 -1357562 -1237719 -1060549 820570 186841 -1873449
6115 -1873449 -1635742 -653861 1256802 2599028 852332 867035 2375841 3397067 3834100
6106 3834100 2700889 2830393 3782788 6327045 9157497 6974482 4207715 5380725 5641128
6097 5641128 4882530 6238427 4317362 1251556 431527 734914 230153 -377795 -328821
6088 -328821 728446 2234455 2670545 942113 607929 1829744 4082999 4354529 1484856
6079 1484856 -658809 -830595 -1109839 -1910194 -1327062 452102 2090706 2875051 3223923
6070 3223923 4578513 2724835 -438118 -566272 3151653 5375801 5321780 5845058 5844234
6061 5844234 6843436 7365980 6845052 7126498 6703627 4647025 2908752 2387005 1898202
6052A898202Q1737J304632J279440p44794j085048Q32883K51807J29385o18286
6043C329958J139769J798319j032781l10599K371159m93579k703628j131069N5407
6034C022956k51648j606941j727196O21217M61407J117791N27584r7065j375808
6025F92297j501008m12087J601528K791141N30173j349795Q7751o68151l307257
6016a535408k779759J982221K194440K93970n23967n02573o6870K694192J505370
6007C261616j971083j636317j253242J626539J929674r18853j224182R3077J274492
5998A181721J207173J413126j51346j743986K25077O83036R10085j033971n82869
5989B108046o34075p63142o15618l96477R03678j006756k350131j08432k98457
$$ plain form
6052 1898202 1979939 3284571 4564011 3819217 2734169 3567052 3818859 3948244 3329958
6043 3329958 4469727 6268046 5235265 4924666 7295825 6802246 4098618 2967549 3022956
6034 3022956 2771308 1164367 -562829 58388 519795 1637586 2165170 2068105 692297
6025 692297 -808711 -1220798 380730 3171871 3702044 2352249 2440000 1771849 -1535408
6016 -1535408 -4315167 -2332946 -138506 155464 -368503 -871076 -937946 1756246 3261616
6007 3261616 1290533 -345784 -1599026 27513 1957187 1038334 -185848 -92771 1181721
5998 1181721 2388894 3802020 3650674 1906688 2131765 2814801 3724886 2690915 2108046
5989 2108046 1473971 710829 95211 -301266 602412 -404344 -2754475 -2862907 -3161364
5980c161364m17556J384604J722251L635187J371714k866934j95006m36720k645529
5971a609353k731465P58450K993907P61177j382270l40743J594043Q35879k293841
5962a414216k653184J069043K928019J130302N49675J558220J378473P14616j08021
5953E152927j755695k809263M34637K35165p74469j586389j044257j02122Q50466
5944a399000Q07619M28555m18062J725312K956148n45508k714548j693332K26532
5935f26284j442047r72175J189007j569948K09534K88563k58737m17616j640671
5926e240374J04261K914996J894025L411908L074300P67474n85965k624233k382036
5917A334356j814265j774786J307959K022551p00612j698199J25413r74512J173753
$$ plain form
5980 -3161364 -3578920 -2194316 -472065 3163122 4534836 1667902 1472896 1036176 -1609353
5971 -1609353 -4340818 -3582368 -588461 172716 -1209554 -1550297 43746 879625 -1414216
5962 -1414216 -4067400 -2998357 -70338 1059964 1609639 3167859 4546332 5260948 5152927
5953 5152927 3397232 587969 1022606 1257771 483302 -1103087 -2147344 -2249466 -1399000
5944 -1399000 -591381 -162826 -580888 1144424 4100572 3555064 840516 -852816 -626284
5935 -626284 -2068331 -3040506 -1851499 -3421447 -3211913 -2923350 -3182087 -3599703 -5240374
5926 -5240374 -5136113 -2221117 -327092 3084816 6159116 6926590 6340625 3716392 1334356
5917 1334356 -479909 -2254695 -946736 1075815 375203 -1322996 -1197583 -2172095 -998342
5908i98342M391039K817331j06860l988526j942036J660682L16174j995577j634356
5899a480471l11050R82956j534455k694431l36743J019669J412402J925153K257182
5890A240212l07350k021341j653710Q66246J449013j63841j14715q83185Q0700
5881a507971N25365K22473P37457Q38809K07353L18166j073895k615306o7493
5872b415042K390090K020188K100886O76821l295447l233566j324192J91569j50626
5863c039319R95612K166939K496979J613088j138293J54236P71876m07536k814089
5854G99493K94348K592699J027613j703784l098517j922181j3528k013567o68887
5845d706311o64305k635302j391538K205511K937894K132722J986405J695919
$$ plain form
5908 -998342 3392697 6210028 6103168 2114642 172606 1833288 2149462 153885 -1480471
5899 -1480471 -1791521 -808565 -2343020 -5037451 -5374194 -4354525 -2942123 -1016970 1240212
5890 1240212 932862 -1088479 -2742189 -1875943 -426930 -590771 -705486 -1588671 -1507971
5881 -1507971 -982606 -760133 -22676 816133 1023486 1341652 267757 -2347549 -2415042
5872 -2415042 -24952 1995236 4096122 4772943 1477496 -1756070 -3080262 -2888693 -3039319
5863 -3039319 -2043707 123232 2620211 4233299 3095006 3249242 4021118 3613582 799493
5854 799493 1093841 3686540 4714153 3010369 -88148 -2010329 -2023857 -4037424 -4706311
5845 -4706311 -5370616 -8005918 -9397456 -7191945 -4254051 -2121329 -134924 1560995
5837A560995n8151q25711l77634Q92200l36677o15478J146670J508219R18755
5828C813188l74731j059752j409051k754900k356074p02951J529910J188672J133367
5819i92322j050248j090071L6106P49343L322838K266005r45185j495399r60475
5810a59408l97673n3617J322587K113967L262434J228691p28747j640736J577337
5801F524835J971791n70631k518310k079208l87888m42428m3411r54897j802060
5792c02207l1376J224078M02970J228227J55045O8758j050118k07656K243262
5783C730983J225404j234946j324463q5965m53974m75031L17647j406240m15263
5774a21848J44079p23965O64271n96899j745075K631331K341847q9053J348964
$$ plain form
5837 1560995 1502844 677133 299499 1191699 855022 239544 1386214 2894433 3813188
5828 3813188 3438457 2378705 969654 -1785246 -4141320 -4844271 -3314361 -2125689 -992322
5819 -992322 -2042570 -3132641 -3096535 -2347192 975646 3241651 2296466 801067 -159408
5810 -159408 -557081 -610698 711889 2825856 6088290 7316981 6588234 4947498 6524835
5801 6524835 8496626 7925995 5407685 3328477 2940589 2498161 2454750 1499853 -302207
5792 -302207 -333583 890495 1293465 2521692 2676737 2745495 1695377 1487721 3730983
5783 3730983 4956387 3721441 2396978 2311013 1857039 1382008 1699655 293415 -121848
5774 -121848 22231 -701734 -37463 -634362 -2379437 251894 2593741 2504688 3853652
5765C853652N04954k1246j049418M73711N90700K14714k397781k419695M33320
5756A82911O71245O73170O0754O70492J004507j211081k690401r31663L18686
5747a251380K122505J408505l46918k87926m28556o32918j775262m38163l73120
5738b003233R96387K234543K176206N37181j799275k223030l434087n78556J336960
5729b756904n93524K64879j76500k086327R31602M329481M040102K954844N03494
5720G411147j923114j600537l290125l923926j303906K619505K904171j166795
5712b73580j197383p72027j986460l09330m70534L9582J035916J871485J695901
5703c66430J463473L88616o58130k131417k075491J348546K205655m9485l127228
$$ plain form
5765 3853652 4358606 4337360 3287942 3761653 4352353 4567067 2169286 -250409 182911
5756 182911 854156 1527326 1588080 2258572 3263079 2051998 -638403 -1570066 -1251380
5747 -1251380 871125 2279630 1932712 1644786 1216230 583312 -1191950 -1630113 -2003233
5738 -2003233 -1006846 1227697 3403903 3941084 2141809 -81221 -3515308 -4093864 -2756904
5729 -2756904 -3350428 -3085549 -3262049 -5348376 -4416774 -87293 3952809 6907653 7411147
5720 7411147 5488033 3887496 597371 -3326555 -4630461 -2010956 893215 -273580
5712 -273580 -1470963 -2242990 -4229450 -4538780 -5009314 -4969732 -3933816 -2062331 -366430
5703 -366430 1097043 1485659 827529 -1303888 -3379379 -2030833 174822 125337 -3001891
5694c001891j694220J716931K523743K622342J764679J572655O8282j129975k040198
5685B402348j579992j703505O70662j63772j091301p14647O28720J473933o75292
5676g52846m17376J966718K875874O90567k069411k511469k611217q12668J97892
5667c443936J012013K15297q60023j039469J429213J750310o4693N35354Q2403
5658c83531j80875J289731J47992j876782k975520k588560L61478J408806J989908
5649b807353J489583M35051J09037O34623K14073J635910J058056J182900q50097
5640C101783j334600o17687J60692k708875l050334k161968q08423J76847J502368
5631e740197K172262L382328J598641L52318K75559N17866J737942Q93883j254181
$$ plain form
5694 -3001891 -4696111 -2979180 -455437 2166905 3931584 5504239 5572521 4442546 2402348
5685 2402348 822356 -881149 -210487 -374259 -1465560 -2180207 -1551487 -77554 -752846
5676 -752846 -1170222 796496 3672370 4362937 2293526 -217943 -2829160 -3641828 -3443936
5667 -3443936 -2431923 -2216626 -3076649 -4116118 -2686905 -936595 -1001288 -465934 -383531
5658 -383531 -564406 725325 873317 -1003465 -3978985 -6567545 -6206067 -4797261 -2807353
5649 -2807353 -1317770 -882719 -773682 -139059 75014 1710924 2768980 3951880 3101783
5640 3101783 1767183 1149496 1310188 -1398687 -4449021 -6610989 -7419412 -7242565 -5740197
5631 -5740197 -3567935 -185607 1413034 1765352 2040911 2558777 4296719 5190602 3936421
5622C936421L52974K139535J2741k059945o90213O76918J334589L54229r22852
5613E134397K64305J4364m258829k822478K04262L45795m90947n80437J042585
5604a146983J498249l05474r30469J076106K49147q47650R93212K737040J812537
5595E135715M06592j934724k764377o30375L97834K213268K996563J552639n68992
5586F804143j214712m50933j145925k430215k164820k688050l78274J327647K76678
5577b064461j787229k804243k863669o28613L539620K292592j301516Q26518K142876
5568b648125K616642O90101L65203R53651K083074j876063m103805l96026R92129
5559a323219M64817o15855M07077J140778j55460J81776j658040k276650J280146
$$ plain form
5622 3936421 4289395 6428930 6441671 4381726 3691513 4368431 5703020 6057249 5134397
5613 5134397 5398702 5413066 1154237 -1668241 -1463979 -1118184 -1609131 -2189568 -1146983
5604 -1146983 351266 45792 -884677 191429 440576 -407074 586138 3323178 5135715
5595 5135715 5542307 3607583 843206 212831 610665 2823933 5820496 7373135 6804143
5586 6804143 5589431 5138498 3992573 1562358 -602462 -3290512 -3668786 -2341139 -2064461
5577 -2064461 -3851690 -6655933 -9519602 -10148215 -6608595 -4316003 -5617519 -4791001 -2648125
5568 -2648125 -31483 658618 1023821 1977472 4060546 2184483 -1919322 -2315348 -1323219
5559 -1323219 -858402 -1474257 -1067180 73598 -81862 99914 -1558126 -3834776 -2554630
5550b554630K200980J480267M50579M60128J93238J277990J713747o00773k191107
5541B430419j033446j634412J34985P42178M28740j60594j436830j97270K664889
5532A938659J584184j421889l714567j630012n82698k226582j127307M67111j6751
5523f729852l88101M33194m55642R83460N93360J649909J722560J048452j515
5514a144175l9534J167234N99149L59832p84488J222110R43452j217433J494903
5505B601050K502898K096437j312955l464289p71335k25186o24986q32581O44167
5496F13220K99271k340211r11462J320993K355294L615137R01380n02735p99689
5487D551198J22669l5586r09837M55254k32567j727170p33099p78822O58171r43865
$$ plain form
5550 -2554630 -353650 1126617 1577196 2037324 2230562 3508552 5222299 4621526 2430419
5541 2430419 1396973 -237439 -102454 639724 1068464 907870 -528960 -726230 1938659
5532 1938659 3522843 2100954 -1613613 -3243625 -3826323 -6052905 -7180212 -6713101 -6729852
5523 -6729852 -7117953 -6684759 -7140401 -6156941 -5563581 -3913672 -2191112 -1142660 -1144175
5514 -1144175 -1183709 -16475 582674 942506 158018 1380128 2323580 1106147 2601050
5505 2601050 5103948 7200385 5887430 2423141 1651806 1426620 801634 -30947 613220
5496 613220 912491 -1427720 -2339182 -1018189 1337105 4952242 5853622 5350887 4551198
5487 4551198 4673867 4638281 3728444 4183698 3951131 2223961 1490862 712040 1370211 426346
5477D26346Q38697j48123n20021J281140K523613J321923O33672o63172k053710
5468C640365j381096m58462O00531j358603j587106J629592p48075n77346j066811
5459a307011k007043k26172r67091R5561R16482L50625N86067J651826J051699
5450A44943k087361l183749k629452N44495P06218K201879L573045K820708J449984
5441C540710Q37777j447087j738315m27348k759928m462902k13604K067183J386572
5432c216942j622006L18722N56975J741479K798175K130648J028666J735936J180968
5423F652621m93285q72438j35606k407245k727192O23597J551446N08041J243352
5414C943291J426814j436168j374192k117563Q02629m27096j272378K210921K501286
$$ plain form
5477 426346 1265043 1116920 596899 1878039 4401652 5723575 6357247 5694075 3640365
5468 3640365 2259269 1800807 2401338 1042735 -544371 1085221 337146 -240200 -1307011
5459 -1307011 -3314054 -3540226 -4507317 -4411756 -3495274 -3144649 -2558582 -906756 144943
5450 144943 -1942418 -5126167 -7755619 -7211124 -6504906 -4303027 -729982 2090726 3540710
5441 3540710 4378487 2931400 1193085 765737 -1994191 -6457093 -6670697 -4603514 -3216942
5432 -3216942 -4838948 -4520226 -3963251 -2221772 576403 2707051 3735717 5471653 6652621
5423 6652621 6159336 5286898 5151292 2744047 16855 640452 2191898 2699939 3943291
5414 3943291 5370105 3933937 2559745 442182 1244811 817715 -454663 1756258 4257544
5405D257544J126393j792927k431602M93345J289550K04501j606825j784649j185806
5396a430476l16567j062288m14507M55637L604072M128474M7391p61713L37613
5387D587636M40915O41796r4745o24054Q41942p71623j448849j264255j496372
5378H12391j793290q67748r01632k30604k336687l944232p6931l73667j841269
5369a1553669N61282L174642N091010J463696j411111Q6154j38913q77282O52037
5360b952154K401248K86080j430472q53513J005528L009762K161165Q07751j612177
5351B823218k684315j555140O92432J132780K76297m71887n14079k75396q79877
5342a455967l92977J006682K379325M74854j631675j192298n74641k16321Q45022
$$ plain form
5405 4257544 5383937 3591010 1159408 1652753 2942303 3146804 1539979 -244670 -1430476
5396 -1430476 -1747043 -2809331 -3223838 -2768201 835871 4964345 5011736 4250023 4587636
5387 4587636 5028551 5670347 5575602 4951548 5793490 5021867 3573018 2308763 812391
5378 812391 -980899 -1848647 -2750279 -2980883 -5317570 -9261802 -9338733 -9712400 -11553669
5369 -11553669 -10992387 -7817745 -2726735 -1263039 -2674150 -2587996 -2726909 -3604191 -2952154
5360 -2952154 -550906 -264826 -1695298 -2548811 -1543283 1466479 3627644 4435395 2823218
5351 2823218 138903 -1416237 -723805 408975 685272 213385 -300694 -576090 -1455967
5342 -1455967 -1848944 -842262 1537063 2011917 380242 -812056 -1386697 -1603018 -757996
5333g57996K514353K775206J383826r61387j789306j124669m30917l93560m42746
5324G72804n5686o68989J7302j993999n64844K62675J184949J818421K98110j811081
5314g40338m04821p03970O91394O45804l97460m68095j295209j13707J990964
5305g95438K733138K081167J802559m74340k999378l512983k876778q69076J175591
5296c735538K18851J56716J720972K328435K99680p36021n04400o13350J37082
5287g27573o476J676740R47578k606888j837063Q34622O13956n59753k9507J949323
5277B54959M66695p23760j882472K05959K311967R93449j002627j552421k993609
5268c921860j355174J499758K502501J033423n42586m08413J100893K368354k98708
$$ plain form
5333 -757996 1756357 4531563 5915389 4954002 3164696 2040027 1609110 1215550 772804
5324 772804 717118 48129 65431 -1928568 -2493412 -2230737 -1045788 772633 1070743 -740338
5314 -740338 -1145159 -1849129 -1157735 -511931 -909391 -1377486 -2672695 -2786402 -795438
5305 -795438 1937700 4018867 5821426 5347086 2347708 -1165275 -4042053 -4911129 -3735538
5296 -3735538 -3516687 -3359971 -1638999 689436 989116 253095 -251305 -864655 -727573
5287 -727573 -734049 942691 1890269 -716619 -2553682 -1719060 -1105104 -1664857 -1694364 254959
5277 254959 721654 -2106 -1884578 -1678619 633348 1626797 624170 -928251 -3921860
5268 -3921860 -5277034 -3777276 -1274775 -241352 -783938 -1192351 -91458 2276896 1978188
5259A978188j161793L84431J177259J177423L12399P43999N44062j992879K35125
5250C398214M26367j603937p46550p82969m79156R760K30590J787617J201539
5241C441475j491058m96827J452975J83212j802435n79593k91517K557645L783860
5232F757737L74566l479707l410920o31041K584030L382517J993777k026715k225236
5223C319008l069342r73151K768337K487707J269133J692810l161889m090896
5215B41717q88798J2442J080703J738795Q8254K38043J167333R79433Q23851P22346
5205F204119j591328l88592r32619l831847l102792N09890K666715L819819J242726
5196D596091r55151m69703r95565k9942j87879K413932L153801K137963o29424
$$ plain form
5259 1978188 816395 1200826 2378085 3555508 3867907 4611906 5155968 3163089 3398214
5250 3398214 3824581 2220644 1474094 691125 211969 221729 452319 2239936 3441475
5241 3441475 1950417 1453590 2906565 3089777 1287342 707749 416232 2973877 6757737
5232 6757737 7132303 3652596 241676 -389365 2194665 5577182 7570959 5544244 3319008
5223 3319008 249666 -723485 2044852 4532559 5801692 7494502 4332613 241717
5215 241717 -647081 -634639 446064 2184859 2273113 2511156 3678489 4657922 5481773 6204119
5205 6204119 4612791 4224199 3291580 -540267 -3643059 -3133169 -466454 3353365 4596091
5196 4596091 3640940 3171237 2175672 2145730 1957851 4371783 7525584 9663547 9034123
5187I034123l296273j322762r23188Q31804O31708l24195N83783J01771j847825
5178C468946j405014k03148J61142r02401p03416R9885j337411k416027k43180
5169c480624J958118P80687k095182l74700J533969J194561K64049K092254R03875
$$ plain form
5187 9034123 5737850 4415088 3491900 4323704 4955412 4631217 5215000 5316771 3468946
5178 3468946 2063932 1860784 2021926 1119525 416109 515994 -821417 -3237444 -3480624
5169 -3480624 -1522506 -741819 -2837001 -3211701 -1677732 -483171 -219122 1873132 2777007
$$ [...]
##END NTUPLES=NMR SPECTRUM
##END=
