##TITLE=C13DEPT135
##JCAMPDX= 6.0         $$ Bruker NMR JCAMP-DX V2.0
##DATA TYPE= NMR SPECTRUM
##DATA CLASS= NTUPLES
##ORIGIN= UXNMR, Bruker Analytische Messtechnik GmbH
##OWNER= root
$$ XWIN-NMR		Version 3.5
$$ Sat Feb 15 09:31:25 2025 Russian Standard Time (UT+4h)  servis@DPX200
##.OBSERVE FREQUENCY= 50.3277607988526
##.OBSERVE NUCLEUS= ^13C
##.ACQUISITION MODE= SIMULTANEOUS
##.ACQUISITION SCHEME= undefined
##.AVERAGES= 329
##.DIGITISER RES= 17
##SPECTROMETER/DATA SYSTEM= spect
##.PULSE SEQUENCE= dept135
##.SOLVENT NAME= DMSO
##.SHIFT REFERENCE= (INTERNAL, DMSO, 0, 219.126)
##AUDIT TRAIL= $$ (NUMBER, WHEN, WHO, WHERE, WHAT)
$$ ##TITLE= Audit trail, XWIN-NMR		Version 3.5
$$ ##JCAMPDX= 5.01
$$ ##ORIGIN= Bruker BioSpin GmbH
$$ ##OWNER= servis
$$ F:\spectra/data/av/nmr/C13DEPT135/1/pdata/1/auditp.txt
$$ ##AUDIT TRAIL=  $$ (NUMBER, WHEN, WHO, WHERE, WHAT)
(   1,<2025-02-15 09:30:11.01 +0400>,<servis>,<DPX200>,
      <created by zg, POWCHK disabled, PULCHK disabled
       terminated by command 'halt'
       configuration hash MD5:
       00 E9 B6 7A A2 85 ED C7 34 08 36 98 17 FE 4E 26
       data hash MD5: 64K
       75 96 08 EB 55 FB 26 22 FD C1 4B DE 42 D4 0A 5C>)
(   2,<2025-02-15 09:30:22.57 +0400>,<servis>,<DPX200>,
      <Start of raw data processing
       efp BC_mod = 2 LB = 1 FT_mod = 6 PKNL = 1 PHC0 = 413.407 PHC1 = 5.268371 SI = 32K 
       data hash MD5: 32K
       EA D4 EC 3F 54 59 F7 C8 A3 35 8E 9A 1F A5 10 3E>)
(   3,<2025-02-15 09:30:40.76 +0400>,<servis>,<DPX200>,
      <pk PHC0 = -28.6 PHC1 = 0 
       data hash MD5: 32K
       C5 45 7E D2 AA 70 18 91 C7 0C 69 5B 89 1E 7B 5F>)
$$ ##END=
$$ 
$$ hash MD5
$$ BB 9E 28 97 5F 8D FF D9 96 A0 27 2D AB F5 5A E3
##$RELAX= 
##$RELAX= 
##$RELAX= 
##$RELAX= 
##$RELAX= 
##$RELAX= 
##$RELAX= 
$$ Bruker specific parameters
$$ --------------------------
##$DU= <F:\spectra>
##$EXPNO= 1
##$NAME= <C13DEPT135>
##$PROCNO= 1
##$TYPE= <nmr>
##$USER= <av>
##$AMP= (0..31)
100 100 100 100 100 100 100 100 100 100 100 100 100 100 100 100 100 100 
100 100 100 100 100 100 100 100 100 100 100 100 100 100 
##$AQSEQ= 0
##$AQ_mod= 1
##$AUNM= <au_zg>
##$AUTOPOS= <>
##$BF1= 50.322729
##$BF2= 200.13
##$BF3= 50.322729
##$BF4= 50.322729
##$BF5= 500.13
##$BF6= 500.13
##$BF7= 500.13
##$BF8= 500.13
##$BYTORDA= 1
##$CFDGTYP= 0
##$CFRGTYP= 5
##$CHEMSTR= <none>
##$CNST= (0..31)
1 1 145 1 1 1 1 1 1 1 1 1 1 1 1 1 1 1 1 1 1 1 1 1 1 1 1 1 1 1 1 1 
##$CPDPRG= <waltz16>
##$CPDPRG1= <>
##$CPDPRG2= <waltz16>
##$CPDPRG3= <>
##$CPDPRG4= <mlev>
##$CPDPRG5= <mlev>
##$CPDPRG6= <mlev>
##$CPDPRG7= <mlev>
##$CPDPRG8= <mlev>
##$CPDPRGB= <>
##$CPDPRGT= <>
##$D= (0..31)
0 2 0.003448276 0 0 0 0 0 0 0.06 0 0.03 2e-05 4e-06 0 0 0.0002 0 0 0 0 
0 0 0 0 0 0 0 0 0 0 0 
##$DATE= 1739597410
##$DBL= (0..7)
120 120 120 120 120 120 120 120 
##$DBP= (0..7)
150 150 150 150 150 150 150 150 
##$DBP07= 0
##$DBPNAM0= <>
##$DBPNAM1= <>
##$DBPNAM2= <>
##$DBPNAM3= <>
##$DBPNAM4= <>
##$DBPNAM5= <>
##$DBPNAM6= <>
##$DBPNAM7= <>
##$DBPOAL= (0..7)
$$ [...]
##$SUBNAM2= <"">
##$SUBNAM3= <"">
##$SUBNAM4= <"">
##$SUBNAM5= <"">
##$SUBNAM6= <"">
##$SUBNAM7= <"">
##$SUBNAM8= <"">
##$SUBNAM9= <"">
##$SW= 238.246396889851
##$SWIBOX= (0..15)
0 1 3 0 0 0 0 0 0 0 0 0 0 0 0 0 
##$SW_h= 11990.4076738609
##$TD= 65536
##$TD0= 1
##$TE= 0
##$TE2= 300
##$TE3= 300
##$TEG= 300
##$TL= (0..7)
0 120 120 120 120 120 120 120 
##$TP= (0..7)
150 150 150 150 150 150 150 150 
##$TP07= 0
##$TPNAME0= <>
##$TPNAME1= <>
##$TPNAME2= <>
##$TPNAME3= <>
##$TPNAME4= <>
##$TPNAME5= <>
##$TPNAME6= <>
##$TPNAME7= <>
##$TPOAL= (0..7)
0.5 0.5 0.5 0.5 0.5 0.5 0.5 0.5 
##$TPOFFS= (0..7)
0 0 0 0 0 0 0 0 
##$TUNHIN= 0
##$TUNHOUT= 0
##$TUNXOUT= 0
##$USERA1= <user>
##$USERA2= <user>
##$USERA3= <user>
##$USERA4= <user>
##$USERA5= <user>
##$V9= 5
##$VALIST= <valist>
##$VCLIST= <CCCCCCCCCCCCCCC>
##$VD= 0
##$VDLIST= <DDDDDDDDDDDDDDD>
##$VPLIST= <PPPPPPPPPPPPPPP>
##$VTLIST= <TTTTTTTTTTTTTTT>
##$WBST= 1024
##$WBSW= 4
##$XGAIN= (0..3)
0 0 0 0 
##$XL= 0
##$YL= 0
##$YMAX_a= 620787
##$YMIN_a= -654471
##$ZGOPTNS= <>
##$ZL1= 120
##$ZL2= 120
##$ZL3= 120
##$ZL4= 120
##$ABSF1= 0
##$ABSF2= 0
##$ABSG= 0
##$ABSL= 0
##$ALPHA= 0
##$AQORDER= 0
##$ASSFAC= 0
##$ASSFACI= 0
##$ASSFACX= 0
##$ASSWID= 0
##$AUNMP= <proc_1d>
##$AZFE= 0.1
##$AZFW= 0.5
##$BCFW= 0
##$BC_mod= 2
##$BYTORDP= 0
##$COROFFS= 0
##$CY= 12.5
##$DATMOD= 1
##$DC= 0
##$DFILT= <>
##$DTYPP= 0
##$F1P= 215.000008851289
##$F2P= -4.99998459219978
##$FCOR= 0.5
##$FTSIZE= 32768
##$FT_mod= 6
##$GAMMA= 0
##$GB= 0
##$INTBC= 1
##$INTSCL= 1
##$ISEN= 30
##$LB= 1
##$LEV0= 0
##$LPBIN= 0
##$MAXI= 10000
##$MC2= 0
##$MEAN= 0
##$ME_mod= 0
##$MI= 0
##$NCOEF= 0
##$NC_proc= -2
##$NLEV= 6
##$NOISF1= 0
##$NOISF2= 0
##$NSP= 0
##$NTH_PI= 0
##$NZP= 0
##$OFFSET= 219.1257
##$PC= 1.4
##$PHC0= 384.807
##$PHC1= 5.268371
##$PH_mod= 1
##$PKNL= yes
##$PPARMOD= 0
##$PSCAL= 4
##$PSIGN= 0
##$REVERSE= no
##$SF= 50.322729
##$SI= 32768
##$SIGF1= 0
##$SIGF2= 0
##$SINO= 80
##$SIOLD= 32768
##$SREGLST= <13C.CDCl3>
##$SSB= 0
##$STSI= 32768
##$STSR= 0
##$SW_p= 11990.4076738609
##$SYMM= 0
##$S_DEV= 0
##$TDeff= 65536
##$TDoff= 0
##$TI= <>
##$TILT= no
##$TM1= 0
##$TM2= 0
##$TOPLEV= 0
##$USERP1= <user>
##$USERP2= <user>
##$USERP3= <user>
##$USERP4= <user>
##$USERP5= <user>
##$WDW= 1
##$XDIM= 32768
##$YMAX_p= 322544195
##$YMIN_p= -174722399
$$ End of Bruker specific parameters
$$ ---------------------------------
##NTUPLES= NMR SPECTRUM
##VAR_NAME=  FREQUENCY,     SPECTRUM/REAL,   SPECTRUM/IMAG
##SYMBOL=    X,             R,               I
##VAR_TYPE=  INDEPENDENT,   DEPENDENT,       DEPENDENT
##VAR_FORM=  AFFN,          ASDF,            ASDF
##VAR_DIM=   32768,         32768,           32768
##UNITS=     HZ,            ARBITRARY UNITS, ARBITRARY UNITS
##FACTOR=    0.365929370215793, 1,           1
##FIRST=     11027.0033138647, 0,            0
##LAST=      -963.404359996184, 0,           0
##MIN=       -963.404359996184, -174722399,  0
##MAX=       11027.0033138647, 322544195,    0
$$ Real data points
##PAGE= N=1
##DATA TABLE= (X++(R..R)), XYDATA
$$ [...]
9383B144533m292547j739569J954041L527422m25287l635529l511815k185729
9375h164480J285653K60658j846664j578893J963602J470350j337142J898771
9367f048145N341828K294833J98247n29085k276640k622248O98562J143867j90489
9358a989270k552194P34186o94008l38567K262553J265743j489511k569676J056421
9349d314323J385259j606502M39351L975980J407601j006989k84995J108259K748340
9340C851981J355359M67353j681070j579960j802972j629692L22732J978816K492900
9331C775447P38460o49461j983621k701369k3114N3215j272156j766378N17148
9322c311829J476695L2484Q7455j013179n36503K137518L683556J299852j598323
$$ plain form
9383 2144533 -2148014 -3887583 -1933542 1593880 1168593 -2466936 -5978751 -8164480
9375 -8164480 -6878827 -6618169 -8464833 -10043726 -8080124 -6609774 -7946916 -6048145
9367 -6048145 -706317 1588516 1786763 1257678 -1018962 -3641210 -2942648 -1798781 -1989270
9358 -1989270 -4541464 -3807278 -4501286 -4839853 -2577300 -1311557 -2801068 -5370744 -4314323
9349 -4314323 -2929064 -4535566 -4096215 -120235 1287366 280377 -4618 1103641 3851981
9340 3851981 5207340 5674693 3993623 2413663 610691 -1019001 -696269 1282547 3775447
9331 3775447 4513907 3864446 1880825 -820544 -843658 -790443 -2062599 -3828977 -3311829
9322 -3311829 -1835134 -1802650 -1715195 -2728374 -3264877 -1127359 2556197 3856049 2257726
9313B257726k570137j847019K060762J658059R26779l10563k133712j944661q77332
9304b780098j800278J364074M063946K638398K085481K495661j332697m299144
9296B435343j072302K303879J035269m19400l34015j506186j056135k75452l31312
9287G79689Q22840j913212j899122j907057l392120L12564m8973Q09158K703697
9278c732536j331071k913450k596197j235453K880568N529509K213284j221497
9270b406843j028717j164505J079825R87763K055284j603161m684393j368317
9262h133064J019433P26432O51736K553737L088046m11230k218111j601177k110087
9253f434285j006098J411264L550293J092260o8785Q06565P40844p08412K453801
$$ plain form
9313 2257726 -312411 -2159430 -98668 1559391 2486170 2175607 41895 -1902766 -2780098
9304 -2780098 -4580376 -3216302 847644 3486042 5571523 8067184 6734487 2435343
9296 2435343 1363041 3666920 4702189 4282789 3948774 2442588 1386453 1111001 779689
9287 779689 1602529 -310683 -2209805 -4116862 -7508982 -7196418 -7245391 -6436233 -3732536
9278 -3732536 -5063607 -7977057 -10573254 -11808707 -8928139 -3398630 -1185346 -2406843
9270 -2406843 -3435560 -4600065 -3520240 -2532477 -477193 -2080354 -6764747 -8133064
9262 -8133064 -7113631 -6387199 -5735463 -3181726 -93680 -504910 -2723021 -4324198 -6434285
9253 -6434285 -7440383 -6029119 -2478826 -1386566 -1455351 -648786 92058 -616354 1837447
9244A837447L175969R45633k417642l683054q48679K582691k45062o91980k830666
9235b175343m227608k32825K270537J491381j174591k473142J378293Q40627j123261
9226e425932k69289N12647J560843K467258m91586p10101L10509N15791Q39320
9217f90540J395590P44414K69741o39924j116544j422850n21317J681070J371843
9208A071483k91569m70570j883313K510229J836145m5329o40404j132823J438377
9199B392226J864586j449029l974018k192571J802014J467726O23340L29354j070029
9190b06401p36383j28255J14834j459711k360070j46581K196100J518012p82122
9181a990577k37259J50683P54513J301977K204412k23326j96469K774149K198109
$$ plain form
9244 1837447 5013416 5959049 3541407 -141647 -990326 1592365 1347303 655323 -2175343
9235 -2175343 -6402951 -6635776 -4365239 -2873858 -4048449 -6521591 -5143298 -4302671 -5425932
9226 -5425932 -5695221 -5182574 -3621731 -1154473 -1646059 -2356160 -2045651 -1529860 -690540
9217 -690540 705050 1449464 1719205 1079281 -37263 -1460113 -1981430 -300360 1071483
9208 1071483 779914 309344 -1573969 936260 2772405 2727076 2086672 953849 2392226
9199 2392226 4256812 2807783 -1166235 -3358806 -1556792 -89066 534274 863628 -206401
9190 -206401 -942784 -1071039 -956205 -2415916 -4775986 -4922567 -2726467 -1208455 -1990577
9181 -1990577 -2227836 -2077153 -1322640 -20663 2183749 1960423 1763954 4538103 6736212
9172F736212j089048k491462l516087n27694K489317K395465J221380k128247
9164C089836j126233O45692j389872l025152j138767J377020L248927L096926
9156D778377J246377k355592j584406R34321J819301m50548k636927j958512r71180
9147a178789k36533j420412k295425o08K564107N15908J293099N00411o94538
9138i52780J016558j777721j72863L895362J816358p96067L16912N26675O2160
9129C934594N23189L23241j171953l173986j440204L188594L124268j001922k381306
9120A924515j887300m14361J631258q668J859048J958004m99855j031510j159643
9111B371488n51414j141557k044638L69286l28684k322680j83523K121504Q71533
$$ plain form
9172 6736212 5647164 3155702 -360385 -888079 1601238 3996703 5218083 3089836
9164 3089836 1963603 2609295 1219423 -1805729 -2944496 -1567476 1681451 4778377
9156 4778377 6024754 3669162 2084756 3019077 4838378 4387830 1750903 -207609 -1178789
9147 -1178789 -1415322 -2835734 -5131159 -5131767 -2567660 -2051752 -758653 -258242 -952780
9138 -952780 63778 -1713943 -1886806 2008556 3824914 3028847 3345759 3872434 3934594
9129 3934594 4457783 4781024 3609071 435085 -1005119 2183475 5307743 4305821 1924515
9120 1924515 37215 -377146 1254112 1245444 3104492 5062496 4562641 3531131 2371488
9111 2371488 1820074 678517 -1366121 -996835 -1325519 -3648199 -3831722 -1710218 -838685
9102h38685j853567k095533n77628J335662j003988j935852O8922K859757K975314
9093a065598K551382K078675R37361j953326j997622r39447n86352j827691k97762
9084c100380O15281J294554r27502l978750k477387J01920J528243J395514J028152
9075d520355L139024M772489p44n008647l006847l385768q38977M559534L497018
9066g93273J701848J392651N68014j161711k19183J244729j2899j102049j658406
9057d0279k234741j961427j822731J647264K385596Q18545q87643m33433J549716
9048i79133R24730j132250k100509j317385J024261j293262n94044p49011j219500
9039g436103n16278K513665J727215l1571K045367J627732m09745K597664L220954
$$ plain form
9102 -838685 -2692252 -4787785 -5365413 -4029751 -5033739 -6969591 -6900669 -4040912 -1065598
9093 -1065598 1485784 3564459 4501820 2548494 550872 -388575 -974927 -2802618 -3100380
9084 -3100380 -2485099 -1190545 -2118047 -6096797 -8574184 -8472264 -6944021 -5548507 -4520355
9075 -4520355 -1381331 3391158 3390414 -1618233 -4625080 -8010848 -8849825 -4290291 -793273
9066 -793273 908575 2301226 2869240 1707529 1488346 2733075 2720176 1618127 -40279
9057 -40279 -2275020 -4236447 -6059178 -4411914 -2026318 -1207773 -2095416 -2528849 -979133
9048 -979133 -54403 -1186653 -3287162 -4604547 -3580286 -4873548 -5467592 -6216603 -7436103
9039 -7436103 -7952381 -5438716 -3711501 -3743072 -1697705 -69973 -479718 2117946 5338900
9030E338900Q20214k404682j794639K83502J230876M31898K91025j135025j022473
9021B039596Q20045M73776R4366j230483k731069l515946k004513k334002J44894
9012h243336J558009N54833K032410R31409M61238J03574k42473N95115J245494
9003a003727Q859J485645O80208k991780k351116J403173M76186j495782k418787
8994f207121l532789j044748J967939L745208K302682m3330q70814M90824J091312
8985b100837L40411r46588k177381k268190j59992J937559K163870p95876r35589
8976d942613j736671J357054L776052J050970j329021M13497J845001J15146k268067
8967a718652j689827l147249l625464q69565L063095L497058J809603J604130
$$ plain form
9030 5338900 6159114 3754432 1959793 2243295 3474171 3906069 4197094 3062069 2039596
9021 2039596 2859641 3333417 3427783 2197300 -533769 -4049715 -6054228 -8388230 -8243336
9012 -8243336 -6685327 -6130494 -4098084 -3166675 -2705437 -2601863 -2844336 -2249221 -1003727
9003 -1003727 -994868 490777 1170985 -1820795 -4171911 -2768738 -2292552 -3788334 -6207121
8994 -6207121 -9739910 -10784658 -8816719 -5071511 -2768829 -2812159 -3682973 -3192149 -2100837
8985 -2100837 -1760426 -2707014 -4884395 -7152585 -7312577 -5375018 -3211148 -4007024 -4942613
8976 -4942613 -6679284 -5322230 -1546178 -495208 -1824229 -1410732 434269 549415 -1718652
8967 -1718652 -3408479 -6555728 -10181192 -11050757 -7987662 -4490604 -2681001 -1076871
8959a076871K300927J505210j863370j735832j16778O03727o70154r78426J443014
8950e88553L032730K035088M91882j333741l801829k035181K8084k653219k212915
8941g037654N60511K677709M880675K423587q90739k204155l283745l760328k749168
8932i383307J36843J930022j55560j021121n1099K446023J940235M71018p02799
8923d389745j97194O57290k23641j628162j053254j986417k88428J392430L624000
8914d093121L674835K191137J055335j304864j398366o78252p964j38475o94681
8905a394416m15276K257321K642690k440393j173374J005552J681906j143431
8897A020579o05812q7545j471486k661095m8579K140798M143879L274606j112664
$$ plain form
8959 -1076871 1224056 2729266 865896 -869936 -986714 -382987 -1053141 -2031567 -588553
8950 -588553 2444177 4479265 4971147 3637406 -164423 -2199604 -2171520 -4824739 -7037654
8941 -7037654 -6477143 -3799434 1081241 3504828 2614089 409934 -2873811 -6634139 -9383307
8932 -9383307 -9246464 -7316442 -7472002 -8493123 -8544222 -6098199 -4157964 -3686946 -4389745
8923 -4389745 -4586939 -3929649 -4153290 -5781452 -6834706 -8821123 -9109551 -7717121 -4093121
8914 -4093121 -418286 1772851 2828186 1523322 124956 -553296 -561260 -699735 -1394416
8905 -1394416 -1809692 447629 3090319 649926 -523448 482104 2164010 1020579
8897 1020579 414767 327222 -1144264 -3805359 -3853938 -1713140 2430739 5705345 4592681
8888D592681m130533l257009K350262n83351j673563J44181K28574n38801j641560
8879d509119j914954J422979K081621L034457Q01733L42525n96246O47145p96475
8870E13666k210990j309245J993039J689331r35768j307988L59466K310574M82591
8861A584676k481671j257108r55383q06173J435599K820971j137095j625607K261359
8852a60432L812784K111831j319012k118564k776312j738060j002355j110293
8844d300413J289667J776938L622691M582359K118585N76014q97997j149542r196
8835G609106l10933k088957l515277j894213n20666J385294L511056j95191k444334
8826A535885P13262M29409J986602K212243Q5662j806867p49220J388777j31746
$$ plain form
8888 4592681 462148 -2794861 -444599 -1027950 -2701513 -2557332 -2328758 -2867559 -4509119
8879 -4509119 -6424073 -5001094 -2919473 114984 916717 1259242 662996 1310141 513666
8870 513666 -1697324 -3006569 -1013530 675801 -259967 -1567955 -1208489 1102085 1584676
8861 1584676 -896995 -2154103 -3109486 -3915659 -2480060 340911 -796184 -2421791 -160432
8852 -160432 3652352 5764183 4445171 2326607 -449705 -2187765 -3190120 -4300413
8844 -4300413 -3010746 -1233808 2388883 6971242 9089827 9665841 8767844 7618302 7609106
8835 7609106 7298173 5209216 1693939 -200274 -720940 664354 4175410 3980219 1535885
8826 1535885 2249147 2678556 4665158 6877401 6963063 5156196 4406976 5795753 5664007
8817E664007j650971k510874j121874P30370K91455n44736j771440j879639q18479
8808c612181K02964R5106M93140J910233J767816r886J437691j909164j002822
8799f27103j965341j394585K204356J498974R77519L75593j525558k262318k2098
8790b740561K5316K046473K466927J845051r65174j066718l10858j126150M82654
8781F56960J176245N25037M06916k76935q83579J27339K340689J99617k192558
8772B079731k011772k407217J77942J046936r27877L45987K51790P2195k039800
8763c412085m28186J507696J886307K82350j815614r50086L251710K607248j620027
8754A309313m365077l666752n02786J456891J408896M4818K483831K219760R81489
$$ plain form
8817 5664007 4013036 1502162 380288 1110658 1402113 857377 -914063 -2793702 -3612181
8808 -3612181 -3409217 -3314111 -2820971 -910738 857078 847192 2284883 375719 -627103
8799 -627103 -2592444 -3987029 -1782673 -283699 693820 1069413 -456145 -2718463 -2740561
8790 -2740561 -2715245 -668772 1798155 3643206 2678032 1611314 1300456 174306 656960
8781 656960 1833205 2358242 2765158 2488223 1604644 1731983 4072672 4272289 2079731
8772 2079731 67959 -2339258 -2161316 -1114380 -2042257 -1696270 -1444480 -1372285 -3412085
8763 -3412085 -3840271 -2332575 -446268 -163918 -1979532 -2929618 322092 2929340 1309313
8754 1309313 -3055764 -6722516 -7225302 -5768411 -4359515 -4314697 -1830866 388894 1370383
8745A370383O53373J06377r75951Q18339K119634m99105o71359j423674N16815
8736B014832N81151q33744M65873p74218l769834k820621Q87649N20197J81405
8727c547310R39833M89958J313044J595599O55729N82065k130666j158504j133591
8718b393843j882818j339053n65963J729347J467719K649487J876850R57651j393933
8709A105444l395556m8383m81749n57118j037133l578018p69639J626067R65120
8700f170965J101696K054126m4799k531354J62310J72501N2456N71018p92109
8691e425120J187820j578033j456749R03004j535580j233792m47361j95629P81484
8682h999956J002410j072734m66717L59989O51520J544094L214707o37042m805249
$$ plain form
8745 1370383 2023756 2130133 1154182 1972521 4092155 3593050 2921691 1498017 2014832
8736 2014832 2595983 1762239 2228112 1453894 -2315940 -5136561 -4248912 -3728715 -3547310
8727 -3547310 -2607477 -2117519 -804475 791124 1446853 2028918 -101748 -1260252 -2393843
8718 -2393843 -4276661 -5615714 -6181677 -4452330 -2984611 -335124 1541726 2499377 1105444
8709 1105444 -2290112 -2338495 -2820244 -3377362 -4414495 -7992513 -8762152 -7136085 -6170965
8700 -6170965 -5069269 -3015143 -3059942 -5591296 -5428986 -5256485 -5204029 -4633011 -5425120
8691 -5425120 -4237300 -5815333 -7272082 -6369078 -7904658 -9138450 -9585811 -9781440 -8999956
8682 -8999956 -7997546 -9070280 -9536997 -9177008 -8525488 -6981394 -3766687 -4403729 -9208978
8673i208978q38694L30777P89918R80972M97103l211487m765447j151400m86699
8664a7063935k057147k231196k807858q22511J227987n1896l852112j565439k239738
8655c1463845l468253j825693m03533l838093o763577n749928o611931o080104
8647f6204957o600041q490852j1067424j4169998j8660134j9608249j5884368
8640a60686023j1511407k524969K096390O836196J2887838J6615122J7070614
8633a19216239J5867786J3765742J1518256J0114241J0852363R340193N422509
8626d2335149N403184M502571L643319M182977L412092K833525p40946j7209L247535
8617a5868101L495144K725408J587353J451685p29240l886843l090514n71874
$$ plain form
8673 -9208978 -10047672 -9716895 -8926977 -7946005 -7448902 -10660389 -15425836 -16577236 -17063935
8664 -17063935 -19121082 -21352278 -24160136 -24982647 -23754660 -23806556 -27658668 -29224107 -31463845
8655 -31463845 -34932098 -36757791 -37161324 -40999417 -47762994 -53512922 -60124853 -66204957
8647 -66204957 -72804998 -81295850 -92363274 -106533272 -125193406 -144801655 -160686023
8640 -160686023 -172197430 -174722399 -172626009 -165789813 -152901975 -136286853 -119216239
8633 -119216239 -103348453 -89582711 -78064455 -67950214 -57097851 -47757658 -42335149
8626 -42335149 -36931965 -32429394 -28786075 -24603098 -21191006 -18357481 -19098427 -19115636 -15868101
8617 -15868101 -12372957 -9647549 -8060196 -6608511 -7337751 -11224594 -14315108 -14886982
8609a4886982L335558L111268k119591k293578K50654K52615Q85772K129791K81770
8600i052723j435631O22018L756667K456463K319180M54823J039264R81328k770863
8591a629474k736855k279255l156770p18474p1575m24381N29298L2564Q31552
8582i623370J480743o87311R4703J697587O86458R20537J518124O21109N7189
8573c234231j120257O74554K133622O12520k88461r82336j06495K89866k075059
8564d096277j261134L33333K145046P92332q71609K77573k020175j41756k11656
8555e054323p06960R94894J455945J498897O88727J183234l0830M92403N62614
8546A084601k149062j842560M17943j865660k906077k176247O23311K105883M876823
$$ plain form
8609 -14886982 -11551424 -8440156 -10559747 -12853325 -12602671 -12350056 -11464284 -9334493 -9052723
8600 -9052723 -10488354 -9866336 -6109669 -3653206 -1334026 -879203 160061 1141389 -1629474
8591 -1629474 -4366329 -6645584 -9802354 -10520828 -10592403 -11016784 -10487486 -10454922 -9623370
8582 -9623370 -8142627 -8829938 -8735235 -7037648 -6351190 -5430653 -3912529 -3291420 -3234231
8573 -3234231 -4354488 -3679934 -1546312 -933792 -1222253 -2204589 -2311084 -2021218 -4096277
8564 -4096277 -5357411 -5024078 -2879032 -2086700 -2958309 -2680736 -4700911 -4842667 -5054323
8555 -5054323 -5761283 -4766389 -3310444 -1811547 -1122820 60414 29584 521987 1084601
8546 1084601 -1064461 -2907021 -2489078 -4354738 -7260815 -9437062 -8813751 -6707868 -1831045
8537a831045K420627m49556M26955J993301J334049j399083M57387k307541j774613
8528a129519J538696j035406o04435J265757P25704j450203k182343j193263l44686
8519d409698l59863K85670K8619k685064k725840q5745L072017L47576J374093
8510e158235q20762l497619k062502k198669N4074L420935N781397L238688n1235
8501a293928l209971J90483l13907k476083n27996j014132n19504J977677L052068
8492d135293l17247l134980l965960l399530k535016j512724j304916j011222
8484b1316888j971925l577103l746754j541022j833046l402346l825588m975480
8476d6190152o923266o587883o129479j0834087j2574206j1718153r953480o594651
$$ plain form
8537 -1831045 589582 140026 566981 2560282 3894331 2495248 2952635 645094 -1129519
8528 -1129519 409177 -626229 -1230664 35093 760797 -689406 -2871749 -4065012 -4409698
8519 -4409698 -4769561 -4483891 -4455272 -7140336 -9866176 -9951921 -6879904 -6532328 -5158235
8510 -5158235 -5978997 -9476616 -11539118 -13737787 -13683713 -10262778 -4481381 -1242693 -1293928
8501 -1293928 -4503899 -4313416 -4627323 -7103406 -7631402 -8645534 -9165038 -7187361 -4135293
8492 -4135293 -4452540 -7587520 -11553480 -14953010 -17488026 -19000750 -20305666 -21316888
8484 -21316888 -23288813 -26865916 -30612670 -32153692 -33986738 -37389084 -41214672 -46190152
8476 -46190152 -53113418 -59701301 -65830780 -76664867 -89239073 -100957226 -110910706 -117505357
8468a17505357l208774L050957Q862211R161771J0710328J3384720J0080843Q161792
8460e7301509N939431L733208L477536O495059N664566M890496L267355K042558
8452b1791300J760039K094710J017893j232032k205919j85695Q01268K060622
8444a7680414J958139J014956K94274m8834J57006q58568k260638L298294M463953
8435i661832k24238k016844K9254O60412l75039N63863K93200r54491k822636
8426a4508351l163262j794611k289479k61925k5721k744590l453619n570575p811065
8417d1623198m970526l322618k904204q657160j3011477j2332058j2892791j4267745
8409a13981777j5002258j3531448j3873155j1807777m557213r22050L702288Q740171
$$ plain form
8468 -117505357 -120714131 -117663174 -108800963 -99639192 -88928864 -75544144 -65463301 -57301509
8460 -57301509 -51362078 -47628870 -44151334 -37656275 -31991709 -27101213 -23833858 -21791300
8452 -21791300 -20031261 -17936551 -16918658 -18150690 -20356609 -20542304 -19741036 -17680414
8444 -17680414 -15722275 -14707319 -14413045 -14461879 -14304873 -15163441 -17424079 -14125785 -9661832
8435 -9661832 -9886070 -11902914 -11873660 -11213248 -11588287 -11024424 -10731224 -11685715 -14508351
8426 -14508351 -17671613 -19466224 -21755703 -22017628 -22043349 -24787939 -28241558 -33812133 -41623198
8417 -41623198 -46593724 -49916342 -52820546 -61477706 -74489183 -86821241 -99714032 -113981777
8409 -113981777 -128984035 -142515483 -156388638 -168196415 -172753628 -173675678 -169973390 -161233219
8401a61233219J1226890J4668140J5825952J4203630J3724622J0349871J0990956
8394g0243158J0954015J0580135P697319O260792M081008J309106J491045J012913
8386b6856825k458539P51560M947185Q494692O625791N99593m146939m030813
8378a6074295j486450K880820L043150N93988o23986p94696Q46966J153140j713511
8369a2174874j9195L069608K475323n89793J965074L267142N71821M04731J247876
8360B17713q94361l38361o59015k648254m20533q2295j915607j132211k4060J044218
8350f852766P2678L02332J456093J340363j461362k17992J118164j195128N64245
8341d873373K201356K738349J697799M51244J17471Q02772J82555j096421j748233
$$ plain form
8401 -161233219 -150006329 -135338189 -119512237 -105308607 -91583985 -81234114 -70243158
8394 -70243158 -59289143 -48709008 -41011689 -34750897 -30669889 -29360783 -27869738 -26856825
8386 -26856825 -29315364 -28563804 -23616619 -15121927 -8496136 -7896543 -12043482 -16074295
8378 -16074295 -17560745 -14679925 -11636775 -11042787 -11666773 -12461469 -11614503 -10461363 -12174874
8369 -12174874 -12194069 -9124461 -6649138 -7238931 -5273857 -2006715 -1434894 -1030163 217713
8360 217713 -676648 -1015009 -1674024 -4322278 -4742811 -4825106 -6740713 -7872924 -7896984 -6852766
8350 -6852766 -6780088 -6477756 -5021663 -3681300 -5142662 -5360654 -4242490 -5437618 -4873373
8341 -4873373 -2672017 66332 1764131 2215375 2332846 3135618 3318173 2221752 473519
8332D73519n71875N85505j343125j450854j961161j249292J509334K952064K032820
8323I76935p19029k3768O24952j842193k359048k234162q24591J022893j607794
8314f985805P5852K032807P82173Q89179k67391j625577j262373m53200J045360
8305e768975J715717N54623J303840J384789K9056m784p80751N44712J682018
8296F60245J691683M10487l96339K550806K643833Q28708J263631o43038j728550
8287G281466O55776K928719K359859J842042Q72391q17127j270463O52646R09906
8278A5415215o86142l754270l692076k509511p28911j240479j406037j164099
8270B33690m89008J122718J361747M82842M63012J010406k299788j215360R8205
$$ plain form
8332 473519 -98356 487149 -855976 -2306830 -4267991 -5517283 -4007949 -1055885 976935
8323 976935 257906 234138 859090 -983103 -3342151 -5576313 -6400904 -5378011 -6985805
8314 -6985805 -6909953 -4877146 -4094973 -3205794 -3473185 -5098762 -6361135 -6814335 -5768975
8305 -5768975 -4053258 -3498635 -2194795 -810006 -780950 -785734 -1566485 -1021773 660245
8296 660245 2351928 2762415 2366076 4916882 7560715 8389423 9653054 9010016 7281466
8287 7281466 7937242 10865961 13225820 15067862 15940253 15123126 13852663 14505309 15415215
8278 15415215 14729073 10974803 7282727 4773216 4044305 2803826 1397789 233690
8270 233690 -255318 867400 2229147 2711989 3175001 4185407 1885619 670259 768464
8261G68464j345436k125955j211480J632269J52749k889978O94930K104383J817118
8252d02936j160081j934295K58333J489371K5417J537443R24047r11199J247497
8243A073597K700087K6778k265096j370261m11551l004321j253659J067340L062458
8234c74628N52581L35055J193537O24488M157444N239036J895451j06587J382631
8225A4899008M83681j42323K175195J901342l134683l183595m496911n274928
8217C226786m75769J318340n50517k706738n80985j07977K02021r1907j039525
8208h06271n34346l32346J34031P85180j28617J084006K05097J38442J346745
8199A891921j699619k973787l325881j126672N91726m46344n11374K44038L095885
$$ plain form
8261 768464 -576972 -2702927 -3914407 -2282138 -2129389 -5019367 -4324437 -2220054 -402936
8252 -402936 -1563017 -3497312 -3238979 -1749608 -1724191 -186748 737299 -173900 1073597
8243 1073597 3773684 3800462 1535366 165105 -246446 -3250767 -4504426 -3437086 -374628
8234 -374628 177953 513008 1706545 2331033 6488477 11727513 13622964 13516377 14899008
8225 14899008 15382689 15240366 17415561 19316903 16182220 12998625 8501714 3226786
8217 3226786 2751017 4069357 3518840 812102 231117 123140 325161 233254 -806271
8208 -806271 -1340617 -1672963 -1538932 -753752 -882369 201637 406734 545176 1891921
8199 1891921 192302 -2781485 -6107366 -7234038 -6642312 -7088656 -7600030 -7355992 -4260107
8190d260107L386884K206200P14938J583246J692976R42903m76956k208611r46581
8181B634892J822093L884097J753356k96685J026814P29122J657287L548097J501475
8172A8260548J133943K250658J985524L161301L484298L901114J130808l259094
8164C2049100m188919n077292n733025l057894n35199j116519o12967k044603
8156I682682k160349k28123J198557J156883q34565k090872j235772j722845j308641
8147B456955n15381N61652j533177j844053j657175o43931P48300n3255N56287
8138a923778o87377l81513O08934q24429j318957P20347L182558K273509J375743
8129C025037l31302O96672K866642J937000j521211r79670K347610J686694N39353
$$ plain form
8190 -4260107 -873223 1332977 2047915 3631161 5324137 6267040 5790084 3581473 2634892
8181 2634892 4456985 8341082 10094438 9797753 10824567 11553689 13210976 16759073 18260548
8172 18260548 19394491 21645149 23630673 26791974 30276272 34177386 35308194 32049100
8164 32049100 27860181 22782889 17049864 13991970 13456771 12340252 11727285 9682682
8156 9682682 7522333 7294210 8492767 9649650 8815085 6724213 5488441 3765596 2456955
8147 2456955 1941574 2503226 970049 -874004 -2531179 -3175110 -2426810 -2480065 -1923778
8138 -1923778 -2611155 -2992668 -2383734 -3208163 -4527120 -3806773 -624215 1649294 3025037
8129 3025037 2693735 3390407 6257049 8194049 6672838 5693168 8040778 9727472 10266825
8120A0266825J433948k048696k347275K26105J370224J2685K572780L144029J058009
8111A5688634K410985M041999J99280m432410l255893m359294l940125k232854
8103D120322j213554j031966N51884P88121m07079j094887J67976J332563K138620
8094E352000k248583l905758j844390M04576p23890J618087J707340j834494j210603
8085b685715j390183J426518J127577j319007k407268p00497K689341L254533
8077d701m77009k129171K97248J438910r28041l66389j027888M03134K731700
8068f2207K199906p68405l119109P77948L160939K710799R87499J084310J132481
8059H104161k067508j837996L38094J635341K049993N18617l022761k741240R5218
$$ plain form
8120 10266825 11700773 9652077 7304802 7530907 8901131 8913816 11486596 14630625 15688634
8111 15688634 18099619 22141618 22340898 17908488 14652595 10293301 6353176 4120322
8103 4120322 2906768 1874802 2426686 3214807 2807728 1712841 1880817 3213380 5352000
8094 5352000 3103417 -802341 -2646731 -2242155 -2966045 -1347958 359382 -1475112 -2685715
8085 -2685715 -4075898 -2649380 -1521803 -2840810 -5248078 -5948575 -3259234 -4701
8077 -4701 -481710 -2610881 -2313633 -874723 -1802764 -2169153 -3197041 -2793907 -62207
8068 -62207 2137699 1369294 -1749815 -971867 2189072 4899871 5887370 6971680 8104161
8059 8104161 6036653 4198657 4536751 6172092 8222085 8740702 5717941 2976701 3071919
8050C071919k05134k776406k744228j622005n76581k312368l543879l652971l075481
8041a7437134P78487J837908j330239l936400m947113n737146q489548p168606
8033d6429791l894606o107109r364500j1296036q438890m415518k662956J131245
8025i1478161M106814M425232N476754M747909M651146O541380N663458N543363
8017e0322105P704779R685265P646826N292103K337528K682145K475525o21607
8009a3119541J442907L656389J712863m26350r93470M64721j007223L22408J322557
8000f624739J179241J047866J49120j07959j324903j09361K174657J723699Q7834
7991a804545R93031K561438M23067m56321K362780J103881j814959k820563j736428
$$ plain form
8050 3071919 2866785 90379 -2653849 -4275854 -4852435 -7164803 -10708682 -14361653 -17437134
8041 -17437134 -16658647 -14820739 -16150978 -20087378 -25034491 -30771637 -39261185 -46429791
8033 -46429791 -50324397 -56431506 -65796006 -77092042 -85530932 -89946450 -92609406 -91478161
8025 -91478161 -87371347 -82946115 -77469361 -72721452 -68070306 -61528926 -55865468 -50322105
8017 -50322105 -42617326 -32932061 -25285235 -19993132 -17655604 -14973459 -12497934 -13119541
8009 -13119541 -11676634 -8020245 -6307382 -6733732 -7727202 -7262481 -8269704 -7947296 -6624739
8000 -6624739 -5445498 -4397632 -4248512 -4356471 -5681374 -5790735 -3616078 -1892379 -1804545
7991 -1804545 -811514 1749924 2172991 1716670 4079450 5183331 3368372 547809 -1188619
7982a188619n9911r5596o90168j556572J353434J672510J144420j09794N30470
7973A000174M11885j100397j251617j41021J497774J116070k999004r26292o31715
7964c024143P08907J501375R00119J529827K226709j37722n96950N3853N13225
7955C675200J35490k211331k650964k239994l49161J144194L826610L282409p25374
7946C887079k002476J158853K503701j60961k750424r00484j708186k43103L1454
7937a84547J264072J332305j435533N3894J789882J922566J512867L10781p49297
7928E816990l390878m724899k782717J035276M039235M222819K092131N09907
7920F817864j74069j904941k309797j755234j382799j566487K74891J443329j312693
$$ plain form
7982 -1188619 -1248530 -1344126 -2034294 -3590866 -2237432 -564922 579498 469704 1000174
7973 1000174 1412059 311662 -939955 -1080976 416798 1532868 -1466136 -2392428 -3024143
7964 -3024143 -2315236 -813861 86258 1616085 3842794 3705072 3108122 3161975 3675200
7955 3675200 3810690 1599359 -1051605 -3291599 -3640760 -2496566 1330044 4612453 3887079
7946 3887079 1884603 3043456 5547157 5386196 2635772 1735288 27102 -216001 -184547
7937 -184547 1079525 2411830 976297 1030191 2820073 4742639 6255506 6566287 5816990
7928 5816990 2426112 -2298787 -5081504 -4046228 -6993 4215826 6307957 6817864
7920 6817864 6643795 4738854 2429057 673823 -708976 -2275463 -2000572 -557243 -1869936
7911a869936j932205O52189K126974L103615K611205k484126k860655r50192k48071
7902a851202Q74155L69833J012345L20021k52377Q72612J564808Q52519j91383
7893C571331k163585o2414M35080J110765N04083K135752Q58307o55130k838550
7884B895639J7718N10205l231639j722619r96393k291478K623224K491861J392922
7875A689440J35786o47596n22088J067746P99066j088785j346806J088086q60638
7866C14211l567818r45526q57917m59071L32749l38763J646278J952796J30685
7857a792376P80667K175438k00405k459895r20022r2515J072274J033300M77425
7848G3891J813720j27521j240809n04858R46043K056130M450268J221359Q86877
$$ plain form
7911 -1869936 -3802141 -3149952 -1022978 2080637 4691842 2207716 -652939 -1603131 -1851202
7902 -1851202 -977047 -607214 405131 725152 472775 1345387 2910195 3762714 3571331
7893 3571331 1407746 1345332 1780412 2891177 3395260 5531012 6389319 5734189 2895639
7884 2895639 2913357 3423562 191923 -1530696 -2527089 -4818567 -2195343 296518 1689440
7875 1689440 1825226 1177630 655542 1723288 2522354 1433569 86763 1174849 314211
7866 314211 -3253607 -4199133 -5057050 -5516121 -5183372 -5522135 -3875857 -1923061 -1792376
7857 -1792376 -1011709 1163729 963324 -1496571 -2416593 -2509108 -1436834 -403534 73891
7848 73891 1887611 1760090 519281 14423 960466 3016596 7466864 8688223 9575100
7839I575100l75894k488013l451614l706631k146111j13738K126759J125086j90717
7830C54227N637J392525K62564k880203j848766k41501o51985J186817L207236
7821G86551K087224R14298J447920J48087m070890j973266j738217n23847Q25533
7812b096607J214625J706320L25034r78267J023889J122177R95534r26548k338479
7803D7678L06411j57189J296863m97310j065883k93507j67105p94375K66614L84201
7793f73602p78791j061802J17740J836542j171738k447652j704862p14960l23192
7784f922317L524826N351278P38271P78895J465616J81608j763799N02087Q19804
7775D676269l704753k434271N08285K403464K495511J782791j615475k934355
$$ plain form
7839 9575100 9199206 6711193 3259579 -447052 -2593163 -2706901 -580142 544944 354227
7830 354227 359864 1752389 2014953 -865250 -2714016 -2955517 -3607502 -2420685 786551
7821 786551 2873775 3788073 5235993 5384080 1313190 -660076 -2398293 -2922140 -2096607
7812 -2096607 -881982 824338 1149372 171105 1194994 2317171 3312705 2386157 47678
7803 47678 354089 196900 1493763 996453 -69430 -362937 -530042 -1324417 -1057803 -673602
7793 -673602 -1452393 -2514195 -2396455 -559913 -1731651 -4179303 -5884165 -6599125 -6922317
7784 -6922317 -3397491 1953787 2692058 3470953 4936569 5118177 3354378 3856465 4676269
7775 4676269 971516 -1462755 -954470 1448994 3944505 5727296 4111821 1177466
7767A177466k184855j612169J16749Q20700p82083k402305j744104o74784L334938
7758c950447L566273j080151l087861K123804K534664N42769K815740L411818
7750F876609L18567q44796o80582k997781m539071r85688p54986J219334K376143
7741a2251J237947j055045k394526j808501q33041J839336J051262J054653N89634
7732c30532K728516L771624j468925k007568O45407o22863k434903l034038l22938
7723c076220K130652K921189L727072K679497j136501l506568k277869j061780
7715C99472j9526L81067q4411J574895j31847k162642j133953J074733K60934
7706A58722k634170j963145j071024J824074n84243k279030j327100j10136L26084
$$ plain form
7767 1177466 -1007389 -2619558 -2502809 -1682109 -2464192 -4866497 -6610601 -7285385 -3950447
7758 -3950447 -384174 -1464325 -4552186 -2428382 106282 649051 3464791 6876609
7750 6876609 7195176 6350380 5669798 2672017 -1867054 -2852742 -3607728 -2388394 -12251
7741 -12251 1225696 170651 -2223875 -4032376 -4865417 -3026081 -1974819 -920166 -330532
7732 -330532 2397984 6169608 4700683 2693115 3338522 2715659 280756 -2753282 -3076220
7723 -3076220 -945568 1975621 5702693 8382190 7245689 3739121 1461252 399472
7715 399472 379946 761013 676602 2251497 2119650 -42992 -1176945 -102212 158722
7706 158722 -2475448 -4438593 -5509617 -3685543 -4269786 -6548816 -7875916 -7986052 -7659968
7697g659968K027061J666855K30703Q74550o37574J43251M000625K930812k365259
7688A211056k123622j754659m34249J181860J812320J136736J029224J981841
7680D040507j919147k910304o74927j477058N1905K359147L83791k816768j157538
7671d120392L54248L58218p98667j489166k379765l104293l216763k192420L0846
7662a6558154L70474m819685n518557n272750n815497n655777o017440q526009
7654e7813395r900296r319192q515774n079384l833531l066210J119549M664340
7646i1743893O162763Q406668R090842Q318251P554705N830223O664784Q585824
7638c1129833O460541O653733M204983p08677Q33371M294438K801103J623257
$$ plain form
7697 -7659968 -5632907 -3966052 -3735349 -2860799 -3498373 -3355122 645503 3576315 1211056
7688 1211056 -912566 -2667225 -3101474 -1919614 -107294 1029442 2058666 4040507
7680 4040507 2121360 -788944 -1463871 -2940929 -2889024 -529877 -146086 -2962854 -4120392
7671 -4120392 -3766144 -3407926 -4206593 -5695759 -8075524 -11179817 -14396580 -16589000 -16558154
7662 -16558154 -16187680 -21007365 -26525922 -31798672 -37614169 -43269946 -49287386 -57813395
7654 -57813395 -67713691 -77032883 -85548657 -90628041 -94461572 -97527782 -96408233 -91743893
7646 -91743893 -85581130 -77174462 -68083620 -59765369 -52210664 -46380441 -39715657 -31129833
7638 -31129833 -24669292 -18015559 -13810576 -14519253 -13685882 -9391444 -6590341 -4967084
7630d967084m5929j560773k042112k223067n78073J891599J763241J77030P21005
7621f864163J651406J154354o63392k12427q77308l03414R14010L53592K62149
7612d585193l50725J43411l50717k27239R01124K355526J157627J456484K143799
7603B644097N04424q34564n72306P13204J744289j592311l504840j676661j566173
7594d140841j115942n540q60185M01771K991072L179157n6548j399755j399864
7585b406675J25566j42396r75144l92482J118584J052438p52043j935555K99263
7576d008444K356079j18002l15597K601121M408134J779076j172129j429262j991842
7567B109134k039299Q13376Q804k408322j611502l05377M211821N746681m99807
$$ plain form
7630 -4967084 -5013013 -6573786 -8615898 -10838965 -11417038 -9525439 -7762198 -7585168 -6864163
7621 -6864163 -5212757 -4058403 -4721795 -4934222 -5811530 -6114944 -5200934 -4847342 -4585193
7612 -4585193 -4935918 -4792507 -5143224 -5370463 -4469339 -2113813 -956186 500298 2644097
7603 2644097 3148521 2313957 1741651 2454855 4199144 2606833 -898007 -2574668 -4140841
7594 -4140841 -5256783 -5262323 -6122508 -5720737 -2729665 449492 392944 -1006811 -2406675
7585 -2406675 -2281109 -2423505 -3398649 -3791131 -2672547 -1620109 -2372152 -4307707 -4008444
7576 -4008444 -1652365 -1770367 -2085964 515157 4923291 6702367 5530238 4100976 2109134
7567 2109134 69835 883211 892015 -1516307 -3127809 -3433186 778635 6525316 6025509
7558F025509m393892k734538j574509K32532L112801M98030r25506P74042R65349
7549A979818m86642j95066K083784N56371Q2445q2094j544143j655346n14796
7540B24331N62316p84132j628493j150560j544946R7314J767354j342674l030128
7531f829618p88072J658264Q18704q71698j260523L55493K590573Q74780n50721
7522d002818J090381J295846J728426L96881k039277J25245L81165j675718N20724
7513b179145K695776K60681j263427j26571P29003j961814r73642J743653K351383
7504A275897j526956k19598j298446J59113J047080K94386J11046k46153k33474
7495f37105O90575l82427m23966j11169J551076L83432N91646K120968K595183
$$ plain form
7558 6025509 1631617 -1102921 -2677430 -2444898 667903 1165933 240427 1014469 1979818
7549 1979818 1493176 1298110 3381894 3938265 4020710 3938616 2394473 739127 224331
7540 224331 786647 2515 -1625978 -2776538 -4321484 -4224170 -2456816 -3799490 -6829618
7531 -6829618 -7617690 -5959426 -5140722 -6012420 -7272943 -6917450 -4326877 -3452097 -4002818
7522 -4002818 -2912437 -1616591 111835 508716 -1530561 -1405316 -1024151 -2699869 -2179145
7513 -2179145 516631 777312 -486115 -612686 116317 -1845497 -2819139 -1075486 1275897
7504 1275897 -251059 -470657 -1769103 -1609990 -562910 -268524 -157478 -403631 -637105
7495 -637105 53470 -328957 -752923 -864092 686984 1070416 1662062 3783030 6378213
7486F378213k84152k234508o58291O31151l29365l327150j92155J416605k60730
7477A139618N48947j89543M95112J865208J257875J720919n62070r10532L27405
7468E692939l15922j178451k078314M59153j88469m523894k941023L226863N375148
7459C528030K485778k308257j31736J934144l76747j749061p15140l06318j013882
7450A346811R18504K264922J369416m465j613293q86218J24907J02505k266040
7441A357049l088963K57486J642067J515k200153j082848r54644j514749l65307
7432e948547N15176J931842J756941J425149K999410K087595R91570k066729m273858
7423e81451k85692J317201J264182L57915j410235j610866p62723k09880K439241
$$ plain form
7486 6378213 6094061 3859553 3201262 3832413 3503048 175898 -16257 1400348 1139618
7477 1139618 1688565 1499022 1994134 3859342 5117217 6838136 6276066 5365534 5692939
7468 5692939 5377017 4198566 2120252 2579405 2390936 -2132958 -5073981 -1847118 3528030
7459 3528030 6013808 3705551 3573815 5507959 5131212 3382151 2667011 2360693 1346811
7450 1346811 2265315 4530237 5899653 5895188 4281895 3395677 3520584 3623089 1357049
7441 1357049 -1731914 -1474428 167639 169154 -2030999 -3113847 -4068491 -5583240 -5948547
7432 -5948547 -5433371 -3501529 -1744588 -319439 2679971 4767566 5759136 3692407 -581451
7423 -581451 -867143 450058 1714240 2072155 661920 -948946 -1711669 -1921549 517692
7414E17692L833523J959948L73709N65356j371437k815537m43404J236854J188993
7405E045697n64762j125386l71429J063068K89583J170149K169423q71716o63288
7396F141339j666764j794771j628045L07954o0772k992309m786056k533080j72174
7387i184678K649244N906021O415594J502137m555542l706703J025938n36771
7379d84760j621522k93246O93268J153558O20028J061165j408801n55193J871303
7370A035800j170651j519500J39909j498396k408688r89894K092287K876387p90115
7361b232861j743819J596935K440023J383025j579715j24640L316142K788384
7353E843474O66891P42489L68099r62720j892032j519797j448740j929609o74416
$$ plain form
7414 517692 4351215 6311163 6684872 7250228 5878791 3063254 2619850 3856704 5045697
7405 5045697 4480935 3355549 2984120 4047188 4336771 5506920 7676343 6804627 6141339
7396 6141339 4474575 2679804 1051759 1359713 1298941 -1693368 -6479424 -9012504 -9184678
7387 -9184678 -6535434 -629413 5786181 7288318 2732776 -973927 52011 -484760
7379 -484760 -2106282 -2399528 -1706260 -552702 67326 1128491 -280310 -835503 1035800
7370 1035800 -134851 -1654351 -1514442 -3012838 -5421526 -6411420 -4319133 -1442746 -2232861
7361 -2232861 -3976680 -2379745 60278 1443303 -136412 -261052 3055090 5843474
7353 5843474 6510365 7252854 7620953 6658233 4766201 3246404 1797664 -131945 -806361
7344h06361j782832j540543k07212J906469J271923O97950K180737K396120j455001
7335B661250j493312J258023L501031K211574P52914j055474j621587j239964
7327D974455k15010R9765k129652j410460J261729P14556R70386K078517k57738
7318F086548k893733m371493r74827J168694J235176n91064j826687J167265J200168
7309B00047J37047J136306L540456l17297m559835j028184K970038K400346j011052
7300C467872k268451r48047p91750j960000Q11110J683044o03796j361660M1938
7291a929740J480360J627654k84578k863654P88394L738517J824171M57553Q27748
7282E666425J2234o91873k44230L09792j997761k388722l89780p38789j54088
$$ plain form
7344 -806361 -2589193 -4129736 -4336948 -2430479 -1158556 -460606 1720131 4116251 2661250
7335 2661250 1167938 2425961 5926992 8138566 8891480 7836006 6214419 4974455
7327 4974455 4759445 4859210 2729558 1319098 2580827 3295383 4265769 6344286 6086548
7318 6086548 3192815 -1178678 -2153505 -984811 250365 -340699 -2167386 -1000121 200047
7309 200047 337094 1473400 5013856 4696559 136724 -891460 2078578 4478924 3467872
7300 3467872 1199421 251374 -540376 -2500376 -1689266 -6222 -610018 -1971678 -1929740
7291 -1929740 -449380 1178274 893696 -1969958 -1181564 2556953 4381124 4838677 5666425
7282 5666425 5678659 4986786 4742556 5052348 3054587 665865 276085 -462704 -616792
7273f16792P01903J727413J108220l35196j777205J25915P15601L5228R73181
7264B658268L8732j195870j432627j137758N50070K239737J549916O48196K61706
7255D180370q79493o94953N0553K07259J71691N5375j529752r58827j371491j357374
7245b126642L20133O05989J119108J921066K819342L338196K187279k569898m026871
7236C587702m003631l906243M73588J219812P21582R15882L205141K365481q61261
7227C718053M65933l554995m484479l66226J273268K777277J531343j983332k323717
7218b946875l67274R12573J108873L21435o63707j024839r37967K317187M901752
7209C621158K548130k062731n72783R83406L01089m64491j450158r05261l039701
$$ plain form
7273 -616792 85111 1812524 2920744 2585548 808343 934258 1649859 1685087 2658268
7264 2658268 2697000 1501130 68503 -1069255 -519185 1720552 3270468 3918664 4180370
7255 4180370 3300877 2605924 2656477 2863736 3035427 3090802 1561050 602223 -769268 -2126642
7245 -2126642 -1806509 -1200520 -81412 1839654 4658996 7997192 10184471 7614573 3587702
7236 3587702 -415929 -4322172 -3848584 -2628772 -1907190 -991308 2213833 4579314 3718053
7227 3718053 4183986 628991 -3855488 -4221714 -2948446 -171169 1360174 -623158 -2946875
7218 -2946875 -3314149 -2401576 -1292703 -971268 -1634975 -2659814 -3597781 -1280594 3621158
7209 3621158 6169288 4106557 3533774 4517180 4818269 4353778 2903620 1998359 -1041342
7200a041342J51333L233148L194644j347775k733634j040067j345322Q98559L488078
7191C457622K427928j236190k427807k635787q85878K33012J512991J461283o73668
7182A233506K862509L93499m919683j211962J705802J785591o73906n31173L69721
7173A013904Q52688J31322j241418p42647k479814q8451L734795J925498N71459
7164C677336M18608m87397r18109j727382j196249J182175K379090Q19420j803327
7155B344165l333072J178299L228613o46526k553211k181705j33645L47043m89160
7146b239199K675107M173615K924146J235688N4757p80264r79854j650576J04355
7137E517775j927266k703391j190184o31428K256206L438630j53974k914485j087875
$$ plain form
7200 -1041342 -890009 2343139 5537783 4190008 1456374 416307 -929015 -30456 3457622
7191 3457622 5885550 4649360 2221553 -414234 -1300112 -1067100 445891 1907174 1233506
7182 1233506 4096015 4489514 -430169 -1642131 63671 1849262 1175356 644183 1013904
7173 1013904 1866592 1997914 756496 13849 -2465965 -2554416 1180379 3105877 3677336
7164 3677336 4095944 3608547 2690438 963056 -233193 948982 3328072 4147492 2344165
7155 2344165 -988907 189392 3418005 2771479 218268 -1963437 -2097082 -1750039 -2239199
7146 -2239199 435908 4609523 7533669 8769357 8824114 8043850 7063996 5413420 5517775
7137 5517775 3590509 887118 -303066 -934494 1321712 4760342 4606368 1691883 604008
7128F04008j954471k02682K713413Q2735N49241j47572P15962J789076K355119
7119F504829L7133k469648l301001q51129K296606K048332j487256k352691K083652
7110B508827L076692q83677k345221L84347P30757q06312j955998j056018K293540
7101A946937K892250J054228k423786j929442o45240J218832K327557K250968
7093F692304R45114J202906J044077j228707k034971j265556N53365j848973k126089
7084A933470j526064J083831l33639M00260J982068L01657Q25329P72892k351490
7075C088314n88319K005858L14394l15330j7386k105287l096079j382356J766744
7066c29447K982843J085060L115636K361217l53363P31208J211772m157558n359167
$$ plain form
7128 604008 -1350463 -1553145 1160268 1243003 1792244 1644672 2360634 4149710 6504829
7119 6504829 6541962 4072314 771313 -79816 2216790 4265122 2777866 425175 2508827
7110 2508827 5585519 4701842 2356621 2740968 3471725 2665413 709415 -346603 1946937
7101 1946937 4839187 5893415 3469629 1540187 894947 2113779 4441336 6692304
7093 6692304 7637418 8840324 9884401 8655694 6620723 5355167 5908532 4059559 1933470
7084 1933470 407406 1491237 1157598 1557858 3539926 3841583 4666912 5439804 3088314
7075 3088314 2499995 4505853 4820247 4504917 4487531 2382244 -713835 -2096191 -329447
7066 -329447 2653396 3738456 6854092 9215309 8861946 9593154 10804926 6647368 1288201
7057A288201k600065O38945K478808r6000j54114J354315M72269J203448L197793
7048G783600K054749j545323j539802M89325K104542J640943J504256j32236j54193
7039A2205861k498489l174017k476700l784042j728565Q20712k00174j807328
7031b642742k193090K46694L383235J104525J005784l04122k359688p84819L17961
7022b226262J086210J442691J837671K081513K034914K794043j970217l276546
7014C804017o58847N9055k276735l128096k133527K60692J651753J622885J728977
7005I30174J365926j996617K07496K789036K316665J257412k042130j709339K25214
6996C343837J945854L552989O37158k701770k847711l281229J111005J986899
$$ plain form
7057 1288201 -1311864 -672919 1805889 1709889 1555775 2910090 3382359 4585807 7783600
7048 7783600 9838349 8293026 6753224 7242549 9347091 10988034 12492290 12360054 12205861
7039 12205861 9707372 6533355 4056655 272613 -1455952 -635240 -835414 -2642742
7031 -2642742 -4835832 -4589138 -1205903 -101378 904406 600284 -1759404 -2544223 -2226262
7022 -2226262 -1140052 302639 2140310 4221823 6256737 9050780 7080563 3804017
7014 3804017 3145170 3204225 927490 -2200606 -4334133 -4073441 -2421688 -798803 930174
7005 930174 2296100 299483 506979 3296015 5612680 6870092 4827962 3118623 3343837
6996 3343837 5289691 8842680 9479838 6778068 3930357 649128 1760133 3747032
6988C747032k468927k155503J327678l95570j797431j478851Q4356K121661J546604
6979E31049K97111k875023k778116J123503K281133K896670K566524J304708r48428
6970D399131q20668j534016p97221J072087K60463O01181J751670q88343Q86733
6961D931017R83947k019284m625203k368608r8174J627769M369176K981138m98391
6952E283387j889499p1890K268109P39473J035093p99973k056567k625384l462096
6943a579347l72572J710258K661337J681163L42176L96463K9239K98387L40943
6934E508047k634348l729134o46276K291469L291586r14473j702444K53876J795181
6925C513484O85473j229253k786816l435696M15209J309428j738670j205117R36651
$$ plain form
6988 3747032 1278105 -877398 450280 54710 -1742721 -3221572 -3137216 -1015555 531049
6979 531049 828160 -2046863 -4824979 -3701476 -1420343 1476327 4042851 5347559 4399131
6970 4399131 3578463 2044447 1247226 2319313 2579776 3180957 4932627 4044284 4931017
6961 4931017 5914964 3895680 -729523 -3098131 -3196305 -1568536 2800640 5781778 5283387
6952 5283387 3393888 3321998 5590107 6329580 7364673 6564700 4508133 1882749 -1579347
6943 -1579347 -1951919 -241661 2419676 4100839 4443015 4839478 4868717 5167104 5508047
6934 5508047 2873699 -855435 -1501711 789758 4081344 3166871 1464427 1718303 3513484
6925 3513484 4198957 2969704 182888 -3252808 -2837599 -1528171 -3266841 -4471958 -3535307
6916c535307K704565J063792j652658j994832k269727P74428M552066L094682
6908B737009m72437q03808r31045J023883M71843q95395j911067k666131k445051
6899e892199r02779K216470K429810P80457j048966K684715J793883j690586J196381
6890A567186k052670l000944J521504K307965J679101R55823j374231j343111
6882B60623k540867M09765L447260K970540O25298p84382K316518J591684K17879
6873H514318p7759k458658o00587j454615l097281J175089M156050J718882j46373
6864G729066l47932k31391l62092j810460m46410J479785q54329Q45937K328292
6855H330466R47802j396514k367573m12446j74839R01652J943643n76271j830257
$$ plain form
6916 -3535307 -830742 233050 -1419608 -3414440 -5684167 -4909739 -357673 2737009
6908 2737009 2264572 1460764 529719 1553602 2025445 1130050 -781017 -3447148 -5892199
6899 -5892199 -6794978 -4578508 -2148698 -1368241 -2417207 267508 2061391 370805 1567186
6890 1567186 -485484 -3486428 -1964924 343041 2022142 2977965 1603734 260623
6882 260623 -2280244 -1870479 1576781 4547321 5172619 4388237 6704755 8296439 8514318
6873 8514318 8436559 5977901 5377314 3922699 825418 2000507 6156557 7875439 7729066
6864 7729066 7381134 7149743 6787651 4977191 4530781 6010566 5156237 6002174 8330466
6855 8330466 9278268 7881754 5514181 5101735 4926896 5828548 7772191 7195920 5365663
6846E365663k272341r56015J968462J852384K634573j25811l079988j820124o69643
6837B897160R22144L882563J756828j98661Q73514M39987o02347J958518K622003
6828A4551709j805624l548163l815492J64207R05816J075301J285495J52317J207601
6819A0173167k84845j736174K127071J723612L95494K457433J422946j447714
6811A4830990p654K278462J388646J082857j476980l439532j376960m81402m80857
6802A2317570R45690L933292L214521K871133J765370J556930N46513M057652
6794C1208671N767729L277844K538542O420533M406030J727946K272020N145035
6786F2764350Q918399J2304434J5929783J8552082K3175078K6303155L0214088
$$ plain form
6846 5365663 3093322 2137307 4105769 5958153 8592726 8466915 5386927 3566803 2897160
6837 2897160 3819304 7701867 9458695 9260034 10133548 10573535 9971188 11929706 14551709
6828 14551709 12746085 9197922 5382430 5546637 6452453 7527754 8813249 8965566 10173167
6819 10173167 9888322 8152148 10279219 12002831 12398325 14855758 16278704 14830990
6811 14830990 14823336 17101798 18490444 19573301 18096321 14656789 13279829 12798427 12317570
6802 12317570 13263260 17196552 20411073 23282206 25047576 26604506 27151019 31208671
6794 31208671 36976400 40254244 42792786 49213319 53619349 55347295 57619315 62764350
6786 62764350 71682749 83987183 99916966 118469048 141644126 167947281 198161369
6779A98161369L6040678L7820194L3415268J7106686q621413l0964790m0656636
6772B42301356m0821270l4535166k9752010k3452006k0605879k0927579j5714269
6765E6493177j0569106q379290n999398m253144j543042l915588m177132k843158
6757A4813319k352171m274296l417983k367763K10077J836096m15454Q17032r44912
6748C903945r85459L3586J120945O86538J571809J656105k82607n94734j090492
6739F019636n87904P60797l195450m506403J310059J708725k084115j598730k045750
6730d219135o45986R78369K377428J337859j322662K08395K483751J658682J501691
6721D358392P57585r31482m78146K462793R05951K297980K513603K424239L709760
$$ plain form
6779 198161369 234202047 272022241 305437509 322544195 313922782 282957992 242301356
6772 242301356 201480086 166944920 137192910 113740904 93135025 72207446 56493177
6765 56493177 45924071 37544781 31545383 27292239 25749197 21833609 17656477 14813319
6757 14813319 12461148 8186852 4768869 2401106 2611183 4447279 4031825 4848857 3903945
6748 3903945 2918486 2952072 4073017 4759555 6331364 7987469 7704862 7110128 6019636
6739 6019636 5431732 6192529 2997079 -1509324 -199265 1509460 -574655 -2173385 -4219135
6730 -4219135 -4865121 -3886752 -1509324 -171465 -1494127 -1285732 1198019 2856701 4358392
6721 4358392 5115977 4184495 3706349 6169142 7075093 9373073 11886676 14310915 18020675
6712A8020675N022705J447833k800412P51904K275763K092300L847238N738109
6704C6396115O993272P666463P215370Q181353J1850484J1915032Q103094K696401
6696A01017584l202504q224075j1619631j1107504j2965039j1803396o283572
6689C5811863o157893m708158L48659r41823m865161l360978j241005l307530
6681A1577974m170254l223494q53486j605952j978540m69999j28721J249268M84711
6672H81507l32819M36725J781234J195360M41147o92210k122328k355758p42633
6663a509775j04288J2657J863270L022175K284385L045911J020163j357244l239644
6654E037610j141475m93312k519408m344670k12718K381953j57324k97602K16454
$$ plain form
6712 18020675 23043380 24491213 21690801 22442705 24718468 26810768 30658006 36396115
6704 36396115 43389387 51055850 58271220 66452573 78303057 90218089 98321183 101017584
6696 101017584 97815080 89591005 77971374 66863870 53898831 42095435 35811863
6689 35811863 29653970 24945812 25294471 24352648 19487487 16126509 14885504 11577974
6681 11577974 7407720 4184226 3330740 1724788 -253752 -723751 -852472 396796 881507
6672 881507 548688 985413 2766647 3962007 4403154 3710944 1588616 -767142 -1509775
6663 -1509775 -1614063 -1601406 261864 3284039 5568424 8614335 9634498 8277254 5037610
6654 5037610 3896135 3402823 883415 -3461255 -3673973 -1292020 -1449344 -1746946 -1530492
6645a530492j729342n85420m01330P3150P83704J414420j34397q82976J79016
6636b813667P67976j13539K110632J844244k446147j891947R0385L949705L073925
6627D571567l48963l741106m338966o02862J965163N65756r94763N24597K375233
6618b4344J138214k883252k720184q16545J405731K094645p39572j929752k680250
6609g155309j703583K30491Q66028j105620k399343N61408J607153J299448k28067
6600h027394J623690J575686J301423M103606K006842o11494k219869k482600
6592b730110l82186j334258j421816j08456O34633J617178O8911J010171J067831
6583a578102k101563j476529l337741m553209o65195K342421J998842J381246
$$ plain form
6645 -1530492 -3259834 -3845254 -4246584 -4173434 -3389730 -1975310 -2109707 -2992683 -2813667
6636 -2813667 -2045691 -2159230 -48598 1795646 -650501 -2542448 -2452063 1497642 4571567
6627 4571567 4222604 481498 -3857468 -4460330 -2495167 -1929411 -2924174 -2399577 -24344
6618 -24344 1113870 -1769382 -4489566 -5306111 -3900380 -1805735 -2545307 -4475059 -7155309
6609 -7155309 -8858892 -8628401 -7762373 -8867993 -11267336 -10705928 -9098775 -7799327 -8027394
6600 -8027394 -6403704 -4828018 -3526595 577011 2583853 1972359 -247510 -2730110
6592 -2730110 -3112296 -4446554 -5868370 -5976826 -5342193 -3725015 -3656104 -2645933 -1578102
6583 -1578102 -3679665 -5156194 -8493935 -13047144 -13712339 -11369918 -9371076 -7989830
6575g989830j68317J141102Q03894j904347j420420j512162j299719r73510K66921
6566a3056388J76769k1958J18802n229188o217969l474363m605566o917014o320324
6557d5547199o264330p499042p924181p911871q351431j1342143r154499k650416
6549a06645112L163516Q102156J1745751J5026386J4778686J0616869P270042
6542c5941706M353758J723836J529547M366081M702546M978521M208355K036010
6534h043052J66002q83010j81079R39760Q40569O57727J102082j68110J325401
6525d243710K828714j345135k553343R12220J88309J649341K322718J093342o67723
6516A84733j684866K62302K27957j086137r49635j98454m33338R56248j3882r64224
$$ plain form
6575 -7989830 -8158147 -7017045 -6213151 -8117498 -9537918 -11050080 -12349799 -13323309 -13056388
6566 -13056388 -12879619 -12901577 -12782775 -18011963 -24229932 -27704295 -32309861 -39226875 -45547199
6557 -45547199 -51811529 -59310571 -67234752 -75146623 -83498054 -94840197 -103994696 -106645112
6549 -106645112 -103481596 -95379440 -83633689 -68607303 -53828617 -43211748 -35941706
6542 -35941706 -31587948 -29864112 -28334565 -23968484 -19265938 -14287417 -10079062 -8043052
6534 -8043052 -7877050 -8760060 -8941139 -8001379 -7160810 -6503083 -5401001 -5569111 -4243710
6525 -4243710 -1414996 -2760131 -5313474 -4401254 -4212945 -2563604 -240886 852456 184733
6516 184733 -1500133 -1237831 -1009874 -2096011 -3045646 -3244100 -3677438 -2721190 -2735072 -3699296
6506c699296r14479L237182M870397J702607j333936q44105n7820P32545L67330
6497D060425j649100j896699k480093j591086l626170j596364P34635P56815K979024
6488d308613K122404P36439k378412l528797j317015K698300K70672l893769j020898
6479a0619689N984819N309315J272037n1814J950530K79235l506804l319363k192825
6470d894559K29585K671534K501957J714386J307360j080706l176623q81934O36435
6461i72565J466420Q14359o81515L07859k099083R09113L178685L89819k907056
6452D06036m615294j636318O98846R33757L50677o42052k712387q78437K283132
6443e812040L742873L179294P35158j674331k303670k412597O95129L325603J430634
$$ plain form
6506 -3699296 -4613775 -1376593 3493804 5196411 3862475 3018370 2960550 3693095 4060425
6497 4060425 2411325 514626 -1965467 -3556553 -7182723 -8779087 -8044452 -7287637 -4308613
6488 -4308613 -2186209 -1449770 -3828182 -7356979 -8673994 -5975694 -5705022 -9598791 -10619689
6479 -10619689 -4634870 674445 1946482 1894668 3845198 4124433 617629 -2701734 -4894559
6470 -4894559 -4664974 -1993440 508517 2222903 3530263 2449557 -727066 -1609000 -972565
6461 -972565 493855 1308214 626699 934558 -1164525 -255412 2923273 3313092 406036
6452 406036 -4209258 -5845576 -5146730 -4212973 -3862296 -4504348 -7216735 -8095172 -5812040
6443 -5812040 -2069167 1110127 1845285 170954 -2132716 -4545313 -3850184 -524581 906053
6434I06053r00579j139587N84096N19307K449464K453178J37987m56803j102939
6425C450177j97675K816544K897119M06209j747061j799950j947467j788469j653022
6416D36405M59649Q27446N1680J18937k13447M84264l9313m85612P98573L612342
6406F050924O97174l262325j558850R63479L380341K52405m027507l575230n34302
6397a613891P55954p89289j650554k714503m703481k407322J257307J847849R73887
6388i044043K215407L884518L133158R30554j268368j537877j058461L82168J689709
6379f73235J873089R33782n27833j702313K46387Q6862o80305K783152M319125
6370F658711J950026k945773l006815j888194k718344j087245K097731K156844
$$ plain form
6434 906053 5474 -1134113 -550017 -30710 2418754 4871932 5009919 4553116 3450177
6425 3450177 3252502 6069046 8966165 9372374 7625313 5825363 3877896 2089427 436405
6416 436405 896054 1723500 1775180 1894117 1680670 2164934 2125621 1640009 2438582 6050924
6406 6050924 6748098 3485773 1926923 2890402 6270743 6523148 2495641 -1079589 -1613891
6397 -1613891 -857937 -1647226 -3297780 -6012283 -10715764 -13123086 -11865779 -10017930 -9044043
6388 -9044043 -6828636 -2944118 189040 1119594 -148774 -1686651 -2745112 -2362944 -673235
6379 -673235 1199854 2133636 1605803 -96510 149877 236739 -443566 2339586 6658711
6370 6658711 8608737 5662964 2656149 767955 -1950389 -3037634 -939903 1216941
6362A216941K221551J103872N55756l244147m700783p88454L741348L182642n09603
6353B779123p15100K26220j82058k316523m590184k70343L216253J840682J533527
6344A521597N00290j150392j511890j249820J86501J54958M9438o5057K589198
6335A024823k86889k476525m48924q73623m39202j280212k480611o7080O92579
6326f635664Q44078r58911M57110J385633J462419J591805R62062R57329l11429
6317b45568N6140k310220K55252J538989q68282k84246O40180J2201k791Q73182
6307c35163j643192j553564k53021N47644O23625j069430k019345p59513K070827
6298d391132M110208J301850m272459k624183k091633j440598K740555L889573
$$ plain form
6362 1216941 3438492 4542364 5098120 1853973 -2846810 -3635264 106084 3288726 2779123
6353 2779123 2064023 2290243 2108185 -208338 -4798522 -5068865 -1852612 -11930 1521597
6344 1521597 2021887 871495 -640395 -1890215 -1703714 -1548756 -1499318 -1564375 1024823
6335 1024823 737934 -1738591 -2187515 -3061138 -3500340 -4780552 -7261163 -7328243 -6635664
6326 -6635664 -5791586 -6750497 -6293387 -4907754 -3445335 -1853530 -891468 65861 -245568
6317 -245568 -189428 -2499648 -2244396 -705407 -1573689 -1857935 -1217755 -1205554 -1208345 -335163
6307 -335163 -1978355 -3531919 -3784940 -3237296 -2613671 -3683101 -5702446 -6461959 -4391132
6298 -4391132 -280924 1020926 -3251533 -5875716 -7967349 -9407947 -6667392 -2777819
6290b777819N12617j2736O6954J162892K353896q25387p85312K938858K490365
6281E124328R34653Q2090j395744j783176o83161j406763o81239j022879j754160
6272b586051m17453P25918J542851n1810l369222n139286k529592r14178M06929
6263a2331894p91799n793M623507K055740J010508K615799j056576l667760k674133
6254a0222401q43817k080945m625084l514850l707164o468194n041093q559213
6246d5062761p852800p327089r304788p051647n617799l657335K422775O117824
6238g7333620O864147P785735Q844140Q963136N780737M690051K531430L16280
6230c1557964M133592N816890N045997M837830J354669j053126o66481q49883
$$ plain form
6290 -2777819 -2265202 -2277938 -2210984 -1048092 1305804 480417 -304895 2633963 5124328
6281 5124328 6058981 6141071 4745327 2962151 2278990 872227 190988 -831891 -2586051
6272 -2586051 -3003504 -2277586 -734735 -786545 -4155767 -9295053 -11824645 -12738823 -12331894
6263 -12331894 -13123693 -13129486 -8505979 -6450239 -5439731 -2823932 -3880508 -7548268 -10222401
6254 -10222401 -11066218 -13147163 -17772247 -21287097 -24994261 -31462455 -36503548 -45062761
6246 -45062761 -52915561 -60242650 -69547438 -76599085 -82216884 -85874219 -83451444 -77333620
6238 -77333620 -70469473 -62683738 -53839598 -44876462 -39095725 -34405674 -31874244 -31557964
6230 -31557964 -27424372 -21607482 -16561485 -11723655 -10368986 -11422112 -12088593 -12938476
6222a2938476q15056J266021M073179K702942J251952K061186L142301j446938
6214g02889j858652j594707k047765q60320K04907K018725L233755L491917J921278
6205C806249J215161k07424k230881j10764K080389M61146j484146M32650K186764
6196F149144l04248l001483o11279J476285P97450M063j614882k610064k570867
6187b285881l858896l005023N56290J084873l27051p06321J930896K884394J829729
6178a896990J403975K245805J629538N5102J7977J759923j42423k573267j740643
6169G58997p38921R60609J597954k493084l692906n17741J578090R78079k723982
6160d292905j353815K058701L676421K817427R81428j584093j841693L23819J303359
$$ plain form
6222 -12938476 -13753532 -12487511 -8414332 -5711390 -4459438 -2398252 744049 -702889
6214 -702889 -2561541 -4156248 -6204013 -7064333 -6859426 -4840701 -1606946 1884971 3806249
6205 3806249 5021410 4813986 2583105 2472341 4552730 5013876 3529730 3962380 6149144
6196 6149144 5844896 2843413 2232134 3708419 4505869 4509932 2895050 284986 -2285881
6187 -2285881 -6144777 -9149800 -8593510 -7508637 -7835688 -8542009 -6611113 -3726719 -1896990
6178 -1896990 -493015 1752790 3382328 3437430 3455407 5215330 5072907 2499640 758997
6169 758997 20076 980685 2578639 85555 -3607351 -4125092 -2547002 -1568923 -4292905
6160 -4292905 -5646720 -3588019 88402 2905829 3887257 2303164 461471 785290 2088649
6151B088649n41761k161515p18025Q37394O05616J817271K361807K959453K153466
6142I402355k220254k768137Q20171M801579J696304j205607l719249m567570
6134B239592j153336K174720L04196j178443j192220k784142j175989L293953
6126E28331O39670j546874k192722M56852J326103m11511j506764j767974P53198
6117c721691L454164K969879p08589j337998N08597L10466k24480L84205j207996
6108D26557j569641k179719J665900K856949J472075K171306J003103l486646
6100B359884l281902k471577k12377r85128j78282J766734J429883o16599j12492
6091b301856o56496q25454J156581P72874J416145J447813k289713k443311M29538
$$ plain form
6151 2088649 1546888 -614627 -1332652 -495258 110358 1927629 4289436 7248889 9402355
6142 9402355 7182101 4413964 5234135 10035714 11732018 10526411 6807162 2239592
6134 2239592 1086256 3260976 3565172 2386729 1194509 -1589633 -2765622 528331
6126 528331 1168001 -378873 -2571595 -2114743 -788640 -1200151 -2706915 -4474889 -3721691
6117 -3721691 -267527 2702352 1993763 655765 1164362 1474828 1250348 1634553 426557
6108 426557 -1143084 -3322803 -1656903 1200046 2672121 4843427 5846530 2359884
6100 2359884 -922018 -3393595 -3605972 -4591100 -4769382 -3002648 -1572765 -2189364 -2301856
6091 -2301856 -2958352 -3783806 -2627225 -1854351 -438206 1009607 -1280106 -3723417 -3293879
6082c293879K878016K817998J331160j266962j095150L65687p81335j989952j296717
6073b331134K72908q29749o06838R9573k44595j362270j025968j679275k65093
6064g972441L284421J708452K08581k126889j252650L71439J734282K968471K087739
6055A011405m03797o34467J425940J057578j65260K98330J674669Q64435r97915
6046D130918J97364j984653j151149j234832j507773P8861j607332o48394m46988
6037d173978K262030K716528J987368J737496Q45648j663061l230866k738572
6029b257407O72177P34105l76764q95373n02758k301162k861537J91077M076245
6020c521397K260028k218943j562143J774492j40702j018444k19149J773927R15338
$$ plain form
6082 -3293879 -415863 2402135 3733295 2466333 1371183 1736870 955535 -1034417 -2331134
6073 -2331134 -2058226 -2887975 -3494813 -3395240 -3639835 -5002105 -6028073 -7707348 -7972441
6064 -7972441 -4688020 -2979568 -2770987 -4897876 -6150526 -5779087 -4044805 -1076334 1011405
6055 1011405 607608 -26859 1399081 2456659 2291399 2589729 4264398 5128833 4130918
6046 4130918 4328282 2343629 1192480 -42352 -1550125 -1471264 -3078596 -3726990 -4173978
6037 -4173978 -1911948 804580 2791948 4529444 5375092 3712031 481165 -2257407
6029 -2257407 -1585230 -851125 -1227889 -2123262 -2626020 -4927182 -7788719 -7597642 -3521397
6020 -3521397 -1261369 -3480312 -5042455 -3267963 -3408665 -4427109 -4646258 -2872331 -1956993
6011a956993k643379m11994J419504q28141L25792K226117J446649j68389o9020
6002f59854J372178J986419n82817j972900k543293j798292r1867M45102k09803
5993d055127m58385M98674r47139N14048J995491j42264k410144k398549k236945
5984i640340j32752K641518K346506r82751j364866R65399O88708J175533J958550
5975b344495J630134Q80505Q73834o17937n30951L58720J424831j49316j313396
5966B11929m88129k361366k575078j254343o45554R49532J190377k244103j403915
5957h620650j282654k841402l965404l132698k621039k443626k450855m915049
5949c2273377q503832q295194o087257o293907p138347p428344q519073p144296
$$ plain form
6011 -1956993 -4600372 -5012366 -3592862 -4421003 -4095211 -1869094 -422445 -590834 -659854
6002 -659854 712324 2698743 2115926 143026 -2400267 -4198559 -4290426 -3845324 -4055127
5993 -4055127 -4513512 -4014838 -4961977 -4447929 -2452438 -2594702 -5004846 -7403395 -9640340
5984 -9640340 -9773092 -7131574 -4785068 -5767819 -7132685 -6167286 -5478578 -4303045 -2344495
5975 -2344495 -714361 166144 1039978 422041 -108910 249810 1674641 1525325 211929
5966 211929 -276200 -2637566 -5212644 -6466987 -7112541 -6163009 -4972632 -7216735 -8620650
5957 -8620650 -9903304 -12744706 -16710110 -19842808 -22463847 -24907473 -27358328 -32273377
5949 -32273377 -40777209 -49072403 -55159660 -61453567 -68591914 -76020258 -84539331 -91683627
5941i1683627J093017O460128R573228J0143472R991009Q611758M844811O303387
5933c4662817O726335M468276K264878K968684L899991J764529J425541J470400
5925i674183j429429N8562R55635R09434m76923k53144k54392J326552J163482
5916g674406j9094Q31546J779128L42367J271463J051629J484561N17596J904415
5907A489205M38798j379784J970207L523951K102353j361757m420434m748793
5899b386254p32726J822269J103662J347975l58955k203623j123957R88461M46831
5890a096317j366848j13381K047847m99749L59157L311974L781060j196510n556260
5881c29027l897573q3808r70861q18919J702905K245959K499805K138179j867855
$$ plain form
5941 -91683627 -90590610 -84130482 -74557254 -64413782 -54422773 -45811015 -40966204 -34662817
5933 -34662817 -27936482 -23468206 -21203328 -18234644 -14334653 -12570124 -11144583 -9674183
5925 -9674183 -11103612 -11045050 -10089415 -9179981 -9656904 -9910048 -10164440 -8837888 -7674406
5916 -7674406 -7693500 -6861954 -5082826 -4740459 -3468996 -2417367 -932806 -415210 1489205
5907 1489205 1928003 548219 2518426 6042377 8144730 6782973 2362539 -2386254
5899 -2386254 -3118980 -1296711 -193049 1154926 795971 -1407652 -2531609 -1543148 -1096317
5890 -1096317 -2463165 -2576546 -528699 -1028448 -669291 2642683 6423743 5227233 -329027
5881 -329027 -4226600 -4310408 -5281269 -6100188 -4397283 -2151324 348481 2486660 618805
5872F18805j783239r69736q62203j05569K072441L55301q59918J361480L03729
5863A31091L18567R31382J76591K381129J953279k921476j146130j218187j064256
5854d58010K492305K984416j441721k554607j153313j948099o75315M9361k99872
5845c004855r42138m87875j42231J502256J589665O0706J196055r41355l627960
5836d797732k388169j107028m79141R38746L348944L060622m20652k295713j161676
5827e301799Q39807L436598L278797K105758J907330l64760q28085J451927j502932
5818E022641j333387J7997p15972k976218m68216J725650J053843J131132o23909
5809B833561k196491j844455k168788p17987O3252o51638J549167J588030L11485
$$ plain form
5872 618805 -1164434 -2134170 -2996373 -3101942 -1029501 -674200 -1534118 -172638 131091
5863 131091 449658 1381040 1557631 3938760 5892039 2970563 1824433 606246 -458010
5854 -458010 2034295 5018711 3576990 1022383 -130930 -2079029 -2754344 -2704983 -3004855
5845 -3004855 -3946993 -4434868 -4577099 -3074843 -1485178 -1424472 -228417 -1169772 -4797732
5836 -4797732 -7185901 -8292929 -8772070 -7833324 -4484380 -1423758 -1844410 -4140123 -5301799
5827 -5301799 -4461992 -1025394 2253403 4359161 6266491 5901731 5073646 6525573 5022641
5818 5022641 3689254 3707251 2991279 15061 -453155 1272495 2326338 3457470 2833561
5809 2833561 637070 -1207385 -3376173 -4094160 -4030908 -4682546 -3133379 -1545349 -1233864
5800a233864j638808M44326m82801l33816K263151R01978k733987l378809J194346
5791d998284K789733J235250J894096K112281K406396K22950j515301m054975
5783I2146l633725j403233J13332R66124K350645K043190k280895m09609K39015
5774a923010J63397N80597N19369J252929o05704j019297J099967L834527K951421
5765F854196J2206m584506m702881o66574L708411K490223l2319k98549p68452
5756B011755J393541j044786k716183L151J296874Q87371J506186J198335J511161
5747F047405k17293k197583j368063k282024k533598j722019q15486J82045K776581
5738b130035L507394L018536m75827j086051J28566j37078K81791q66660j042435
$$ plain form
5800 -1233864 -2872672 -2428346 -2911147 -3244963 -981812 -79834 -2813821 -6192630 -4998284
5791 -4998284 -2208551 -973301 920795 3033076 5439472 5662422 4147121 92146
5783 92146 -3541579 -4944812 -4831480 -3865356 -1514711 528479 -1752416 -2162025 -1923010
5774 -1923010 -1759613 -1179016 -659647 593282 -12422 -1031719 68248 3902775 6854196
5765 6854196 6866402 2281896 -2420985 -3087559 620852 3111075 3078756 2780207 2011755
5756 2011755 3405296 2360510 -355673 -352522 944352 1831723 3337909 4536244 6047405
5747 6047405 5830112 3632529 2264466 -17558 -2551156 -4273175 -5088661 -4906616 -2130035
5738 -2130035 1377359 4395895 3920068 2834017 2962583 2825505 3107296 2240636 1198201
5729A198201K46966J714905K108839K19739m7269j838074j6957m4807k318771
5720A222772l654562k445844J66531n80337j823951O72241L275399K723478r24140
5711a368413l188562k118823J644790M719684M613413J131617k115900l067562
5703B50244k895431J519876L491065J705774k428888l806887n510214l481928
5695a1156389j059213K128973L149661L176810J764216J146371K547616J647103
5687C345148m41956j120614N80759R28695k158718k173669j283872J866223K419308
5678A961304J222507m68183p18786m70294j434383k243178J229339L223345j87866
5669B113805p22258j093319l019676j415746R31098J728431l32456L30595K337177
$$ plain form
5729 1198201 1445167 3160072 5268911 5488650 5441381 3603307 3586350 3541543 1222772
5720 1222772 -2431790 -4877634 -4711103 -5291440 -7115391 -6443150 -3167751 -444273 -1368413
5711 -1368413 -4556975 -6675798 -5031008 -311324 4302089 5433706 3317806 250244
5703 250244 -2645187 -1125311 2365754 4071528 1642640 -2164247 -7674461 -11156389
5695 -11156389 -12215602 -10086629 -6936968 -3760158 -1995942 -849571 1698045 3345148
5687 3345148 2903192 1782578 2363337 3292032 1133314 -1040355 -2324227 -458004 1961304
5678 1961304 3183811 2715628 1996842 1526548 92165 -2151013 -921674 2301671 2113805
5669 2113805 1391547 298228 -2721448 -4137194 -3206096 -1477665 -1810121 -1479526 857651
5660H57651K258572K469422J221044k165112k345126L20579k327975j272370J901487
5651I18172q60928j756255L69855P14203K119726K076004m71458k615649j183571
5642f89901P07855Q34016R15130j66909j05601o58833j39937L85396m15419K613245
5632C279042K392115j128318l745655l316277P09567L305385K174223q60582r40001
5623A869499N2510j231601j161254K93597K50887M333455N195720k68647k875125
5614F459041n67657p0339j588826j639726r98277j534069l468261k565639P78097
5605e195656K145226K957363K800647K105525L180728M65978j049825k122236
5597E287750l015322Q07228J695220j520762m488615l134492L582643K532435
$$ plain form
5660 857651 3116223 5585645 6806689 4641577 2296451 2617030 289055 -983315 918172
5651 918172 57244 -1699011 -1329156 -614953 1504773 3580777 3109319 493670 -689901
5642 -689901 17954 851970 1767100 1600191 1494590 835757 695820 1081216 665797 3279042
5632 3279042 5671157 4542839 797184 -2519093 -1809526 1495859 3670082 2809500 1869499
5623 1869499 1922009 690408 -470846 -177249 73638 4407093 9602813 9334166 6459041
5614 6459041 5891384 5821045 4232219 2592493 1594216 60147 -3408114 -5973753 -5195656
5605 -5195656 -3050430 -93067 2707580 4813105 7993833 8459811 7409986 5287750
5597 5287750 2272428 3079656 4774876 3254114 -1234501 -4368993 -786350 1746085
5589A746085j459336o44804n0343r16773o2512J203370J974351K063265j868909
5580A984394l832763k555333J176048K644882K977681J407828q38097j598711
5572A365929R71062K488243O51639m06159M58969O0842p83527k79942q61273m42535
5562C223248j193584j176521O88637J591315J218250J212548j494244k116248
5554A953401J74516J558795J525833K78587k551190n105451l832252J979915K352402
5545a665444j610711r44119j36714J753952L374119k72020j009498J150303J035291
5536A675159j901749r77985N54534R90938N44650j346120j669077M17921L692069
5527A980340K874190j108316j741195l00108J661150K130524k212103j682808
$$ plain form
5589 1746085 286749 -358055 -408398 -1325171 -1387683 -184313 1790038 3853303 1984394
5580 1984394 -1848369 -4403702 -3227654 -582772 2394909 3802737 2964640 1365929
5572 1365929 2336991 4825234 5476873 5070714 5529683 5590525 4806998 4527056 3665783 3223248
5562 3223248 2029664 853143 1541780 3133095 4351345 5563893 4069649 1953401
5554 1953401 2127917 3686712 5212545 5491132 2939942 -2165509 -5997761 -4017846 -1665444
5545 -1665444 -3276155 -4220274 -4356988 -2603036 771083 499063 -510435 639868 1675159
5536 1675159 -226590 -1204575 -650041 340897 885547 -460573 -2129650 -1711729 1980340
5527 1980340 4854530 3746214 2005019 1704911 3366061 5496585 3284482 1601674
5519A601674j455537m97289J09818J433854J822830o28942L05271J025436k836
5510C714279k607545m048786k414404M77036M6674j97590Q97460p00271o62812
5501e495959P80055K48204k28806L120854L771462R51723p46133j658350k459376
5492a716326j387951j3765k85718j397238K274465K221171r1033K56297K287683
5483B147585J182247N32184J017302r55644l954985m958202q53708J794145L814131
5474b34945M752387N615524M225618J026645j719969m170000o831334m767420
5466b103494k784874l29496O26311K015582K011554J731049K555502J541717Q93856
5457F157707L449326K382732k336789l332743j551914j89052l79760j191606j219104
$$ plain form
5519 1601674 146137 -351152 -241334 1192520 3015350 2386408 2691679 3717115 3714279
5510 3714279 1106734 -2942052 -5356456 -4879420 -4832746 -5030336 -4132876 -4833147 -5495959
5501 -5495959 -4715904 -4467700 -4696506 -1575652 2195810 3147533 2401400 743050 -1716326
5492 -1716326 -3104277 -3118042 -3403760 -4800998 -2526533 -305362 -396395 -140098 2147585
5483 2147585 3329832 3862016 4879318 3923674 -31311 -4989513 -5843221 -4049076 -234945
5474 -234945 4517442 10132966 14358584 15385229 13665260 9495260 2663926 -2103494
5466 -2103494 -4888368 -5217864 -4591553 -2575971 -564417 1166632 3722134 5263851 6157707
5457 6157707 9607033 11989765 9652976 6320233 4768319 4579267 4199507 3007901 1788797
5448A788797k022473k395701m99205L64241Q79368o21492m44903O85320j621941
5439c887989N12335L097874L150621j647927j123593K490677K215890N24169r88734
5430D343323J284266J649766q10978j351181k181595l389545m867243k498423
5422g821610Q26955K837140J484470J701250O28871n26304N84185J76025q1118
5413a90136l349961k782759j52649J864000L120078J199514o98722P42434K673720
5404B425519l31478j331943l395504l659330j619867n37657J086194J296168J686494
5395d381404L534436K556955m04466Q16366L397577R36055k267278k873136m082389
5386b767284l604191j57939L945011K556484l19514L96494J021852k423452j484956
$$ plain form
5448 1788797 -233676 -2629377 -3128582 -2764341 -1884973 -2506465 -2951368 -2266048 -3887989
5439 -3887989 -3375654 -277780 2872841 1224914 101321 2591998 4807888 5332057 4343323
5430 4343323 5627589 7277355 6466377 5115196 2933601 -455944 -5323187 -7821610
5422 -7821610 -6994655 -4157515 -2673045 -971795 -342924 -869228 -285043 -109018 -190136
5413 -190136 -3540097 -6322856 -6475505 -4611505 -1491427 -291913 -990635 -248201 2425519
5404 2425519 2094041 762098 -2633406 -6292736 -7912603 -8450260 -7364066 -6067898 -4381404
5395 -4381404 -846968 1709987 1305521 2121887 5519464 6455519 4188241 1315105 -2767284
5386 -2767284 -6371475 -6529414 -2584403 -27919 -347433 49061 1070913 -1352539 -2837495
5377b837495N05382J322908k45112j616374j74261O90675K86540n92056J175737
5368a484056M82722j389587j504522P51608K920704J237495J712479k6208O6427
5359B767062J514447J134556R60626J542784k322997k644791r71656o9159K088377
5350C999249L97985k043960k659634l144328o93095K076855P97754k731320m70673
5341d471167K680045P25145j256676l176432j262237R26997k83959k135415L82562
5332g871137O56276J086599K58363R10951M116748J638117Q6932r13420k257593
5323b288164j655958J926513J488981J307819K306996k84N28378q1538L59672
5314C892415M97170k736327m793306m041049J106098O552893O003010J343598
$$ plain form
5377 -2837495 -2332113 -1009205 -1254317 -2870691 -3044952 -2354277 -2067737 -2659793 -1484056
5368 -1484056 -1001334 -2390921 -3895443 -3143835 -223131 1014364 2726843 2700635 2767062
5359 2767062 4281509 5416065 6376691 7919475 5596478 2951687 1980031 1910872 3999249
5350 3999249 4397234 2353274 -306360 -3450688 -4143783 -2066928 -1269174 -4000494 -4471167
5341 -4471167 -1791122 -1065977 -2322653 -5499085 -6761322 -5834325 -6118284 -8253699 -7871137
5332 -7871137 -7214861 -6128262 -5869899 -4958948 -842200 795917 882849 -30571 -2288164
5323 -2288164 -3944122 -2017609 -528628 779191 3086187 3085903 3614281 3532743 3892415
5314 3892415 4389585 1653258 -3140048 -7181097 -6074999 477894 6480904 7824502
5306G824502j645147n742207k294690O54720J470664J445042j34234N96870J913912
5297D089432J917710M00399l74934K16354k501583k919047P22343L707245J784067
5288G041986j149706p70189k112633j762187j632674J64828K279546N74289L1950
5279B665210k130117k685567r11471M37401N3315J733992J968156J051851o28459
5270A554311J626386M29255p51222M99381j018828J391739J29041j024059J345212
5261D181216p61131j500897j777023k297717p26169J625645m18560n58308M266623
5252B033679J989255k747961k87064J886496j093796l709203M79572O35185k102061
5243b915898j564666M95587J398156O53173j228102j634316r14023K654889L63266
$$ plain form
5306 7824502 6179355 437148 -1857542 -1202822 267842 1712884 1578650 2175520 4089432
5297 4089432 6007142 6407541 6032607 6248961 3747378 828331 1550674 5257919 7041986
5288 7041986 5892280 5122091 3009458 1247271 -385403 -220575 2058971 2633260 2665210
5279 2665210 535093 -2150474 -3061945 -2624544 -2571229 -837237 1130919 2182770 1554311
5270 1554311 3180697 3609952 2858730 3358111 2339283 3731022 3860063 2836004 4181216
5261 4181216 3420085 1919188 142165 -2155552 -2881721 -1256076 -1674636 -2232944 2033679
5252 2033679 4022934 1274973 987909 2874405 1780609 -1928594 -1449022 -813837 -2915898
5243 -2915898 -4480564 -3984977 -2586821 -1933648 -3161750 -4796066 -5710089 -3055200 -2691934
5234b691934j49192J38731Q26143P17201o8402k114657l248454J157816L650970
5225a781778J941946k130922k495437r08457J492042L367613J638355m89642M19092
5216A052812p51022N33772J736674J03796j45130J102010Q73622l90641j323839
5207B792054j189765j916003N63653J342075K348770M229920J444277j886045
5199G728936k025244k091307j614039j154949r07855R64717N23133L81590M02406
5190B207388l235153l249547K408461N524247L389980m76576r917k325904o311709
5181b078730k612132J669259K123832O64357Q13734j529837n316607m170635k2770
5172a0459529K607190J870480j29284K488227K342771J55518J279934L277312
$$ plain form
5234 -2691934 -2841126 -2702395 -1876252 -1159051 -1227453 -3342110 -6590564 -5432748 -1781778
5225 -1781778 160168 -1970754 -4466191 -5374648 -3882606 -514993 1123362 633720 1052812
5216 1052812 301790 835562 2572236 2676032 2530902 3632912 4506534 4115893 2792054
5207 2792054 1602289 -313714 249939 1592014 3940784 8170704 9614981 7728936
5199 7728936 5703692 3612385 1998346 843397 -64458 900259 1423392 1804982 2207388
5190 2207388 -1027765 -4277312 -1868851 3655396 7045376 6568800 6558883 4232979 -2078730
5181 -2078730 -4690862 -3021603 -897771 -233414 580320 -949517 -6266124 -10436759 -10459529
5172 -10459529 -7852339 -5981859 -6111143 -3622916 -1280145 -1124627 155307 3432619
5164C432619Q13741j353417M007O47751k809278k052981n33105P96697j191173
5155b245139O20053O59988j550425j994108R09458K949230K841469J29953j467515
5146H52964j292777m33415r21379j209342J484122K002572j599720l86686K275049
5137G71388m3090k653536j460571K855933J117875p40832j722269j877323j428199
5128e180624k74419J427981J834418J240425L53079N85597J66999Q59136K891459
5119C904051L041319m67495k967463q37860O35678n30129o09164p97064N58078
5110A929951J525968j36697n94876l66168n62241R49438j201181j891473Q05720
5101D58441J0924m68814k266078k974126M46240J33471J4342P97647L87043r71411
$$ plain form
5164 3432619 4246360 2892943 2896950 3544701 735423 -1317558 -1850663 -1053966 -2245139
5155 -2245139 -1625086 -965098 -2515523 -4509631 -3600173 -650943 2190526 2320479 852964
5146 852964 -439813 -873228 -1794607 -3003949 -1519827 482745 -1116975 -1503661 771388
5137 771388 728298 -1925238 -3385809 -529876 587999 -152833 -1875102 -3752425 -5180624
5128 -5180624 -5455043 -4027062 -2192644 -952219 -599140 -13543 153456 1012592 3904051
5119 3904051 6945370 6477875 3510412 2672552 3308230 2778101 2168937 1371873 1929951
5110 1929951 3455919 3319222 2724346 2358178 1795937 2745375 1544194 -347279 458441
5101 458441 469365 551 -2265527 -5239653 -4793413 -4659942 -4645600 -3847953 -3460910 -4432321
5091d432321j850364q50545m79224J525147R83407j31771q27419J908657L273355
5082h81078N42399j837622l176604J619864J376535J34803K67582J283463J462533
5073G91875r25770J020994J683698J89575l7273j688618j027294J621160O00976
5064B229323j816020j406526N89160q01289r19137L01881K70746m35733N12463
5055a475132J256033L44038j24302j313829j3505K546600K499269L457000n26311
5046F649861n15534l113636n250047k862539j991011M67883J636124K422360K850955
5037B94416K35741J010574Q89068J851683l84533k324319k796644K83155M55977
5028d84882R45564K596197J043680q74905j82164L52566k035265k952802j666313
$$ plain form
5091 -4432321 -6282685 -7133230 -7612454 -6087307 -5103900 -5235671 -6063090 -4154433 -881078
5082 -881078 -338679 -2176301 -5352905 -3733041 -2356506 -2221703 -1954121 -670658 791875
5073 791875 -133895 887099 2570797 2760372 2723099 1034481 7187 1628347 2229323
5064 2229323 413303 -993223 -404063 -1205352 -2124489 -1822608 -1551862 -1987595 -1475132
5055 -1475132 -219099 124939 637 -1313192 -1326697 1219903 3719172 7176172 6649861
5046 6649861 6134327 3020691 -2229356 -5091895 -7082906 -6615023 -4978899 -2556539 294416
5037 294416 530157 1540731 2429799 4281482 3896949 1572630 -1224014 -940859 -484882
5028 -484882 460682 3056879 4100559 3225654 3043490 3396056 1360791 -1592011 -3258324
5019c258324K140016L120572J179748k78108O69413M16945N47405n85403j175938
5010B776326o10074j294245j823493R29311Q33914j072612r45442p17906J39784
5001a784437o05144n58571K171261M695319Q99567k104399n94886o03145r95115
4992E20450N10154j392242J57935J644747n3515j905355N87021K57246j14275
4983B12166j621185m47551k94711K724555J388122j713055j89004J356924K724813
4974D141074M44539j733242q58900J190362J489246n40413K65224J682348j5353
4965F064885l769799m426791o81500K595922N79652j489820l70277L62323J455958
4956C20553J021300L82028J337742J588130o4687N66839k726207m440790l111390
$$ plain form
5019 -3258324 -1118308 2002264 3182012 2903904 3573317 3990262 4537667 3952264 2776326
5010 2776326 2166252 872007 -951486 -22175 811739 -260873 -1206315 -1924221 -1784437
5001 -1784437 -2389581 -2948152 -776891 3918428 4817995 2713596 2118710 1515565 520450
4992 520450 1030604 -361638 -203703 1441044 1387529 -517826 69195 326441 212166
4983 212166 -1409019 -1856570 -2151281 573274 1961396 248341 59337 1416261 4141074
4974 4141074 4585613 2852371 1993471 3183833 4673079 4132666 4397890 6080238 6064885
4965 6064885 2295086 -2131705 -2813205 -217283 362369 -1127451 -1497728 -1135405 320553
4956 320553 1341853 1723881 3061623 4649753 4585066 5151905 2425698 -2015092 -5126482
4947e126482k69283j397353j469742K463056L681013J577990o15160j374764o41522
4938c172247Q79078K817888J372089j065997j524384k727198Q13602L245022K168994
4929B806847M76148j844134m89340J512039K957740J151546j753579j625257K379076
4920E571086K003126q09085J73107L8350j541877l074424l036112j172313J26612
4911a721530K073606J437398K482765O8974K91167q10872K29119n44655k491113
4902A014859j905299n44292J325606p9741j010696j904828N7795K881565J951531
4893A786500N67087k839965k294153o23191K57414K240807L14616k044996J383329
4884a252552M433201J406007j734245j104046J04337R01812p11643j348721n04961
$$ plain form
4947 -5126482 -5395765 -6793118 -8262860 -5799804 -2118791 -540801 -1155961 -2530725 -3172247
4938 -3172247 -2293169 524719 1896808 830811 -693573 -3420771 -2607169 637853 2806847
4929 2806847 3282995 1438861 949521 2461560 5419300 6570846 4817267 3192010 5571086
4920 5571086 7574212 6765127 6938234 6976584 5434707 2360283 -675829 -1848142 -1721530
4911 -1721530 352076 1789474 4272239 4341213 4632380 3821508 4050627 3505972 1014859
4902 1014859 -890440 -1434732 -109126 -188867 -1199563 -3104391 -3046596 -165031 1786500
4893 1786500 2353587 -486378 -2780531 -3403722 -3146308 -905501 -590885 -2635881 -1252552
4884 -1252552 3180649 4586656 2852411 1748365 1852702 2754514 2042871 694150 189189
4875A89189J11735k06047J249365L127762J027455k318864J72092J41285n68385
4866B925587j338869k854909k443496p49403o81035J159053K041834J516547j36823
4857e61514p44705N32343N65518O55778K727940K900957R09012J328405j63631
4848H150103k533848p20690P78692j47336q88713k469255l198853k247582p3432
4839c350914n34030q79846J196661J464974K155042K973326K417687O15144o47322
4830E410722J22331J402711j672789l308461l286864k539848j028174P41793J877236
4821b281343K062876J424202l01827L16127K366167Q23865j438479j744650l271815
4812b044877j884693K990308N2047l404766k446690Q74706J665847J025219j294062
$$ plain form
4875 189189 300924 94877 1344242 4472004 5499459 3180595 3352687 3493972 2925587
4866 2925587 1586718 -1268191 -3711687 -4461090 -5142125 -3983072 -1941238 -424691 -561514
4857 -561514 -1306219 -773876 -208358 447420 3175360 6076317 6985329 8313734 8150103
4848 8150103 5616255 4895565 5674257 5526921 4638208 2168953 -1029900 -3277482 -3350914
4839 -3350914 -3884944 -4764790 -3568129 -2103155 51887 3025213 5442900 6058044 5410722
4830 5410722 5533053 6935764 5262975 1954514 -1332350 -3872198 -4900372 -4158579 -2281343
4821 -2281343 -218467 1205735 903908 1220035 3586202 4410067 2971588 1226938 -2044877
4812 -2044877 -3929570 -939262 -887215 -4291981 -6738671 -5863965 -4198118 -3172899 -4466961
4803d466961l065786j078731K351092K238910L865202K781206o48654j946064
4795C0214k905492l183832j503289J465509J084069J862971J460287J943506K206030
4786B459973j208760k306107P75322m37589k306292l104284j964073O05447K421654
4777e064709Q36232J976395K261119J246120K323229K838259L54325k07262J033463
4768G597171j057538k390548L72884J848771K050396j09684m211822n627066l912532
4759e439968k980952j62374L749123K878911J260260K07303l2195L34423j037178
4750a222647j571224L742778M056483n92836p6748m87024q05040n33733o33337
4741A876672J167891J427013j063198k823116j222123J258765P36147J37885M84849
$$ plain form
4803 -4466961 -7532747 -8611478 -6260386 -4021476 -156274 2624932 1976278 30214
4795 30214 -2875278 -6059110 -7562399 -6096890 -5012821 -3149850 -1689563 253943 2459973
4786 2459973 1251213 -1054894 -279572 -717161 -3023453 -6127737 -8091810 -7486363 -5064709
4777 -5064709 -4228477 -2252082 9037 1255157 3578386 6416645 6770970 6563708 7597171
4768 7597171 6539633 4149085 4521969 6370740 8421136 8311452 4099630 -1527436 -5439968
4759 -5439968 -8420920 -8583294 -4834171 -1955260 -695000 -487697 -519892 -185469 -1222647
4750 -1222647 -2793871 948907 5005390 4412554 4335806 3848782 3043742 2510009 1876672
4741 1876672 3044563 4471576 3408378 585262 -636861 621904 1358051 1495936 1980785
4732A980785l27039k409455k982047k508023L20120M45477Q29762K117865L290998
4723G58443K050771p64162k205331m3405K488883J041163o14236K310186J018082
4714F040394l718731l758065k052257K624363L328510l268030m020470M24717
4706d399569O75110K72992q03975o69536J446748o67774j545010k626146q83459
4697i200619K613640K447039J985153N50777j40882o73978k079899P29976K539113
4688a229680j27396l192561n45585J123533J121088k70631J337308L086380K797740
4679D100196J309844K041613J539610j29312r50145p13075l90352j34082j213432
4670E460865k755816k377043k686664q13207J645655l45373q1290j10186j319444
$$ plain form
4732 1980785 1653746 -755709 -3737756 -6245779 -5925659 -5480182 -4650420 -2532555 758443
4723 758443 2809214 2045052 -160279 -203684 2285199 3326362 2712126 5022312 6040394
4714 6040394 2321663 -1436402 -3488659 -864296 2464214 -803816 -4824286 -4399569
4706 -4399569 -3724459 -3451467 -4255442 -4924978 -3478230 -4146004 -5691014 -8317160 -9200619
4697 -9200619 -6586979 -4139940 -2154787 -1604010 -1744892 -2418870 -4498769 -3768793 -1229680
4688 -1229680 -1357076 -4549637 -5095222 -3971689 -2850601 -3121232 -1783924 1302456 4100196
4679 4100196 5410040 7451653 8991263 8861951 7911806 7198731 6808379 6674297 5460865
4670 5460865 2705049 328006 -2358658 -3171865 -1526210 -1871583 -1952873 -2063059 -3382503
4661c382503J087338J734963K453429J254014n52782n99688j873284j520667j894108
4652c293288k768637r69745N59318L182130O049226J909740m12842j51392o4585
4643D039925j165014j772446k430397K12959L102439O71757k284427k534983k287432
4634d447619j660074j359697j216334M3196K7335K38335J627629J290076J312995
4625d144158L104435L138115P28875j422317j795141J78049l65561j57965q1466
4616h17134O50823O26168L17840K152137j122988j162168n78487L02137j185489
4607h17161k745583J729084L748794R37761J407328K15468J295070O49818k581769
4598C838810k782512l046796n34612L143650J056652R39501K59754j126547p42252
$$ plain form
4661 -3382503 -2295165 -560202 1893227 3147241 2594459 1994771 121487 -1399180 -3293288
4652 -3293288 -6061925 -7031670 -6472352 -3290222 2759004 4668744 4255902 4104510 4039925
4643 4039925 2874911 1102465 -1327932 -1114973 1987466 2659223 374796 -2160187 -4447619
4634 -4447619 -6107693 -7467390 -8683724 -8640528 -8613193 -8374858 -6747229 -5457153 -4144158
4625 -4144158 -1039723 2098392 2827267 1404950 -390191 -212142 -577703 -735668 -817134
4616 -817134 -166311 459857 777697 2929834 1806846 644678 66191 368328 -817161
4607 -817161 -3562744 -1833660 1915134 2852895 4260223 4475691 5770761 6420579 3838810
4598 3838810 1056298 -1990498 -2525110 618540 1675192 2614693 2874447 1747900 1005648
4589A005648K028537L42688j150356r30432j786634m44792K37839J375584J328039
4580B006121k38065m64368q18997j191373Q11175J060721l27368Q41593J021669
4571B701108m55572k299282l32001J317093K04039J961823K05986k637735j706762
4562a041303r00535Q99636J164624K720483J460553k788172m371036k19525L058746
4553a6529K649485l19296l54169l08748O92574j829523r35385J873513K15859
4544A667781J648376J103054j444405l370031l082160j52632P57237J433688K605062
4535A165970N454651J232702k076863R55281J149585Q53253k131558l916682j482698
4526A203641J325237j211998j928110J696551J087314Q22778J002478K52367k405440
$$ plain form
4589 1005648 3034185 3376873 2226517 1296085 -490549 -935341 -697502 678082 2006121
4580 2006121 1768056 1303688 484691 -706682 104493 1165214 837846 1679439 2701108
4571 2701108 2245536 -53746 -385747 931346 1135385 3097208 3303194 665459 -1041303
4562 -1041303 -1941838 -1042202 122422 2842905 4303458 1515286 -2855750 -3075275 -16529
4553 -16529 2632956 2313660 1959491 1650743 2343317 513794 -421591 1451922 1667781
4544 1667781 3316157 4419211 2974806 -395225 -3477385 -3630017 -2872780 -1439092 1165970
4535 1165970 6620621 7853323 5776460 6731741 7881326 8734579 6603021 2686339 1203641
4526 1203641 2528878 1316880 -611230 1085321 2172635 2995413 3997891 4250258 1844818
4517A844818j963177N66017P41779p88302j209729m07303J656442J419504Q95715
4508B755764j593342j602119k11504p09810k72229N49693J839923K032945L97902
4499C187223p4303l76270l762951l325131K365775L592302K586524p70058k26578
4490C196533K412447o6669k125643n9942p5587k446225k768837j024824K078340
4481h80407L457216J727403J619522j167515j408579j18322k36969M9142Q3005
4472C124496j179780k781061o28831K426151K603900Q49922r03831k682323j241347
4463d12704j451531r23471J344356j905000k083450J401342L89522o83743r47923
4454e272602k105007j772472L807060L823711L12712m09838l65955q93103N94773
$$ plain form
4517 1844818 -118359 447658 1189437 401135 -808594 -1215897 440545 1860049 2755764
4508 2755764 1162422 -439697 -651201 -1361011 -1633240 -1083547 756376 2789321 3187223
4499 3187223 3112920 2736650 -1026301 -4351432 -1985657 1606645 4193169 3423111 3196533
4490 3196533 5608980 5542311 3416668 3356726 3281139 834914 -1933923 -2958747 -880407
4481 -880407 2576809 4304212 5923734 4756219 3347640 3229318 2992349 3041491 3124496
4472 3124496 1944716 -836345 -1465176 960975 3564875 4414797 3510966 828643 -412704
4463 -412704 -1864235 -2787706 -1443350 -3348350 -5431800 -4030458 -3640936 -4324679 -5272602
4454 -5272602 -7377609 -9150081 -5343021 -1519310 -1206598 -1616436 -1982391 -2875494 -2280721
4445b280721K290697M02594j749191j721564j005510l3383K398813O90713q82168
4436a889720J293677K157616j760070l068023m43385K546374K555736J578082
4428B970287K19144l336963j63967J017498j585164j62361K357878j20927j194221
4419A204J523283L242484L99849j939595K312618K899372j986148j721784N12569
4410E243852K903641L794552K547815k282249n351988k091341j018116k456108
4402A290058r11429Q41534O66783j36858k645195j875994J035392J286548P14669
4393B65508k637887k417503q57563J211126M159021K786289k77822j567434L14329
4384I78064o68405j833278P04618q84313r36347J114119J657655O6751R9587j398172
$$ plain form
4445 -2280721 9976 412570 -1336621 -3058185 -4063695 -4097078 -1698265 -1007552 -1889720
4436 -1889720 -596043 1561573 -198497 -3266520 -3709905 -1163531 1392205 2970287
4428 2970287 3189431 -147532 -311499 705999 -879165 -1041526 1316352 1195425 1204
4419 1204 1524487 4766971 5166820 3227225 5539843 8439215 6453067 4731283 5243852
4410 5243852 8147493 11942045 14489860 12207611 6855623 4764282 3746166 1290058
4402 1290058 378629 1220163 1886946 1750088 -895107 -2771101 -1735709 -449161 265508
4393 265508 -2372379 -4789882 -5647445 -4436319 -277298 2508991 2231169 663735 978064
4384 978064 309659 -1523619 -819001 -1703314 -2639661 -1525542 132113 198864 298451 -1099721
4374a099721K55451K37420J746529K006946J258834M26436N59532m879623l518401
4365c006597L20727M71582K31133O46964P97548R53337K112963K091196j000152
4356C618701j897630j07580j291332l287047k816825R02450J441181M02432o02429
4347c638079k25584j148841J605584L181146K657359R67990J427045Q51342o15532
4338E062430k237221l193337j525531P65955l67669l09679P86453J341059Q36005
4329A158465k78589k510148O94292K465230R95349m51125j806064J441751L06879
4320B016040j869046p70021l17377J303017L468728J161174j909130k781504k65009
4311C6872O21639n25538j230285n62789J262108l92072j596431j549258J685885
$$ plain form
4374 -1099721 -844270 -606850 1139679 3146625 4405459 4831895 5391427 511804 -3006597
4365 -3006597 -2685870 -2214288 -1983155 -1336191 -538643 414694 2527657 4618853 3618701
4356 3618701 1721071 1613491 322159 -2964888 -5781713 -4879263 -3438082 -3035650 -3638079
4347 -3638079 -3863663 -5012504 -3406920 -225774 2431585 3399575 4826620 5677962 5062430
4338 5062430 2825209 -368128 -1893659 -1127704 -1495373 -1805052 -1018599 322460 1158465
4329 1158465 879876 -1630272 -935980 1529250 2524599 2073474 267410 1709161 2016040
4320 2016040 146994 -623027 -940404 362613 3831341 4992515 3083385 301881 36872
4311 36872 658511 132973 -1097312 -1660101 -397993 -790065 -2386496 -3935754 -2249869
4302b249869K286039J350697n46661Q85924L03472J431956K631936j543979l063845
4293A485670j223894M282J224077J792382Q76080p12403j481788j383013j394497
4284h13104J741795L457310K118821k002985k882100j832910j212393j197847
4276b623413j091783k135101j150474M97516J655726N70013J01031R21403R69357
4267b285725Q96345l36744j111930j936605P56453P80984J01246J14711K54464
4258b766801Q38305j460283l088788j366572J136245J469569J163253N23359J112512
4249b439201j84008j394517J365628K842587J794187o32435l38066r07134n43200
4240d36159M15733J676203L85771q37693J328530J163384N72549J814711r98417
$$ plain form
4302 -2249869 36170 1386867 840206 1726130 2029602 3461558 6093494 4549515 1485670
4293 1485670 261776 266058 1490135 3282517 4158597 3446194 1964406 581393 -813104
4284 -813104 928691 4386001 6504822 4501837 1619737 -213173 -1425566 -2623413
4276 -2623413 -3715196 -5850297 -7000771 -6503255 -4847529 -4277516 -4176485 -3255082 -2285725
4267 -2285725 -1389380 -1726124 -2838054 -4774659 -4018206 -3237222 -3135976 -3021265 -2766801
4258 -2766801 -1928496 -3388779 -6477567 -7844139 -6707894 -5238325 -4075072 -3551713 -2439201
4249 -2439201 -2623209 -4017726 -2652098 190489 1984676 1352241 1014175 107041 -436159
4240 -436159 -20426 1655777 2041548 1203855 2532385 3695769 4268318 6083029 5084612
4231E084612j027931J744506q97430j783606J695223J299449k085649l575725
4223D53449j001767q40612j265050o97631J524467K160304J54903o42896r43749
4214a098582k00593k81253R48252L150355K324304J82539k921739j404587J707661
4205B406357N60466k270119q94110R87484J40878N0048l60797j333318n21828
4196a234939o2835N77542J477551O39452j003069Q01980j198740k177210N13991
4187a666277J594072J258755l40684J315127N56621j333429n11427R23479n8820
4178A737417o35516j567075k203157J2836l24871R91498P21635O60388m22574
4169a029419J337992J831695n2969q65176O65383J34654n73808j6434M54471J123475
$$ plain form
4231 5084612 4056681 5801187 4903757 3120151 4815374 6114823 4029174 453449
4223 453449 -548318 -1388930 -2653980 -3351611 -1827144 333160 488063 -154833 -1098582
4214 -1098582 -1299175 -1580428 -632176 2518179 4842483 5025022 2103283 698696 2406357
4205 2406357 2966823 696704 -197406 790078 930956 981004 620207 -713111 -1234939
4196 -1234939 -1297774 -720232 757319 1396771 393702 1195682 -3058 -2180268 -1666277
4187 -1666277 -72205 1186550 845866 2160993 2717614 1384185 872758 1796237 1737417
4178 1737417 1101901 -465174 -2668331 -2655495 -2980366 -1988868 -1267233 -606845 -1029419
4169 -1029419 308573 2140268 2087299 1222123 1887506 2022160 1448352 1431918 1886389 3009864
4159C009864N63690j893350j908472K81610R69139J58090r18068k43258N42554
4150E61799L076530J284767j457506j358361j036195o82043J84391j319862o39307
4141a385787j691085p85253J684021P42068J502450J662527J400433J991778J479687
4132F600839l83914j349062j412758k112680j563106k985934k108784Q51247j6188
$$ plain form
4159 3009864 3573554 1680204 -228268 53342 1022481 1180571 262503 19245 561799
4150 561799 3638329 4923096 3465590 2107229 1071034 388991 573382 -746480 -1385787
4141 -1385787 -3076872 -3862125 -2178104 -1436036 66414 1728941 3129374 5121152 6600839
4132 6600839 6216925 4867863 3455105 1342425 -220681 -3206615 -5315399 -4464152 -4480340
$$ [...]
##END NTUPLES=NMR SPECTRUM
##END=
