##TITLE=abcd
##JCAMPDX= 6.0         $$ Bruker NMR JCAMP-DX V2.0
##DATA TYPE= NMR FID
##DATA CLASS= NTUPLES
##ORIGIN= UXNMR, Bruker Analytische Messtechnik GmbH
##OWNER= root
$$ XWIN-NMR		Version 3.5
$$ Wed Aug 13 11:12:05 2025 Russian Standard Time (UT+4h)  servis@DPX200
##.OBSERVE FREQUENCY= 200.131235884673
##.OBSERVE NUCLEUS= ^1H
##.DELAY= (6, 6)
##.ACQUISITION MODE= SIMULTANEOUS
##.ACQUISITION SCHEME= undefined
##.AVERAGES= 32
##.DIGITISER RES= 18
##SPECTROMETER/DATA SYSTEM= spect
##.PULSE SEQUENCE= zg
##.SOLVENT NAME= Acetone
##.SHIFT REFERENCE= (INTERNAL, Acetone, 0, 16.5164)
##AUDIT TRAIL= $$ (NUMBER, WHEN, WHO, WHERE, WHAT)
$$ ##TITLE= Audit trail, XWIN-NMR		Version 3.5
$$ ##JCAMPDX= 5.01
$$ ##ORIGIN= Bruker BioSpin GmbH
$$ ##OWNER= servis
$$ F:\spectra/data/av/nmr/H1/1/audita.txt
$$ ##AUDIT TRAIL=  $$ (NUMBER, WHEN, WHO, WHERE, WHAT)
(   1,<2025-08-13 10:33:52.81 +0400>,<servis>,<DPX200>,
      <created by zg, POWCHK disabled, PULCHK disabled
       configuration hash MD5:
       00 E9 B6 7A A2 85 ED C7 34 08 36 98 17 FE 4E 26
       data hash MD5: 32K
       F8 5A 1D 37 57 06 70 3F A4 2D 24 46 FC 1B B2 9C>)
$$ ##END=
$$ 
$$ hash MD5
$$ 77 69 3D A0 10 33 EE 07 D8 A8 5B C3 5B BA 71 D6
##$RELAX= 
##$RELAX= 
##$RELAX= 
##$RELAX= 
##$RELAX= 
##$RELAX= 
##$RELAX= 
##$RELAX= 
$$ Bruker specific parameters
$$ --------------------------
##$DU= <F:\spectra>
##$EXPNO= 1
##$NAME= <H1>
##$PROCNO= 1
##$TYPE= <nmr>
##$USER= <av>
##$AMP= (0..31)
100 100 100 100 100 100 100 100 100 100 100 100 100 100 100 100 100 100 
100 100 100 100 100 100 100 100 100 100 100 100 100 100 
##$AQSEQ= 0
##$AQ_mod= 1
##$AUNM= <au_zg>
##$AUTOPOS= <>
##$BF1= 200.13
##$BF2= 200.13
##$BF3= 200.13
##$BF4= 200.13
##$BF5= 500.13
##$BF6= 500.13
##$BF7= 500.13
##$BF8= 500.13
##$BYTORDA= 1
##$CFDGTYP= 0
##$CFRGTYP= 5
##$CHEMSTR= <none>
##$CNST= (0..31)
1 1 145 1 1 1 1 1 1 1 1 1 1 1 1 1 1 1 1 1 1 1 1 1 1 1 1 1 1 1 1 1 
##$CPDPRG= <>
##$CPDPRG1= <>
##$CPDPRG2= <>
##$CPDPRG3= <>
##$CPDPRG4= <mlev>
##$CPDPRG5= <mlev>
##$CPDPRG6= <mlev>
##$CPDPRG7= <mlev>
##$CPDPRG8= <mlev>
##$CPDPRGB= <>
##$CPDPRGT= <>
##$D= (0..31)
0 2 0 0 0 0 0 0 0 0.06 0 0 0 0 0 0 0.0002 0 0 0 0 0 0 0 0 0 0 0 0 0 0 
0 
##$DATE= 1755066832
##$DBL= (0..7)
120 120 120 120 120 120 120 120 
##$DBP= (0..7)
150 150 150 150 150 150 150 150 
##$DBP07= 0
##$DBPNAM0= <>
##$DBPNAM1= <>
##$DBPNAM2= <>
##$DBPNAM3= <>
##$DBPNAM4= <>
##$DBPNAM5= <>
##$DBPNAM6= <>
##$DBPNAM7= <>
##$DBPOAL= (0..7)
0.5 0.5 0.5 0.5 0.5 0.5 0.5 0.5 
##$DBPOFFS= (0..7)
0 0 0 0 0 0 0 0 
##$DE= 6
##$DECBNUC= <off>
##$DECIM= 32
##$DECNUC= <off>
##$DECSTAT= 4
##$DIGMOD= 1
##$DIGTYP= 9
##$DL= (0..7)
0 120 120 120 120 120 120 120 
##$DP= (0..7)
150 150 150 150 150 150 150 150 
##$DP07= 0
##$DPNAME0= <>
##$DPNAME1= <>
##$DPNAME2= <>
##$DPNAME3= <>
##$DPNAME4= <>
##$DPNAME5= <>
##$DPNAME6= <>
##$DPNAME7= <>
##$DPOAL= (0..7)
0.5 0.5 0.5 0.5 0.5 0.5 0.5 0.5 
##$DPOFFS= (0..7)
0 0 0 0 0 0 0 0 
##$DQDMODE= 0
##$DR= 18
##$DS= 0
##$DSLIST= <SSSSSSSSSSSSSSS>
$$ [...]
##$SUBNAM0= <"">
##$SUBNAM1= <"">
##$SUBNAM2= <"">
##$SUBNAM3= <"">
##$SUBNAM4= <"">
##$SUBNAM5= <"">
##$SUBNAM6= <"">
##$SUBNAM7= <"">
##$SUBNAM8= <"">
##$SUBNAM9= <"">
##$SW= 20.6817932712277
##$SWIBOX= (0..15)
0 0 3 0 0 0 0 0 0 0 0 0 0 0 0 0 
##$SW_h= 4139.07284768212
##$TD= 32768
##$TD0= 1
##$TE= 0
##$TE2= 300
##$TE3= 300
##$TEG= 300
##$TL= (0..7)
0 120 120 120 120 120 120 120 
##$TP= (0..7)
150 150 150 150 150 150 150 150 
##$TP07= 0
##$TPNAME0= <>
##$TPNAME1= <>
##$TPNAME2= <>
##$TPNAME3= <>
##$TPNAME4= <>
##$TPNAME5= <>
##$TPNAME6= <>
##$TPNAME7= <>
##$TPOAL= (0..7)
0.5 0.5 0.5 0.5 0.5 0.5 0.5 0.5 
##$TPOFFS= (0..7)
0 0 0 0 0 0 0 0 
##$TUNHIN= 0
##$TUNHOUT= 0
##$TUNXOUT= 0
##$USERA1= <user>
##$USERA2= <user>
##$USERA3= <user>
##$USERA4= <user>
##$USERA5= <user>
##$V9= 5
##$VALIST= <valist>
##$VCLIST= <CCCCCCCCCCCCCCC>
##$VD= 0
##$VDLIST= <DDDDDDDDDDDDDDD>
##$VPLIST= <PPPPPPPPPPPPPPP>
##$VTLIST= <TTTTTTTTTTTTTTT>
##$WBST= 1024
##$WBSW= 30
##$XGAIN= (0..3)
0 0 0 0 
##$XL= 0
##$YL= 0
##$YMAX_a= 2503586
##$YMIN_a= -2258776
##$ZGOPTNS= <>
##$ZL1= 120
##$ZL2= 120
##$ZL3= 120
##$ZL4= 120
##$ABSF1= 10
##$ABSF2= 0
##$ABSG= 5
##$ABSL= 3
##$ALPHA= 0
##$AQORDER= 0
##$ASSFAC= 0
##$ASSFACI= 0
##$ASSFACX= 0
##$ASSWID= 0
##$AUNMP= <proc_1d>
##$AZFE= 0.1
##$AZFW= 0.1
##$BCFW= 1
##$BC_mod= 2
##$BYTORDP= 0
##$COROFFS= 0
##$CY= 19
##$DATMOD= 1
##$DC= 2
##$DFILT= <>
##$DTYPP= 0
##$F1P= 11.0000007629395
##$F2P= -0.999999237060547
##$FCOR= 0.5
##$FTSIZE= 0
##$FT_mod= 4
##$GAMMA= 1
##$GB= 1
##$INTBC= 1
##$INTSCL= 1
##$ISEN= 128
##$LB= 0.05
##$LEV0= 0
##$LPBIN= 0
##$MAXI= 10000
##$MC2= 0
##$MEAN= 0
##$ME_mod= 0
##$MI= 0
##$NCOEF= 0
##$NC_proc= 0
##$NLEV= 6
##$NOISF1= 0
##$NOISF2= 0
##$NSP= 1
##$NTH_PI= 0
##$NZP= 0
##$OFFSET= 16.51637
##$PC= 1
##$PHC0= -210.3336
##$PHC1= 15.90155
##$PH_mod= 0
##$PKNL= yes
##$PPARMOD= 0
##$PSCAL= 4
##$PSIGN= 0
##$REVERSE= no
##$SF= 200.13
##$SI= 16384
##$SIGF1= 0
##$SIGF2= 0
##$SINO= 400
##$SIOLD= 16384
##$SREGLST= <1H.CDCl3>
##$SSB= 0
##$STSI= 0
##$STSR= 0
##$SW_p= 4139.07284768211
##$SYMM= 0
##$S_DEV= 0
##$TDeff= 0
##$TDoff= 0
##$TI= <>
##$TILT= no
##$TM1= 0
##$TM2= 0
##$TOPLEV= 0
##$USERP1= <user>
##$USERP2= <user>
##$USERP3= <user>
##$USERP4= <user>
##$USERP5= <user>
##$WDW= 1
##$XDIM= 8192
##$YMAX_p= 0
##$YMIN_p= 0
$$ End of Bruker specific parameters
$$ ---------------------------------
##NTUPLES= NMR FID
##VAR_NAME=  TIME,          FID/REAL,        FID/IMAG
##SYMBOL=    X,             R,               I
##VAR_TYPE=  INDEPENDENT,   DEPENDENT,       DEPENDENT
##VAR_FORM=  AFFN,          ASDF,            ASDF
##VAR_DIM=   16384,         16384,           16384
##UNITS=     SECONDS,       ARBITRARY UNITS, ARBITRARY UNITS
##FACTOR=    0.0002416,     1,               1
##FIRST=     0,             0,               0
##LAST=      3.9581328,     0,               0
##MIN=       0,             -2258776,        0
##MAX=       3.9581328,     2503586,         0
$$ Real data points
##PAGE= N=1
##DATA TABLE= (X++(R..R)), XYDATA
0@%%%%%%%l2O4o4O4o4R6j51J84k25K88l52M17n14O40p66Q96j054J244j469J724
27I26j991K294k634L014l454L939m466N045n685O402p188Q050q994J0012j1130
42e860J2364j3708J5176j6777J8520k0425K2517k4821K7344l0116L3183l6587
54a9190M0387m4660M9497n5008O1356o8775P7590q8246J01438j18271J40571j71717
66i5028K18604k98004M66834j418567J404994J482289k256042J275996j012585
75b31509r01874K347537j159924k313006L114838O13434j817989Q14146r87790
84e22137r44232K851292r64058k279994K518947P00195j602204P01871j436866
93i77186q87738L277644j58785k344315J555455L2393j299661J209603r49583
$$ plain form
0 0 0 0 0 0 0 0 0 -32 32 -32 32 -32 64 -87 97 -128 160 -192 225 -289 351 -415 481 -573 671 -798 926
27 926 -1065 1229 -1405 1609 -1845 2094 -2372 2673 -3012 3390 -3798 4252 -4742 5270 -5860
42 -5860 6504 -7204 7972 -8805 9715 -10710 11807 -13014 14330 -15786 17397 -19190
54 -19190 21197 -23463 26034 -28974 32382 -36393 41197 -47049 54389 -63882 76689 -95028
66 -95028 123576 -174428 292406 -1126161 278833 1761122 -494920 781076 -231509
75 -231509 -1133383 1214154 54230 -2258776 856062 1469496 -348493 465653 -522137
84 -522137 -1466369 1384923 420865 -1859129 659818 1360013 -242191 459680 -977186
93 -977186 -1864924 1412720 1253935 -1090380 465075 497468 -802193 407410 -542173
102e42173q71760L028943k50137k538739J057046J39741p01455J585159j035721
111a29096j324560K693355J04600k278188O73667j45538m39423K071032p03654
120E22195j682604J981099o656j958357Q50948Q0327k31410K028982r22678k182730
130a520884J595338M67473j212722R26790k94870o20470J936931n77057k087985
139a387456J230108M74973q35874J081127l33810q78358J615603m85392j950930
148a470009J147010P47582m38692R55891p65391j339351J494621J43874j369583
157h94048R48069L85090o00593Q82970o19933j279884J373681L48505j147550
166f03693P48480K41450n82463Q22388o01729j322923J299713P08592p96432M69362
$$ plain form
102 -542173 -1413933 1615010 1364873 -1173866 -116820 22921 -678534 906625 -129096
111 -129096 -1453656 1239699 1344299 -933889 -260222 -405760 -845183 1225849 522195
120 522195 -1160409 820690 814034 -1144323 -293375 -213048 -444458 1584524 661846 -1520884
130 -1520884 74454 541927 -670795 255995 -38875 -659345 1277586 700529 -1387456
139 -1387456 -157348 317625 -518249 562878 229068 -649290 966313 480921 -1470009
148 -1470009 -322999 424583 -14109 941782 176391 -1162960 331661 475535 -894048
157 -894048 54021 439111 -161482 721488 101555 -1178329 195352 543857 -603693
166 -603693 144787 386237 -196226 626162 24433 -1298490 1223 709815 -86617 382745
176C82745k29954q22781R18029r8747r97412J083857M98026q82675K96259k14773
186f7426o49428J035068P5623j023064P53425M36390o90779K93877k87721p04093
196h28128J037637L75745q29364M32669J11692p27392L91558O557m86638R13972
206C98308K57224r43005J74203J39495m11297N60973M5150o30284O08903K78237
216D77907p11229J45731O6385l87040N64504J87081n47395L77588J29842o67404
226c64030J50862K09360j80622N32393P5012p06154J44087K14512l25161K80195
236C0454J52847l33543L13943J00412n25896J45204K01154k78145K34185J61926
246B02541k86684K22578N2986n02061R7521K77120r2138K39899M4127m36909O6706
$$ plain form
176 382745 152791 -669990 248039 149292 -848120 235737 733763 -148912 147347 -67426
186 -67426 -716854 318214 393837 -629227 124198 560588 -130191 163686 -124035 -828128
196 -828128 209509 585254 -244110 188559 300251 -427141 -35583 -29026 -515664 398308
206 398308 655532 -287473 -113270 26225 -385072 175901 221051 -409233 199670 477907
216 477907 -233322 -87591 -21206 -408246 156258 343339 -204056 173532 303374 -364030
226 -364030 -213168 -3808 -184430 347963 422975 -283179 -139092 75420 -249741 30454
236 30454 183301 -150242 163701 264113 -261783 -116579 84575 -193570 40615 202541
246 202541 -84143 138435 191421 -310640 -213119 64001 -28137 211762 255889 -181020 -114314
257a14314J47562k26103J86882K08128k10289P1687L2746k95531J22956J78067
267A01791k00014Q8404J52391j51993P1395K1945k90499O2150K13733n4084R8820
278A14039N4062k51385k6646Q0656r3658J36709J67557j40154m5812J2707j30316
289a22241O9824J23409r7850K1966R2773q1641q23K2248j30146J5767J21772q372
301B6686M3810L8151j40654o8137M0836j971R1333J02673p9484p5958j0190m5997
313g8902L9698Q6191k3606j3550K5757l9171j1510K1886m3564j0325N4038J9328
325B6270K1449J4210p1127o4321J1614L2822O0693N7196l4214p2487l4197p422
337e9514L4289O0539J1091k7861j7952j5588l409J6665r50j3633J0699K0915J3067
$$ plain form
257 -114314 33248 -192855 -5973 202155 -8134 63553 96299 -199232 -76276 101791
267 101791 -98223 -9819 142572 -9421 61974 83919 -206580 -144430 69303 15219 114039
278 114039 168101 -83284 -109930 -29274 -122932 13777 181334 41180 -4632 8075 -122241
289 -122241 -52417 70992 -26858 -4892 87881 6240 5417 27665 -102481 -86714 35058 26686
301 26686 70496 108647 -32007 -100144 -59308 -61279 30054 132727 53243 -22715 -32905 -78902
313 -78902 -39204 46987 23381 9831 35588 -3583 -15093 6793 -36771 -47096 6942 26270
325 26270 47719 61929 -9198 -73519 -61905 -29083 31610 88806 54592 -17895 -52092 -59514
337 -59514 -25225 35314 46405 18544 592 -14996 -18405 -1740 -2690 -16323 -5624 15291 28358
350B8358L125k8245m6065r919L3157M5712L3853j2433n7323m2855K918L4230M5438
363B9951J8963k6699l4304j3743M708K0998J3861j0353r190N142J0246R620j0450
376H750l0081j3031J5374L2263L1035p606m2198l1828o051K6914M7145J2550k5362
389A7874k6216k3937L875L7693J1229j2504l817j6622o4L1566o363k5484K193
402a0577q904J1245M7597j0020l9288l975k0710O387O3306J632l2703K738l6034
415b9306j4330O4165N549k6341J9364l4902k2957O5018n484l9163L0240k5744
427a3891k0645P4325j1719n1743L5440l0090l1427Q6786r60n1458M0868m2695
439a7209m9480R7269O240n6542N1611l9184n8188J00615k616p0349O8827k7449
$$ plain form
350 28358 31483 3238 -42827 -52746 -19589 26123 59976 47543 -9780 -52635 -49717 -15487 29951
363 29951 48914 22215 -12089 -25832 -21124 -126 13735 3382 -5808 -666 9580 19200 8750
376 8750 -21331 -34362 -18988 13275 44310 36704 -5494 -37322 -43373 -16459 30686 43236 17874
389 17874 -8342 -32279 -28404 9289 20518 8014 4197 -12425 -12489 19077 12714 -12770 -10577
402 -10577 -19481 -8236 39361 29341 -9947 -13922 -34632 -28245 35061 36693 3990 6728 -29306
415 -29306 -43636 20529 26078 -263 19101 -15801 -38758 26260 20776 -18387 11853 -13891
427 -13891 -34536 39789 28070 -23673 11767 -18323 -49750 37036 36076 -15382 25486 -17209
439 -17209 -66689 30580 36820 -19722 31889 -7295 -65483 35132 32516 -37833 30994 3545
451C545o8025J03249l815p8470P8888l0954q4806J17407J0422q7150P9147l5780
463C658r6182J30536J4818j02125Q9730k3618j07786J27625J1178j10535J07750
474D5049j3962j27123J28014K1492j17189J09843j4939j39451J41639L4568j33958
485f6017J07031o315j46289J44840L7249j46384J18269Q359j63543J37394M4664
496F9258j50463J26818J5554j80581J39980N8496j63110J23798K4437j88373J45711
507B1525O8170j79187J24251L8019k00608J43286P8768j87827J28801N0246k16814
518a31370J38847R0608j97456J30959O5877k28316J33769J00719k08397J30275
528B5515Q0003k39599J31066J18195k16976J20438Q8682k46614J31421J33899
$$ plain form
451 3545 -64480 38769 34954 -43516 35372 4418 -80388 37019 47441 -39709 39438 3658
463 3658 -92524 38012 52830 -49295 40435 16817 -90969 36656 47834 -62701 45049
474 45049 31087 -96036 31978 53470 -63719 46124 31185 -108266 33373 67941 -66017
485 -66017 41014 34699 -111590 33250 70499 -75885 42384 50743 -112800 24594 69258
496 69258 -81205 45613 61167 -119414 20566 79062 -84048 39750 64187 -124186 21525
507 21525 89695 -89492 34759 72778 -127830 15456 94224 -93603 35198 85444 -131370
518 -131370 7477 98085 -99371 31588 97465 -130851 2918 103637 -104760 25515
528 25515 105518 -134081 -3015 115180 -101796 18642 107324 -139290 -7869 126030
538A26030k28990J12580J08672k50311J15655J37354k32185J19184J30806k65092
548a26297R3651J53301k25842J09417J33614k71160R7776J79007k39842P8301
558a8074J46478k55198R6056J79974k54755P7621J79472k63108N6687J83880k32727
569a03694R0715J85519k91315M0115K19299k26061N5787J82385k71919O0206K29964
580A71001k64972K3526K22228k43571L3942K13311k59849M6383K46553k81676
590i3124j6081K47440k10268L7214K20004k98738k410K86319k32480k1788K42333
601A58421k36122L622K50685k74218k0879L02070k26884n9575K45029k17444J382
612g3913K74440k82861p7533L16122j73907n6196K37528k47754m4006L09871k30282
$$ plain form
538 126030 -102960 9620 118292 -132019 -16364 120990 -111195 7989 138795 -126297
548 -126297 -32646 120655 -105187 4230 137844 -133316 -35540 143467 -96375 -18074
558 -18074 128404 -126794 -30738 149236 -105519 -27898 151574 -111534 -54847 129033 -103694
569 -103694 -12979 172540 -118775 -78660 140639 -85422 -29635 152750 -119169 -58963 171001
580 171001 -93971 -70445 151783 -91788 -57846 155465 -104384 -58001 188552 -93124
590 -93124 -109205 138235 -72033 -34819 185185 -113553 -115963 170356 -62124 -83912 158421
601 158421 -77701 -74079 176606 -97612 -118491 183579 -43305 -102880 142149 -75295 -73913
612 -73913 200527 -82334 -159867 156255 -17652 -73848 163680 -84074 -128080 181791 -48491
623d8491r3116L09606j75214r1094K40750k29207n0081L43492k13395j51173K88860
634A30937j45288p6872K61950k42640j06753L61966j57269j60121K70315j60431
644b4206j03901K88876k10209j26208L73198j40375k05887K44576j43482q4019
654a31637L36526k02144k01564L46550r6328j87185K50557j53494j21164L56320
664A96437j60345k29275L25441p9599j98510K48353j37111j27424L80765j35264
674H3468k91422K74386m3192j52284K81575j40452j98329L54389q5199k81747
684a98807K61101k8651j57496K80995j29781k31317L47623m0017k91324K24897
694C7223j6505j35692L07806j23241l02651L02298J6709k39145K32743k8791j80987
$$ plain form
623 -48491 -141607 167999 -7215 -98309 142441 -86766 -136847 206645 -6750 -157923 130937
634 130937 -14351 -91223 170727 -71913 -178666 183300 26031 -134090 136225 -24206
644 -24206 -128107 160769 -49440 -175648 197550 57175 -148712 95864 -47618 -131637
654 -131637 204889 2745 -198819 147731 51403 -135782 114775 -38719 -159883 196437
664 196437 36092 -193183 132258 52659 -145851 102502 -34609 -162033 218732 83468
674 83468 -207954 66432 23240 -129044 152531 12079 -186250 168139 82940 -198807
684 -198807 62294 33643 -123853 157142 27361 -203956 143667 103650 -187674 37223
694 37223 20718 -114974 192832 69591 -233060 69238 85947 -153198 79545 50754 -130233
705a30233K90079r6545l10549K98878O2520k27914K01159n3075k00718L12409
715A46011m7281l32858K51839Q3928j89928K11757p0935k59017K92371J3310k96920
726a97723K39091Q2353k05904J82956p5694k65765L12249Q1793k89471J69731
736C3616M7287j96693K11584l8227k86221K70482J13965k55201J44423K4794k13701
747a43892K05876L153k67615K52043J33208k54303Q6592j150j93681K49229O6236
758A35696k77476J66292J06143k25141J04138J9997j93371K30091Q6444k71700
768a18887J23708R9617k04438J02299K9340j84030K28624J11010k79570N3510
778c8817P4865j58210J55533O6738k06627J54882R0321k54029O0659R6370j30005
$$ plain form
705 -130233 159846 63301 -247248 51630 114150 -113764 87395 34320 -166398 146011
715 146011 98730 -234128 17711 101639 -88289 123468 52533 -206484 85887 99197 -197723
726 -197723 41368 123721 -82183 100773 25079 -240686 71563 153356 -136115 33616
736 33616 80903 -115790 95794 57567 -228654 41828 155793 -99408 45015 69809 -143892
747 -143892 61984 65137 -202478 49565 182773 -71530 15062 13912 -179769 69460 135696
758 135696 -141780 24512 130655 -94486 9652 29649 -163722 66369 152813 -118887
768 -118887 4821 104438 -100000 2299 31639 -152391 76233 187243 -92327 -38817
778 -38817 36048 -122162 33371 100109 -106518 48364 138685 -115344 -54685 41685 -88320
789h8320J47963N5955k26417J17964J06290k12811N0506Q5644j14495J53725O6799
800A42803k42114N4324R8338j51409Q7797R8555j28615R5042M0951k25857N8622
811g1563J34381j00719O8971N4735j53787P4911P0115j79392M2966J19188p9897
822b0091O6210M5118j65157L6946P5470j25246O1896J20418q3147J9279Q792j55911
834a15423N5238J22803p6637L0722N9663j06564J6103M0309j11298M8736J07639
845G1291o8027J5159M1065j04419O135M8068p5008N7441J05214o7870k5506J721
857E264r1979L7818R3809l9362J9731M2347q6668k1393L2357m3686M1643P3211
869F3092m8694o445K6761o6575j3582L6138k1785M3488O6160m9989l9648m715
$$ plain form
789 -88320 59643 115598 -110819 7145 113435 -99376 -48870 36774 -77721 76004 142803
800 142803 -99311 -44987 53351 -98058 -10261 88294 -40321 54721 95672 -130185 -71563
811 -71563 62818 -37901 31070 85805 -67982 6929 77044 -102348 -59382 59806 -20091
822 -20091 46119 91237 -73920 -36974 38496 -86750 -24854 95564 12417 31696 40488 -115423
834 -115423 -60185 62618 -14019 16703 76366 -30198 -14095 26214 -85084 -36348 71291
845 71291 3264 18423 59488 -44931 -38796 9272 -65736 -8295 96919 29049 3543 5264
857 5264 -86715 -48897 44912 5550 25281 67628 -19040 -40433 -8076 -51762 -10119 63092
869 63092 14398 7953 34714 -31861 -45443 -9305 -31090 12398 78558 28569 -11079 -15794
881a5794m7488K1741P1136K43P206Q162o7563l0918K8655K866L0383M1955k6279
894B4305k0057K122l7178j1282L0817J0449K5006K9602l0425l9345j4933j8033
906d8952J9833N4621K0406o155j9922m7792k5199K2434K7890K6886J9805j6863
918B6992l0010j5579j2384J723K4463K1816J2104M342j9527l3947j8858K832K3468
931a2565L8424K2734j3589l3682l3759j6361J9255L9786K6035K902j8588l3099
943a2507k0443L691J3686K0825K0997K783j1115j7247k4269j2291J2631K4187
955I28K6562J4811j6495l4642k7216o869K2837L8598K2217m991k5940l1945j4005
968c6150R595K1573K3424J0482o675j4609j9958j4490K825J2089J9943K2583M28
$$ plain form
881 -15794 -63282 -41541 29595 29838 37044 45206 -22357 -53275 -24620 -21754 8629 50584 24305
894 24305 4248 6370 -30808 -42090 -11273 -824 24182 53784 23359 -15986 -30919 -48952
906 -48952 -29119 25502 45908 39753 19831 -27961 -53160 -30726 -2836 24050 43855 26992
918 26992 -3018 -18597 -30981 -29258 -4795 17021 29125 33467 13940 -20007 -38865 -36033 -12565
931 -12565 25859 48593 35004 1322 -32437 -48798 -29543 10243 36278 39180 20592 -12507
943 -12507 -32950 -29259 -15573 5252 26249 29032 17917 670 -23599 -35890 -23259 928
955 928 27490 42301 25806 -8836 -36052 -42921 -20084 18514 40731 35740 9800 -22145 -36150
968 -36150 -26555 -4982 18442 28924 22249 7640 -12318 -26808 -23983 -11894 8049 30632 31060
981C1060j9035k2923k5623j346L2549K7893J3804k225l5768l0789K998P753K1350
994c02L2363m372j7808o663k5615q861K5652M780P735K6482j4226k2988k011k7831
1008c3665k566M8701J2986k266R195m1941l1501K5353l3J1911M8682j7392l4633
1021g169Q127k7953p900N0567p298j2491M0144k2814l4066K1159k7719q426O7386
1034C1547n068k6146L1077l9248m0195M5370p822j371P0512l0632n9325L2295
1046I94k1516j6861O9820j9705l2737O3682l0251n7238M8996j7905k1628P9913
1058D5564k3619m9071O4608l3454o4372O4243l826j7787Q5820m3825q3194O7299
1070H386r505m4289Q0871j6550m8899Q1223l8817q3610Q3708K211n1343P9298
$$ plain form
981 31060 12025 -10898 -36521 -37867 -5318 22575 36379 34154 -1614 -32403 -29405 -21652 -302
994 -302 32061 27689 9881 3218 -22397 -31258 -5606 -826 6909 33391 19165 -3823 -5834 -33665
1008 -33665 -36231 12470 25456 23190 32385 -9556 -41057 -15704 -15737 -3826 44856 27464 -7169
1021 -7169 958 -26995 -34895 15672 8374 -4117 36027 13213 -20853 306 -27413 -35839 31547
1034 31547 26479 333 31410 -7838 -48033 -2663 -10485 -11856 58656 28024 -31301 994
1046 994 -20522 -37383 32437 12732 -20005 43677 13426 -43812 5184 -12721 -34349 45564
1058 45564 21945 -27126 37482 4028 -60344 3899 73 -17714 68106 24281 -58913 8386
1070 8386 -1119 -45408 35463 18913 -29986 51237 12420 -71190 12518 14729 -36614 42684
1082D2684k4533o2861R1342l0821r5558Q7727J5955m7258Q3395m1057r3911R7710
1094B2814l328q4020R4729P727p1559P9399l8259r7258J18061J5830r6645Q1087
1106B8578r84p7479R7452k8835j15945J18616L2496r5385P9330j3540r8639J08911
1118C4576o264j17345J21156L5773j12696O9018j4844r9293J34157J5617j38746
1129g8891R7946L5195j08814Q3420p878j17362J34309L4908j43980Q6301L4459
1140D9613j14881Q9485M891j25322J36255N0908j57894O3493L4800j05618J12031
1151C7761K1836j51071J11465O1443j50122O5857M0876j13502J13018L4467j64785
1162i2757R8823P5642j46447O0411M2230j19025J21726N2891j83148P2619Q3376
$$ plain form
1082 42684 18151 -44710 46632 15811 -79747 7980 23935 -23323 60072 19015 -74896 22814
1094 22814 19486 -64534 30195 37922 -33637 45762 7503 -89755 28306 44136 -52509 28578
1106 28578 27594 -49885 47567 18732 -97213 21403 53899 -41486 37844 24304 -74335 34576
1118 34576 28312 -89033 32123 67896 -44800 24218 9374 -89919 44238 59855 -78891
1129 -78891 19055 54250 -54564 28856 20978 -96384 37925 72833 -71147 15154 49613
1140 49613 -65268 24217 29108 -96214 40041 90949 -66945 -3452 31348 -74270 37761
1151 37761 59597 -91474 19991 81434 -68688 -2831 38045 -75457 37561 72028 -92757
1162 -92757 6066 81708 -64739 -4328 37902 -81123 40603 93494 -89654 -17035 66341
1173F6341j30769P4442M8766j41417J07303O7182j82762O6446R5089j26833P2128
1184A5916M8359j58385J03107R2098j79321M8506R3084j23052Q1316O0697j77078
1195i4753Q0748J07704j63390M6680R5168j30840P2254O9712j82027P0198J28250
1206I9704j49969L1653Q5292j38149P3699R4432j80660M4725J30153j36806L1321
1217a4605Q8733j46922N9793J09719j71556L1566J35615j29148K1351Q6365j52422
1228h1511N5185J33795j60171Q357J24693j25676K5609J01621j54127L6163J40103
1239A04041j49571n57J25025j22960K0509J08593j54796K3471J51746j36191j4094
1250d4784J15256j23902K2136J28101j48325L4J45104j25888j4686J20792j20252
$$ plain form
1173 66341 -64428 10014 58780 -82637 24666 91848 -90914 -24468 70621 -56212 15916
1184 15916 64275 -94110 8997 101095 -78226 -29720 63364 -59688 21628 82325 -94753
1195 -94753 -14005 93699 -69691 -23011 72157 -58683 13571 83283 -98744 -28546 99704
1206 99704 -50265 -18612 66680 -71469 2230 96662 -83998 -39273 90880 -45926 -14605
1217 -14605 74128 -72794 -13001 96718 -74838 -43272 92343 -36805 -15454 70911 -81511
1228 -81511 -26326 107469 -52702 -44345 80348 -45328 -19719 81902 -72225 -36062 104041
1239 104041 -45530 -46087 78938 -44022 -23513 85080 -69716 -46245 105501 -30690 -44784
1250 -44784 70472 -53430 -31294 96807 -51518 -51484 93620 -32268 -46954 73838 -46414
1261d6414J0964J32306j41897j4709J46703j10562k0024J16430j20269J790J43868
1272I8186j25952l2136J34632j01872j9298J24701j12231j5658J39026j13922
1282b4524l9396J34195q8594k4928J20884j09228k8283J42455r4386m6283J23075
1293F4987q5572k8799J27428r6521m1588J32847q4445m7636J23709p6405l6637
1304d8632J22348r0323m9399J32265o8641m9694J14842p6205m3690J25652p3741
1315e218n4944J20678o4220n1547J15553o5141n0319J17314o5645n8303J17031
1326E5239n1715n3655J06790o0866n6360J14884m8325n9040J04371m8921n7616
1337e5214J04855m4928n8419J02660m2239o1198R9012l6081n8373R4664l8321
$$ plain form
1261 -46414 -35450 96856 -45041 -59750 86953 -23609 -43633 72797 -47472 -45682 98186
1272 98186 -27766 -59902 74730 -27142 -46440 78261 -33970 -49628 89398 -24524
1282 -24524 -63920 70275 -18319 -43247 77637 -31591 -59874 82581 -11805 -58088 64987
1293 64987 -20585 -49384 78044 -18477 -60065 72782 -11663 -59299 64410 -11995 -48632
1304 -48632 73716 -16607 -66006 66259 -2382 -52076 62766 -13439 -57129 68523 -5218
1315 -5218 -60162 60516 -3704 -55251 60302 -4839 -55158 62156 -3489 -61792 55239
1326 55239 3524 -50131 56659 -4207 -60567 54317 5992 -53048 51323 2402 -55214
1337 -55214 49641 4713 -53706 48954 6715 -54483 44529 8448 -49925 44739 6418
1348F418o1302R6087k8466n9692Q7727l2660o1411Q9913k3253n8967Q3608k6408
1360A1594o1610Q2899j9571n8707P9277k0094o0208P6877j6053n7983P4106j6489
1372A4038n9855P2473r837n5568O7263j5210n8968O8784n132n4398O1841j0209
1384A5222n6164O1539m936n2967N9685l963n4661N3634k301m9330N4027l041n2942
1397c6198N1061L987m7368M4681k336m8592M7425O075m5525M0896K849m6357L7693
1410H291N571m0237L9894O070m5372L1389Q397l6993L2470N861l9818L1155J1054
1423A7732l7045K4727P143l5006K6854J1157l2447K3930Q680l5579J8803J1720
1435A0669k5873K2976Q931l3202J5625J1700k5492J7046J0280k5788J5508J0595
$$ plain form
1348 6418 -54884 41203 12737 -46955 40772 8112 -53299 36614 13361 -45606 38002 11594
1360 11594 -50016 32883 13312 -45395 33882 13788 -46420 30457 14404 -43579 30527 14038
1372 14038 -45817 26656 16819 -38749 28514 13304 -45664 23120 17988 -36410 25431 15222
1384 15222 -40942 20597 15661 -37306 22379 18416 -36245 17389 15088 -34242 19785 16744 -36198
1397 -36198 14863 18850 -28518 16163 13827 -34765 12660 18735 -26790 14106 16955 -29402 8291
1410 8291 13862 -26375 13519 19589 -25783 5606 14003 -22990 9480 15341 -24477 6678 17732
1423 17732 -19313 5414 12557 -22449 4405 15562 -16885 7045 15725 -19854 -1051 10669
1435 10669 -15204 7772 16703 -16499 -874 10826 -14666 2380 12660 -13128 2380 12975
1447A2975k5586J2260J0303k2863J2305J1929j9208J1302P768k4139P242J2837
1459G125j3462J0499Q233k0518M026R298j3936P705J1053j3539L232P080j3600
1472f804L656Q876j1224L123R860q091J370M442j2335K89J0026l163K823N530
1486H378j0200m015M825l284L232Q471m590l818K338m618j003N756j682p10N252
1501D332j536l474Q46l701k373N998L542K0J467m446p080J082L550K315N111L23
1517E976o310k273k54j658L751M008j556P43P54m645j552P76j866L437O077p46
1533D662j795k491o789n63O097L220L312J271o894m946M80OM047N385j250j570
1549B182p13m352j319J746J46L542M265j177k219l713n287J030M960M186M396
$$ plain form
1447 12975 -12611 -351 9952 -12911 -606 11323 -7885 3417 11185 -12954 -5712 7125
1459 7125 -6337 4162 12395 -8123 -4097 5201 -8735 -1030 10023 -3516 -284 6796 -6804
1472 -6804 -3148 5728 -5496 -2373 7487 -604 766 5208 -7127 -6838 3188 25 2848 8378
1486 8378 -1822 -5837 -1012 -4296 -1064 7407 2817 -1001 1337 -3281 -4284 1472 -210 -920 4332
1501 4332 2796 -678 168 -3533 -5906 92 3634 3654 5121 675 -6405 -5323 -1773 542 5653 5976
1517 5976 -334 -2607 -2861 -4519 -768 3240 1684 2427 3181 -1464 -3016 -2240 -4106 -669 5408 4662
1533 4662 2867 376 -6413 -6976 -879 2341 5653 6924 30 -4916 -4436 -4430 -383 5002 3752 2182
1549 2182 1469 -2883 -4202 -2456 -2310 1232 5497 4320 2101 -1612 -6899 -5869 -909 3277 7673
1564G673j606p239l912j678J826P654L045j536l97n218m353K812o2J538P185r70
1580D762l052J219p118m323O652Q89L401R068p128r159J544n445K266J4611k215
1595E972m090N139j1072o521J0777l088Q92J4153q572p785R278j0565o095J5309
1609C732m047j7J6763j3869j4172J1644p912j096K3106p998r051J4531j7034j2654
1623a8074K2416m302l719K1868j6212j4455K1695j3601j2852K6675o671o989K5212
1636B0991k1009k0836K7072r871j0726L2995j1028j5970K5062k3928k1042L9571
1648A1281m573j5190K9931k0345k1393L5387j8432k3125M3174o352k0762L1921
1660B1522k4031k6221M3969j3661k5806M6652q407k8656L1991k6237k7537N7698
$$ plain form
1564 7673 6067 -1172 -5084 -6762 -4936 2718 5763 4227 3830 -1388 -5741 -2929 -2991 -1453 5732 4762
1580 4762 1710 2929 -4189 -8512 -1860 -971 2430 11498 4370 -4789 -3245 -8690 -6424 8187 5972
1595 5972 1882 7021 -4051 -10572 205 -2883 -1991 12162 3590 -4195 5083 -5482 -11577 3732
1609 3732 -315 -332 16431 2562 -11610 34 -7878 -8974 14132 6134 -2917 11614 -5420 -18074
1623 -18074 4342 40 -3679 18189 1977 -12478 9217 -4384 -17236 9439 2768 -4221 20991
1636 20991 -18 -20854 6218 -3653 -14379 18616 7588 -8382 16680 -7248 -28290 11281
1648 11281 6708 -8482 21449 1104 -20289 15098 -3334 -26459 16715 10363 -10399 21522
1660 21522 -2509 -28730 15239 1578 -24228 22424 14017 -14639 17352 -8885 -36422 21276
1672B1276o105l4014M0193j5247l2241M3003j9898l1552O1400n989m3046L8817
1684A6597j5551l3012N3120j6631l9354O3537m059n0416L7054j6685l2359O7820
1696C0061j0969n2179N6790o144n2147M5862j1752l5001P3598j2256o6292N4347
1708A3918o39m8293N4052j3096m4893P7863q076p5701N0826K465m4023O5604j2433
1721A7574n9791P4347m194p8846N3996R375m2460O9916j7074p7472P3258R863
1733B8492p3756N4428O976m9323P3905j3140q9369O9717K1345o8204N6022M334
1745B1427n9998P4231o999r6519O8756L4345o2862N3245m954p4640P8470J0361
1757C4863r5628O3336L5295o4638N3400o702q4526Q2095K5683r5221N6100L3021
$$ plain form
1672 21276 15171 -18843 21350 6103 -26138 16865 -3033 -34585 26815 20826 -22220 16597
1684 16597 1046 -31966 21154 4523 -34831 28706 24647 -25769 11285 -5400 -37759 30061
1696 30061 19092 -33087 23703 17559 -34588 11274 -478 -35479 38119 25863 -40429 13918
1708 13918 13279 -35014 19038 5942 -38951 38912 30836 -44865 5961 8426 -35597 30007 17574
1721 17574 -42217 32130 27936 -50910 3086 12461 -29999 39917 22843 -54629 18629 28492
1733 28492 -45264 9164 16140 -33183 40722 27582 -61787 7930 29275 -38929 17093 21427
1745 21427 -38571 35660 28661 -67858 898 35243 -27619 25626 20672 -53968 24502 34863
1757 34863 -60765 2571 37866 -26772 26628 19926 -64600 17495 43178 -52043 4057 37078
1769C7078o6807N5826n900r3980Q4957M2853r2193M5193K2509p2568O4547O539
1781B8054r8170Q0082M9486r2526L6987J7598p3957P4192J9417j05122O7865N3634
1793E7540q7847L3849J3893p8471Q0861L6059j08240N0318N0233q3448L7390J9197
1805B1334q1120P9635M5842j12478L3421M9944p3273M5177K3693r0685P0032N5450
1817F6972j08102K2578M7391o7824N2191L1189r8884N6119O0292j01228J8226
1828b1080M7749o3605N6142L5305j09497M0714O7279q6114K0106M3943o9650N3722
1840A5014M2973j10697K8972P0539p4203K2196M0890p6731M8421N1111j07542
1851d9057J8779P2359o2342K4312L6606q7428L9232O2943r4088J2242O7595n9635
$$ plain form
1769 37078 -29729 26097 20197 -73783 11174 54027 -38166 7027 29536 -43032 21515 28054
1781 28054 -70116 9966 59452 -33074 3913 21511 -52446 21746 41163 -63959 3906 57540
1793 57540 -30307 3542 17435 -61036 19825 55884 -52356 -2038 48195 -35253 2137 21334
1805 21334 -59786 19849 65691 -46787 -13366 36578 -36695 8482 32175 -58510 11522 66972
1817 66972 -41130 -18552 28839 -38985 13206 44395 -54489 1630 61922 -39306 -21080
1828 -21080 26669 -36936 19206 54511 -54986 -14272 53007 -33107 -13001 30942 -38708 15014
1840 15014 57987 -52710 -23738 46801 -27402 -5206 35684 -41047 7374 58485 -49057
1851 -49057 -30278 42081 -20261 4051 40657 -46771 -7539 55404 -38684 -26442 41153 -18482
1863a8482K2317L7247r0074L1469P2323q1573M272O0267n8058K1514M1320r0018
1875d7476K1487P8492o7226r83N0655o1331J9002N0172q2154J3160P7493n9631
1887h340o531M4051o0723J9560N9256p5593J455P1369n2017o016M1556o1381J6405
1900a6949O6075o6430p275O2271m8694m566M3509n8018J2700O8066o0345j6268
1912b5924N3636m2687Q71M7583n6589K794O5226n1442j8506M8147l9024J958N0276
1925C6319n2411n916O0235m3697j9395M4631l4028K221N1149m9344j6025N4088
1937B7827l3192j5245M2983l2487l608M8788m2617j9914M9676k5286j3735L9915
1949B3105l0865q166M6719l5482k2608M4535j8648j0959L7451l0711j4641M3423
$$ plain form
1863 -18482 3835 41082 -48992 -17523 54800 -26773 -22501 37766 -20292 1222 42542 -47476
1875 -47476 -25989 52503 -14723 -15706 34949 -26382 -7380 42792 -39362 -26202 51291 -8340
1887 -8340 -14871 29180 -31543 -11983 47273 -28320 -26865 44504 -7513 -13529 28027 -33354 -16949
1900 -16949 49126 -17304 -24579 37692 -11002 -15568 27941 -30077 -17377 50689 -9656 -25924
1912 -25924 27712 -14975 -14104 33479 -23110 -20316 44910 -6532 -25038 23109 -15915 -13957 36319
1925 36319 -16092 -22008 38227 -5470 -24865 19766 -14262 -12041 39108 -10236 -26261 27827
1937 27827 -5365 -20610 22373 -10114 -13722 35066 -7551 -27465 22211 -3075 -16810 23105
1949 23105 -7760 -15926 30793 -4689 -27297 17238 -1410 -12369 25082 -5629 -20270 23153
1961B3153k6044j9992M0430j6470j2682L3633k7900j6298M1655j8380j9206L4090
1973A5989j5539j2826L2165k3725j8238L7542j2116j6753K9426j5618j5051K9649
1985A4905j7305j6599L3794q796j7475K3633j3904j4041K9098j1289j7159K6977
1997A1839o936j6004K1193j0826j4286K5741o621j5927K1959n663j5796J8027
2009F700o959j2415K3058l673j6477J5750m314j2779J7563l383j2702J7317k480
2022E206j4402J3286k064j1241J4546j516j1519J3583j182j2977J0143m58q621
2035g216J2855j90j1610Q628l81r517R647J377q151Q331k11r621P075J476p415
2050d923O767J391o954O068R05p964M276K079m988N412J971o541K418J188n080
$$ plain form
1961 23153 -2891 -22883 17547 1077 -11605 22028 -5872 -22170 19485 1105 -18101 15989
1973 15989 450 -12376 19789 -3936 -22174 15368 3252 -13501 15925 307 -14744 14905
1985 14905 -2400 -18999 14795 5999 -11476 12157 -1747 -15788 13310 2021 -15138 11839
1997 11839 4903 -11101 10092 -734 -15020 10721 4100 -11827 10132 4469 -11327 6700
2009 6700 -259 -12674 10384 6711 -9766 5984 1670 -11109 6454 3071 -9631 7686 5206
2022 5206 -9196 4090 2026 -9215 5331 3815 -7704 5879 4697 -8280 1863 1405 -7216
2035 -7216 5639 5449 -6161 2467 2086 -7431 2216 3593 -4558 3773 3562 -6059 1016 2492 -4923
2050 -4923 1844 3235 -3719 2349 3254 -4710 -434 1645 -3343 2069 4040 -2501 -83 1105 -3975
2065c975L948L168m172J878J131m831J847K667l131J430K208l136P70J902l183
2080a479k8K340j458P76K292k481j378J378j160K47K826p36j485Q69j271r93K370
2097F29K02j299J286k97j585J454L6j898J451Q87j294J364K17k586O46R61j198
2114a024J836J169k497kN73j672J608J673k028L33Q82j984P90J289j854N97J353
2131A042j573P14J013k154R9J129r76J224J139j977k58M00r89J287J133j247J81
2148A87j9j135Q91M74o94O80j84o65J055l61p96O94p31J10J783r13o09P24j797
2167a306L31K240j336J93J371k798J97K378k271P96K292l459O02K871l554P48
2183g05K854m235J321L888m557P96L316n565J459M917n264J340M322o913J117
$$ plain form
2065 -3975 -27 3141 -1031 847 1978 -2853 -1006 1661 -1470 -40 2168 -968 -198 1704 -1479
2080 -1479 -1507 833 -625 151 2443 -38 -1416 -38 -1198 -951 1875 1139 -346 523 -748 -1741 629
2097 629 831 -468 818 521 -1064 390 426 -1472 -21 866 -428 936 1153 -1433 -787 174 -1024
2114 -1024 812 1981 -516 -518 55 -1617 -9 1664 -364 -31 851 -1133 -343 946 -908 -311 1042
2131 1042 -531 183 1196 -958 -859 270 -706 518 1657 -320 -578 -178 -1167 120 1253 6 187
2148 187 168 -967 -76 398 -296 384 200 -465 590 229 -567 127 -604 -494 1289 376 -233 491 -1306
2167 -1306 -975 1265 -71 122 1493 -1305 -1108 1270 -1001 -205 2087 -1372 -770 2101 -1453 -705
2183 -705 2149 -2086 -765 3123 -1434 -638 2678 -2887 -1428 3489 -1775 -435 3887 -3026 -1909
2198a909N571o283J699N723p751J114O397p774J431O883q546J427P814q879R54
2213b129P740r882J308R475r645R93R014j1304O91J0498j0709J221J0901j2236
2227d064J09J1466j2137Q22J2471j3150K39J3354j3375k20J3406j4275K26J5319
2241A0191j4359o57J5127j5540j048J6393j5058k86J7354j6817k453J7816j5818
2254e155j308J8724j7260k280K0037j7310l645K0154j7055k791K1497j8100m115
2267h607K2343j8315n555K2842j6994l997K3683j9816p056K5094j7355o551K4917
2280A4633j8502o560K6209j9816q913K7620j7414q559K6812j9188q470K8975k0164
2293c337j1568K9895j6702r725K8530k0967j1390L2091j8781j3113L1436j7484
$$ plain form
2198 -1909 3662 -2621 -922 4801 -2950 -1836 4561 -3213 -1782 5101 -3445 -2018 5796 -3083 -2129
2213 -2129 5611 -4271 -2963 6512 -3133 -2140 6874 -4430 -3739 6759 -3950 -2729 8172 -4064
2227 -4064 -3955 7511 -4626 -3804 8667 -4483 -4244 9110 -4265 -4485 8921 -5354 -5128 10191
2241 10191 -4168 -4825 10302 -5238 -6286 10107 -4951 -5237 12117 -4700 -7153 10663 -5155
2254 -5155 -6463 12261 -4999 -7279 12758 -4552 -8197 11957 -5098 -7889 13608 -4492 -8607
2267 -8607 13736 -4579 -10134 12708 -4286 -8283 15400 -4416 -11472 13622 -3733 -10284 14633
2280 14633 -3869 -10429 15780 -4036 -12949 14671 -2743 -11302 15510 -3678 -12148 16827 -3337
2293 -3337 -14905 14990 -1712 -11437 17093 -3874 -15264 16827 -1954 -15067 16369 -1115
2305a115j2102L0518k1151j3328L5178j7896j5909L2116j7678j3457L3261k1175
2317b738j6660L7291j5837j7808L2569j8483j5973L6294j9218j9461L8289j4573
2329C692k0647L2851j7794j7629L9544j7118k3906L7628j2643k1816L4237j7068
2341f69k0840M1514j4131k7214L6613j1353k3233L5975j5464k3764M2677j1666
2353H445l0706L5098r624k3122L8608j4343k8526M2029q614l1731L4850q690k4348
2366b0674M0403j2800l2500M1042n600l2116L4503p966k5751M2011j0794l6841
2378b7083L8805k059l0628L5113p835k9529M1800p164l8902L6964J122l0135L4693
2391A5162p468l3306M1408k099m0016L3970L329k9733L4725o228l7709L9485L690
$$ plain form
2305 -1115 -13217 17301 -3850 -17178 18000 104 -15805 16311 -1367 -14824 18437 -2738
2317 -2738 -19398 17893 2056 -15752 16817 -1666 -17639 18655 -563 -20024 18265 3692
2329 3692 -16955 15896 -1898 -19527 20017 2899 -21007 16621 3978 -17838 16399 -669
2341 -669 -21509 20005 5874 -21340 15273 3920 -19313 16662 1198 -22566 20111 8445
2353 8445 -22261 12837 3213 -19909 18699 4356 -24170 17859 9245 -22486 12364 3674 -20674
2366 -20674 19729 6929 -25571 15471 9871 -22245 12258 4292 -21459 20552 9758 -27083
2378 -27083 11722 9663 -20965 14148 6313 -23216 18584 11420 -27482 9482 10604 -19531 15162
2391 15162 7694 -25612 15796 13697 -26319 7651 10980 -18753 15972 9744 -27965 11520 15210
2404A5210l8915L1377M182l1164L3893l612m0237L7710R135l7932K7823L684l2531
2417b1377L4272O88m2066L4219J2683l6213K5540L082l4653L4246N692m2236L0458
2430D335J4356l5215K3565L023l5965L4511J1172m2143K4938J3946l3738K3832
2442F617M926l7476L2414J5353m1032K0124J3474l2586K4116P922l8451K8814
2454D215J8736l9486J5496J2925l1110K4937J2066l9527K2630K0295l6580J3306
2466b097J3784l0342K3744J5396l9937J6662K1627l2833J1962J4450l0271K1578
2478C723J8531l9251J0776K1881k8686J2347J5546l1311J7328K0454l6791P274
2490h179K2298k5281J2019J5664l2675J3197K2650l2625M980K1278k3570J1476
$$ plain form
2404 15210 -23705 7672 11854 -19310 14583 10971 -29266 8444 17579 -20353 7470 11154 -21377
2417 -21377 12895 13583 -28483 5736 18419 -17794 7746 10828 -23825 10421 16113 -26123 4335
2430 4335 18691 -16524 7041 10064 -25901 8610 19782 -22361 2577 16523 -17215 6617
2442 6617 11543 -25933 6481 21834 -19198 926 14400 -18186 5930 13852 -24599 4215
2454 4215 22951 -16535 -1039 11886 -19224 5713 17779 -21748 882 21177 -15403 -2097
2466 -2097 11687 -18655 5089 20485 -19452 -2790 18837 -13996 -2034 12416 -17855 3723
2478 3723 22254 -16997 -6221 15660 -13026 -679 14867 -16444 884 21338 -15453 -8179
2490 -8179 14119 -11162 857 16521 -16154 -2957 19693 -12932 -7952 13326 -10244 1232
2502A232J6486l3149Q747K3977k7675M075K0098k3198R353J7141l1957N533K5403
2515A6066k2939K711J7819k3816P140J9306k8569K518K4773j9595J303J6427k3641
2528a0497M561K1176k4320M5K3362j7335n23J5250k2618K710K3242j9745k839
2541g531K0117j6373j408J5976k0009P19K3189j6490n100J7172j5018j603J6890
2554A0531j7305j324K1907j3827o693J4476j3662j152J8271j4361l914J8644j2240
2567f49o831J3763j1295j081J7843j2629o340J5743r908n790J3328r505k036J6560
2581A1173j0650p981J3000p661m408J3441p649l906J3794r104q290J1862m692
2594a071l470J2164p087o029J1559o331p133J0765l067l666J0451o144p127R558
$$ plain form
2502 1232 17718 -15431 -6684 17293 -10382 -6307 13791 -9407 -54 17087 -14870 -9337 16066
2515 16066 -6873 -4162 13657 -10159 -3019 16287 -12282 -9764 15009 -4586 -3283 13144 -10497
2528 -10497 -5936 15240 -9080 -9035 14327 -3008 -3531 11719 -10899 -8189 15053 -4692 -7531
2541 -7531 12586 -3787 -5195 10781 -9228 -8509 14680 -1810 -6910 10262 -4756 -6359 10531
2554 10531 -6774 -8098 13809 -18 -6711 7765 -5897 -7049 11222 -3139 -7053 11591 -649
2567 -649 -7480 6283 -5012 -6093 11750 -879 -7219 8524 -1384 -7174 6154 -3351 -5387 11173
2581 11173 523 -7458 5542 -2119 -6527 6914 -735 -4641 9153 49 -8241 3621 -1071
2594 -1071 -4541 7623 536 -5493 6066 -265 -7398 3367 300 -3366 7085 941 -6186 3372
2608C372l725n569R807j974m438P917n314p027Q729q60m177P772k425n545O256
2623B799l107n489P716K48m005N531k323n509N146j108m003O473P30m197L250
2638B152k157m701M866J115k840M247j27m642K004m02k918M244J648k948J955
2653A496k39l846J564J011j762L079J641l016R5j32k710J688K431r36J134O13
2669B111l271o19J273q60J435K260j439p23M09k121m02K116n8M69J660j557j758
2686a075N02r39QK739L73r42N00j728j768J590O31Q9K019n35k111L17o05r57K115
2705B23Q46p14J153p65k314O23J99l19K269O37j490J74j011j774J539J204r2J388
2723A776n87k122K46j65m73J846O89o75N88j000j625P43J77J70J801j61r54P6
$$ plain form
2608 3372 -353 -5922 3885 1911 -2527 5390 76 -6951 1778 918 -3259 4513 2088 -3457 2799
2623 2799 -308 -5797 1919 2167 -1838 3693 1370 -4139 1007 -101 -4104 2369 3099 -1098 2152
2638 2152 -5 -4706 160 1275 -1565 2682 2555 -2087 -83 -485 -3403 841 2489 -459 1496
2653 1496 1257 -2589 -1025 -14 -1776 1303 2944 -72 23 -109 -2819 -1131 1300 364 1498 2111
2669 2111 -1160 -1779 -506 -1366 69 2329 890 167 576 -1545 -1947 169 111 580 2240 683 -1075
2686 -1075 -573 -1512 -1504 1235 1608 666 1166 -562 -2330 -740 -109 -20 1999 1464 -647 -330 -935 -1892 223
2705 223 1069 355 1508 743 -1571 -948 -749 -1068 1201 1838 348 522 -489 -2263 -724 480 388 1776
2723 1776 1189 -933 -687 -852 -1325 521 1210 535 1123 123 -1502 -759 -582 -412 1389 1228 274 350
2741C50j478o88J629M03O44J001j764j025N28j003P49J879q05L15N31k468j7J341
2759A22j247J388J737k160M99N98l196J027K262j687J895J210m000Q38J490l250
2775b474K365K589l352J759J131n051K121K747l991K656K515m969K305J893o127
2790c883K927L922m926K905K497o892K827L305o674L715M686o688K646K902q124
2805d855M053N143p944L411N002q246L262M115r434M542O635r201L223N439r858
2820d713L826N740j0556M944P883j0939K734O079j0958N058P653j2246M261Q722
2834G488j2222L069P442j2331N532R342j3954L607R814j3241L344Q889j3701N633
2848a289J1204j5604K405J0942j3835M092J0812j5582M513J2832j6528J760J2611
$$ plain form
2741 350 -1128 -1816 -187 216 860 1861 97 -928 -400 -1403 -654 1225 420 735 1266 -1202 -1219 122
2759 122 -1125 263 2000 -160 339 937 -2259 -1232 1030 -657 1238 2448 -1552 -714 776 -2474
2775 -2474 -109 2480 -872 887 2018 -3033 -912 1835 -2156 500 3015 -1954 351 2244 -3883
2790 -3883 -956 2966 -1960 945 3442 -3450 -623 2682 -3992 -277 4409 -2279 367 3269 -4855
2805 -4855 -802 4341 -3603 -192 4810 -3436 -174 3941 -5493 -951 5684 -3517 -294 5145 -4713
2820 -4713 -887 4853 -5703 -759 7124 -3815 -1081 4998 -5960 -902 6751 -5495 -1234 7488
2834 7488 -4734 -1665 5777 -6554 -1022 8320 -5634 -2027 7787 -5454 -2110 6779 -6922 -1289
2848 -1289 9915 -5689 -3284 7658 -6177 -2085 8727 -6855 -2342 10490 -6038 -4278 8333
2861H333j4566L981J2522j7372L224J4962j6929R24J3987j5466L676J4579j8884
2874g029J358J6802j6879O41J5557j6881K574J6548j9855O0J8770j6813L8J6608
2888A1499j8466J554J8973k0148j376J9983j7077k93J8086j9981J81K1092j9953
2901e926k487K1086j7551j139J9486k0977j210K3424j9352m002K1599j8292j885
2914g226K1740k1256l266K4927j8682n362K2485j8771l220K3870k0932n543K6310
2927A5074j7896o881K3280j9098m732K6245j9979q076K6779j7271q060K4711j8889
2940d793o790K7903j8947j0329K7303j6509r160K6033j8716q885K9256j7619j2164
2953a3417K7346j6098j0043K7634j8115j1137K9774j6526j3362K7779j5591j1028
$$ plain form
2861 8333 -6233 -2252 10270 -7102 -3878 11084 -5845 -4921 9066 -6400 -2724 11855 -7029
2874 -7029 -5671 11131 -5748 -5107 10450 -6431 -3857 12691 -7164 -7104 11666 -5147 -5109 11499
2888 11499 -6967 -5413 13560 -6588 -7964 12019 -5058 -5351 12735 -7246 -7065 14027 -5926
2901 -5926 -8413 12673 -4878 -6017 13469 -7508 -8718 14706 -4646 -8648 12951 -5341 -7226
2914 -7226 14514 -6742 -10008 14919 -3763 -9125 13360 -5411 -8631 15239 -5693 -11236 15074
2927 15074 -2822 -9703 13577 -5521 -10253 15992 -3987 -12063 14716 -2555 -10615 14096 -4793
2940 -4793 -11583 16320 -2627 -12956 14347 -2162 -11322 14711 -4005 -12890 16366 -1253 -13417
2953 -13417 13929 -2169 -12212 15422 -2693 -13830 15944 -582 -13944 13835 -1756 -12784
2965a2784K8686j7553j3231L0126j5071j4249K7990j5250j2451K9722j6222j5184
2977a5471K9869j3808j5005K8522j4418j4264L0057j4690j6935K9762j2145j6002
2989a4528K8662j3457j6334L0245j2467j8325K9254j0829j7289K8872j1819j8244
3001a6259K9822j0425j9462K8849r346j8558K8608j0259j9776K9346q383k0135
3013a5978K8084q346j9723K8349q371k0670K8423p025k0701K7486p132k0547K7711
3026A1560o852k1164K7496n754k0997K6689o136k1139K6928n155k1238K6211m865
3039E584k1402K5856m458k1382K5648l833k1497K5069l512k1648K4694k846k1623
3052a5350K4190k240k1535K3660k160k1959K3374r17k1539K2442j051k1709K2318
$$ plain form
2965 -12784 15902 -1651 -14882 15244 173 -14076 13914 -1336 -13787 15935 -287 -15471
2977 -15471 14398 590 -14415 14107 -311 -14575 15482 792 -16143 13619 1474 -14528
2989 -14528 14134 677 -15657 14588 2121 -16204 13050 2221 -15068 13804 1985 -16259
3001 -16259 13563 3138 -16324 12525 3179 -15379 13229 2970 -16806 12540 4157 -15978
3013 -15978 12106 3760 -15963 12386 4015 -16655 11768 4743 -15958 11528 4396 -16151 11560
3026 11560 4708 -16456 11040 5286 -15711 10978 4842 -16297 10631 5476 -15762 10449 5584
3039 5584 -15818 10038 5580 -15802 9846 6013 -15484 9585 6073 -15575 9119 6273 -15350
3052 -15350 8840 6600 -14935 8725 6565 -15394 7980 7063 -14476 7966 6915 -14794 7524
3065G524l29k1854K1639N86k1446K0689K83k1392K0848J205k1660J9773J862k0845
3079a3117J9104J239k1047J9344K639k0935J7826K459k0156J7755K309k0351J7745
3092D814L474k0130J5958L003j9012J6480L075j9671J5841M218j8860J4283L331
3105F804j8042J5107L960j8627J3763M628j7646J2763L946j6911J3533M646j7758
3118i834J1647N153j6021J1366M442j6088J1595N356j6354R711N515j4650R933
3131A771N012j5049R575N818j4847P982N808j3085Q530N167j4158P704O183j2956
3145f545O724N651j1967P071N263j2748O160O208j1237N505N309j0774N769N205
3159E594j1276M831O048r515M491M751r809M492N260r458L801N533q239L383M299
$$ plain form
3065 7524 7195 -14659 6980 7566 -13880 6809 7092 -14300 6548 7753 -13907 5866 7728 -13117
3079 -13117 5987 7226 -13821 5523 8162 -12773 5053 7512 -12644 5111 7420 -12931 4814
3092 4814 8288 -11842 4116 7119 -11893 4587 7662 -12009 3832 8050 -10810 3473 6804
3105 6804 -11238 3869 7829 -10798 2965 7593 -10053 2710 6656 -10255 3278 7924 -9834
3118 -9834 1813 6966 -9055 2311 6753 -9335 2260 7616 -8738 973 6488 -8162 1771
3131 1771 6783 -8266 1309 7127 -7720 262 6070 -7015 1515 6682 -7476 228 6411 -6545
3145 -6545 179 5830 -6137 934 6197 -6551 -391 5817 -5420 85 5394 -5380 389 5594
3159 5594 -5682 -851 5197 -4318 173 4924 -4885 -393 4867 -4591 -790 4743 -3496 -113 4186
3174D186q522L554N182p865K671M882p002K466M054p235K529N023o289J671M154
3189C459n973J594L939n747J733M599n187O70L537m801J137L823m470P69L830
3204B912m052O8L039l648O25L509l350M0L044l148k82K679k486L23K909k614n69
3221a001K279k087k78K383j660j97K113j807q15J779j156l28J867r98n87J416
3237I23j123q76J409l18l54J284o26r44Q57l72o21J104J41o27N87k35r38O15K55
3256A41n21O43M04p90Q1J61q01L50P83m16J27M76r36k81O64m54J85R62o03m08
3276b33N40o99k79R86k70j80Q99o51o70P09m23l48J176j81m99P03o47p81R51r2
3296A1l24J073l37q12N95m12n69J105J5m96P51l99q42O87j99l90J027j4o24N02
$$ plain form
3174 4186 -4336 -782 4400 -3465 -794 4088 -2914 -448 3606 -3629 -1100 3923 -2366 -695 3459
3189 3459 -2514 -920 3019 -2728 -995 3604 -1583 -913 2624 -2177 -1040 2783 -1687 -918 2912
3204 2912 -1140 -1072 1967 -1681 -1056 2453 -897 -857 2187 -961 -1243 1436 -1050 -727 2182 -432 -1001
3221 -1001 1278 -809 -1087 1296 -364 -561 1552 -255 -1070 709 -447 -775 1092 94 -493 923
3237 923 -200 -1076 333 15 -339 945 319 -625 232 -140 -761 343 484 -143 444 209 -729 -114 141
3256 141 -380 263 667 -123 -42 119 -682 -332 451 35 162 638 -298 -579 85 -369 -184 778 175 -233
3276 -233 307 -392 -671 315 45 -135 764 113 -557 152 -271 -619 557 376 -123 580 -67 -848 103 11
3296 11 -313 760 423 -389 206 -206 -775 330 345 -151 600 201 -641 46 -153 -543 484 470 -154 348
3316C48m46o89Q12Qj94P94k91o74L20l32k28Q74qk67M35m89m34M22k89J18P61
3337E51k55k33K15o56o6N31k78L69N42o83j35P6p02N54O42n38L93K02j008K89
3357a90K37p60R27N71j041N06R5j289Q66M03j086J261M92j609P00J15j491J510
3375B17O73j655J309M20k149J140M97j811J980P85k443J319O22k490J700Q29k435
3392a492K247R98l240J462R38k813K325J226l285K227J250l903J808J502l219
3407a969K690J535m369K203J855m287K174J996l973K913J949n350K200K561m620
3422b492K616K378m968K979K476o137K334L379m946K841K656o230K984L468o594
3437c256K416L998n606K909L154p349K909M635o903K310M499o507K905L932q306
$$ plain form
3316 348 -98 -787 25 33 -161 633 342 -332 -12 -344 -572 302 294 27 462 -27 -461 -39 -328 -210 551
3337 551 296 63 278 -378 -444 87 -191 178 720 37 -98 -22 -724 -170 472 -66 327 529 -479 -190
3357 -190 47 -713 214 785 -256 250 345 -944 -78 325 -761 500 992 -617 83 198 -1293 217
3375 217 890 -765 544 964 -1185 -45 452 -1359 621 1406 -1037 282 904 -1586 114 943 -1492
3392 -1492 755 1753 -1487 -25 913 -1900 425 1651 -1634 593 1843 -2060 -252 1250 -1969
3407 -1969 721 2256 -2113 90 1945 -2342 -168 1828 -2145 768 2717 -2633 -433 2128 -2492
3422 -2492 124 2502 -2466 513 2989 -3148 -814 2565 -2381 460 3116 -3114 -130 3338 -3256
3437 -3256 -840 3158 -2448 461 3615 -3734 -825 3810 -3093 -783 3716 -2791 114 4046 -4260
3452d260K753N978p200K018M842p637K863N286q931K355P065p648J596N345q618
3467d193K805O904r404J611P824q146J339O069r527K647Q553r715P00Q202q715
3482c046J302P158j0245K228R909j0079k15Q478r151J546Q530j0992J314J0942
3496G679j0165r00Q844r627J669J0070j1626K2J1621j0084j256R533j0129J428
3510b921J1589j2130j566J2223r739j334J0461j0842N26J2990j2157l011J2748
3523F837r334j427J1562j1561r28J4222j1681m230J3241r071j602J2623j2255
3536c604k622J5282j0747m922J3555r215k101J3674j2553m235J6124r671n290
3549f325J3596r663k743J4799j2349n681J6555q616n428J3567j0361l643J5992
$$ plain form
3452 -4260 -1507 4471 -2729 -711 4131 -3506 -643 4643 -4288 -1933 5132 -2516 -920 4425 -4193
3467 -4193 -1388 5516 -3888 -2277 5547 -2599 -1260 4809 -4718 -2071 6482 -3233 -2533 5669 -3046
3482 -3046 -1744 5414 -4831 -2603 7306 -2773 -2988 5490 -3661 -2115 6415 -4577 -3263 7679
3496 7679 -2486 -3386 5458 -4169 -2500 7570 -4056 -4034 7587 -2497 -3753 5780 -4349 -2921
3510 -2921 8668 -3462 -5028 7195 -2544 -3878 6583 -4259 -3733 9257 -2900 -5911 6837
3523 6837 -2497 -3924 7638 -3923 -4851 9371 -2310 -6540 6701 -2370 -3972 8651 -3604
3536 -3604 -6226 9056 -1691 -6613 6942 -2273 -4374 9300 -3253 -7488 8636 -1035 -6325
3549 -6325 7271 -2392 -5135 9664 -2685 -8366 8189 -427 -5855 7712 -2649 -6292 9700
3562I700j1560o765J6493p920n627J3695j0811m671J7099j0312p802J6021p565
3575b5n866J4243j0839o019J7890q821q740J5392p427o320J5069j0234p451J8128
3589H980p384r544J4704p233o809J6091r282r074J7802o108r979J4339p032p432
3603g961J6825q047j0441J6962n078j0010J4198o759q116J7224o804j1531J5795
3616F257m217r626J4274o400r075J7015n505j2011J4732l613r256J4394n978j0067
3630i076J6450m187j2026J3705l102r109J4433n248j1150J5487k783j1690J3021
3643D725k766r397J4213m249j1872J4402j462j1262J2273k390r916J3814k932
3656C181j2295J3208l37j0830J1641j975j0537J3145j462j2277J2006M53j0550
$$ plain form
3562 9700 -1860 -8625 7868 -52 -5679 8016 -2795 -7466 9633 -679 -8481 7540 -25
3575 -25 -5891 8352 -2487 -8506 9384 563 -8177 7215 -212 -6532 8537 -1697 -9148 8980
3589 8980 1596 -7948 6756 -477 -7286 8805 -477 -9551 8251 2143 -7836 6503 -529 -7961
3603 -7961 8864 817 -9624 7338 2260 -7750 6448 -311 -8427 8797 1993 -9538 6257
3616 6257 2040 -7586 6688 288 -8787 8228 2723 -9288 5444 1831 -7425 6969 991 -9076
3630 -9076 7374 3187 -8839 4866 1764 -7345 7088 1840 -9310 6177 3394 -8296 4725
3643 4725 1959 -7438 6775 2526 -9346 5056 3594 -7668 4605 2215 -7701 6113 3181
3656 3181 -9114 4094 3757 -7073 4568 2593 -7944 5201 3739 -8538 3468 3921 -6629
3669f629J0955j477j0923J2378o8j1948J0726P81j0184J0333p99j1013J1350R97
3683D479j1307R480R36r887R747p4j0817J0229J773j0613Q328J026r538R189Q12
3698C763j0472Q841K199r870P452J299r192Q361J652r994P534K522r160O595J716
3713C246q833P452K383r463O191K787q483N955K218q452O307K894q824N134L015
3728C527p779N172K645q017N171L246q003M177L134p093M470K926p470M071L384
3743C561p080L448L199o424L624L025o756L157L431o136K802L109n812K860L061
3758C069n926K416L294n269K197K990n167K083L024n045J759L159m458J541K797
3773B464m494J454K996m174J129K943l815R46K698l713Q52K817l409O15K708l189
$$ plain form
3669 -6629 4326 2849 -8074 4304 4236 -7712 3014 3795 -6389 3944 3145 -7868 3482 4479
3683 4479 -6828 2652 3588 -6299 3448 3374 -7443 2786 4559 -6054 2274 3300 -6238 2951 3763
3698 3763 -6709 2132 4331 -5539 1913 3212 -5980 2381 4033 -5961 1573 4095 -5065 1530 3246
3713 3246 -5587 1865 4248 -5215 976 3763 -4720 1235 3453 -4999 1308 4202 -4622 512 3527
3728 3527 -4252 920 3565 -4452 719 3965 -4038 139 3273 -3820 650 3576 -3894 177 3561
3743 3561 -3519 -71 3128 -3296 328 3353 -3403 -246 3185 -2951 -149 2960 -2852 8 3069
3758 3069 -2857 -441 2853 -2416 -219 2771 -2396 -313 2711 -2334 -575 2584 -1874 -333 2464
3773 2464 -2030 -576 2420 -1754 -625 2318 -1497 -551 2147 -1566 -714 2103 -1306 -691 2017 -1172
3789a172M42K547l039M06K669k745J37K408k556O7K385k325k9K348k127k36K140
3806A320j917k47K129j704l47K014j563m78J834j348m64J828j190n56J619j077
3822a47o05J549q16o20J454p65p28J292n77o83J195l82p67J117l65q22J040k10
3840A60p62R61o2q36Q04k1q39P75J64q08O65J36q64N79K76p75N33L61q14L98M03
3861D34q50L73M63p65L47M94q19K37N02p75K53O15p45J48N34p71J12O08o52J14
3881a43O12p08M9N89o72O8O22o23P6N68o67K1N19n73Q3N95n72M6M65o35Q1N19
3903C20n14J04M84o08J13L89n60K06L97n34K02L53o13K50K54n55L99K48n86L69
3923A18J13n94M25J99o17N82P2p19N94J5p08P74Op08Q18j50p96Q80j52p59J058
$$ plain form
3789 -1172 -730 1817 -1222 -816 1853 -892 -755 1653 -903 -836 1549 -776 -805 1543 -584 -820 1320
3806 1320 -597 -844 1285 -419 -766 1248 -315 -793 1041 -307 -771 1057 -133 -689 930 -147
3822 -147 -752 797 -19 -639 815 50 -678 614 37 -646 549 167 -600 517 152 -670 370 160
3840 160 -602 359 297 -539 265 244 -595 180 344 -464 201 337 -527 52 328 -447 86 447 -367 31 434
3861 434 -416 -43 420 -345 2 496 -323 -86 416 -359 -106 509 -236 -88 446 -325 -213 395 -257 -143
3881 -143 469 -239 -190 399 -273 -205 417 -206 -130 438 -229 -208 311 -262 -179 416 -156 -110 355 -280 -199 320
3903 320 -194 -90 394 -214 -101 288 -272 -66 331 -203 -1 352 -261 -11 243 -312 87 335 -251 118
3923 118 231 -363 62 261 -356 226 298 -421 173 188 -520 254 260 -448 370 220 -576 304 152 -607 451
3944D51j83q86J105k93r72J256k96r09J403m31j069J429m37j075J648m90j141
3961h90J738o28j299J857n70j265K004o79j382K121p82j555K277o45j514K359
3977A147q50j735K518p89j838K701p61j887K749r48k100L024p93k164L059q28
3993E05k298L203r68k496L431p02k580L392r10k712L664q91k915L829o91l017
4009b156L744r48l085M126p96l357M092o60l388M115r26l531M552o53l799M324
4025A654o53l752M520q28l974M875m56m241M457n53m053M875n77m534N041k25
4041A576m666M683l76m491N263l05n132N104R4n033M897j10m997N498R6n776N098
4058A423M83n331N135J62n624N589N52o209N050Q58n607N256M64o210N565J065
$$ plain form
3944 451 268 -618 487 194 -778 478 182 -727 676 245 -824 605 168 -907 741 251 -890
3961 -890 848 220 -1079 778 208 -1057 947 268 -1114 1007 225 -1330 947 302 -1212 1147
3977 1147 297 -1438 1080 291 -1547 1154 393 -1494 1255 307 -1793 1231 438 -1726 1333 505
3993 505 -1793 1410 442 -2054 1377 675 -1905 1487 577 -2135 1529 638 -2277 1552 861 -2156
4009 -2156 1588 640 -2445 1681 885 -2472 1620 960 -2428 1687 761 -2770 1782 1129 -2670 1654
4025 1654 1001 -2751 1769 941 -3033 1842 1386 -2855 1602 1049 -3004 1871 1294 -3240 1801 1576
4041 1576 -3090 1593 1217 -3274 1989 1684 -3448 1656 1750 -3283 1614 1504 -3493 2005 2101 -3675 1423
4058 1423 1906 -3425 1710 1872 -3752 1837 2389 -3820 1230 2088 -3519 1737 2201 -4009 1556 2621
4074B621o473M940J159n895N391P89o743N380J632o600M838J369o179N368J197
4089B794p116N134K178o582M665J513o557N346J740p393M827K579o589M519J741
4104B799p007N192K462p534M412K959o711M376K081p398M919L258p574L842L239
4119C315o831M172K701p722M435M000p523L312L488p005M009L389p915L803M582
4134D210p347K785L671p091L826M083p939L051M905p087K449L883p136L508M691
4149D462p839K273N041o742K230M150p202K987N274p563J495N087o380K089M469
4164C831p186K252N689p110Q63N166o142J841M945p200J398O031o558L70N266
4179C456n963J428N482p066M70O314n938k3N388n868Q46N996o719m07O443n275
$$ plain form
4074 2621 -3852 1088 2247 -3648 1743 2532 -4211 1169 2801 -3799 1039 2408 -3771 1597 2794
4089 2794 -4322 812 2990 -3592 1073 2586 -3971 1375 3115 -4278 549 3128 -3461 1058 2799
4104 2799 -4208 984 3446 -4088 324 3283 -3428 948 3029 -4369 550 3808 -3766 76 3315
4119 3315 -3516 656 3357 -4365 70 4070 -3453 -141 3347 -3658 351 3740 -4175 -372 4210
4134 4210 -3137 -352 3319 -3772 54 4137 -3802 -751 4154 -2933 -484 3399 -3737 -229 4462
4149 4462 -3377 -1104 3937 -2805 -575 3575 -3627 -640 4634 -2929 -1434 3653 -2727 -638 3831
4164 3831 -3355 -1103 4586 -2524 -1661 3505 -2637 -796 4149 -3051 -1653 4378 -2180 -1810 3456
4179 3456 -2507 -1079 4403 -2663 -2193 4121 -1817 -1840 3548 -2320 -1474 4522 -2197 -2604 3839 -1436
4195a436l45N480n821J67O379o129j090O386m762o15N558n719n10O676n410j616
4211b807O169m356q87N659n485j171O783m581j984N844m132j166N824n044j761
4226c095O680l859k246N501l899j495O027m456k331O452l215k468N250l655j871
4241b680O155l722k892O029k667k677N199l357k305O238l007l399N611k270k768
4256b512N172k919k800O065k305l679N128j913k820N192k470l226N722j746l743
4271b854M674j540k868N113j997l591N217j191l663M384j287k934M914j500l825
4286b948M642p12l408M050j013l067M528j018l839M070k86l200L785p99l240M157
4302A702n35l732L590L5l089L486n30l398L716ll561L169K41k994L136k10l429
$$ plain form
4195 -1436 -1781 3699 -2122 -1955 4424 -1705 -2795 3591 -1171 -1786 3772 -1947 -2457 4219 -1191 -2807
4211 -2807 3362 -994 -1881 3778 -1707 -2878 3905 -676 -2660 3184 -948 -2114 3710 -1334 -3095
4226 -3095 3585 -274 -2520 2981 -918 -2413 3614 -842 -3173 3279 64 -2404 2846 -809 -2680
4241 -2680 3475 -247 -3139 2890 223 -2454 2745 -612 -2917 3321 314 -3085 2526 256 -2512
4256 -2512 2660 -259 -3059 3006 701 -2978 2150 237 -2583 2609 139 -3087 2635 889 -2854
4271 -2854 1820 280 -2588 2525 528 -3063 2154 963 -2700 1684 397 -2537 2377 877 -2948
4286 -2948 1694 982 -2426 1624 611 -2456 2072 1054 -2785 1285 999 -2201 1584 785 -2455 1702
4302 1702 1167 -2565 1025 1060 -2029 1457 927 -2471 1245 1242 -2319 850 1091 -1903 1233 1023 -2406
4319b406L268M65l317K730L82k966K828J26l353K856P66l039K308M31k869K489
4335F99M67l079K353R24k796J935N15k701K150P57k817J915R43k526J566O15k435
4352a515J838R18k470J374R22k237J290P79k155J441R98k177R74R01j921J097
4368E7Q39j900J054J029j935O89R38j621Q30R40j651O21J005j591M53R74j347
4385f16N49R64j454L10J000j272K26R68j090K94R14j223P6R45r30R2Q97r03K1
4404b32Q03q77q8R01o60q9P86o82j96P55n93k20Q19m16k75O53m69l06O78k98l07
4425c13O94k78m16N65k78l60O39j47l58N15j09m97M90o5l80N33k0m65L99Jm97
4446c47M34J06m43M07J01n61L30J35m95L91K14n10L34J61n89L10K29m95L46K35
$$ plain form
4319 -2406 862 1327 -1990 740 1122 -1844 984 1110 -2243 613 1379 -1660 648 1079 -1790 699
4335 699 1166 -1913 440 1364 -1432 503 1018 -1683 467 1224 -1593 322 1265 -1261 305 920 -1515
4352 -1515 323 1241 -1229 145 1067 -1170 120 899 -1256 185 1183 -994 -20 881 -1040 57
4368 57 896 -1004 50 1079 -856 -167 771 -850 -20 920 -731 -110 895 -696 -243 731 -616
4385 -616 -67 897 -557 -247 753 -519 -293 675 -415 -121 793 -430 -354 591 -339 -247 650 -253 -232
4404 -232 571 -306 -394 507 -153 -242 544 -138 -334 421 -172 -392 427 11 -264 389 -80 -386 292 -6 -313
4425 -313 381 103 -313 252 -26 -386 253 106 -252 263 154 -343 147 82 -298 235 215 -250 149 150 -347
4446 -347 87 193 -250 157 258 -303 27 162 -333 58 272 -238 96 257 -332 -22 207 -288 58 293
4466B93n35K36K03n33L21K74m79K61K51n68K45K30m72L12K64m87K06K09m98K50
4486a7K31m18K82K05m84K03J74m30K86J87l92K56J57m88K71R8l61L48J05m22K88
4507G9L0l90L72K3l48M35n8m19M13r2l45N05r1l88N15j66l77N24k08l06O59k73
4529I4m17O35k82l75O68l11l50P97m00m81Q27m40l68R07n33m01R83n75m87R95
4549D86n79l60J080p05m87J173o90m93J198p61m19J294q49n78J386q04n29J430
4567G93r52n07J543j026o49J649r49o01J653j105o88J864j143p63J875j089p43
4584h38J953j291q37K144j191r49K141j245r09K252j400j040K455j311j077K389
4600A246j376j069K535j447j228K645j305j259K603j478j244K863j518j454K891
$$ plain form
4466 293 -242 -6 197 -336 -15 259 -220 41 292 -276 -31 199 -273 39 303 -184 22 231 -267 -17
4486 -17 214 -204 78 283 -201 2 176 -254 32 219 -173 83 240 -248 23 121 -240 108 213 -209 79
4507 79 109 -281 91 114 -234 201 143 -276 137 45 -300 205 114 -274 241 75 -302 222 14 -292 367 94
4529 94 -323 312 30 -345 323 12 -338 459 59 -422 405 -35 -403 504 -29 -430 553 -22 -509 486
4549 486 -93 -453 627 -78 -565 608 -82 -575 623 -138 -557 737 -112 -690 696 -108 -637 793
4567 793 -159 -666 877 -149 -798 851 -98 -699 954 -151 -839 1025 -118 -881 994 -95 -838
4584 -838 1115 -176 -1013 1131 -60 -1009 1132 -113 -1022 1230 -170 -1210 1245 -66 -1143 1246
4600 1246 -130 -1199 1336 -111 -1339 1306 1 -1258 1345 -133 -1377 1486 -32 -1486 1405
4615A405j380j450K902j587j429L124j515j656L081j460j584L146j586j738L396
4630A669j478j911L296j476j835L451j595k013L607j415k165L481j447k099L726
4645A796j531k348L794j366k384L721j430k386L954j377k677L941j235k666L938
4660A744j308k721M113j235k992M092j085k920M110j209l048M276j059l228M182
4675A712j001l133M239j069l310M316q81l385M185q38l371M328r03l554M320o80
4691I75l577M263p12l599M323o23l807M332m76l778M267n14l842M337l58m027
4707b816M317k44m027M291k24m163M330p6m249M285L7m311M277P7m404M251K36
4724A587m447M156L21m546M210L83m544M114M67m572M070N53m673M034O56m637
$$ plain form
4615 1405 25 -1425 1477 -110 -1539 1585 70 -1586 1495 35 -1549 1597 11 -1727 1669
4630 1669 191 -1720 1576 100 -1735 1716 121 -1892 1715 300 -1865 1616 169 -1930 1796
4645 1796 265 -2083 1711 345 -2039 1682 252 -2134 1820 443 -2234 1707 472 -2194 1744
4660 1744 436 -2285 1828 593 -2399 1693 608 -2312 1798 589 -2459 1817 758 -2470 1712
4675 1712 711 -2422 1817 748 -2562 1754 873 -2512 1673 835 -2536 1792 889 -2665 1655 975
4691 975 -2602 1661 949 -2650 1673 1050 -2757 1575 1099 -2679 1588 1074 -2768 1569 1211 -2816
4707 -2816 1501 1257 -2770 1521 1297 -2866 1464 1388 -2861 1424 1461 -2850 1427 1504 -2900 1351 1587
4724 1587 -2860 1296 1617 -2929 1281 1664 -2880 1234 1701 -2871 1199 1752 -2921 1113 1769 -2868
4740b868L975P16m704L929Q06m723L831R09m679L745R32m731L730J100m752L576
4756G92J145m692L577J149m764L506J334m736L350J369m716L351J445m825L246
4771E31J623m721L076J581m729L145J723m861K986J886m705K804J830m750K899
4786C18K000m820K655K079m645K604K009m689K609K254m714K308K264m520K335
4801D7K214m619K277K443m515J992K357m367K116K349m474J954K554m268J681
4816b59K418m154J841K484m313J599K622m004J441K437l980J566K609m095J244
4831e44K674l764J225K507l836J267K722l848R30K712l562J016K575l674R63K804
4847B167l566O70K693l323P79K630l490O57K841l260M44K644l107N94K620l233
$$ plain form
4740 -2868 1107 1823 -2881 1048 1854 -2869 962 1871 -2808 937 1869 -2862 868 1968 -2784 792
4756 792 1937 -2755 822 1971 -2793 713 2047 -2689 661 2030 -2686 665 2110 -2715 531
4771 531 2154 -2567 509 2090 -2639 506 2229 -2632 354 2240 -2465 339 2169 -2581 318
4786 318 2318 -2502 153 2232 -2413 191 2200 -2489 120 2374 -2340 -32 2232 -2288 47
4801 47 2261 -2358 -81 2362 -2153 -161 2196 -2171 -55 2294 -2180 -226 2328 -1940 -259
4816 -259 2159 -1995 -154 2330 -1983 -384 2238 -1766 -325 2112 -1868 -302 2307 -1788 -544
4831 -544 2130 -1634 -409 2098 -1738 -471 2251 -1597 -667 2045 -1517 -501 2074 -1600 -637 2167
4847 2167 -1399 -729 1964 -1359 -580 2050 -1440 -783 2058 -1202 -758 1886 -1221 -627 1993 -1240
4863a240L50K847k981K69K548k878L75K609k949J38K688k608J04K401k637J62
4879h02K570k589j02K529k310m5K268k382KK461k258k58K345k057j40K181k145
4896g32j62K373j957l94K131j785k48K115j877l50K207j653m95J974j575l38K020
4913A254j622n09K053j418n27J791j337m42J900j348o50J841j149n98J664j110
4929b07n17J707j108o67J582q81n94J458r20n53J506q49o86J338o63n60J309p50
4947e5o00J288o39o56J178m67n64J081n57o04J106m29n95R72l73n21R06m06n89
4966e24R04k43n57P83k72n12P56k33n52P18r4n46O12j39m85N88o9m88N22Mm80
4987c07M59m9m29M74rm02L81M6m13L09N8l68L57P1l60K23J09l50K03J15k71J94
$$ plain form
4863 -1240 -890 1957 -1024 -755 1793 -1085 -710 1899 -1050 -912 1776 -832 -728 1673 -964 -802
4879 -802 1768 -821 -923 1606 -704 -749 1519 -863 -861 1600 -658 -916 1429 -628 -768 1413 -732
4896 -732 -894 1479 -478 -872 1259 -526 -774 1341 -536 -886 1321 -332 -827 1147 -428 -766 1254
4913 1254 -368 -877 1176 -242 -769 1022 -315 -757 1143 -205 -855 986 -163 -761 903 -207
4929 -207 -724 983 -125 -792 790 -91 -685 773 -147 -700 806 -43 -729 609 -54 -614 695 -55
4947 -55 -655 633 -6 -662 516 49 -515 566 9 -595 511 82 -513 459 86 -435 471 65 -524
4966 -524 380 137 -420 363 91 -421 335 102 -450 268 174 -372 240 101 -384 204 135 -353 169 173 -307
4987 -307 152 103 -326 148 139 -263 118 164 -249 60 118 -250 107 178 -182 41 150 -200 3 118 -153 41
5009D1J35l03J24J32k62J17J67k40O9J99k68L3J63j78K9K14k20k5J71j81j0K03
5031A10j55j4J80j67o9J91r8r9K49j31j03K03j14j26K24o2j05J95p7j29J91p4
5053B0j26K13n2j55K23r1j59K06n0r0J64n5j44J60m2j23J60j6j15J74o9j17J19
5076C5m4q9J48m5o8J32q1r6J47m1p4J36q2n4J39r6m1J23n9pJ05j04m6J20q6nJ08
5103G5r8J9J05j55J6J37j64M4J37j86O8J19k22Q6J13j93J12J11k77J43J40k72
5125a42J07J79k73J09J79l52J74J87l50J82K02m21K19J88m42K11K83m31K09K11
5145B29m74K57K34m84K44K98n33K41K48n57L03L41o37K70L56o01K80L08o88L40
5165b5M41p10K47M43p40L31M02q04L18N60q02K45M93q32L68N43r08K80O60q88
$$ plain form
5009 41 176 -127 -3 129 -133 -16 151 -89 -20 179 -89 -56 107 -71 -42 172 -48 -73 98 -83 -93 110
5031 110 -45 -59 121 -46 -115 76 -22 -121 128 -3 -106 97 -17 -143 81 19 -86 109 32 -97 94 20
5053 20 -106 107 55 -100 123 32 -127 79 29 -61 103 48 -96 64 22 -101 59 43 -72 102 33 -84 35
5076 35 -9 -98 50 5 -63 69 -12 -108 39 -2 -76 60 -22 -76 63 -33 -74 49 -10 -17 88 -16 -62 58 -28 -33 75
5103 75 -23 -4 101 -54 -38 99 -65 -21 116 -70 -2 117 -105 -19 94 -99 13 124 -153 -10 130 -142
5125 -142 -35 144 -129 -20 159 -193 -19 168 -182 0 202 -219 0 188 -254 -43 240 -191 18 229
5145 229 -245 12 246 -238 6 304 -229 12 260 -297 6 347 -290 -20 336 -265 15 323 -365 -25
5165 -25 416 -294 -47 396 -344 -13 389 -415 -97 463 -339 -94 399 -433 -65 478 -430 -150 510 -378
5185c78K60N98r32L27P43j046K29P82r83K54P27j050L10Q68j111J51Q88j041K27
5204a77Q46j154K83R78j185R4R87j101K06J000j280J59J161j235L4J103j175J62
5222b94J164j374OJ337j219l4J213j260O0J361j447r1J470j256r5J386j403m4
5240e20J571j460k46J610j283j96J520j475j76J790j456l94J727j343k64J685
5256A090j518l91J986j422n04J801j372m02J924j608n11K082j362o56J904j378
5272c37n17K088j564p14K221j349p30K005j460n90K245j551q33K232j267q27K119
5289A171j464p56K408j462j073K328j262q94K302j531r52K543j320j255K360j213
5305g0j031K409j419j179K595j198j367K379j182j157K571j341j452K695j089
$$ plain form
5185 -378 -118 480 -452 -125 618 -428 -199 583 -400 -146 581 -469 -159 709 -402 -251 637 -404 -177
5204 -177 669 -485 -202 776 -409 -315 672 -429 -223 777 -503 -344 817 -418 -384 719 -456 -294
5222 -294 870 -504 -498 839 -380 -414 799 -461 -401 960 -487 -578 892 -364 -459 927 -476 -520
5240 -520 1051 -409 -655 955 -328 -524 996 -479 -655 1135 -321 -715 1012 -331 -595 1090
5256 1090 -428 -819 1167 -255 -759 1042 -330 -732 1192 -416 -927 1155 -207 -863 1041 -337
5272 -337 -854 1234 -330 -1044 1177 -172 -902 1103 -357 -947 1298 -253 -1086 1146 -121 -948 1171
5289 1171 -293 -1049 1359 -103 -1176 1152 -110 -1004 1298 -233 -1185 1358 38 -1217 1143 -70
5305 -70 -1101 1308 -111 -1290 1305 107 -1260 1119 -63 -1220 1351 10 -1442 1253 164
5320A64j486K473j145j317K687j251j617K673r61j551K507j119j457K748j106
5335B42j787K666q41j611K553j087j601K767r55j853K611p95j647K579j007j763
5351a529K724p56j910K499o94j697K560q83j908K693n85j974K440o20j805K588
5367A143p21k033K624m71j952K381n93j866K565n41k134K515l42j982K366m96
5383D63j991K523l58k177K397k19k004K254l64k045K431j90k167K214j25j999
5399a357K206k37k067K240k9k128K053n9j969K094j04k075K098P1k026J879Kj901
5417a309J979K3k031J880K03j969J740J31j906J826J75j987J688K81j859J613
5433D78K02j852J689K43j915J544L69j800J449L09j831J520L82j876J389M30j743
$$ plain form
5320 164 -1322 1151 6 -1311 1376 125 -1492 1181 220 -1331 1176 57 -1400 1348 242
5335 242 -1545 1121 280 -1331 1222 135 -1466 1301 346 -1507 1104 309 -1338 1241 234 -1529
5351 -1529 1195 439 -1471 1028 334 -1363 1197 314 -1594 1099 514 -1460 980 360 -1445 1143
5367 1143 422 -1611 1013 542 -1410 971 378 -1488 1077 536 -1598 917 575 -1407 959 463
5383 463 -1528 995 637 -1540 857 638 -1366 888 524 -1521 910 720 -1447 767 642 -1357
5399 -1357 849 612 -1455 785 756 -1372 681 622 -1347 747 643 -1432 666 737 -1289 590 592 -1309
5417 -1309 670 693 -1338 542 745 -1224 516 647 -1259 567 742 -1245 443 724 -1135 478
5433 478 680 -1172 517 760 -1155 389 758 -1042 407 716 -1115 405 787 -1089 300 730 -1013
5450a013J348L94j769J318M75j722J185N04j654J161N00j689J121N73j611J022
5466A43N31j507R89N36j527R31N64j415Q55N33j397Q54N91j400P52O36j333P08
5484D4N88j284O56O22j223N86O41j173N24O08j128N13O14j084M47O13j059M30
5502f5N87r85L52O33r55L22O13q94K56O09q80K62O20q31J81O29p74J57O08p33
5522b88Q5O53p23Q5O13o53N2N75o14K4N77n73K1N21n12m4N48m81n4N09m23p9M67
5545B86l64j16M60l49j20M57l18j25M10k83j44M19k65j45L75j86j88L69j85j81
5565a93L69j70j96L42j38j77L06r3k40L12p3k18K71l2k33K43j4k01K37j1k35K31
5587H7Rk32K11L0k42J92O6k65J79Q5k43J44J07k50J21J08k49J09J35k25Q7J57
$$ plain form
5450 -1013 335 729 -1040 278 753 -969 216 720 -934 227 727 -962 159 732 -879 143
5466 143 674 -833 156 692 -835 96 660 -755 100 633 -764 90 681 -719 33 669 -664 44
5484 44 632 -652 4 626 -597 -11 630 -543 -19 589 -539 -26 588 -496 -49 564 -495 -65
5502 -65 522 -463 -111 522 -433 -111 502 -392 -136 473 -407 -145 475 -356 -175 454 -320 -163 445 -288
5522 -288 -203 450 -273 -188 425 -228 -176 399 -215 -191 386 -187 -166 355 -157 -201 347 -134 -188 321 -102 -181 286
5545 286 -78 -194 266 -83 -203 254 -64 -189 221 -62 -206 213 -52 -197 178 -8 -196 173 -12 -193
5565 -193 176 6 -190 152 14 -163 143 50 -190 122 49 -169 102 70 -163 80 66 -135 102 91 -144 87
5587 87 96 -136 75 105 -137 55 121 -144 35 120 -123 21 128 -122 -1 107 -142 -33 102 -123 -36 121
5609A21k43O2J85k48O0K07k54O8J78k24L7J81k10K4K15k27NK04k26J2K08k11l
5632g9K23j89j9K02j91k8K18k19j0K36j92n2K36j89l4K22k16j2K08j61n4K12j55
5655d3n9K33j96l9K24j87n8K51j96m6K52j90k4K08j94k0K34j95j4K11k05k9K16
5678A34k05J6K05k07OJ98k40L6K18k35K8K12k80L6K27k68O8K13l13J11J94l08
5700a54J11J93l09J27K12l49J26J94l59J81K43m18J94K24m26K07K25m58K32K52
5720B48n12K77K25m92K75K52n35L00K33n66L49K47o39L94K66o43L79K59o78M02
5740D1K77p08M44K84p63M67L15p95M99K96q56N49L31q95N45L54r03N82L62r60
5760e34N91L81r64N73L98j012O78M10j132O69M82j152O94M52j180P41M98j296
$$ plain form
5609 121 -122 -60 125 -123 -63 144 -110 -42 136 -88 -51 130 -80 -56 159 -68 -63 141 -85 -73 135 -76 -79
5632 -79 144 -45 -64 138 -53 -81 137 -82 -92 144 -48 -100 136 -53 -87 135 -81 -93 115 -46 -100 112 -43
5655 -43 -102 131 -65 -104 120 -67 -125 126 -70 -116 136 -54 -78 130 -64 -84 150 -45 -59 152 -53 -82 134
5678 134 -71 -55 150 -57 -51 147 -93 -57 161 -74 -46 166 -114 -78 149 -119 -51 162 -151 -40 154 -154
5700 -154 -43 150 -159 -32 180 -169 -43 151 -208 -27 216 -202 -8 216 -210 -3 222 -236 -4 248
5720 248 -264 13 238 -254 21 273 -262 38 271 -295 54 301 -338 56 322 -321 58 317 -361 41
5740 41 318 -390 54 338 -425 42 357 -438 61 357 -499 50 381 -514 31 385 -518 64 426 -534
5760 -534 57 438 -526 47 445 -567 111 521 -611 58 540 -612 82 534 -646 95 593 -703
5778g03P63N54j277P68N42j395Q42N90j450Q02O43j436Q39O32j559Q84P22j574
5796h13Q32P05j535Q87O87j663Q99Q35j677Q58P89j695R76P95j846R47R38j788
5814h69Q93Q69j843J003R23j947R38J020j881R08R54j978J032J087k104R08J142
5831A055k001R35J088k164J013J255k216Q84J253k138R69J240k337R95J429k293
5847a033Q39J347k246R63J428k469R30J561k371Q07J464k361R90J560k570Q52
5863c09J683k372P78J537k457R24J694k585P37J755k407P71J623k515Q29J843
5879A529k572N99J810k389P21J741k612P44J986k587N01J888k402O71J891k672
5895a153O01K128k518L97J981k481N94K031k674M55K215k467L20K051k506M99
$$ plain form
5778 -703 60 614 -663 105 647 -748 94 684 -766 36 679 -757 82 714 -845 39 761 -813
5796 -813 19 724 -811 76 763 -900 -1 834 -843 15 804 -891 85 880 -966 -19 919 -869
5814 -869 24 893 -950 53 976 -971 -33 987 -894 14 968 -1010 22 1109 -995 -87 1055
5831 1055 -946 -11 1077 -1087 -74 1181 -1035 -151 1102 -1036 -67 1173 -1164 -169 1260 -1033
5847 -1033 -194 1153 -1093 -130 1298 -1171 -241 1320 -1051 -244 1220 -1141 -151 1409 -1161 -309
5863 -309 1374 -998 -220 1317 -1140 -216 1478 -1107 -370 1385 -1022 -251 1372 -1143 -314 1529
5879 1529 -1043 -444 1366 -1023 -302 1439 -1173 -429 1557 -1030 -529 1359 -1043 -372 1519 -1153
5895 -1153 -552 1576 -942 -545 1436 -1045 -451 1580 -1094 -639 1576 -891 -571 1480 -1026 -527
5911e27K190k651K59K292k406K66K103k511L70K316k564R2K328k353J90K159k524
5928i71K33K415k448o3K307k247J07K198k445O4K460k297j67K263k151PK292k339
5946g82j39K490k112k91K238k107q3K380k233l44K461j948l76K237k033k17K426
5963A567k060n07K432j856m37K235j923l85K458j895o60K349j693n07K264j829
5979d47n53K458j730p96K301j554n99K242j713o99K403j503q57K217j427o64K203
5996A282j529q49K289j278q79K049j262p76K177j352r83K194j097r25J965j159
6012a33q32K104j126j079K032q97r62J864j025r34K009r33j113J884p54j008J797
6029H94q51j057J886p10j159J741o37j014J737p42j107J782n35j149J602n31j049
$$ plain form
5911 -527 1663 -988 -729 1563 -843 -577 1526 -985 -615 1701 -863 -771 1557 -796 -606 1553 -971
5928 -971 -738 1677 -771 -834 1473 -774 -667 1531 -914 -850 1610 -687 -854 1409 -742 -735 1557 -782
5946 -782 -921 1569 -543 -834 1404 -703 -786 1594 -639 -983 1478 -470 -846 1391 -642 -859 1567
5963 1567 -493 -1000 1432 -424 -861 1374 -549 -934 1524 -371 -1031 1318 -375 -882 1382 -447
5979 -447 -1000 1458 -272 -1068 1233 -321 -920 1322 -391 -1090 1313 -190 -1047 1170 -257 -921 1282
5996 1282 -247 -1096 1193 -85 -964 1085 -177 -953 1224 -128 -1111 1083 -14 -939 1026 -133
6012 -133 -965 1139 13 -1066 966 69 -893 971 -54 -988 1021 88 -1025 859 105 -903 894
6029 894 43 -1014 872 162 -997 744 107 -907 830 88 -1019 763 228 -921 681 150 -899
6046h99J648n64j142J632l79j160J456l83j044J492l56j199J467k13j118J328
6062E66l00j092J402k44j126J254j13j099J212j71j078J247p9j152J140j2j053
6079f98J078o7j012J031L4j051R52P7r81R37M7j009R33J16r86Q18J21r09Q36J13
6099C80r80Q02J91r35O93K17q51O78J75q93O44K82q71O15K14q23N81K55q16M74
6119C2L47p57M45K82p47M59K95p23L64L33o74L32L18o72L48L42o29K72L03n70
6139c00K82K96n61K37L69n52J97L19m92J51L30m77J45L53m52Q5L24m04P6L41l98
6160a31N6L51l89J8L26l64L8L08l21KL30l11k4L03k93qL02k55p7L12k37p1L12
6183A77k12r4K95k20q1K66j73q8K63j42j24K72j33j23K37j01j18K34j17j45K53
$$ plain form
6046 -899 749 185 -957 675 296 -864 592 209 -835 657 301 -898 569 356 -762 566
6062 566 266 -826 576 332 -794 460 347 -752 460 289 -789 458 379 -773 367 355 -698
6079 -698 380 313 -699 332 366 -685 267 344 -637 300 347 -662 271 387 -599 219 340 -569 267 380
6099 380 -600 202 393 -542 151 368 -483 195 370 -523 121 403 -468 147 361 -462 119 374 -442 32
6119 32 379 -378 67 349 -398 61 356 -367 -3 330 -344 -12 306 -366 -18 324 -305 -33 270 -300
6139 -300 -18 278 -283 -46 323 -229 -32 287 -205 -54 276 -201 -56 297 -155 -70 254 -150 -74 267 -131
6160 -131 -75 276 -113 -95 231 -133 -95 213 -108 -106 224 -87 -111 192 -101 -109 193 -62 -139 173 -64 -135 177
6183 177 -35 -129 166 -54 -135 131 -42 -130 133 -9 -133 139 6 -117 120 19 -99 135 18 -127 126
6204A26q3j56K33o6j77K30p2j55K27m4j91K24o1j41J73k2j71J96l3j49J69qj86
6227a37J82J0j85J90rj63J88l1j71J75J6j61J54Jj74J65J9j84J69L0j87J87oj87
6251a09J92Nj90J70oj88K04Kj77J54L8k09J86k3j78K00k4j73J78j1j56J75k1j69
6275a30J85k3j52J97n8j59K20o8j58K37n9j73K50q4j58K56r3j63K79j00j81K61
6297A26r0j97L11j28j62K95j15k01L46j78j88L84j48k12L60j88j97L84j98k29
6317b25M31j77k40M02j97k47M61j97k83M97k09k84N00k26k84N45k51l01N30k08
6337C7l15N33k33l32N96k22l78O25k52l68O24k68l75O45k56m26O73k42m40O92
6357C18k43m89P32k42m78P24k54m88P72k71n53Q03k26n72Q10k36n89Q47k27o44
$$ plain form
6204 126 43 -113 120 54 -123 107 35 -120 107 63 -128 96 35 -106 67 45 -126 70 37 -112 57 49 -137
6227 -137 45 55 -130 60 51 -112 76 45 -126 49 65 -96 58 59 -115 50 69 -115 54 84 -103 84 78 -109
6251 -109 83 88 -102 68 62 -126 78 80 -97 57 95 -114 72 49 -129 71 47 -126 52 41 -115 60 39 -130
6275 -130 55 32 -120 77 19 -140 80 12 -146 91 32 -141 109 25 -133 123 30 -133 146 46 -135 126
6297 126 36 -161 150 22 -140 155 40 -161 185 7 -181 203 55 -157 203 15 -182 202 4 -225
6317 -225 206 29 -211 191 -6 -253 208 11 -272 225 16 -268 232 6 -278 267 16 -285 245 37
6337 37 -278 255 22 -310 286 64 -314 311 59 -309 315 47 -328 317 61 -365 308 66 -374 318
6357 318 75 -414 318 76 -402 322 68 -420 352 81 -472 331 105 -467 343 107 -482 365 138 -506
6377e06Q40j84o85Q99j99p13R04j71p68R51j76p42R30j81p50R26j31q24R34o1
6397B93q70R46r8q69R59q6r02R86o4r50J037r5r63J018pj009J000nj022J005K9
6418C33j019R86O3j072J015J03j154J029J31j169J051J53j214J060J67j221J039
6435B81J98j251J041K60j308J076K80j364J040L22j346R87L97j412J010L96j391
6452g84R81M47j457R84M95j475R62N15j470R10N62j503R15O18j527Q87O68j545
6470h17Q82O66j534Q48P28j581Q09P81j577P98P99j616P76Q90j608P18Q97j646
6488g87P27R64j675O73J003j667O57J002j675O60J073j709N95J118j684N56J120
6505I51j729N58J213j712M60J273j761M88J259j744M49J317j729L71J358j722
$$ plain form
6377 -506 334 150 -535 364 165 -548 356 185 -583 368 192 -550 380 199 -551 375 244 -580 354 293
6397 293 -577 369 271 -598 361 275 -627 359 295 -655 382 287 -676 342 335 -674 326 321 -701 304 333
6418 333 -686 300 363 -709 306 409 -745 284 415 -754 297 450 -764 296 463 -758 281
6435 281 479 -772 269 529 -779 297 577 -787 253 575 -771 216 613 -799 211 607 -784
6452 -784 197 644 -813 171 666 -809 153 668 -802 108 670 -833 82 700 -827 60 728 -817
6470 -817 65 731 -803 45 773 -808 1 782 -795 3 802 -814 -38 852 -756 -38 859 -787
6488 -787 -60 904 -771 -98 905 -762 -105 897 -778 -118 955 -754 -159 959 -725 -169 951
6505 951 -778 -220 993 -719 -259 1014 -747 -259 1000 -744 -295 1022 -707 -336 1022 -700
6521g00L76J365j740L25J440j684K19J407j646K45J469j714J77J528j637J44J479
6538A053j619J26J544j644K8J597j611K8J578j603jJ624j612p7J631j500j09J632
6556A065j577q6J695j530k21J681j455j99J689j541k19J776j455l15J728j435
6572c99k80J751j446l46J790j334m56J761j365l83J800j364m84J789j238n39J754
6589A011j255n14J793j235n98J756j111n78J682j140o24J789j106o72J699j006
6605a09o82J688j016p11J706r18p88J660q99p17J650r11p70J666q30q12J570p69
6623Hp94J595p92q51J626o89q87J523o73q44J561o68r34J530n86q80J436n68r05
6642g92J514n65r79J447m57r10J364m80r08J395m45r42J290l38r20J277l71r37
$$ plain form
6521 -700 -324 1041 -699 -374 1066 -618 -399 1008 -638 -393 1076 -638 -461 1067 -570 -426 1053
6538 1053 -566 -440 1104 -540 -512 1085 -526 -498 1080 -523 -524 1100 -512 -589 1042 -458 -567 1065
6556 1065 -512 -598 1097 -433 -654 1027 -428 -627 1062 -479 -698 1078 -377 -692 1036 -399
6572 -399 -679 1072 -374 -720 1070 -264 -720 1041 -324 -707 1093 -271 -755 1034 -204 -743 1011
6589 1011 -244 -758 1035 -200 -798 958 -153 -731 951 -189 -813 976 -130 -802 897 -109
6605 -109 -791 897 -119 -830 876 -42 -830 830 -69 -786 864 -47 -817 849 19 -793 777 8
6623 8 -786 809 17 -834 792 103 -784 739 66 -778 783 115 -819 711 125 -755 681 113 -792
6642 -792 722 157 -822 625 168 -742 622 142 -766 629 184 -758 532 194 -726 551 180 -757
6660g57J273k79r89J201k30q99J173k67r50J170j87r29J066j34q95J048j38r19
6678f42J039q6r06R37n9q84R34l1r02R08K5q71Q30pq42Q39L3q78P80P9p93P16
6700B19N6q08P20J37q31O75J27p43O09J14p21N92J82p58N37J94o94N08K05p06
6720c86M73K25o45M08K23o39M17K21o16L65K70n94L11K73n85L20K62n62K67K90
6740B98n50K21K99m98K17L02n24J73L01m34J23L23m36J08L61m70P3L65m14P2L35
6761B45l78N4L12l67LL40l55O1L14l18lL07l12JL26l06rL03k77m6K99k53m5K92
6785A88k24o1K90k26j30L51k13j13K99j92j14K86j51j48L27j86j42L05j61j47
6805a62L01j35j66L07j13j77K82j18j81L02j17j55K59j15j54K63r6j59K75p2k19
$$ plain form
6660 -757 516 237 -752 449 219 -680 493 226 -724 446 259 -670 396 262 -633 415 277 -642
6678 -642 397 311 -595 342 283 -601 333 302 -600 308 333 -538 292 285 -557 282 315 -563 217 296 -497 219
6700 219 275 -533 187 324 -507 168 295 -448 161 275 -446 146 328 -430 107 301 -393 115 320 -386
6720 -386 87 312 -333 75 298 -341 76 297 -319 46 316 -278 33 306 -279 41 303 -259 8 298
6740 298 -252 -31 268 -230 -13 289 -235 -62 239 -195 -72 251 -185 -77 284 -186 -113 252 -162 -90 245
6761 245 -133 -79 233 -134 -131 209 -146 -85 229 -89 -92 215 -97 -96 230 -76 -85 218 -59 -105 194 -59 -104 188
6785 188 -36 -97 193 -33 -163 188 -25 -138 161 -31 -145 141 -10 -158 169 -17 -159 146 -15 -162
6805 -162 139 4 -162 145 32 -145 137 19 -162 140 23 -132 127 12 -142 121 25 -134 141 69 -150
6826a50L12j43j80L06j05j77K54q9j66K54r6j67K65q8j53K28q6j76K62j01j57
6847a53K76j12j46K51j23j51K85j19j63L01j31j63K85j31j41K95j56j53L09j50
6867A0j68L26j49j49L11j48j74L15j72j36L08j78j38L23j65j57L09j53j73L45
6887A87j97j55L22j70j72L76k16j49L94k40j75M16k62j79M43k39j91M77k87j97
6907b14M83k70k18M81k80k12N16k99k23N18k83k40N39l06k38N53l04k44N46l35
6927c0k49O01l11l14O05k94l01O29l75l15O55l25l10O60l61l05O90l76l72P67
6947C69l53m11P40l49l77P72l80m28Q00l19m73Q23l73m56Q48l82n11Q79l58n09
6967d48Q73l64n40R50l74n83R23l54o04R64l53o64J038l44o41R44l14o68J022
$$ plain form
6826 -150 162 19 -161 145 40 -137 117 28 -138 116 20 -147 118 30 -123 105 19 -157 105 4 -153
6847 -153 123 11 -135 116 -7 -158 127 8 -155 146 15 -148 137 6 -135 160 4 -149 160 10
6867 10 -158 168 19 -130 181 33 -141 174 2 -134 174 -4 -142 181 16 -141 168 15 -158 187
6887 187 -10 -165 157 -13 -185 191 -25 -174 220 -20 -195 221 -41 -220 223 -16 -207 270 -17 -214
6907 -214 269 -1 -219 262 -18 -230 286 -13 -236 282 -1 -241 298 -8 -246 307 3 -241 305 -30
6927 -30 -279 322 11 -303 302 8 -293 336 -39 -354 301 -24 -334 326 -35 -340 350 -26 -398 369
6947 369 16 -395 345 -4 -381 391 11 -417 383 64 -409 414 41 -415 433 51 -460 419 61 -448
6967 -448 425 61 -479 471 97 -486 437 83 -521 443 90 -574 464 120 -521 423 109 -559 463
6986D63l42p26J051k81p54J012k92p50J085k99q22J114k73q15J061k56q39J148
7004D85k17r38J107j72r36J113k15r08J172j78j016J134j30r86J146j60j039J178
7022D40q2j110J177o8j107J200r6j142J214j9j190J168k2j172J257k4j244J223
7040D03N3j295J214N2j274J251J03j365J176K17j363J188J50j341J193K15j433
7057h56J171K76j393J121K38j411J183K98j488J139L39j454J146L43j540J139
7073B51M43j548J067M24j508J108M74j595J047N59j590J024N03j538J058N59j638
7090i00J001O53j605R68O36j654J023O79j680R66P11j616Q92P30j642Q98Q04j671
7108h07Q35P90j635Q52Q47j723Q54Q80j676P55Q72j621P66Q61j648P31R65j657
$$ plain form
6986 463 121 -605 446 165 -589 423 131 -619 466 167 -655 459 186 -629 432 176 -663 485
7004 485 268 -670 437 265 -671 442 227 -681 491 313 -703 431 301 -685 461 301 -738 440
7022 440 358 -752 425 357 -750 450 354 -788 426 407 -783 385 363 -809 448 424 -820 403
7040 403 456 -839 375 427 -847 404 507 -858 318 535 -828 360 510 -831 362 577 -856
7057 -856 315 591 -802 319 557 -854 329 627 -861 278 617 -837 309 652 -888 251
7073 251 694 -854 213 637 -871 237 711 -884 163 722 -868 156 659 -879 179 738 -900
7090 -900 101 754 -851 117 753 -901 122 801 -879 87 798 -818 74 804 -838 60 864 -807
7108 -807 28 818 -817 35 882 -841 13 893 -783 -28 844 -777 -11 850 -798 -67 898 -759
7126g59O37R83j626O72R98j647N75J048j604N33J052j569N22J086j583M65J104
7143H87j549M38J098j521M31J092j499L36J165j454L17J173j526L38J203j502
7159e73K71J199j439K32J209j449K03J243j411J36J254j367J37J240j395R7J284
7176H71j339O7J255j315M8J259j298K2J274j256l7J273j220m2J276j204q3J233
7194G84j113j50J266j101j46J238j035k26J238r89k31J203r57k48J187r33k74
7211d87J198r12k89J206q86l15J169q38l55J162p78m08J146p54l80J138p30l92
7229e05J126p02m37J105o68m17J058o15m43J042n83m77J072n56n18J040n17n11
7247e06J001m76n21R91m45n19R54m10n40Q99l36n38Q67l29n63Q50k74n80Q40k59
$$ plain form
7126 -759 -122 861 -765 -93 905 -742 -167 881 -723 -190 862 -707 -185 901 -682 -217 887
7143 887 -662 -224 874 -647 -216 876 -623 -287 878 -576 -259 914 -612 -274 929 -573
7159 -573 -302 897 -542 -310 899 -550 -347 896 -515 -379 875 -492 -355 885 -510 -413 871
7176 871 -468 -401 854 -461 -413 846 -452 -430 844 -412 -449 824 -396 -438 838 -366 -449 784
7194 784 -329 -479 787 -314 -460 778 -257 -483 755 -234 -465 738 -219 -467 720 -213 -487
7211 -487 711 -201 -490 716 -170 -485 684 -154 -509 653 -125 -533 613 -141 -521 617 -113 -505
7229 -505 621 -81 -518 587 -81 -498 560 -55 -498 544 -39 -516 556 0 -518 522 5 -506
7247 -506 495 19 -502 489 44 -475 479 69 -471 428 92 -446 421 92 -471 379 105 -475 365 106
7267A06n55Q01k50n60Q01k08n64P36j88n41O76j22n68O85q1n70O20m5n61O02m9
7288A65n50N91l1n48N78j0n63N77j9n12M98J9n18M80P5n34M44P9n20M27Q6n14
7310c00L91J40n13L59J39n02L46J51m88L14J65m72L00J78m52K79J71m49K67J94
7330B18m55K25K36m15J80K07l72J50K46l89J46K44l70J06K50l43J01K66l47O1
7350e5K94l55O3K75l20L7K68l33O2K78l11L3K61l02J3K94k94MK82k74m5L15k77
7373h7k7K91k58l8K95k28o4K78k02p6K72j72r5K92k06r3K83j77j03K84j74r5K79
7396A79j91j13K88j48j37L11j89j40K97j46j30K55j38j49K96j34j55K73j41j40
7416a52L09j55j48K63j28j38K83j38j48K83j39j45K76j15j58L03j18j70K77j55
$$ plain form
7267 106 -449 352 102 -458 343 135 -429 307 119 -422 254 132 -436 249 168 -402 218 173 -388 214 165
7288 165 -385 206 175 -373 205 195 -368 209 190 -322 176 195 -323 157 232 -302 142 221 -299 128 214 -300
7310 -300 91 231 -282 77 216 -286 60 211 -277 37 202 -270 30 208 -244 35 206 -243 24 218
7330 218 -237 -12 224 -191 -11 196 -176 -26 220 -169 -23 221 -149 -43 207 -136 -35 231 -116 -55
7350 -55 239 -116 -53 222 -98 -61 207 -126 -64 214 -97 -64 197 -105 -92 202 -92 -88 194 -80 -125 190 -87
7373 -87 -114 177 -81 -119 176 -52 -116 162 -40 -116 156 -16 -111 181 -25 -118 165 -12 -115 169 -5 -100 179
7396 179 -12 -125 163 15 -122 189 0 -140 157 11 -119 136 -2 -151 145 11 -144 129 -12 -152
7416 -152 157 2 -146 117 -11 -149 134 -4 -152 131 -8 -153 123 8 -150 153 35 -135 142 -13
7436a3j42L20j56j47L13j56j85L14j37j54L00j48j35K87j50j46K80j41j21K89
7456A72j81j54L29j82j26L13k07j27L33k06j45L34j68j47L26k06j40L75k14j43
7476a64L55k17j47L79k42j14L59k13j66L91k19j83M19k52j72M19k60j79M57k80
7496b9j71M66l28j43M72k89j89M84l14j88M91l21k00N40l36j61N23l74j88N41
7516B86l43k06N41l31k16N70l56k42O29l62k60O37l91k69O80m05k79O96l97k89
7536c07O76m04k79P13m16l40P34l82l54P38m16l17P67m39l45P59l90l78Q31m58
7556gl88Q55m51m35Q34m29m23Q95m76m53R36m43m64R00m78m54R71m94m94R76m28
7577E0n59R91m54n27J012m58o01J032m16o07J045m51o06J072m35o68J046l73o51
$$ plain form
7436 -13 -155 165 9 -138 175 19 -166 148 11 -143 157 9 -126 161 11 -135 145 4 -117 172
7456 172 -9 -163 166 -16 -142 171 -36 -163 170 -36 -181 153 -15 -162 164 -42 -182 193 -21 -164
7476 -164 191 -26 -173 206 -36 -150 209 -4 -170 221 2 -181 238 -14 -186 233 -27 -206 251 -29
7496 -29 -200 266 -62 -205 267 -22 -211 273 -41 -229 262 -59 -259 281 -55 -216 307 -67 -255 286
7516 286 -57 -263 278 -53 -269 301 -55 -297 332 -30 -290 347 -44 -313 367 -38 -317 379 -18 -307
7536 -307 369 -35 -314 399 -17 -357 377 -5 -359 379 -37 -354 413 -26 -371 388 -2 -380 451 -7
7556 -7 -395 460 9 -426 408 -21 -444 451 -25 -478 458 15 -449 451 -27 -481 490 -4 -498 478 50
7577 50 -509 482 28 -499 513 55 -546 486 70 -537 508 57 -549 523 88 -580 466 93 -558
7596e58J060l97p14J121l80p52J096l69p14J098l72p70J135l23q11J125l38q07
7614f70J178l58q57J174k63q87J155l14q49J216l20r53J244k47r28J176k77r47
7632g27J260k54j018J239k28r79J203k23j032J278j77j113J221j36j066J219j61
7649C06j100J239q7j131J186q9j117J220q0j171J212K4j179J112Pj111J185Mj247
7668h17J183R1j224J113P4j218J160J24j280J113J86j273J063J71j267J138J84
7685E21j312J069K25j273J059J93j312J108K90j348R99K84j253J000K80j346J021
7702B05L62j317R18L66j273R24L83j342R12M18j270Q44M21j287Q72M73j339Q07
7720G7N19j274P60N24j298P92N31j318P10N99j250O73N78j259O72O36j309O14
$$ plain form
7596 -558 502 105 -609 512 132 -620 476 107 -607 491 119 -651 484 161 -650 475 137 -670
7614 -670 508 150 -707 467 204 -683 472 158 -691 525 205 -748 496 249 -679 497 220 -727
7632 -727 533 279 -739 500 272 -707 496 273 -759 519 342 -771 450 314 -752 467 306
7649 306 -794 445 358 -773 413 324 -793 427 347 -824 388 412 -767 345 352 -759 426 430 -817
7668 -817 366 457 -767 346 420 -798 362 486 -794 319 505 -768 295 466 -801 337 521
7685 521 -791 278 503 -770 289 482 -830 278 568 -780 219 503 -750 250 530 -816 205
7702 205 567 -750 168 534 -739 185 568 -774 138 556 -714 130 551 -736 136 609 -730 77
7720 77 596 -678 82 606 -692 100 631 -687 23 622 -628 45 623 -636 36 672 -637 -23
7738b3O56j233N87O33j239N65P02j247N06P20j210N25O96j225M87P28j159M12
7756a19P24j149M39P28j168L84Q22j154L52P34j082L38P89j123K91Q25j048K43
7774a74P86j030K44Q22j036J58Q47r66J25P92r42J55Q47r70P5Q45r20R3Q06q87
7794c30L2Q46q26l7Q55q13l1Q49q10m5Q64p57j34Q54p48q4Q19o67k03Q84o77j76
7816c35Q23o49j70Q33o33k28Q22o02j84P99n78k44Q48n54l01P76m87k53P20m66
7836f3k98P62m59l40P73m16k99P10l73l55P27l78l58O75k93l76O93l16m03P06
7856C19k70m22O61k45m04O41k15m10O21j91m20N84j81m23O11j68m15N43j10m22
7876c16N27r5m46N45r0m35M77k1m52M73m3m55M77k1m24M35l6m07M34Qm18L87M6
$$ plain form
7738 -23 633 -600 -13 620 -619 -54 648 -599 -93 627 -583 -58 638 -587 -100 628 -531 -119
7756 -119 605 -544 -105 623 -545 -161 661 -493 -141 593 -489 -151 638 -485 -194 631 -417 -174
7774 -174 612 -418 -174 648 -388 -230 617 -349 -224 568 -374 -219 628 -342 -267 578 -342 -249 557 -330
7794 -330 -298 548 -278 -315 540 -273 -304 545 -265 -310 554 -203 -337 517 -231 -315 504 -163 -366 518 -159 -335
7816 -335 488 -161 -331 502 -131 -359 463 -139 -323 476 -102 -346 502 -52 -353 423 -64 -317 403 -63
7836 -63 -361 401 -58 -398 375 -41 -340 370 -3 -358 369 -9 -367 308 15 -361 332 16 -387 319
7856 319 49 -373 288 43 -361 280 65 -345 276 85 -335 249 68 -355 256 88 -327 216 106 -316
7876 -316 211 116 -330 215 125 -310 167 146 -306 167 124 -331 146 125 -299 136 100 -307 127 135 -283 104 150
7899A50m41L75P4m32L54J00m38L36Q4m11L21J19m32K93J40m18K65J55m29K93J37
7920A95l97K41J67l74J77J73l65J90J93l88J84J96l90J74K29l73J36K27l59J16
7940d8K21l45J35K19l34J13K08k99O7K40l40R9K38l07O0K43l06O1K39k82K9K76
7962A87k79L8K43k86L6K74l12L2K57k89jK84k57k4K65k47k4K82k34m4K99k62l8
7985a00K81k64j9K66k45j5K67k35n9K82k37m2K95k33p5K93k21o0K88k10o7K50
8007A40j94o3K97k11r3L15k30p1K96k15q7K93k10o4K62k10o8K94k27n7K92k36
8029d7p5L01k35o4L04k52n4K88k39n0K98k58o1L22k52o6L09k52n5L15k60l4L14
8052A97k45o6L11k66o9L42k78l7L30k74n6L51l02m4L30k95m5L25k75m9L19l14
$$ plain form
7899 150 -291 84 158 -274 80 180 -258 78 162 -249 72 191 -241 52 192 -226 39 194 -235 58 195
7920 195 -202 39 206 -168 9 182 -183 7 200 -188 -4 192 -198 -24 205 -168 -32 195 -164 -48
7940 -48 173 -172 -37 182 -152 -39 169 -130 -63 177 -163 -64 174 -133 -73 170 -136 -75 164 -118 -89 187
7962 187 -92 -54 189 -97 -61 213 -99 -67 190 -99 -100 184 -73 -97 168 -79 -103 179 -55 -99 200 -62 -100
7985 -100 181 -83 -102 164 -81 -96 171 -64 -123 159 -78 -120 175 -58 -133 160 -61 -121 167 -43 -110 140
8007 140 -54 -117 180 -31 -124 191 -39 -110 186 -29 -116 177 -33 -97 165 -45 -113 181 -46 -103 189 -47
8029 -47 -122 179 -56 -120 184 -68 -122 166 -73 -123 175 -83 -144 178 -74 -140 169 -83 -138 177 -83 -117 197
8052 197 -48 -114 197 -69 -138 204 -74 -111 219 -55 -111 240 -62 -106 224 -71 -116 209 -66 -115 204 -110
8074a10pL50l45oL37l44qL59l65OL85l98J5L65l52k9L70l57j4M13l98j7M21m16
8098a45nM49m21j6M33m18lM38m29m1M62m41nM54m50j2M56m44m2M92m56l1N03m44
8122a16m8M96m72m9N22m84l9N28m84n8N47m87p1N77n42n0N99n20q6O13n01j04
8144b29O21n50r1O48n36r0O25n40j25O47n23j05O64n51j25O80n58j29P07n55j43
8165b58O97n68j43P00n55j69P05n49j60P15n56j87P59n46k14P56n34k20P50n38
8185a15k54P94n08k77Q01n25k86Q04n13l02Q19m98l31Q33m97l25Q35m92l58Q34
8205D39m72l56Q19m52l79Q62m83l89Q71m42m42Q72m41m29Q61m35m64Q82m00m66
8225d44Q69m11m86Q91l85m95Q75l86n11Q83l59n71R40l30n55Q51k99n69Q81k94
$$ plain form
8074 -110 -117 233 -112 -118 219 -125 -133 226 -139 -133 252 -146 -131 234 -118 -147 223 -134 -148 265 -133 -150 271 -145
8098 -145 -150 299 -122 -138 295 -123 -126 312 -117 -158 304 -137 -142 312 -138 -150 306 -138 -180 312 -144 -175 328 -116
8122 -116 -164 332 -140 -189 333 -151 -190 338 -146 -204 343 -144 -215 362 -180 -230 369 -151 -237 376 -125 -229
8144 -229 392 -158 -249 399 -137 -227 398 -142 -267 380 -143 -248 416 -135 -260 420 -138 -267 440 -115 -258
8165 -258 439 -129 -272 428 -127 -296 409 -140 -300 415 -141 -328 431 -115 -329 427 -107 -327 423 -115
8185 -115 -369 425 -83 -360 441 -84 -370 434 -79 -381 438 -60 -391 442 -55 -380 455 -37 -395 439
8205 439 -33 -389 430 -22 -401 461 -22 -411 460 18 -424 448 7 -422 439 4 -460 422 22 -444
8225 -444 425 14 -472 419 34 -461 414 28 -483 400 41 -530 410 80 -475 376 77 -492 389 95
8245I5o10R09k89o19Q90k78n85Q70k54o28Q63k12o70Q57j62o80Q37j32p39Q59
8265C22j32p00Q37j24p32Q39r4p47Q21r4p30Q11o1p47P82kp81Q00k2p65P76mq13
8288e60Q21K3p93P40O7q02P57L4p82P17R8q21O95J41q43P27J26q53O71J86q33
8309d84O48J71q37O53K23q71O15K36q28N69K31q36O02K87q57N35L17q53N53L10
8329C84q29M81L56q33M87L31q17M73L48q29M40M26q34M55L46p82M05M34q37L74
8349b1M75q31L48M38p90L54M58q01L16M86p67K88M75p91K93N06p86K49N09p57
8369c49K61M90p58K25N59p72K18N18o88J81N25p21J87N45o76R3N70o67J24N23
8389C88o42R1N38n97Q0N41o13N6N74o06J8N77n78ON59n68j3N48n49lN32m86l4
$$ plain form
8245 95 -515 394 105 -514 376 98 -487 383 129 -499 364 152 -518 339 177 -503 334 202 -537 322
8265 322 190 -510 327 203 -529 310 216 -531 290 196 -534 277 216 -531 251 249 -532 268 246 -519 257 253 -560
8288 -560 261 284 -509 231 298 -504 253 287 -495 222 320 -501 194 335 -508 219 345 -508 163 349 -484
8309 -484 164 335 -502 151 374 -497 118 354 -474 95 326 -510 92 379 -478 57 374 -479 74 384
8329 384 -445 36 392 -441 46 377 -440 33 381 -448 -8 418 -416 39 385 -397 8 442 -395 -21
8349 -21 454 -377 -29 409 -381 -27 431 -370 -54 432 -335 -47 428 -363 -70 436 -350 -101 408 -349
8369 -349 -88 402 -356 -131 428 -344 -126 392 -296 -115 410 -311 -124 421 -255 -162 408 -259 -135 388
8389 388 -254 -163 375 -222 -142 399 -214 -158 416 -190 -172 405 -173 -167 392 -176 -189 359 -190 -193 339 -147 -181
8412a81N40n28l5N39m81l8N05m57p4N19m46p2N34m28j23N60m41j11M97l72j33
8433b26N35l62j68M91l42j32M89l43j77N19k93k13M94l05j87M94k61k32M59k19
8453B1k54M85k44k20M42k08k65M37j81k41M16j82k42L94j45k48L67r4k59L99j30
8474D8k77M05j27k82L59o2k87L54p7k65L48m2k91L09k3k84L14j7k91L01j2k88
8496a87K72J3k61K49K2k99K51M9l15K69M0k59J97M3k59K08R8k96K02P5k80J91
8518B3R7k66J38J35k84J58J40k65J24J26k87J72J11k48J35J44k58J05J63k68Q8
8539a7J56k48J10J35k26R9J36k43O4J80k48O1J54k15O3J68k36M7J94k34N0J81
8561A31k17J5K10k45N7J78k38O8J70k38M5K19k28K8J82j95nK28k40J0K07k19J1
$$ plain form
8412 -181 359 -169 -204 335 -146 -184 321 -136 -210 309 -137 -209 325 -103 -226 334 -107 -218 279 -93 -226
8433 -226 309 -53 -221 270 -72 -204 285 -58 -235 284 -9 -222 272 -33 -220 274 13 -219 240 21
8453 21 -233 252 8 -212 230 22 -243 194 13 -228 188 6 -236 158 13 -235 132 38 -221 178 48
8474 48 -229 176 49 -233 126 64 -223 131 54 -211 137 95 -196 113 90 -194 120 103 -188 113 101 -187
8496 -187 85 98 -163 86 108 -191 60 109 -206 63 103 -156 41 84 -175 33 131 -165 37 112 -168 23
8518 23 120 -146 -8 127 -157 1 141 -124 0 126 -161 11 122 -126 9 153 -105 0 163 -105 -17
8539 -17 139 -109 1 136 -90 9 145 -98 -34 146 -102 -41 113 -102 -39 129 -107 -60 134 -100 -50 131
8561 131 -86 -71 139 -106 -49 129 -109 -41 129 -109 -64 155 -73 -45 137 -58 -63 165 -75 -65 142 -77 -66
8584f6K25k27MK29k17k4K08j86k0K05k00j4K25k06k1K32k05m1K26k03j1K24k31
8607i4J1J94j95l0K46j98rK06j83l1K38k31k0K19j88l4K47k14j8K40k16l1K43
8630A52k45J9K23k04KK18k16m2K62k47RK38k29l9K68k55J1K44k61NK39k43k8K96
8654A77k54k4K76k63m1L27k78k1K86k67j0K56k68qL09k85l7L21k98oL22l21k2
8677a29L48k81m5L41k86k8L45l35k3L28l18k7L51l31qL39l19k5L58l59kL62l84
8700a28OL81l70k3L60l54k4M26m19k9M43l94l8M46m22j9M72m33n2M82m39n7M81
8723B96m50k0N10m60p1N37m85nM92m80p4N57m81p0N56m93p4N67m73r2O00n25q9
8746b27N99n27p7O45n62j08O46n33j19O53n48r9O65n61j20O72n31j49P12n65j65
$$ plain form
8584 -66 159 -68 -64 165 -52 -76 132 -54 -74 131 -69 -83 142 -64 -85 147 -58 -99 127 -76 -87 137 -94
8607 -94 -83 111 -84 -114 132 -66 -75 131 -52 -83 155 -76 -96 123 -65 -99 148 -66 -84 156 -60 -91 152
8630 152 -93 -74 149 -55 -53 165 -51 -93 169 -78 -69 169 -60 -99 169 -86 -75 169 -92 -87 152 -91 -119 177
8654 177 -77 -101 175 -88 -129 198 -80 -101 185 -82 -92 164 -104 -112 197 -88 -125 196 -102 -108 214 -107 -129
8677 -129 219 -62 -107 234 -52 -80 265 -70 -93 235 -83 -110 241 -90 -98 241 -78 -103 255 -104 -106 256 -128
8700 -128 -122 259 -111 -134 226 -128 -152 274 -145 -174 269 -125 -163 283 -139 -158 314 -119 -171 311 -128 -185 296
8723 296 -154 -174 336 -124 -195 342 -143 -148 344 -136 -210 347 -134 -204 352 -141 -215 352 -121 -213 387 -138 -227
8746 -227 372 -155 -232 413 -149 -257 389 -144 -263 390 -158 -257 408 -153 -273 399 -132 -281 431 -134 -299
8767b99P33n43j57O93n33j82P44n86j76P58n58k14P83n69k17P95n79k29Q10n61
8787h7k77Q33n58k65Q46n99k63Q51n74k96Q66n54l32Q96n75l09Q67n39l40Q95
8807D86n75l54R25n44l56R11n61l59R20n62l72R43n36m05R38n42m06R64n38m23
8827d46R51n13m37R51n15m44R48m90m83R89n02m92R74m76n21R70m57n28J005m35
8847D9n59R83m39n41R80m14o09R93m05n67R91m02n96R98l65o33R79l49o37J011
8867D68l64o39R80l22o81R87l09o39R64l11o74R71k98o61R43k70o73R56k84o66
8887e22R10k23o96R38k43o87R04k27o86Q93j88p08Q94j86p22Q87j50p19Q74j57
8907A86p16Q70j33p46Q75j12p35Q19o3p42Q21p6p61Q06m5p43P70j9p50P66n7p11
$$ plain form
8767 -299 434 -109 -266 427 -106 -288 456 -130 -306 452 -106 -320 463 -106 -323 472 -107 -336 474 -87
8787 -87 -364 469 -89 -354 492 -107 -370 481 -93 -389 477 -77 -409 487 -88 -397 470 -69 -409 486
8807 486 -89 -443 482 -62 -418 493 -68 -427 493 -69 -441 502 -34 -439 499 -43 -449 515 -23 -446
8827 -446 505 -8 -445 506 -9 -453 495 5 -478 511 9 -483 491 15 -506 464 7 -521 484 49
8847 49 -510 473 34 -507 473 59 -550 443 38 -529 462 60 -536 462 97 -536 443 94 -543 468
8867 468 104 -535 445 123 -558 429 120 -519 445 134 -540 431 133 -528 415 145 -528 428 144 -522
8887 -522 388 165 -531 407 164 -523 381 154 -532 361 173 -535 359 173 -549 338 188 -531 343 186
8907 186 -530 340 207 -539 336 224 -511 308 245 -497 324 248 -513 293 248 -495 275 256 -494 272 215 -496
8929d96P74j7p41P32J7p82P59K0p34O85M2p32O51Q4p24O46N5p03O49O6p26O39
8951A64R4p27O32J04p23O36R3o97N87R8o64N54J35p01N37J70p04N31J68o81M92
8972I8J94o62M73K00o73M46K14o27M15J89o15M03K41o45L68K62o02L65K42o09
8992c23L48K51n68L01K47n41K97K64n55K85K79n55K70K67n07K24K76n01K22L05
9012B86m91J80K76m72J78L08m69J66K86m23J37K86m40J47K92m20J06K77l69J02
9032e7K73l84R3K97l89P3L00l60M7K99l35M6L06l22j7L31l07rL08k97lL05k62
9055f4n0L12k62l1K86k60l3L13k59p4L00k16n3K73k46m5K54j58j04K75j94q2K67
9078A49j59j24K69j45j06K44j43j09K42j29j31K45r2j27K10p0j25K15r8j43K20
$$ plain form
8929 -496 278 261 -480 252 269 -513 246 266 -468 217 259 -473 178 262 -462 184 239 -464 185 251 -475 164
8951 164 258 -469 163 267 -456 180 273 -424 163 261 -403 151 286 -415 122 292 -412 119 287 -394 98
8972 98 292 -370 103 303 -370 76 290 -337 78 267 -348 55 296 -349 19 281 -321 44 286 -323
8992 -323 25 276 -292 9 256 -285 12 276 -279 6 285 -270 0 267 -240 -16 260 -241 -19 286
9012 286 -205 -25 251 -221 -43 265 -204 -38 248 -175 -38 248 -192 -45 247 -173 -67 210 -159 -57
9032 -57 216 -168 -75 222 -167 -94 206 -154 -107 192 -143 -97 209 -113 -130 201 -106 -115 193 -104 -107 198 -64
9055 -64 -114 198 -64 -95 191 -69 -102 211 -48 -122 178 -38 -91 182 -64 -109 145 -13 -117 158 -36 -118 149
9078 149 -10 -134 135 -10 -116 128 -15 -124 118 -11 -142 103 11 -116 94 24 -101 114 16 -127 93
9099I3o7j57K34q7j46K24m4j58K00p0j37J97m2j47J81j6j74J77j3j43J66nj88
9122a22J87Mj90J77J5j71J48J2j96J86oj56J36L0j75J58K6j79J54K4j82J49L5
9145F4j56J14N8j77J13O8j90J40L7j49J04N4j59R7P2j74Q9R0j91Q7O9j43J01O3
9169H1j60Q0Q7j82J01P2j42O7Q1j90Q8R4j58P4J07j88O5J12j80P4J12j80P3J02
9193I0j75P6J16j95P7R6j74P1J13j74O8J07j56N5J21j86O2J13j57N5R4j75P7Q2
9217H1j80Q0J01j53N2R3j47P4Q6j78R7N7j55M5J29j83Q8J01j94J05J11j96O2J18
9241I4k09J00J33k08R7R7k13O3J53k06J03J27k27P0J37j91P9J16k07R2J36k32
9263i6R7J23k20J07J12k33R5J49k42Q7J49k47Q9J43k24P7J71k72J01J64k70J23
$$ plain form
9099 93 26 -131 103 16 -130 94 50 -108 92 22 -115 82 40 -107 74 58 -116 61 48 -95 71 66 -122
9122 -122 65 69 -121 56 71 -100 48 60 -136 50 44 -112 24 54 -121 37 63 -116 38 62 -120 29 64
9145 64 -92 22 80 -97 16 84 -106 34 71 -78 26 80 -79 18 90 -84 5 95 -96 -9 60 -83 18 81
9169 81 -79 1 88 -94 7 79 -63 4 85 -105 -17 77 -81 -7 100 -88 -23 89 -91 -17 95 -85 -12 90
9193 90 -85 -9 107 -88 -11 85 -89 -18 95 -79 -11 96 -60 -5 116 -70 -8 105 -52 3 97 -78 -1 81
9217 81 -99 -19 82 -71 -19 74 -73 1 87 -91 6 63 -92 -47 82 -101 -13 88 -106 -1 110 -86 -24 94
9241 94 -115 -15 118 -90 7 104 -109 -46 107 -99 4 131 -96 -26 111 -80 -1 115 -92 0 136 -96
9263 -96 1 124 -96 11 123 -110 -15 134 -108 -21 128 -119 -30 113 -111 -34 137 -135 -34 130 -140 -17
9285a7J47k57J03J54k51J11J68k78R5J86k72Q1J92k66R4J87l18J01K03l10J28
9306a9K01l03J13J88l35J27K31l37J01K23l41J34K14l52J01K36l38R7K61l56J01
9327e3K65l83J13K64l61P9L02l88P1L05l89J00L05l64P9K83l70P6L11l84O9L29
9349B59m14R4L16l90L9L37l63K9L49m01P0L48m13L8L48m11O7L54m22O2L71m39
9371a72M3L82m08K4L76l82J6L92m21J5M21m22k3M37m16j2M35m12l9M60m05l9M27
9394B77l91o6M88m29o2M78m15n4M64m12n1M54l95o9M61l93q8M92l91q1M80l89
9416i2j19M92l96j02M86l66j40N40l81j48N15l73j53N29l80j49N37l51j96N44
9436B97l50j70N37l66j99N57l29k36N54l43k03N36l03k40N62l00k49N13k82k47
$$ plain form
9285 -17 130 -127 -24 130 -121 -10 158 -120 -25 161 -111 -30 162 -104 -10 177 -141 -40 163 -147 -19
9306 -19 182 -121 -8 180 -155 -28 203 -134 -33 190 -151 -17 197 -155 -54 182 -156 -59 202 -154 -53
9327 -53 212 -171 -58 206 -155 -76 226 -162 -91 214 -175 -75 230 -134 -55 228 -142 -66 245 -139 -70 259
9349 259 -155 -61 255 -135 -96 241 -122 -93 256 -145 -75 273 -140 -102 246 -165 -98 256 -166 -104 267 -172
9371 -172 -129 253 -155 -131 245 -137 -121 271 -150 -135 286 -136 -159 278 -138 -150 285 -127 -166 294 -111 -150 277
9394 277 -114 -180 308 -121 -183 295 -120 -174 290 -122 -173 281 -114 -183 278 -115 -203 289 -102 -183 297 -92
9416 -92 -211 281 -115 -217 269 -97 -237 303 -78 -226 289 -84 -237 292 -88 -237 300 -51 -247 297
9436 297 -53 -223 314 -52 -251 306 -23 -259 295 -48 -251 285 -18 -258 304 4 -245 268 -14 -261
$$ [...]
16383H
##END NTUPLES=NMR FID
##END=
