##TITLE=abcd
##JCAMPDX= 6.0         $$ Bruker NMR JCAMP-DX V2.0
##DATA TYPE= NMR FID
##DATA CLASS= NTUPLES
##ORIGIN= UXNMR, Bruker Analytische Messtechnik GmbH
##OWNER= root
$$ XWIN-NMR		Version 3.5
$$ Wed Aug 13 11:26:17 2025 Russian Standard Time (UT+4h)  servis@DPX200
##.OBSERVE FREQUENCY= 200.131235884673
##.OBSERVE NUCLEUS= ^1H
##.DELAY= (6, 6)
##.ACQUISITION MODE= SIMULTANEOUS
##.ACQUISITION SCHEME= undefined
##.AVERAGES= 32
##.DIGITISER RES= 18
##SPECTROMETER/DATA SYSTEM= spect
##.PULSE SEQUENCE= zg
##.SOLVENT NAME= Acetone
##.SHIFT REFERENCE= (INTERNAL, Acetone, 0, 16.5164)
##AUDIT TRAIL= $$ (NUMBER, WHEN, WHO, WHERE, WHAT)
$$ ##TITLE= Audit trail, XWIN-NMR		Version 3.5
$$ ##JCAMPDX= 5.01
$$ ##ORIGIN= Bruker BioSpin GmbH
$$ ##OWNER= servis
$$ F:\spectra/data/av/nmr/H1/1/audita.txt
$$ ##AUDIT TRAIL=  $$ (NUMBER, WHEN, WHO, WHERE, WHAT)
(   1,<2025-08-13 11:25:45.95 +0400>,<servis>,<DPX200>,
      <created by zg, POWCHK disabled, PULCHK disabled
       configuration hash MD5:
       00 E9 B6 7A A2 85 ED C7 34 08 36 98 17 FE 4E 26
       data hash MD5: 32K
       0B B1 3E 98 26 B6 A4 C6 E3 43 B8 70 C2 C0 F5 F1>)
$$ ##END=
$$ 
$$ hash MD5
$$ D1 9B 7D CF 10 AF FE 50 E9 BF 28 F1 D9 81 4C A2
##$RELAX= 
##$RELAX= 
##$RELAX= 
##$RELAX= 
##$RELAX= 
##$RELAX= 
##$RELAX= 
##$RELAX= 
$$ Bruker specific parameters
$$ --------------------------
##$DU= <F:\spectra>
##$EXPNO= 1
##$NAME= <H1>
##$PROCNO= 1
##$TYPE= <nmr>
##$USER= <av>
##$AMP= (0..31)
100 100 100 100 100 100 100 100 100 100 100 100 100 100 100 100 100 100 
100 100 100 100 100 100 100 100 100 100 100 100 100 100 
##$AQSEQ= 0
##$AQ_mod= 1
##$AUNM= <au_zg>
##$AUTOPOS= <>
##$BF1= 200.13
##$BF2= 200.13
##$BF3= 200.13
##$BF4= 200.13
##$BF5= 500.13
##$BF6= 500.13
##$BF7= 500.13
##$BF8= 500.13
##$BYTORDA= 1
##$CFDGTYP= 0
##$CFRGTYP= 5
##$CHEMSTR= <none>
##$CNST= (0..31)
1 1 145 1 1 1 1 1 1 1 1 1 1 1 1 1 1 1 1 1 1 1 1 1 1 1 1 1 1 1 1 1 
##$CPDPRG= <>
##$CPDPRG1= <>
##$CPDPRG2= <>
##$CPDPRG3= <>
##$CPDPRG4= <mlev>
##$CPDPRG5= <mlev>
##$CPDPRG6= <mlev>
##$CPDPRG7= <mlev>
##$CPDPRG8= <mlev>
##$CPDPRGB= <>
##$CPDPRGT= <>
##$D= (0..31)
0 2 0 0 0 0 0 0 0 0.06 0 0 0 0 0 0 0.0002 0 0 0 0 0 0 0 0 0 0 0 0 0 0 
0 
##$DATE= 1755069945
##$DBL= (0..7)
120 120 120 120 120 120 120 120 
##$DBP= (0..7)
150 150 150 150 150 150 150 150 
##$DBP07= 0
##$DBPNAM0= <>
##$DBPNAM1= <>
##$DBPNAM2= <>
##$DBPNAM3= <>
##$DBPNAM4= <>
##$DBPNAM5= <>
##$DBPNAM6= <>
##$DBPNAM7= <>
##$DBPOAL= (0..7)
0.5 0.5 0.5 0.5 0.5 0.5 0.5 0.5 
##$DBPOFFS= (0..7)
0 0 0 0 0 0 0 0 
##$DE= 6
##$DECBNUC= <off>
##$DECIM= 32
##$DECNUC= <off>
##$DECSTAT= 4
##$DIGMOD= 1
##$DIGTYP= 9
##$DL= (0..7)
0 120 120 120 120 120 120 120 
##$DP= (0..7)
150 150 150 150 150 150 150 150 
##$DP07= 0
##$DPNAME0= <>
##$DPNAME1= <>
##$DPNAME2= <>
##$DPNAME3= <>
##$DPNAME4= <>
##$DPNAME5= <>
##$DPNAME6= <>
##$DPNAME7= <>
##$DPOAL= (0..7)
0.5 0.5 0.5 0.5 0.5 0.5 0.5 0.5 
##$DPOFFS= (0..7)
0 0 0 0 0 0 0 0 
##$DQDMODE= 0
##$DR= 18
##$DS= 0
##$DSLIST= <SSSSSSSSSSSSSSS>
$$ [...]
##$SUBNAM0= <"">
##$SUBNAM1= <"">
##$SUBNAM2= <"">
##$SUBNAM3= <"">
##$SUBNAM4= <"">
##$SUBNAM5= <"">
##$SUBNAM6= <"">
##$SUBNAM7= <"">
##$SUBNAM8= <"">
##$SUBNAM9= <"">
##$SW= 20.6817932712277
##$SWIBOX= (0..15)
0 0 3 0 0 0 0 0 0 0 0 0 0 0 0 0 
##$SW_h= 4139.07284768212
##$TD= 32768
##$TD0= 1
##$TE= 0
##$TE2= 300
##$TE3= 300
##$TEG= 300
##$TL= (0..7)
0 120 120 120 120 120 120 120 
##$TP= (0..7)
150 150 150 150 150 150 150 150 
##$TP07= 0
##$TPNAME0= <>
##$TPNAME1= <>
##$TPNAME2= <>
##$TPNAME3= <>
##$TPNAME4= <>
##$TPNAME5= <>
##$TPNAME6= <>
##$TPNAME7= <>
##$TPOAL= (0..7)
0.5 0.5 0.5 0.5 0.5 0.5 0.5 0.5 
##$TPOFFS= (0..7)
0 0 0 0 0 0 0 0 
##$TUNHIN= 0
##$TUNHOUT= 0
##$TUNXOUT= 0
##$USERA1= <user>
##$USERA2= <user>
##$USERA3= <user>
##$USERA4= <user>
##$USERA5= <user>
##$V9= 5
##$VALIST= <valist>
##$VCLIST= <CCCCCCCCCCCCCCC>
##$VD= 0
##$VDLIST= <DDDDDDDDDDDDDDD>
##$VPLIST= <PPPPPPPPPPPPPPP>
##$VTLIST= <TTTTTTTTTTTTTTT>
##$WBST= 1024
##$WBSW= 30
##$XGAIN= (0..3)
0 0 0 0 
##$XL= 0
##$YL= 0
##$YMAX_a= 2576826
##$YMIN_a= -2267647
##$ZGOPTNS= <>
##$ZL1= 120
##$ZL2= 120
##$ZL3= 120
##$ZL4= 120
##$ABSF1= 10
##$ABSF2= 0
##$ABSG= 5
##$ABSL= 3
##$ALPHA= 0
##$AQORDER= 0
##$ASSFAC= 0
##$ASSFACI= 0
##$ASSFACX= 0
##$ASSWID= 0
##$AUNMP= <proc_1d>
##$AZFE= 0.1
##$AZFW= 0.1
##$BCFW= 1
##$BC_mod= 2
##$BYTORDP= 0
##$COROFFS= 0
##$CY= 19
##$DATMOD= 1
##$DC= 2
##$DFILT= <>
##$DTYPP= 0
##$F1P= 11.0000007629395
##$F2P= -0.999999237060547
##$FCOR= 0.5
##$FTSIZE= 0
##$FT_mod= 4
##$GAMMA= 1
##$GB= 1
##$INTBC= 1
##$INTSCL= 1
##$ISEN= 128
##$LB= 0.05
##$LEV0= 0
##$LPBIN= 0
##$MAXI= 10000
##$MC2= 0
##$MEAN= 0
##$ME_mod= 0
##$MI= 0
##$NCOEF= 0
##$NC_proc= 0
##$NLEV= 6
##$NOISF1= 0
##$NOISF2= 0
##$NSP= 1
##$NTH_PI= 0
##$NZP= 0
##$OFFSET= 16.51637
##$PC= 1
##$PHC0= -209.5336
##$PHC1= 15.90155
##$PH_mod= 0
##$PKNL= yes
##$PPARMOD= 0
##$PSCAL= 4
##$PSIGN= 0
##$REVERSE= no
##$SF= 200.13
##$SI= 16384
##$SIGF1= 0
##$SIGF2= 0
##$SINO= 400
##$SIOLD= 16384
##$SREGLST= <1H.CDCl3>
##$SSB= 0
##$STSI= 0
##$STSR= 0
##$SW_p= 4139.07284768211
##$SYMM= 0
##$S_DEV= 0
##$TDeff= 0
##$TDoff= 0
##$TI= <>
##$TILT= no
##$TM1= 0
##$TM2= 0
##$TOPLEV= 0
##$USERP1= <user>
##$USERP2= <user>
##$USERP3= <user>
##$USERP4= <user>
##$USERP5= <user>
##$WDW= 1
##$XDIM= 8192
##$YMAX_p= 0
##$YMIN_p= 0
$$ End of Bruker specific parameters
$$ ---------------------------------
##NTUPLES= NMR FID
##VAR_NAME=  TIME,          FID/REAL,        FID/IMAG
##SYMBOL=    X,             R,               I
##VAR_TYPE=  INDEPENDENT,   DEPENDENT,       DEPENDENT
##VAR_FORM=  AFFN,          ASDF,            ASDF
##VAR_DIM=   16384,         16384,           16384
##UNITS=     SECONDS,       ARBITRARY UNITS, ARBITRARY UNITS
##FACTOR=    0.0002416,     1,               1
##FIRST=     0,             0,               0
##LAST=      3.9581328,     0,               0
##MIN=       0,             -2267647,        0
##MAX=       3.9581328,     2576826,         0
$$ Real data points
##PAGE= N=1
##DATA TABLE= (X++(R..R)), XYDATA
0@%%%%%%%l2O4o4O4o4R6j60J93k25K88l53M40n36O42p70R23j084J281j515J756
27I44k035K352k704L099l549M043m583N180n839O569p375Q263r234J0281j1429
42f017J2696j4078J5584j7226J9020k0975K3121k5488K8080l0922L4072l7569
54a9702M1469m5859N0821n6481O3001p0621P9674r0618J04172j21462J44376j76388
66i7618K24596l06273M80084j461197J424694J552213k290813J277351j059817
75b56780r30000K411328j143274k348921L150390N97772j863367Q41372r82574
84e24054r50796K900156r98126k331224K572292P20384j631407P05787j478402
93a015390q91587L368739j55197k401375J555887k22j310819J275516r45523q78201
$$ y = [0, 0, 0, 0, 0, 0, 0, 0, -32, 32, -32, 32, -32, 64, -96, 97, -128, 160, -193, 247, -289, 353, -417, 506, -578, 703, -812, 944, -1091, 1261, -1443, 1656, -1893, 2150, -2433, 2747, -3092, 3477, -3898, 4365, -4869, 5412, -6017, 6679, -7399, 8185, -9041, 9979, -10996, 12125, -13363, 14717, -16205, 17867, -19702, 21767, -24092, 26729, -29752, 33249, -37372, 42302, -48316, 55856, -65606, 78770, -97618, 126978, -179295, 300789, -1160408, 264286, 1816499, -474314, 803037, -256780, -1186780, 1224548, 81274, -2267647, 882743, 1480515, -382852, 458520, -524054, -1474850, 1425306, 427180, -1904044, 668248, 1388632, -242775, 463012, -1015390, -1906977, 1461762, 1306565, -1094810, 461077, 460855, -849964, 425552, -519971, -1398172]
103a398172L066897l08807k600719J101429J59533o83803J624327j092577j354438
112a486330K753556Q0484k318851P01143j56876m12292K138735p56747j732677
121a189855K005325m8665j960750R32652Q7642k26237K037007j030185k219553
130a612619J683814M84378j200334R57446l58923o31582J980932o42170k104411
139a443469J302937M67680q20888J121160m04919r05121J643423n46827j930009
148a516033J259689P46668m60931R30367q75558j331989J603563J40866j362696
157h66054R85236L17087o25588R07327o77426j255596J463055L17526j156214
166e90647P85001J79357o07423Q41736o53772j274345J419133O80284q51412M41796
$$ y = [-1398172, 1668725, 1359918, -1240801, -139372, 20161, -663642, 960685, -131892, -1486330, 1267226, 1347710, -971141, -269998, -426874, -839166, 1299569, 542822, -1189855, 815470, 766805, -1193945, -261293, -173651, -399888, 1637119, 606934, -1612619, 71195, 555573, -644761, 312685, -46238, -677820, 1303112, 660942, -1443469, -140532, 327148, -493740, 627420, 222501, -682620, 960803, 413976, -1516033, -256344, 490324, 29393, 959760, 84202, -1247787, 355776, 496642, -866054, 119182, 436269, -189319, 718008, 40582, -1215014, 248041, 565567, -590647, 194354, 373711, -233712, 608024, -45748, -1320093, 99040, 779324, -72088, 369708]
176C69708l11457p96488J021356j06898r87330J119404M14538r28701L27136k35710
186a14442o06882J108563K3564j041676P94426L81101p22486L17526l12687o48549
196h21542J133195L24695q92138M20525N4171p03856M85479R865m76573R29333
206D63154J60325r90800K25175J49607l73933O08743j0307o50148O43431K28344
216D53591p38442J81791O2654l46306O26468J33914n99379L74807Q5037o49327
226d15192K39462K26204j80501N21905j9794p40882K08791K39712k99904L10102
236H9903J02962l58683L35667O2640n37445J90931K02134k61774K72326J21423
246B20084l25853K20972J6702m85132J81715K97571j07268K14586l4522m58145
$$ y = [369708, 58251, -738237, 283119, 176221, -811109, 308295, 722833, -205868, 121268, -114442, -721324, 387239, 410803, -630873, 163553, 544654, -177832, 139694, -172993, -821542, 311653, 636348, -255790, 164735, 218906, -484950, 529, 10394, -466179, 463154, 623479, -367321, -142146, 7461, -366472, 242271, 231964, -418184, 225247, 453591, -284851, -103060, -40406, -386712, 239756, 373670, -225709, 149098, 234135, -415192, -175730, 50474, -130027, 391878, 372084, -368798, -160007, 79705, -220199, 89903, 192865, -165818, 169849, 232489, -304956, -114025, 88109, -173665, 98661, 220084, -105769, 115203, 131905, -353227, -171512, 126059, 18791, 233377, 198855, -259290]
256b59290J31227J77453k07470K07395J62134k45607Q3409J6504k89617J65392
266e8470J73792k02224J12697J27912j82174O7221j191k72717J30388K31325p5582
277E0977O9527l532k66165K5505J16176p4661J45120J23954j79965l9959J8399
288a4624j13465R9333J16471j08746L2817Q0786j01602n637J2068j15713O1453
299e6859J37694k5865J5110l598j52698k9417Q0465J7890Q8471O2456j17244p3861
311e7456Q451k3286N8792P8642l9342j4347K1847m7519j4020J8254l5160J6600
323b8544O9145R338m191j7581q1420l6404N0616N3011N2203K1196o8034p3989
335e4654j0667J9557M8210N1879q103l7085j6948j3100k778J5006J727j9K3932
$$ y = [-259290, -128063, 49390, -158080, 49315, 211449, -34158, 49251, 65755, -223862, -58470, 115322, -86902, 25795, 153707, -28467, 38754, 37563, -235154, -104766, 126559, 50977, 120504, 116972, -149193, -123688, -7512, -82173, 62947, 186901, 6936, -33023, -14624, -128089, -28756, 87715, -21031, 11786, 92572, -9030, -14667, -2599, -118312, -56859, 80835, 54970, 70080, 66482, -86216, -115633, -35168, -17278, 71193, 133649, 16405, -57456, -49005, -72291, -13499, 65143, 25801, 11454, 33301, -14218, -28238, -9984, -45144, -28544, 40601, 49939, 45748, 28167, -53253, -89657, -39041, 13970, 66173, 87369, 19335, -54654, -65321, -45764, 2446, 54325, 46222, 9137, -7811, -20911, -23689, -8683, -6956, -6975, 16957]
348A6957J7919p331k1673l7500k7339K4471N4036L7073K058m3172o1889j9130
360f5520L2569M6875L5446k838m0423l1381m032J0074J9725J1418n644P72O966
373A4007k324r812k0678j7837J4856L5427K7917L456l6922m7697j0962K2748M2012
386A4191L6939j2120m0043k3693j1546J5872L6880K918j2127K172j3792k966J7396
399A0081j9686j6527K3281P178J4279K5416m0702m3954J3534L680K6627N4409
411E7616k7582m5418M903k6074M756O5934r197k7123K1713l6000j5034N8022k4133
424B383l2410M6114j5946q706N8437m7307n3927N2615j3793o993Q1578l5217n9762
437c2934M3397m1484k3219J06609j5940n8875N1227m7279l8070J03473l1375o5189
$$ y = [16957, 34876, 27545, 5872, -31628, -58967, -34496, 19540, 56613, 58671, 15499, -46390, -65520, -32951, 13924, 49370, 46532, 6109, -25272, -29304, -19230, 495, 11913, 6269, 7041, 14007, 11683, 1871, -18807, -36644, -21788, 13639, 41556, 45012, 8090, -39607, -50569, -27821, 14191, 51130, 39010, -1033, -24726, -36272, -20400, 16480, 19398, 7271, 9443, -4349, -7315, 10081, -9605, -26132, -2851, 4327, 18606, 44022, 3320, -40634, -27100, -23420, 3207, 57616, 30034, -15384, -10481, -36555, -31799, 34135, 24938, -2185, 19528, -16472, -31506, 26516, 2383, -30027, 16087, 141, -8565, 49872, 2565, -51362, 1253, -12540, -19533, 62045, 26828, -32934, 10463, -31021, -54240, 52369, 36429, -22446, 28781, -18498, -56568, 46905, 15530, -49659]
449d9659Q5100k6603m9691R4323m5829p4133R9040l0153n8713J22118k8106r1917
461e4223Q1463m7715o0191J53310k0112j09397R2251l7697p7464J39049l1373
472B7901j03334J32232k7523j10737J30345k1501j05638J31311l6355j12170J66256
483G0787q370j44190J10641k5909j00489J79268j6190j59621J35666r607j36181
494a04195J54908l906j36835J60013k0867j72790J65588K2304j55118J40789j4832
505C5059j55057J93647J2895k03239J41288K0565j55742J79758Q554j97784J70588
516E0532J9219k07768J70528N0026j80774J63032J314k22257J96614O5960k21684
527a15258J46529L8009j99091J92352M0729k49907J70032P2977k25222J65430
$$ y = [-49659, 35441, 8838, -40853, 53470, 7641, -66492, 32548, 2395, -56318, 65800, 37694, -54223, 27240, -20475, -80666, 72644, 52532, -56865, 35386, -2311, -79775, 59274, 27901, -75433, 56799, 29276, -81461, 48884, 27383, -78255, 53056, 16701, -95469, 70787, 62417, -81773, 28868, 2959, -97530, 81738, 65548, -94073, 41593, 31986, -104195, 50713, 46807, -90028, 69985, 49118, -123672, 41916, 64220, -90898, 49891, 35059, -119998, 73649, 86544, -116695, 24593, 45158, -110584, 69174, 77728, -120056, 50532, 69751, -138017, 32511, 82537, -98237, 64795, 66109, -156148, 40466, 106426, -115258, 31271, 69280, -129811, 62541, 103270, -146637, 23395, 96372, -128850, 36580]
537C6580O3496k25789J72968M9799k63233J80744J13393k33000J39137N3047k47503
548a60361J90892J03672k70426J44276J06677k42490J52823R0231k63116J64941
558A7119J16372k77327J41286J36171k48614J33218R5140k81185J66162J64618
568A62960k76311J06689J26035k63958J45778J45995k87558J30524J66723k85778
578a28901J05057J60526k67452J27654J58768l05121J15884K03781k79068Q3017
588b5855J61286k85545J25376K07966l02130P6904J99879k85838Q3714K03687
598A59444k83612R3399K14211l10607N7801K32663k69312O4915K09087k98750
608a30761O8909K51392k88989K8515K29456k73832N3397K47075k85863K9578K49761
$$ y = [36580, 100076, -125713, 47255, 97054, -166179, 14565, 127958, -105042, 34095, 87142, -160361, 30531, 134203, -136223, 8053, 114730, -127760, 25063, 115294, -147822, 17119, 133491, -143836, -2550, 133621, -114993, 18225, 113365, -167820, -1658, 162960, -113351, -6662, 119373, -144585, 1193, 147188, -140370, -9846, 156877, -128901, -23844, 136682, -130770, -3116, 155652, -149469, -33585, 170196, -108872, -25855, 135431, -150114, -24738, 183228, -118902, -41998, 157881, -127957, -44243, 159444, -124168, -30769, 183442, -127165, -69364, 163299, -106013, -41098, 167989, -130761, -61852, 189540, -99449, -70934, 158522, -115310, -61913, 185162, -100701, -71123, 178638]
619A78638k84633J4405K60042k55685K5490K48126k91840J383K79675k53231n251
630h2881K57160k66091j077K79479k65662k5840K77814k51962k2962K83807k50003
641f8218l1147K81121k62609m6599L03272k28037m4804K81576k58584n9271L09689
652A76389k28631o3976K98249k36567p2306L05270k30218p9772L08945k24288
662d6905q7305L13173k13950r4240L03942k23056j03237L23766j92507j05078
672a25397L02604k14874j21066L20683j81309j16078L09741j92990j32677L11472
682A60109j77764j32698L12655j70917j40669L09153j63611j45014L04368j65354
692i742j54578L14562j36605j51119K93429j61532j67380L13006j23712j61102
$$ y = [178638, -105995, -91590, 168452, -87233, -61743, 186383, -105457, -104074, 175601, -77630, -82881, 174279, -91812, -92889, 186590, -79072, -104912, 172902, -79060, -102022, 181785, -68218, -99365, 181756, -80853, -127452, 175820, -52217, -97021, 184555, -74029, -133300, 176389, -52242, -116218, 182031, -54536, -126842, 178428, -51790, -131562, 177383, -46905, -134210, 178963, -34987, -129227, 174715, -48341, -151578, 172188, -20319, -125397, 177207, -37667, -158733, 161950, -19359, -135437, 174304, -18686, -151363, 160109, -17655, -150353, 162302, -8615, -149284, 159869, -3742, -148756, 155612, -9742, -164320, 150242, 13637, -137482, 155947, -5585, -172965, 140041, 16329, -144773]
702a44773K96747j37684j74838K96255j26420j70491L05915j15948j84978K88685
712A32470j11748j76556K92609j17054j91297L01593q5636j88092K72708j11012
722A7985j92720K96973q0005j93343K80784q5836k05220K67407p8429j86125K87453
733A28924p2710k14831K60257n8595j93121K59091o9684k01753K71405m3091k09115
744a43223K36764n3557j97450K51759l8271j96966K45303l9519k17448K19680
754F7072k3501j78554K38585l5452k15209K18062j1941j94124K08179j9592j87897
765a34372K18702j3861k05154J97458n277j90901J95561q15j78802J99052j2435
776F9156k10602J79425J9388j65661J83899p107j94714J75848J1710j83377J69099
$$ y = [-144773, 151974, 14290, -160548, 135707, 9287, -161204, 144711, 28763, -156215, 132470, 20722, -155834, 136775, 19721, -171576, 130017, 44381, -143711, 128997, 17985, -174735, 122238, 42233, -151110, 129674, 43838, -161382, 106025, 27596, -158529, 128924, 56214, -158617, 101640, 43045, -150076, 109015, 39331, -162422, 108983, 65892, -143223, 93541, 39984, -157466, 94293, 56022, -140944, 104359, 64840, -152608, 67072, 43571, -134983, 103602, 68150, -147059, 71003, 59062, -135062, 73117, 53525, -134372, 84330, 70469, -134685, 62773, 57496, -133405, 62156, 61341, -117461, 81591, 69156, -141446, 37979, 57367, -108294, 75605, 68498, -126216, 49632, 61342, -122035, 47064]
787D7064J9043j70237J61909M444j80389J62082K0054j76410J48895K8557j54354
798h9342J45350L652j80772J42400M1612j46873J31663J7729j61267J22574K3466
809E0192j49942J30309M0620j45868J02709K1779j38601J14335L1183j41693J03738
820A8761M4105j24341Q8196J8340j33309R7464M6293j14634Q5899L1629j24528
831f6125O9619L0824j03402R0685M2545j15135N7611L0753r8108P0191L4242r8736
843e5036O6354M0454r4821M9228K6820q9996N8151M0556p8061N2952K9186r1772
855d5985L4756L3419o2055N5626L3508q0645K7637K7219o3482L9144L3260n8889
867b6487L3004K7060o1774K3951K5609n2810K7517L1631m2506K4032J8318n6668
$$ y = [47064, 66107, -104130, 57779, 62223, -118166, 43916, 63970, -112440, 36455, 65012, -89342, 56008, 59660, -121112, 21288, 62900, -83973, 47690, 65419, -95848, 26726, 50192, -99750, 30559, 71179, -74689, 28020, 49799, -88802, 25533, 56716, -84977, 18761, 62866, -61475, 26721, 45061, -88248, 9216, 55509, -59125, 26774, 58403, -66125, 3494, 34318, -69084, 21601, 64146, -50989, 6622, 37375, -60733, 9458, 43700, -55036, 11318, 51772, -43049, 6179, 32999, -56997, 1154, 41710, -36351, 16601, 45787, -45985, -11229, 22190, -39865, 15761, 49269, -31376, -3739, 23480, -40002, -858, 32402, -26487, 6517, 33577, -28197, -4246, 21363, -31447, -3930, 27701, -14805, 9227, 27545, -29123]
879b9123J2422K8719k8040K6610K2077m6133M235J6653l0649J9424K6640k7621
891d786O945J2942l0552P394J7882k2394Q970J9999j6985M034P344k6481P19J8617
905C648m825R998J0512k2026q892O366n954J0098J6494q657o404J262r995L7J0255
920A917k171M35P614l150m685q5p049l456R403P675K343P88q750j2278K18P363
936c868O520P938J87j0977o237P9k28O151O675k609r98J055n647k692J167k116
952e600M420Q997N9l428n024r351o41Q965O819M803j257j0044o828L2L495P433
968B850L970k075k289m047k491J546j200J510N966K94P10K70j0170l921N435L95
984c247Q113Q914j0963o928P87q611P612J5476p863j008N008j5939J194J2964
$$ y = [-29123, -16701, 12018, -16022, 10588, 32665, -13468, -9233, 7420, -23229, -3805, 22835, -4786, 2159, 15101, -15451, -8057, 9825, -12569, -3599, 16400, -585, 3449, 10793, -15688, -14969, 3648, -1177, 8821, 19333, -2693, -11585, -5219, -11173, -1075, 15419, 6762, 358, 1620, -8375, -8338, 1917, -254, 181, 7795, 4645, -40, -125, -7174, -10630, -1227, 6448, 8791, 9579, 829, -11449, -11231, -3868, 2652, 10590, 10777, -200, -6437, -6358, -6586, -435, 6240, 3631, 2633, 3688, -1959, -4651, -3484, -5600, -1180, 7817, 7876, 4448, -576, -9927, -10568, -1603, 5216, 10019, 8762, -1282, -8110, -8078, -4583, 2850, 6820, 4745, 2456, -1591, -4082, -2536, -3736, -2226, 3740, 4034, 4744, 5014, -5156, -9077, -3642, -3247, 4866, 13780, 2817, -4111, -3324, -11935, -4323, 11153, 3290, 2282, 7290, -8649, -7455, 5509]
998E509j2014M373J5234j5550R04J2326k1166L04J8064j5317P776K1129k5721
1011d149n697J5992k1742Q838K9189k4818k104K0822l0650O93L0045k5737L780
1024e538L0150l4130k043L2106l3795j375L5405l2100M163L9349m2780q825L8589
1037A9176l5663L475M6915m2084n649M3109m7876n467N3853l9508k974M9082n2763
1050a6374p047N8427m9548j0101N9047m6912m701O0314n9840j4348O7362n1142
1062a4863j0369O9333n4440j3731O6390o4241j5376Q2723n1713j9360P0272o2622
1074a7997j6194Q2743o3232k3985Q6741n5468k3878P9825o5795k3472R2277o3295
1086a1730l0211R4757n7145l2031Q4902o9049k7346J07393o1011m2250R4377o1155
$$ y = [5509, -6505, -2132, 13102, -2448, -1544, 10782, -10384, -10080, 7984, -7333, 443, 21572, -4149, -9846, 6146, -15596, -6758, 22431, -2387, -4491, 16331, -14319, -13626, 16419, -9318, -5538, 24612, -9518, -11561, 20545, -13250, -14625, 20780, -11320, -7157, 32192, -10588, -19413, 19176, -16487, -13012, 33903, -8181, -13830, 29279, -18597, -24064, 29789, -9719, -12693, 36389, -16374, -23421, 35006, -14542, -24643, 34404, -12508, -17209, 43105, -16735, -31083, 36279, -14863, -25232, 44101, -10339, -24070, 42320, -21921, -37297, 45426, -6287, -25647, 44625, -17997, -34191, 48552, -14680, -38665, 48076, -7392, -31270, 48555, -17240, -40712, 51565, -11730, -41941, 52816, -4329, -36360, 48542, -20507, -47853, 59540, -1471, -43721, 50656, -10499]
1098a0499l4284R9906o8103l7805J12646o2347n0019J02009o0828l9381J09359
1109F0654p0430m8088J21779n9437n8530J05100o3218m3115J24133o8600o2752
1120f2504J22587n8080o1919J15549o1538n2485J30169o8267p4706J27888n0605
1131F089o5784J19707o3471o3574J38678n9871q5632J26296m6420o8768J27930
1142F5180o0126p7931J39259n1659r2148J28667l9274p4645J29882n8644r1429
1153h2868J43033l7278r6793J25375l8553q2504J36410m9831j03496J40857k7822
1164B6530j00362J26449l5192r1986J39079m2229j13553J41050j6589j03765J24385
1175E3817l5950j02589J45369k7960j21214J35131j2427j08019J27152l0147j12412
$$ y = [-10499, -44783, 55123, -12980, -50785, 61861, -486, -50505, 51504, -9324, -48705, 60654, -9776, -57864, 63915, 4478, -54052, 51048, -12170, -55285, 68848, 248, -62504, 60083, 2003, -59916, 55633, -5905, -58390, 71779, 3512, -71194, 56694, 6089, -59695, 60012, -3459, -67033, 71645, 11774, -73858, 52438, 6018, -62750, 65180, 5054, -72877, 66382, 14723, -77425, 51242, 11968, -62677, 67205, 8561, -82868, 60165, 22887, -73906, 51469, 12916, -69588, 66822, 16991, -86505, 54352, 26530, -73832, 52617, 17425, -74561, 64518, 22289, -91264, 49786, 33197, -70568, 53817, 17867, -84722, 60647, 32687, -88527, 46604, 34177, -73842, 53310, 23163, -89249]
1186h9249J45877j6602j27807J30085n896j11241J27577k4868j22746J44946j161
1197D8915j30829J20641l892j15377J30278j2101j30527J36237R036j32697J13972
1208C3656K897j18068J28673j162j38283J25951K1305j30545J06854O900j23224
1219h5046J26514J3885j42017J12542K7797j29054J03822J5217j27554J20173
1229C6279K4521j45217J01780L5987j25536J00889K0410j34805J12998L7602j43368
1240g8460R1809L9191j25522R9253K9556j39273J02984M6362j41051Q4471M4307
1251E3627j24644R5385L6585j43725R2111N6676j34124P7235M5893j27050Q9354
1262A7323M7701j41797P9528O2127j28523P0097N0406j26521Q0525N6409j38429
$$ y = [-89249, 56628, 40026, -87781, 42304, 36408, -74833, 52744, 27876, -94870, 50076, 48915, -81914, 38727, 34835, -80542, 49736, 37635, -92892, 43345, 52381, -80316, 33656, 36553, -81515, 47158, 45996, -92287, 33664, 54969, -75576, 31278, 38178, -85046, 41468, 55353, -86664, 25878, 53675, -75379, 28443, 43660, -83894, 36279, 60800, -84417, 17363, 53350, -72186, 28703, 49113, -85692, 27306, 64908, -78460, 13349, 52540, -72982, 26271, 55827, -83446, 19538, 65900, -75151, 9320, 53627, -71017, 24368, 60953, -82772, 9339, 66015, -68109, 9126, 55019, -72031, 17323, 65024, -76773, 2755, 64882, -63641, 6456, 56862, -69659, 10866, 67275, -71154]
1273g1154O6678O7677j20445O2684N2988j27078P0025O6630j29733N4603O8386
1284F1261j15841N5367N8666j23370N9266P2596j22582M3632O9632j09840M9252
1295a961O2916j20844M8184P7865j13042L5432O8234j07341M3119O9142j14592
1306e2888L8154P8615j06544K8504O8783j02392L7587P2935j09560K7648P8704
1317E9546r7766K3881O8524r9263K9859P6505j00604J8921P6026r1146J8605O9733
1329E2821r2394K1957P6750r2573J0093P3781q1893J4328O9529q6615J2296P5914
1341E3994q1303M160P0277p4947Q326O9251p7710M555P2835p2158j452O7265o6555
1354b3462L739O7327p0565l042O9455o1756m096O3629o1154k082O5130o1434p074
$$ y = [-71154, -4476, 63201, -57244, 5440, 58428, -68650, 1375, 68005, -61728, -7125, 61261, -54580, 787, 59453, -63917, -4651, 67945, -54637, -11005, 58627, -51213, -1961, 60955, -59889, -11705, 66160, -46882, -11450, 56784, -50557, -7438, 61704, -52888, -14734, 63881, -42663, -14159, 54624, -47768, -10181, 62754, -46806, -19158, 59546, -38220, -14339, 54185, -45078, -15219, 61286, -39318, -20397, 55629, -35517, -16912, 52821, -39573, -17616, 59134, -33439, -23346, 50435, -31458, -17130, 52399, -34216, -21920, 53994, -27309, -23149, 47128, -27819, -19493, 49758, -27952, -23397, 49438, -22720, -24172, 43093, -23462, -19723, 47604, -22961, -26003, 43452, -18304, -22400, 41229, -19925, -22007, 43123, -18311, -25385]
1367b5385O5105n4625p348O0182n4522n687O2024n4105j1065O0477m6954q688
1379b0591N6404m9417j0120N8308m5198j2350N5306m1684j1549N2338m2087j2034
1391b2674N3771l8198j4652M9592l5087j2570M8102l5608j4804M8253l0404j5006
1403a9285M4049k9856j4716M3307k7837j5203M2436k4754j6399L8312k3478j4545
1415a7969L8572k1930j6542L6094j8960j5491L3540j8615j5362L3211j6210j5632
1427a5294L0708j5046j5504K8764j3591j4185K8413j2512j5672K5399j0823j3632
1439a2975K4942j0198j4270K3055q778j3649K1406p823j2910K0186o788j2482
1451a0284J8671o047j2596J6898m601j0840J6182m443j1749J3943l136r927J3460
$$ y = [-25385, 39720, -14905, -22253, 37929, -16593, -22280, 39744, -14361, -25426, 35051, -11903, -20591, 35813, -13604, -23724, 34584, -10614, -22964, 32342, -9342, -20891, 31447, -10640, -22674, 31097, -7101, -21753, 27839, -7248, -19818, 28284, -7324, -22128, 26125, -4279, -19285, 24764, -5092, -19808, 23499, -4338, -19541, 22895, -1859, -18258, 20054, -3424, -17969, 20603, -1327, -17869, 18225, -735, -16226, 17314, -1301, -16663, 16548, 338, -15294, 15414, 368, -15136, 13628, 37, -14148, 14265, 1753, -13919, 11480, 657, -12975, 11967, 1769, -12501, 10554, 1776, -11873, 9533, 1710, -11200, 8986, 2198, -10284, 8387, 2340, -10256, 6642, 2041, -8799, 7383, 2940, -8809, 5134, 1998, -7929, 5531]
1464E531k493j0079J1438k040r255J0642j046q634R186n80p952Q163l22p772O916
1479A703O53o284O256M98o818M599J169n114M616J520n329K856J358m359K783
1494A07K034l837J668J879l349J175J959k988M81K331j935K15J956k372q24K261
1510G61r57m07K313j333j735J852n92j159K426l02k023J788o8j978J985J45k207
1527a491K008O77k204J589K03k606J767J110j962J728N24k879J181J005j882J804
1543E72Q87k478J011O90j954J387P66j852J256O09j622J033J10j598J237M04p65
1560c07J230n18j308Q98m16pJ584r70m36R11j586L88J629j809O87J431k564J084
1578g9J616l261J460J931l524K269K079m742K100K073n011L405K923n934L030
$$ y = [5531, 3038, -7041, 4397, 2357, -6898, 3744, 2698, -5936, 3250, 2670, -5282, 2881, 2559, -5213, 1703, 2356, -3928, 2328, 2826, -3992, 607, 1776, -3338, 1278, 2798, -2531, 325, 1683, -2676, 107, 2141, -1696, -28, 1851, -1498, -323, 1636, -1352, -871, 1460, -475, -260, 1696, -676, -1500, 761, -196, -603, 1710, 377, -1358, 494, -98, -1257, 1169, 867, -1156, 632, 564, -1414, 571, 716, -1491, 517, 1194, -1010, 579, 782, -1824, -57, 1053, -909, 819, 1343, -1536, -355, 650, -1232, 572, 1459, -1019, -8, 682, -1272, 115, 881, -971, 285, 894, -728, 305, 415, -1183, 54, 458, -307, 923, 405, -903, -5, -421, -428, 1156, 186, -250, 661, -925, -537, 1092, -717, -30, 1401, -1163, -79, 1537, -1724, -264, 1667, -1857, 412, 2491, -2251, -151, 1922, -3089, 316, 3239, -2695, 335]
1593C35K538o896M045L634p369M257L529q577M638M223r349N120M792j0101N610
1608D29N262j1412N572N735j2035O624O834j3231O204O779j4354P169Q272j5091
1622g243P185Q475j6603P460R523j7439Q014J0362j8672Q192J1153j9990Q277
1635a306J1983k0944R143J3348k2448Q600J3697k3560R573J5363k4633R420J5883
1648A4119k6299R462J7247k6929R960J8179k8578R722J9509k9608R557K0506l0554
1661a3707J0127K1981l2180R200K2976l2921R592K4586l3930R264K5512l5636
1673a5136Q663K7402l5708Q693K8134l7466Q221L0037l8327P505L1233l8811P688
1686g872L2436m0591O880L4145m1146O424L5604m1726O270L6360m3854N700L8952
$$ y = [335, 2873, -4023, 22, 3656, -3713, 544, 4073, -4504, 134, 4357, -4992, 128, 4920, -5181, 429, 5691, -5721, -149, 5586, -6449, 175, 7009, -6222, -18, 6761, -7593, -424, 7848, -7243, -58, 8417, -8186, -726, 8797, -8642, -628, 9734, -8938, -746, 10407, -9583, -1306, 10677, -10267, -1124, 12224, -10224, -1624, 12073, -11487, -1914, 13449, -11184, -1764, 14119, -12180, -2718, 14529, -12400, -2440, 15739, -12839, -3117, 16392, -13216, -3659, 16847, -13707, -3580, 18401, -13779, -4579, 18397, -14524, -4932, 19654, -14276, -5012, 20500, -15136, -6473, 20929, -14779, -6086, 22048, -15418, -7197, 22840, -15487, -7982, 23251, -15560, -7872, 24564, -16027, -9147, 24998, -16148, -9724, 25880, -15846, -9576, 26784, -17070, -11370, 27582]
1699B7582m3680N052L9272m5180N086M1125m6527M234M3090m6660L639M3496m8083
1712a7554L693M5557m9260K474M7388m8947J889M7326n0778J905N0407n0942l9
1725a6881N0901n0985k39N1759n2219p49N4431n2218l050N4523n1781k773N5692
1738C6411n3276m093N8296n2287o286N7510n2362n586N9751n3354p817O1255n2343
1751a4181r294O0841n2415q472O3119n3690j1483O4220n1862j1741O3712n3065
1763a4311j1526O6506n3475j4638O6610n1852j3948O6729n3405j4473O9205n3350
1775a1928j7364O8908n1416j6002O9156n3787j7724P1641n1993j9802P0425n1047
1787a0933j8549P1300n2691k1059P3120n0085k2460P1427m9610k1419P2709n0740
$$ y = [27582, -16098, -11046, 28226, -16954, -11868, 29257, -17270, -13036, 30054, -16606, -12967, 30529, -17554, -13861, 31696, -17564, -15090, 32298, -16649, -14760, 32566, -18212, -16307, 34100, -16842, -16881, 34020, -16965, -17204, 34555, -17664, -18413, 36018, -16200, -19250, 35273, -16508, -19281, 36411, -16865, -20958, 37338, -14949, -21235, 36275, -16087, -21673, 38078, -15276, -23093, 38162, -14181, -23475, 37366, -15049, -23521, 39598, -14092, -25575, 38645, -13217, -24958, 38754, -14311, -25837, 40669, -12806, -27444, 39166, -12686, -26634, 40095, -13310, -27783, 41422, -11928, -29292, 39616, -11800, -27802, 41354, -12433, -30157, 41484, -10509, -30311, 40114, -10933, -29482, 41818, -10873, -31932, 41188, -8897, -31357, 40070, -9540, -30959, 41750, -8990]
1799h990k4680P3885m7048k5017P1644m7876k4770P3709m7368k7937P3568m4074
1811d954k7711P1622m5254k7901P4026m3895l1039P2775m1021k9860P1444m2874
1823d642l0852P3987m0302l3240P1558l8869l1696P1449m0223l3169P3299l7429
1835a29l5001P0317l6709l3004P1280l7728l5412P1997l4375l5987O8882l4686
1847e55l4478P0598l4493l7232O9834l1307l6897O7189l1799l5868O8956l0787
1859C161l8981O6913k7599l7356O5051k8527l7588O6305k6269l9957O3452k3851
1871D754l7932O2349k4570l8924O2968k1889m0507N9747k0047l8123N9425k0902
1883F349m0049N9324j7671m0132N6225j7098l8316N6391j7301m0237N5650j4286
$$ y = [-8990, -33670, 40215, -6833, -31850, 39794, -8082, -32852, 40857, -6511, -34448, 39120, -4954, -32665, 38957, -6297, -34198, 39828, -4067, -35106, 37669, -3352, -33212, 38232, -4642, -35494, 38493, -1809, -35049, 36509, -2360, -34056, 37393, -2830, -35999, 37300, -129, -35130, 35187, -1522, -34526, 36754, -974, -36386, 35611, 1236, -34751, 34131, -555, -35033, 35565, 1072, -36160, 33674, 2367, -34530, 32659, 860, -35008, 33948, 3161, -35820, 31093, 3494, -33862, 31189, 2662, -34926, 31379, 5110, -34847, 28605, 4754, -33178, 29171, 4601, -34323, 28645, 6756, -33751, 25996, 5949, -32174, 27251, 6349, -33700, 25624, 7953, -32179, 24046, 6948, -31368, 25023, 7722, -32515, 23135, 8849]
1895H849l9447N2840j4587l8092N3459j4235l9980N1930j1441l8242M9714j2499
1907H269l7871N0303j1158l8927M8149r138l7117M6400j0106l7149M6758q076
1919A0337l7805M4062o819l5752M2931p429l6334M2608m944l6073L9707m470l4474
1932b4455L9048m430l4961L8208k172l4336L5340k144l2817L5146j629l3431L3560
1945A0927K51l2181L1333j33l1155L1229P35l1395K9353J903k9978K7677J512
1958A0078k9156K7612K446k9286K5463L121k7572K4563K730k7255K4074L671k6861
1971a6372K2187L910k5337K1617L661k5104K0823M540k4411J9036M584k2961J8654
1984D827M549k2960J7464N303k1810J6129N154k0716J5574N237k0481J4372N874
$$ y = [8849, -30598, 22242, 7655, -30437, 23022, 8787, -31193, 20737, 9296, -28946, 20768, 8269, -29602, 20701, 9543, -29384, 18765, 9627, -27490, 18910, 8804, -28345, 18413, 10337, -27468, 16594, 9775, -25977, 16954, 9525, -26809, 15799, 10855, -25218, 14489, 10019, -24455, 14593, 10163, -24798, 13410, 11238, -23098, 12242, 10098, -22719, 12427, 10798, -22633, 10927, 11178, -21003, 10330, 10197, -20958, 10271, 11006, -20389, 8964, 10867, -19111, 8566, 10078, -19078, 8534, 10980, -18306, 7157, 10278, -17294, 7269, 9999, -17256, 6818, 10489, -16372, 5815, 9725, -15612, 6005, 9666, -15438, 5385, 9925, -14486, 4550, 9134, -13827, 4827, 9376, -13584, 3880, 9183, -12627, 3502, 8656, -12060, 3514, 8751, -11730, 2642, 8516]
1997H516j9224J3126N590j8302J2593N775j7896J1327O122j6559J0507N795j6017
2010h647R810N998j5216Q796O103j4113Q038N676j3601P543N963j2777O597N719
2024E889j1817O133N449j1326N548N538j0446M862N227r743M389N028r155L995
2038d29N026q404L349M549p734L111M486p143K587M272o456K112L984n902J840
2053g52L830n287J459L597m746J092L247m148Q92L179l649M39K809l115K94K653
2069A794k619M0K352k209k03K159j765l38J902j346m65J632j011o78J399o26o32
2086f14J205l54q37R03o4q03P94K40r26N05L98r05L61N93q67J76P75q93K5R04
2106F16r35j14J037q30j66J095q79m05J179p29m31J281p90n46J253p38n38J292
$$ y = [8516, -10708, 2418, 8008, -10294, 2299, 8074, -9822, 1505, 7627, -8932, 1575, 7370, -8647, 1163, 7161, -8055, 741, 6844, -7269, 769, 6445, -7156, 387, 6350, -6427, 170, 5889, -5928, 205, 5654, -5672, -124, 5414, -5032, -170, 5057, -4686, -297, 4731, -4424, -429, 4597, -3807, -458, 4091, -3643, -532, 3954, -3189, -602, 3670, -2786, -674, 3310, -2592, -752, 3078, -2209, -750, 2847, -1899, -807, 2440, -1708, -816, 2363, -1286, -847, 1962, -1153, -859, 1794, -825, -785, 1567, -642, -845, 1314, -451, -789, 1113, -233, -698, 934, -77, -755, 644, 18, -614, 591, 237, -600, 303, 239, -564, 230, 470, -456, 49, 447, -458, -97, 496, -371, -195, 580, -313, -288, 616, -319, -433, 604, -226, -392, 703, -176, -581, 598, -131, -562, 719, -71, -617, 636, -102, -640, 652]
2124F52o45n95J210o35n79J160n53o03J095m62n17R92m73n82R33l74m39Q50l61
2143G4m09O11l30k01N43k99j16K97k76Q5J29k52K41p6j93M34l15k33O50n24k02
2164c62R22p38k36J160j066k88J547j262l22J791j586l89K180j861m56K525k118
2181e59n25K903k438o76L346k755p71L756k982r22M136l361j104M743l558j315
2197b082N080l831j549N641m121j792O181m327k040O562m578k281P171m843k672
2212c481P763m980k983Q199n370l197Q902n489l692R414n709m023R999o009m321
2227d977J0716o214m893J1224o308n156J1851o679n634J2627o782o162J3072o927
2241b42o487J3818p201p058J4510p217p676J4974p279q021J5768p546q816J6436
$$ y = [652, 7, -588, 622, -13, -592, 568, 15, -588, 507, 45, -472, 520, 47, -535, 398, 24, -415, 435, 74, -335, 276, -54, -255, 288, -11, -127, 170, -106, -21, 108, -144, 97, 21, -172, 262, -53, -286, 364, -160, -362, 560, -178, -414, 746, -320, -608, 939, -323, -645, 1146, -440, -829, 1351, -510, -966, 1559, -559, -1084, 1819, -619, -1295, 2051, -704, -1475, 2281, -701, -1623, 2513, -848, -1952, 2791, -767, -2082, 2998, -833, -2382, 3259, -862, -2654, 3527, -800, -2840, 3722, -856, -3137, 4034, -809, -3481, 4282, -698, -3681, 4518, -852, -4049, 4853, -636, -4328, 5086, -623, -4646, 5353, -656, -4977, 5739, -475, -5368, 5856, -452, -5608, 6243, -436, -6070, 6557, -225, -6387, 6685, -242, -6729, 7089, -112, -7170, 7340, 123, -7553, 7421, 142, -7879, 7889, 343, -8473, 7963]
2255G963p333r331J6852p474r841J7656p447j0735J8153p162j1220J8611p254
2268A438j1856J9411p117j2843J9819o739j3234K0298o884j4036K1048o530j4898
2281a2123K1359o259j5345K1909o353j6220K2623n847j7040K2822n699j7381K3462
2294I908n796j8401K4079n184j8993K4235n190j9509K4968n019k0484K5362m440
2307E536k1014K5507m454k1600K6326m149k2618K6465l485k3028K6613l437k3798
2320a7136K7263k742k4771K7183k124k5165K7365j928k6009K7859j084k6886K7524
2333I349n22k7145K7783j60k8162K7963Q71k8792K7584J314k9133K7917J758l0096
2347a9471K7907K748l0606K7587L050l0909K7966L607l1887K7737M472l2095K7570
$$ y = [7963, 630, -8701, 8151, 677, -9164, 8492, 1045, -9690, 8463, 1301, -9919, 8692, 1438, -10418, 8993, 1876, -10967, 8852, 2113, -11121, 9177, 2293, -11743, 9305, 2775, -12123, 9236, 2977, -12368, 9541, 3188, -13032, 9591, 3744, -13296, 9526, 3827, -13554, 9908, 4112, -14289, 9790, 4606, -14387, 9848, 4658, -14851, 10117, 5098, -15386, 9976, 5536, -15478, 10029, 5575, -16025, 10301, 6152, -16466, 9999, 6514, -16514, 10099, 6662, -17136, 10127, 7385, -17386, 9797, 7673, -17492, 9873, 7945, -18064, 9795, 8711, -18175, 9349, 8827, -18318, 9465, 9305, -18857, 9106, 9977, -18815, 8769, 10083, -19050, 8867, 10625, -19471, 8436, 11184, -19422, 8165, 11215, -19694, 8272, 11879, -20008, 7729, 12201, -19894, 7676]
2360G676M668l2595K7884N314l3351K7525O064l3467K7437O193l4010K7653P013
2373A4004l4678K7130P608l4573K7026P854l5273K6994Q825l5589K6321R315l5577
2386b0613K6184R767l6180K5855J0780l6290K5061J1249l6267K4887J1856l6763
2398b0474K4210J2849l6654K3497J3205l6681K3172J3951l6992K2402J4792l6739
2410a9462K1682J5072l6814K1423J5798l6915K0509J6432l6576K0009J6680l6695
2422a8857J9641J7342l6620J8832J7715l6316J8417J7969l6313J7963J8591l6117
2434a7753J7163J8743l5700J6811J9064l5714J6184J9583l5302J5435J9744l4949
2446a6691J4965K0087l4741J4196K0502l4210J3395K0668l3769J2811K1108l3420
$$ y = [7676, 12344, -20251, 7633, 12947, -20404, 7121, 13185, -20282, 7155, 13348, -20662, 6991, 14004, -20674, 6456, 14064, -20509, 6517, 14371, -20902, 6092, 14917, -20672, 5649, 14964, -20613, 5571, 15338, -20842, 5013, 15793, -20497, 4564, 15813, -20454, 4433, 16289, -20474, 3736, 16585, -20069, 3428, 16633, -20048, 3124, 17075, -19917, 2485, 17277, -19462, 2220, 17292, -19522, 1901, 17699, -19216, 1293, 17725, -18851, 1158, 17838, -18857, 784, 18126, -18494, 338, 18053, -18263, 154, 18123, -18190, -227, 18364, -17753, -590, 18153, -17547, -736, 18328, -17386, -1202, 18381, -16921, -1486, 18258, -16691, -1726, 18361, -16380, -2184, 18318, -15892, -2497, 18171, -15598, -2787, 18321, -15099]
2458a5099J1835K1415l2773J1047K1589l2265J0338K1929l1745R366K2175l1023
2470a3211Q631K2272l0533P903K2546k9915P017K2608k9176O402K2687k8668N641
2483e796K2793k7995M999K2758k7326M422K2690k6726L775K2717k6036L193K2549
2496A6017k5386K729K2475k4799K141K2357k4123J713K2153k3461J159K2024k2801
2509g802O46K1881k2054R7K1631k1399l39K1429k0621r08K1169j9820j457K0964
2523A3417j9084j973K0708j8310k478K0428j7504k981K0107j6736l437J9783j5895
2536c955l877J9387j5168m272J9036j4359m633J8634j3646m964J8219j2909n269
2549g776J7793j2187n506J7349j1558n748J6899j0889n881J6410j0237o036J5926
$$ y = [-15099, -3264, 18151, -14622, -3575, 18014, -14251, -3913, 18016, -13729, -4363, 17812, -13211, -4580, 17692, -12841, -4938, 17608, -12307, -5290, 17318, -11858, -5456, 17231, -11437, -5796, 16997, -10998, -5999, 16759, -10567, -6145, 16545, -10181, -6406, 16311, -9725, -6532, 16017, -9369, -6640, 15835, -8964, -6823, 15534, -8589, -6876, 15277, -8184, -7025, 14999, -7802, -7156, 14725, -7329, -7232, 14399, -7000, -7339, 14090, -6531, -7439, 13730, -6090, -7547, 13417, -5667, -7640, 13068, -5242, -7720, 12708, -4796, -7777, 12330, -4406, -7843, 11940, -3955, -7832, 11555, -3613, -7885, 11151, -3208, -7841, 10793, -2853, -7817, 10402, -2507, -7776, 10017, -2170, -7676, 9673, -1885, -7633, 9266, -1623, -7504, 8906, -1331, -7367, 8559]
2562H559r677o166J5482r039o292J4967q479o348J4471p931o388J3970p342o464
2576f677J3432o787o495J2922o265o523J2454n712o552J1897n190o566J1409m649
2590F98o525J0831m146o517J0325l684o450R821l222o385R261k740o324Q751k354
2605A340o194Q249j929o088P686j577n900P254j268n732O728r66n603O296o85
2620A611n355N837m75n180N402k26m937M944k7m720M557J71m510M141L10m219
2636b676L734M66l977L325O37l798K977P65l499K607Q50l272K264R73l042J954
2652B88J049k782J591J135k558J278J230k364J046J256k082P28J266j880N06J336
2668A043j651K50J327j467M7J311j235j32J316j042l28J286q37n03J253o69o04
$$ y = [8559, -1118, -7284, 8198, -841, -7133, 7834, -645, -6993, 7478, -453, -6841, 7129, -213, -6677, 6755, -32, -6527, 6395, 130, -6393, 6061, 349, -6203, 5694, 504, -6062, 5347, 698, -5827, 5004, 858, -5659, 4666, 982, -5468, 4353, 1131, -5254, 4007, 1267, -5057, 3694, 1340, -4854, 3395, 1466, -4622, 3064, 1487, -4413, 2841, 1573, -4159, 2569, 1603, -4000, 2296, 1611, -3744, 2093, 1618, -3562, 1840, 1614, -3323, 1621, 1594, -3126, 1431, 1602, -2908, 1233, 1543, -2676, 1058, 1524, -2453, 872, 1509, -2289, 688, 1453, -2046, 561, 1411, -1861, 403, 1376, -1666, 288, 1337, -1445, 146, 1281, -1277, 1, 1231, -1133, -87, 1169, -913, -185, 1081, -799, -293, 1043, -608, -358, 969, -498, -451, 860, -375, -507, 809, -233, -561, 725, -112, -615, 638, -31, -635]
2685f35J219n05p36J159l74q13J144k39q68J083j44r68J039l1j004J007M5j051
2703f72R60J22j062R14J75j080Q72K04j073Q53K12j048Q65J76j016P77J83r59
2721e97P97J78r37P87Q9q71P73N1p80P93o3p26Q35j84o26Q79l43n18R20m77l93
2742d13R32o46l21J064q33j85J142j059r3J224j244O7J336j525J84J431j747L10
2760c76J588k069M78J729k326N99J870k638P14K102k974Q90K264l316J006K487
2776B028l681J186K720m051J251L013m441J386L226m775J474L598n220J593L860
2791C167n632J653M192n975J694M591o450J732M956o829J762N362p262J803N717
2806D481p688J799O156q078J795O592q541J802P022q979J772P495r399J806P916
$$ y = [-635, 584, 79, -657, 502, 128, -685, 459, 220, -648, 435, 291, -677, 362, 331, -673, 334, 379, -672, 288, 410, -652, 262, 437, -643, 229, 433, -640, 213, 425, -623, 242, 418, -598, 179, 362, -597, 200, 378, -559, 228, 317, -554, 219, 270, -510, 283, 220, -506, 329, 145, -481, 398, 55, -463, 457, -20, -413, 519, -127, -448, 616, -217, -402, 740, -319, -412, 812, -432, -365, 971, -554, -370, 1061, -686, -376, 1212, -857, -379, 1350, -976, -377, 1493, -1145, -431, 1671, -1303, -413, 1851, -1465, -459, 2028, -1653, -467, 2253, -1798, -547, 2466, -1975, -589, 2637, -2138, -664, 2934, -2286, -693, 3167, -2465, -812, 3380, -2595, -901, 3690, -2760, -1028, 3928, -2901, -1139, 4223, -3039, -1236, 4481, -3207, -1408, 4748, -3330, -1535, 5057, -3484, -1682, 5340, -3639, -1867, 5628, -3771, -1965, 5951]
2821E951r903J793Q415j0329J741Q865j0717J696R342j1195J658R865j1621J593
2835b846J0301j2062J583J0839j2523J409J1401j2881J286J1914j3306J166J2479
2848H760j3682R32J3056j4019P00J3606j4381M74J4272j4705J09J4823j4915j65
2862e135J5414j5307m88J6113j5532r06J6654j5723j198J7252j6057j598J7932
2875A1421j6195k030J8427j6414k298J9052j6677k788J9672j6742l178K0140j6962
2888d572l452K0763j7230l908K1285j7248m243K1678j7427m548K2272j7570n056
2901i256K2710j7526n399K3152j7696n824K3736j7721o392K4178j7620o776K4600
2914A4166j7690p347K5172j7472p993K5452j7302q430K5942j7278r151K6436j6940
$$ y = [5951, -3952, -2159, 6256, -4073, -2332, 6533, -4184, -2488, 6854, -4341, -2683, 7182, -4439, -2846, 7455, -4607, -3024, 7815, -4708, -3299, 8102, -4779, -3493, 8421, -4885, -3719, 8760, -4922, -3990, 9066, -4953, -4253, 9353, -5028, -4554, 9718, -4987, -4878, 9945, -4970, -5135, 10279, -5028, -5516, 10597, -4935, -5841, 10813, -4910, -6108, 11144, -4913, -6511, 11421, -4774, -6804, 11623, -4791, -7089, 11963, -4714, -7502, 12170, -4572, -7750, 12390, -4572, -8024, 12739, -4491, -8399, 12886, -4362, -8605, 13073, -4354, -8902, 13370, -4200, -9256, 13454, -4072, -9471, 13681, -4015, -9839, 13897, -3824, -10216, 13962, -3658, -10434, 14166, -3524, -10871, 14301, -3171, -11164, 14288, -3014, -11444, 14498, -2780, -11931, 14505, -2435]
2927b435r728K6671j6733j0250K7125j6538j1032K7522j6123j1585K7712j5939
2939a333j2101K8168j5711j2829K8420j5262j3291K8580j5133j3812K8974j4776
2951a06j4439K9076j4413j4783K9233j4292j5290K9575j3896j5836K9558j3577
2963H10j6107K9721j3380j6680K9973j2857j7170K9838j2538j7448K9996j2259
2975A899j8035L0088j1619j8482K9891j1267j8793L0002j0751j9498K9922j0048
2987C309j9861K9723r634k0285K9789r026k0918K9535q233k1265K9304p818k1669
3000a7049K9246p076k2219K8876o416k2402K8655n980k2840K8522n292k3172K8086
3013A0939m740k3266K7864m333k3661K7676l682k3852K7207l315k3826K7025k938
$$ y = [-2435, -12163, 14508, -2225, -12475, 14650, -1888, -12920, 14602, -1521, -13106, 14606, -1333, -13434, 14734, -977, -13806, 14614, -648, -13939, 14641, -492, -14304, 14670, -106, -14545, 14531, 118, -14665, 14568, 276, -15014, 14561, 665, -15171, 14387, 810, -15297, 14424, 1044, -15636, 14337, 1480, -15690, 14148, 1610, -15838, 14158, 1899, -16136, 13952, 2333, -16149, 13742, 2475, -16318, 13684, 2933, -16565, 13357, 3309, -16552, 13171, 3537, -16748, 13041, 4015, -16903, 12632, 4399, -16866, 12438, 4620, -17049, 12197, 5121, -17098, 11778, 5362, -17040, 11615, 5635, -17205, 11317, 6025, -17147, 10939, 6199, -17067, 10797, 6464, -17197, 10479, 6797, -17055, 10152, 6837, -16989, 10036, 7098]
3026G098k4096K6655k304k4156K6210k022k4131K5954j570k4336K5514r66k4310
3039a6460K5034o57k4346K4762j18k4512K4184M57k4374K3686Q04k4438K3279
3052G301J459k4527K2584K029k4383K2095K440k4439K1595L108k4371K0832L576
3065I299k4182K0358L970k4181J9781M576k4028J9106M893k3768J8652N243k3677
3078a3958J8049N703k3383J7412N888k3088J6965O229k2919J6363O475k2471J5795
3091C060O600k2218J5386O850k1914J4751P065k1465J4210P157k1156J3730P435
3104I491k0790J3097P542k0322J2573P657j9955J2057P849j9526J1387P990j9020
3117i970J0861Q082j8633J0260Q306j8163R629Q367j7695R120Q498j7274Q512
$$ y = [7098, -16998, 9657, 7353, -16803, 9407, 7385, -16746, 9208, 7638, -16698, 8816, 7850, -16460, 8574, 7917, -16429, 8333, 8215, -16297, 7887, 8344, -16030, 7656, 8460, -15978, 7301, 8760, -15767, 6817, 8846, -15537, 6558, 8998, -15441, 6154, 9262, -15109, 5723, 9299, -14883, 5475, 9445, -14736, 5045, 9621, -14407, 4699, 9592, -14176, 4476, 9719, -13958, 4091, 9794, -13589, 3823, 9711, -13377, 3588, 9817, -13102, 3261, 9736, -12735, 3060, 9660, -12558, 2828, 9678, -12236, 2515, 9580, -11885, 2325, 9482, -11674, 2056, 9491, -11299, 1798, 9340, -10982, 1591, 9248, -10707, 1350, 9199, -10327, 1060, 9050, -9970, 891, 8973, -9660, 600, 8906, -9257, 372, 8739, -8956, 164, 8662, -8612, -100]
3130a00Q644j6778P961Q602j6238P503Q609j5787O937Q676j5220O426Q597j4766
3144f934O051Q566j4259N516Q500j3690N142Q323j3185M769Q216j2675M357Q079
3158F776j2147M059P847j1668L724P729j1109L345P517j0600L051P339j0132K738
3172a531P152r603K418O926r078K103O776q603J799O573q110J523O361p630J244
3187a680O197p198R74N977o708P00N753o267N11N537n805K71N342n401P0N112
3203C385m995j29M879m539k98M631m164m15M355l774n43M134l450o35L876l075
3219g57p28L635k778p83L360k455q75L148k153r04K865j859r35K647j589r90K423
3236A272j331j014K183j100j043J986q81j053J771o29j043J553m43j066J393k60
$$ y = [-100, 8544, -8234, -273, 8329, -7909, -406, 8203, -7584, -647, 8029, -7191, -765, 7832, -6934, -883, 7683, -6576, -1060, 7440, -6250, -1108, 7215, -5970, -1201, 7015, -5660, -1303, 6776, -5371, -1312, 6535, -5133, -1409, 6320, -4789, -1444, 6073, -4527, -1476, 5863, -4269, -1531, 5621, -3982, -1564, 5362, -3716, -1613, 5163, -3440, -1641, 4932, -3178, -1655, 4706, -2924, -1680, 4517, -2681, -1707, 4270, -2438, -1738, 4015, -2252, -1741, 3796, -2009, -1738, 3604, -1797, -1727, 3385, -1610, -1739, 3140, -1399, -1697, 2934, -1230, -1645, 2710, -1064, -1607, 2527, -923, -1558, 2318, -757, -1485, 2150, -628, -1411, 1949, -506, -1381, 1767, -386, -1290, 1575, -284, -1219, 1428, -161, -1151, 1272, -59, -1073, 1110, 10, -1033, 953, 72, -981, 790, 161, -882, 671, 228, -838, 555, 295]
3252B95j066J192q1j039R84P4j018Q48K01r81P04L14r47N54M26r33M32N47r34
3271d28L32O14q74K15O65q29P2P59p71l0P89p34q0Q29p00j55Q12o57k00Q69o16
3292a18k57Q44n99k73Q51n57k81Q55n35l41Q43n08l14P96m68k89P37m53k56P19
3312C96m62k66P07m47k06O41m24j95N96m71o8N33m66l6M76m73M9M34n13J35L59
3333B99n63K31L28o22L58K69o70M40K19p16N48K04q28O68J46q88Q07R0r48R36
3353C08M5j067J076j0j133J194j9j274J352n4j386J485o1j477J585n6j613J744
3371F39r9j770J912q2j922K050p9k089K211m5k259K344j4k421K455L6k621K596
3389H42J30k833K719J73l003K836K67l228K970L72l421L048M81l640L176N73l869
$$ y = [295, -771, 421, 340, -699, 285, 359, -659, 189, 390, -591, 113, 427, -520, 34, 460, -473, -41, 506, -428, -96, 518, -356, -141, 524, -305, -233, 526, -245, -275, 514, -220, -300, 529, -171, -326, 486, -171, -371, 498, -118, -375, 469, -130, -403, 448, -109, -390, 465, -70, -411, 432, -76, -390, 406, -62, -351, 386, -67, -323, 396, -66, -332, 375, -72, -278, 363, -61, -256, 340, -131, -199, 334, -132, -168, 308, -165, -116, 318, -195, -60, 299, -264, -33, 295, -327, 31, 300, -370, 70, 289, -427, 121, 325, -503, 165, 311, -577, 230, 320, -628, 308, 353, -714, 362, 352, -781, 413, 394, -880, 472, 418, -968, 517, 456, -1021, 564, 508, -1105, 639, 540, -1230, 682, 600, -1322, 728, 649, -1440, 771, 726, -1533, 811, 797, -1624, 831, 867, -1754, 842, 972, -1861, 858, 1031, -1972, 864, 1131, -2097, 873, 1245, -2176, 872, 1353, -2287, 889, 1462, -2407]
3406b407L320O81m099L381Q08m306L516R60m551L554J100m768L642J231m967L707
3422H02J399n216L760J577n434L829J740n688L909J918n884L904K154o166L942
3437E46K359o378L918K606o598L914K831o830L886L158p118L865L390p305L831
3452G5L654p545L767L995p782L632M314q011L575M632q274L488M958q433L331
3467f24N287q675L234N616q873L094N981r066K915O276r213K782O613r404K633
3482a424O931r544K466P239r740K316P574r903K169P873j0019J976Q205j0144
3496d025J774Q527j0259J586Q849j0408J366R154j0494J127R522j0595Q79R879
3510F882j0696O36J0199j0745L31J0522j0795J7J0910j0811l06J1289j0906o18
$$ y = [-2407, 913, 1594, -2505, 876, 1684, -2622, 894, 1854, -2697, 857, 1957, -2811, 831, 2062, -2905, 802, 2201, -3015, 745, 2322, -3112, 717, 2457, -3231, 678, 2596, -3288, 616, 2770, -3396, 546, 2905, -3473, 445, 3051, -3547, 367, 3198, -3632, 254, 3412, -3706, 159, 3549, -3756, 75, 3729, -3816, -49, 3946, -3836, -204, 4110, -3901, -326, 4306, -3968, -480, 4478, -3955, -624, 4663, -4012, -778, 4838, -4035, -941, 5040, -4026, -1111, 5165, -4048, -1266, 5347, -4057, -1424, 5507, -4037, -1571, 5668, -4072, -1756, 5818, -4085, -1916, 5957, -4062, -2086, 6119, -4025, -2251, 6276, -3983, -2397, 6452, -3956, -2590, 6564, -3930, -2803, 6719, -3876, -2997, 6882, -3814, -3178, 7021, -3724, -3393, 7129, -3666, -3649, 7261, -3550, -3856, 7433, -3473, -4091]
3524d091J1619j0867r89J1956j0864j306J2294j0862j664J2636j0844k008J2897
3537G907j0785k327J3225j0769k632J3489j0719k971J3753j0670l278J3986j0594
3550b385l541J4189j0548l788J4387j0493m084J4628j0387m354J4764j0264m654
3563f530J4932j0143m969J5134j0030n231J5270r919n528J5417r738n857J5616
3576H424r601o138J5704r392o465J5850r176o819J5942q951p169J6096q723p516
3590g934J6176q471p851J6276q215q171J6297p948q425J6307p683q735J6343p449
3604E17q992J6360p193r236J6329o970r426J6300o724r615J6229o457r786J6126
3618G462o234r927J6045n975j0076J5919n736j0173J5793n501j0279J5671n262
$$ y = [-4091, 7528, -3339, -4328, 7628, -3236, -4542, 7752, -3110, -4774, 7862, -2982, -4990, 7907, -2878, -5205, 8020, -2749, -5381, 8108, -2611, -5582, 8171, -2499, -5777, 8209, -2385, -5926, 8263, -2285, -6073, 8314, -2179, -6263, 8365, -2022, -6376, 8388, -1876, -6530, 8402, -1741, -6710, 8424, -1606, -6837, 8433, -1486, -7014, 8403, -1335, -7192, 8424, -1177, -7315, 8389, -1003, -7468, 8382, -794, -7613, 8329, -622, -7791, 8305, -418, -7934, 8242, -229, -8080, 8196, -19, -8190, 8107, 159, -8266, 8041, 358, -8377, 7966, 517, -8475, 7885, 692, -8544, 7785, 815, -8611, 7689, 965, -8650, 7579, 1122, -8664, 7462, 1228, -8699, 7346, 1371, -8705, 7214, 1478, -8695, 7098, 1597, -8682, 6989, 1727]
3631A727j0428J5553n004j0498J5359m759j0617J5233m450j0752J5051m177j0815
3644h577J4853l923j0920J4674l601j1030J4468l305j1119J4231k960j1245J4022
3657E568k667j1278J3783k393j1307J3514k096j1369J3247j774j1391J2991j520
3670C308j1368J2694j258j1330J2412j024j1252J2103q16j1185J1819n82j1094
3683g573J1515l91j0964J1200k08j0885J0924k8j0723J0578J41j0552J0237L39
3697C610j0389R916M68j0245R603O85j0106R258Q32r943Q934J035r806Q573J216
3712C641r621Q233J408r476P905J569r292P548J716r097P213J885q910O859K031
3727C612q733O563K135q531O237K286q316N897K368q095N611K431p860N291K522
$$ y = [1727, -8701, 6852, 1848, -8650, 6709, 1950, -8667, 6566, 2116, -8636, 6415, 2238, -8577, 6276, 2353, -8567, 6107, 2506, -8524, 5944, 2639, -8480, 5751, 2791, -8454, 5568, 2901, -8377, 5406, 3013, -8294, 5220, 3124, -8245, 5002, 3228, -8163, 4828, 3308, -8060, 4634, 3376, -7954, 4458, 3434, -7818, 4285, 3469, -7716, 4103, 3521, -7573, 3942, 3551, -7413, 3787, 3579, -7306, 3618, 3590, -7133, 3445, 3586, -6966, 3271, 3610, -6779, 3137, 3605, -6640, 2963, 3648, -6458, 2800, 3632, -6311, 2623, 3658, -6148, 2425, 3641, -5980, 2253, 3661, -5815, 2090, 3659, -5633, 1915, 3631, -5466, 1747, 3632, -5278, 1581, 3612, -5121, 1442, 3577, -4954, 1283, 3569, -4747, 1150, 3518, -4577, 1034, 3465, -4395, 896, 3418]
3742C418p608M963K577p359M689K595p098M416K586o816M107K630o545L833K613
3757C001o296L585K634o031L305K629n786L079K616n525K823K601n249K571K596
3772B553m985K320K556m739K093K570m490J833K567m254J659K516m024J435K498
3787B108l795J246K448l516J023K396l308Q57K381l104P05K318k867N26K233k650
3803i99L77K187k450K47K115k247J10K023k035MJ961j852j07J843j643k17J752
3820A069j453k95J689j302l81J593j151m39J485r84n17J446q08n84J307o78o50
3837f53J253n56o58J156m34p09J084l07p68J003k07p96R64j30q04Q64k6q31P92
3856B37N9q52P33J68q72O89K08q89O57K55q92N86L14q79N33L38q59N00L87q75
$$ y = [3418, -4190, 773, 3350, -4009, 680, 3275, -3823, 593, 3179, -3637, 470, 3100, -3445, 388, 3001, -3295, 290, 2924, -3107, 198, 2827, -2959, 120, 2736, -2789, 34, 2635, -2614, -43, 2553, -2432, -112, 2444, -2295, -202, 2368, -2122, -289, 2278, -1976, -317, 2199, -1825, -390, 2108, -1687, -441, 2007, -1509, -486, 1910, -1398, -541, 1840, -1264, -559, 1759, -1108, -582, 1651, -999, -622, 1565, -885, -638, 1477, -770, -660, 1363, -672, -668, 1293, -559, -666, 1177, -466, -683, 1069, -384, -679, 1010, -292, -673, 920, -231, -670, 815, -169, -686, 760, -48, -632, 675, -3, -653, 600, 44, -614, 542, 108, -601, 483, 176, -592, 411, 204, -592, 372, 242, -562, 302, 276, -555, 237, 296, -556, 177, 345, -527, 162, 370, -519, 138, 393, -499, 87, 401, -478, 55, 393, -466, 34, 421, -454]
3876d54M82L97q52M26M23q40L90M47q00L84M11p92L55M24p61L64L89p61L63L86
3896C81p09L19L76p49L76L43o93L75L18o77L68K80o81M47K14o80M93J66o73N49
3916A43J12o74N67Q2o74O35J3o55O95o4o74P86j28o81Q60j85o79R37k62p12J012
3937D54l40p15J125m50p27J224m75p82J342o17p53J421o77q20J562p59q63J700
3955H50q45r11J817r15r30J915j010r55K030j086j024K185j183j066K322j266
3971g2j116K459j313j219K611j424j279K764j460j375K903j527j445L071j597
3986a9j578L233j637j689L412j704j791L572j759j908L718j819j996L909j870
4001G4k123M022j899k230M209j945k364M388j976k484M502k003k596M657k027
$$ y = [-454, 28, 425, -427, -1, 422, -418, -28, 419, -381, 3, 414, -378, -23, 401, -360, 4, 393, -368, -5, 381, -328, -9, 367, -382, -6, 337, -356, 19, 337, -340, 28, 308, -373, 74, 288, -392, 101, 267, -406, 143, 255, -419, 148, 230, -444, 191, 204, -451, 244, 180, -494, 292, 164, -517, 343, 158, -521, 416, 154, -558, 454, 114, -601, 524, 74, -653, 571, 96, -686, 656, 39, -714, 707, 30, -790, 772, 13, -850, 850, 5, -906, 911, -4, -934, 981, -29, -984, 1046, -40, -1064, 1121, -62, -1128, 1194, -72, -1188, 1271, -42, -1261, 1350, -74, -1353, 1411, -49, -1424, 1479, -48, -1493, 1578, -19, -1597, 1636, -1, -1690, 1722, 18, -1773, 1799, 40, -1868, 1850, 31, -1965, 1944, 74, -2049, 1973, 74, -2156, 2053, 108, -2256, 2132, 156, -2328, 2174, 171, -2425, 2232, 205]
4016B05k722M828k084k828M952k109k938N095k124l042N220k112l176N352k133
4031C84l300N471k110l471N626k126l591N761k123l749N890k048l948O003j990
4046F79m083O116j974m239O260j930m424O332j844m568O440j802m760O571j722
4061A052m922O652j634n092O728j578n209O785j497n384O886j429n500O928j347
4076A439n658O977j249n776O996j174n882P043j067o006P049r92o112P083r23
4091A748o209P133q45o309P091p26o399P099o18o524P109n11o638P065l56o744
4107d634P080k55o863P057j14o923O972O7p071O945J99p167O890L70p264O834
4123B123M92p366O795O65p441O708Q27p532O628R78p613O580J097p661O488J204
$$ y = [205, -2517, 2311, 227, -2601, 2351, 242, -2696, 2399, 275, -2767, 2453, 341, -2835, 2517, 384, -2916, 2555, 445, -3026, 2600, 474, -3117, 2644, 521, -3228, 2662, 614, -3334, 2669, 679, -3404, 2712, 738, -3501, 2759, 829, -3595, 2737, 893, -3675, 2765, 963, -3797, 2774, 1052, -3870, 2782, 1148, -3944, 2784, 1206, -4003, 2782, 1285, -4099, 2787, 1358, -4142, 2786, 1439, -4219, 2758, 1509, -4267, 2729, 1555, -4327, 2716, 1649, -4357, 2692, 1700, -4412, 2671, 1748, -4461, 2672, 1827, -4482, 2609, 1883, -4516, 2583, 1965, -4559, 2550, 2039, -4599, 2466, 2110, -4634, 2446, 2191, -4672, 2385, 2271, -4652, 2320, 2387, -4684, 2261, 2460, -4707, 2183, 2553, -4711, 2123, 2615, -4751, 2044, 2709, -4732, 1976, 2803, -4729, 1899, 2877, -4736, 1844, 2941, -4720, 1768, 2972]
4139B972p674O382J350p697O260J496p727O184J581p715O036J703p718N928J818
4154C179p700N803J958p687N645K052p676N563K173p679N422K260p621N269K400
4169C361p631N116K534p598M969K686p573M796K800p547M647K927p488M456L085
4184C540p488M315L180p402M114L322p384L978L417p340L820L553p268L600L651
4199C608p181L474L725p101L267L818o986L125L815o880K980L907o745K776L940
4214C542o637K636L987o523K466M035o398K310M040o262K160M056o108J999M105
4229C408n995J825M097n839J696M119n720J501M152n530J318M204n452J196M229
4244C209n343J053M253n198Q67M260n035P30M267m895N48M317m750M04M290m610
$$ y = [2972, -4702, 1680, 3030, -4667, 1593, 3089, -4638, 1546, 3127, -4588, 1448, 3151, -4567, 1361, 3179, -4521, 1282, 3240, -4447, 1198, 3250, -4426, 1137, 3310, -4369, 1053, 3313, -4308, 961, 3361, -4270, 846, 3380, -4218, 751, 3437, -4136, 660, 3460, -4087, 560, 3487, -4001, 455, 3540, -3948, 367, 3547, -3855, 259, 3581, -3803, 175, 3592, -3748, 72, 3625, -3643, -43, 3608, -3573, -99, 3626, -3475, -208, 3610, -3376, -251, 3564, -3316, -336, 3571, -3174, -398, 3542, -3095, -459, 3528, -2995, -529, 3506, -2892, -582, 3458, -2804, -644, 3412, -2696, -697, 3408, -2587, -762, 3335, -2504, -808, 3311, -2409, -908, 3244, -2286, -968, 3236, -2216, -1020, 3209, -2134, -1081, 3172, -2026, -1159, 3101, -1934, -1204, 3063, -1832, -1284, 3033, -1717, -1313, 2977, -1633]
4260a633K71M293m481J36M281m297RM254m172j04M178l987k51M181l858l27M107
4277B600l677m33M039l517n31L974l369o13L912l243o66L847l103p70L793k943
4293g00q42L701k773r20L599k623r48L523k485j071L462k334j095L403k231j155
4309a489L309k094j225L260j946j306L168j827j340L083j680j386L008j573j407
4324a445K900j436j444K813j324j466K719j201j508K619j086j501K516r68j535
4339a347K428q78j483K302p70j508K196o78j477K107o01j453J972n01j441J897
4355G65m31j397J749l34j402J712k89j363J592k23j330J485j39j298J373m5j300
4372h75J300%j265J227M4j234J141J09j208J042J63j162R46K11j141Q74K83j103
$$ y = [-1633, -1362, 2931, -1550, -1414, 2867, -1430, -1421, 2833, -1339, -1443, 2735, -1252, -1503, 2678, -1180, -1507, 2600, -1077, -1510, 2529, -988, -1519, 2455, -914, -1527, 2385, -858, -1524, 2323, -780, -1550, 2243, -700, -1542, 2159, -614, -1534, 2065, -558, -1506, 2017, -468, -1539, 1923, -411, -1506, 1897, -334, -1489, 1820, -274, -1499, 1761, -185, -1491, 1677, -150, -1490, 1593, -87, -1473, 1535, -38, -1445, 1455, 19, -1425, 1388, 64, -1402, 1317, 116, -1392, 1227, 141, -1360, 1156, 188, -1347, 1081, 203, -1280, 1022, 252, -1256, 940, 262, -1215, 892, 291, -1162, 810, 309, -1132, 765, 334, -1063, 686, 352, -1050, 662, 373, -990, 602, 379, -951, 534, 395, -903, 470, 425, -875, 425, 425, -840, 387, 431, -803, 338, 447, -761, 281, 444, -718, 228, 439, -702, 172, 455, -648]
4390f48P94K80j025P14L28r97O25L64r38N35L86r02M85M32q72M15M26p93L31M66
4410D06p39K82M47o94K22M41o47J54M78n96J10M86n41K1M99n23nN03m53m3M76
4431B84m19r4N27l94j36N21l74j42M78l11j98N09k75k32N00k62k49M94k16k68
4451b57M60j62l01M87j92l18N02j67l08M50j45l43M92j22l43M63j17l63M55r1
4471H0l70M65j04l43M56q6l88M56q0l30M02p5l45M26r3l46M31r2l22M35j23l13
4493b59M48j70k83M59j40k62L88j52k60M64k35k23M42k37j88M65k86j89M81l00
4513c7j77M89l40j47N06m05q6M89m35p0N40m99l0N68n55j4N92o33K7O60o88L8
4535b07O64p36Q3O88q01J22P17q59J21P69r23J56Q09j014K17Q44j095K25R08j158
$$ y = [-648, 146, 426, -599, 115, 443, -554, 71, 435, -503, 32, 418, -484, 1, 433, -439, -24, 402, -391, -60, 406, -333, -51, 396, -298, -76, 365, -282, -128, 350, -246, -136, 350, -191, -170, 329, -194, -199, 304, -149, -192, 284, -135, -229, 298, -96, -232, 289, -85, -227, 251, -60, -258, 251, -24, -256, 244, -18, -267, 227, 11, -257, 203, 41, -260, 227, 35, -283, 219, 52, -256, 194, 49, -294, 198, 76, -267, 196, 79, -284, 171, 80, -290, 175, 71, -272, 184, 98, -290, 166, 86, -244, 158, 83, -262, 164, 71, -275, 156, 64, -258, 177, 54, -259, 189, 19, -264, 195, 55, -207, 181, 29, -231, 233, -2, -225, 217, -20, -208, 257, -29, -218, 263, -37, -214, 275, -65, -212, 294, -111, -197, 292, -143, -213, 327, -172, -202, 366, -189, -203, 389, -244, -217, 443, -245, -207, 457, -279, -196, 492, -309, -187, 530, -329, -208, 561, -362, -206, 603, -411, -194, 650, -445, -220, 688, -470]
4555d70K64R31j250L10J000j316K96J073j407L25J122j510L63J191j597M25J217
4572I67j686M22J316j748M09J404j857M65J436j952M77J526k045M99J617k137
4588h87M99J713k265N08J795k319N25J858k417N15J968k517N09K067k623N26K151
4605A606k693N33K234k791N41K292k867N21K404k974N77K461l054N41K563l132
4621a238N19K675l209N36K730l285N06K835l384M78K965l453M94L002l520M84
4637h65L127l625M44L222l673M12L371l773L61L445l828L09L569l895K89L670
4653B560l951K40L772m025J87L883m074J17L987m122R5M083m164L1M172m197k3
4670a429M253m228n7M323m294o6M393m287j36M469m323k02M563m372k36M601m318
$$ y = [-470, -206, 725, -525, -215, 785, -531, -235, 838, -569, -244, 878, -632, -269, 922, -675, -250, 967, -719, -297, 1019, -729, -320, 1084, -773, -308, 1128, -824, -347, 1179, -866, -367, 1250, -887, -388, 1325, -940, -432, 1363, -956, -431, 1427, -990, -475, 1493, -1024, -515, 1552, -1071, -545, 1606, -1087, -554, 1680, -1111, -570, 1722, -1145, -624, 1780, -1194, -617, 1844, -1210, -669, 1894, -1238, -719, 1956, -1253, -717, 2013, -1272, -766, 2069, -1315, -837, 2128, -1325, -831, 2171, -1349, -865, 2262, -1363, -919, 2303, -1370, -958, 2413, -1360, -999, 2446, -1382, -1073, 2496, -1399, -1110, 2560, -1391, -1151, 2621, -1404, -1217, 2666, -1408, -1291, 2696, -1426, -1331, 2752, -1412, -1381, 2791, -1406, -1429, 2824, -1404, -1461, 2862, -1432, -1498, 2895, -1392, -1528, 2941, -1382, -1584, 2979, -1393, -1629, 2972, -1346]
4687a346l11M667m342l67M744m354m24M813m385m90M872m339n84M954m358o34
4703a884N008m358o93N081m355p79N162m350q48N217m348r46N312m329j023N350
4719C217m280j130N424m254j183N438m220j287N512m207j328N533m152j401N550
4734C232m097j526N616m054j535N543l980j576N564l929j687N581l824j782N560
4749C106l763j805N552l711j842N532l635j897N492l559j976N501l485k061N512
4764B961l402k087N450l315k180N461l222k272N466l143k317N426l035k429N415
4779B777k949k470N394k840k561N369k769k622N340k664k671N298k555k758N262
4794B581k470k759N159k337k843N139k240k858N044k150k893M967k056k898M889
$$ y = [-1346, -1657, 3010, -1332, -1699, 3045, -1309, -1733, 3080, -1305, -1795, 3077, -1262, -1846, 3108, -1250, -1884, 3124, -1234, -1927, 3154, -1201, -1980, 3182, -1168, -2016, 3201, -1147, -2093, 3219, -1110, -2133, 3217, -1063, -2193, 3231, -1023, -2206, 3232, -988, -2275, 3237, -970, -2298, 3235, -917, -2318, 3232, -865, -2391, 3225, -829, -2364, 3179, -801, -2377, 3187, -742, -2429, 3152, -672, -2454, 3106, -657, -2462, 3090, -621, -2463, 3069, -566, -2463, 3029, -530, -2506, 2995, -490, -2551, 2961, -441, -2528, 2922, -393, -2573, 2888, -334, -2606, 2860, -283, -2600, 2826, -209, -2638, 2777, -172, -2642, 2752, -88, -2649, 2720, -49, -2671, 2669, 5, -2666, 2632, 77, -2681, 2581, 111, -2648, 2511, 174, -2669, 2470, 230, -2628, 2416, 266, -2627, 2340, 284, -2614, 2275]
4809B275j944k927M818j870k919M705j742k939M636j651k965M566j557k996M480
4824A970j444k989M366j348k980M285j250l047M217j157l018M105j037l039M029
4839A663r42l062L956q84l032L859p79l057L761o46l088L671n67l093L570m68
4855H62l034L457l76l049L353k84l030L266k30l003L168j58k992L091p5k925K939
4872I80j8k879K825P8k849K730J34k816K627J88k736K499K45k710K409L03k667
4889a657K314L35k586K197L88k542K100M45k476J978M83k440J919N31k389J802
4905D02N80k339J704O48k295J615O77k255J527O96k186J445P58k141J360P68k080
4922a116J250Q08k022J202P87j916J110Q11j890J040Q11j780R19Q43j714Q43Q62
$$ y = [2275, 331, -2596, 2222, 352, -2567, 2138, 396, -2543, 2093, 442, -2523, 2043, 486, -2510, 1970, 526, -2463, 1903, 555, -2425, 1860, 610, -2437, 1780, 623, -2395, 1710, 673, -2366, 1663, 721, -2341, 1615, 731, -2301, 1558, 779, -2278, 1483, 837, -2251, 1420, 853, -2240, 1330, 862, -2172, 1285, 909, -2140, 1213, 929, -2101, 1165, 935, -2068, 1100, 942, -2050, 1041, 966, -1959, 980, 962, -1917, 908, 986, -1863, 867, 1001, -1815, 812, 1000, -1736, 763, 1008, -1702, 707, 1010, -1657, 657, 992, -1594, 603, 991, -1551, 549, 994, -1482, 496, 979, -1461, 458, 989, -1400, 402, 982, -1357, 347, 995, -1300, 315, 992, -1263, 264, 960, -1226, 219, 977, -1164, 196, 964, -1116, 134, 942, -1080, 122, 909, -1007, 103, 914, -976, 64, 875, -905, 14, 857, -857, -14, 848]
4939H48j637P38Q55j577P27Q20j501O40Q42j434N85Q36j372N13Q05j260M36Q06
4957F70j212L96P93j123L19P74j080L14P52j012K19P66r47J62P73q80R0P57q32
4976c01J06P30q17P0O99p23LO78o68PO49o34m6O62n64o5N91n03j13N80m67j31
4998b57N85m09j53N17l53j82N09l01j93M72k60k16M37j76k53M29j51k88M25j54
5018B8k54L79j03k30L13q9k39L23m9k71K87l2k47K60K0l01K98K6l16K74L8k74
5040a59K30N0k94K12R4l33K43Q5l16K03R1k75K17R7l19K05R7k88J80J15k95J92
5062C2R6k78J57J20k86K03J07l04J75J36l04J80R7k83K04Q1k86K02P5k79J84Q6
5084A15k60J91M5k49K16L9k54K21Nk43K45Jk65K66J0k85L00l2k55L01m0k77L43
$$ y = [848, -789, -51, 804, -773, -46, 774, -727, -87, 755, -679, -94, 742, -630, -117, 688, -572, -136, 670, -542, -146, 647, -476, -157, 617, -463, -149, 603, -409, -190, 576, -371, -209, 564, -316, -226, 531, -301, -195, 535, -282, -212, 487, -236, -233, 445, -223, -216, 433, -201, -247, 415, -149, -214, 377, -126, -239, 341, -126, -257, 328, -81, -234, 283, -70, -252, 257, -44, -237, 235, -25, -241, 196, 20, -233, 196, 45, -243, 182, 28, -226, 153, 50, -180, 133, 44, -195, 128, 79, -192, 95, 63, -184, 76, 96, -205, 93, 119, -197, 77, 115, -159, 71, 121, -173, 39, 133, -200, 43, 128, -188, 15, 106, -169, 48, 145, -174, 31, 128, -160, 20, 135, -160, 32, 128, -150, 7, 127, -159, 44, 151, -153, 22, 158, -146, 34, 131, -152, 52, 133, -153, 49, 124, -155, 29, 115, -145, 46, 91, -158, 58, 97, -157, 64, 69, -174, 71, 72, -193, 73, 83, -202, 98, 66, -189, 112, 72, -205, 138]
5107A38p7k68L83j27k63L70r9k96M40j64l10M80j72l04N24j97l32N26k40k96N71
5128B87k58l58O11k51l58O37k94l72O88l04m04P07l05m41Q10l64m73Q51m08m42
5148d41Q42l81m96R02m18n08R66m30n71J011m22n95J041m64o10J096m56o69J138
5167E35m56o98J192n01p39J246m97p82J307n25q13J364n00r00J410n16r59J458
5185F26m90r71J481m80j027J551m80j109J580m70j162J656m90j205J706m75j245
5202a004J730m44j294J734m31j340J784l98j408J825l93j476J875l77j517J905
5218G71l71j553J926l23j629J956k93j694J972k59j767K021k47j797K026j73j875
5235a309K055j35j955K058p1k012K093n2k090K149l0k170K159P5k246K179J19
$$ y = [138, 61, -207, 176, 49, -214, 156, 57, -239, 201, 37, -273, 207, 35, -269, 255, 58, -274, 252, 12, -284, 287, 29, -329, 282, 31, -327, 310, 16, -356, 332, 28, -376, 331, 26, -415, 395, 31, -442, 409, 1, -441, 401, 20, -476, 426, 8, -500, 466, 36, -535, 476, 54, -541, 500, 36, -574, 522, 66, -603, 535, 79, -619, 573, 72, -667, 579, 82, -700, 607, 82, -731, 633, 133, -767, 643, 127, -832, 626, 136, -835, 646, 166, -861, 690, 210, -899, 681, 211, -951, 705, 215, -990, 716, 241, -1004, 726, 282, -1012, 722, 291, -1049, 735, 337, -1071, 754, 361, -1115, 760, 383, -1134, 771, 400, -1153, 773, 450, -1179, 777, 484, -1210, 762, 503, -1264, 757, 510, -1287, 739, 566, -1309, 746, 611, -1344, 714, 643, -1369, 724, 672, -1418, 731, 701, -1469, 690, 765, -1481, 698, 817]
5252H17k320K164J84k374K193K19k433K207K53k472K193L26k547K200L90k605
5268a605K191M57k628K159N11k703K132N97k751K131O69k801K110P04k822K091
5284D42P80k872K063Q61k931K062Q79k960K036R74l024K013J051l031J965J105
5300A413l080J910J228l156J932J267l188J867J362l241J837J446l294J786J532
5315A621l311J775J562l341J728J673l405J674J754l385J576J833l412J550J872
5330A764l425J506J955l442J438K032l436J386K070l448J332K130l435J259K189
5345A875l444J197K227l386J128K304l366J062K319l376R97K395l401R61K425
5360A917l354R05K470l328Q04K545l313P44K596l324O93K643l304O16K682l266
$$ y = [817, -1503, 661, 845, -1529, 664, 883, -1550, 657, 910, -1562, 631, 957, -1590, 610, 1000, -1605, 586, 1043, -1585, 574, 1085, -1618, 514, 1111, -1640, 491, 1160, -1641, 469, 1173, -1649, 442, 1222, -1650, 413, 1274, -1657, 405, 1284, -1676, 360, 1334, -1690, 323, 1374, -1657, 308, 1413, -1667, 243, 1471, -1685, 247, 1514, -1674, 193, 1555, -1686, 151, 1597, -1697, 89, 1621, -1690, 85, 1647, -1694, 34, 1707, -1698, -24, 1730, -1655, -79, 1754, -1658, -108, 1764, -1661, -155, 1800, -1642, -204, 1828, -1608, -222, 1848, -1600, -268, 1862, -1573, -314, 1875, -1569, -372, 1855, -1531, -403, 1901, -1465, -403, 1916, -1460, -463, 1932, -1469, -508, 1917, -1437, -532, 1938, -1390, -586, 1959, -1354, -610, 1986, -1338, -645, 1998, -1306, -690, 1992, -1274]
5376a274N26K750l255M53K831l257L84K860l203L33K874l159K53K913l126K04
5392h93K904l060R0K951l048P3K984k988j9K982k913q5K962k835j26K973k823
5409h71k03K965k721k73K974k667k80K911k599l42K935k522m46K939k500m45K951
5426A806k422n46K948k368n96K897k258o52K907k240o72K895k182p19K849k075
5442d28q06K868k035q08K820j967q65K794j877r23K764j799r65K721j719j003
5458a228K704j686j026K654j599j047K581j498j059K520j434j069K466j361j096
5473a178K419j306j100K362j217j158K317j157j129K274j089j157K189r98j151
5488a079K116r47j195K076q69j187K037q25j191J975p56j181J897o99j177J852
$$ y = [-1274, -748, 2002, -1253, -800, 2031, -1226, -842, 2018, -1185, -852, 2022, -1137, -884, 2029, -1097, -893, 2011, -1049, -959, 1992, -1056, -983, 2001, -987, -1006, 1976, -937, -1022, 1940, -895, -1021, 1952, -871, -1074, 1891, -830, -1103, 1871, -796, -1076, 1835, -764, -1106, 1829, -693, -1139, 1800, -700, -1145, 1806, -616, -1162, 1786, -582, -1178, 1719, -539, -1191, 1716, -524, -1196, 1699, -483, -1202, 1647, -428, -1234, 1634, -401, -1209, 1611, -356, -1221, 1573, -304, -1227, 1537, -262, -1227, 1494, -225, -1228, 1476, -210, -1236, 1418, -181, -1228, 1353, -145, -1204, 1316, -118, -1187, 1279, -82, -1178, 1241, -65, -1165, 1197, -20, -1178, 1139, -18, -1147, 1127, 38, -1119, 1070, 72, -1079, 1037, 90, -1105, 971, 102, -1085, 952, 127, -1064, 911, 155, -1026, 871, 172, -1005, 847]
5504H47o70j189J800n82j171J712n22j191J655m49j171J587m24j135J529l73j133
5521h80J447l03j135J418k66j120J350k22j095J290k02j028J194j28j069J136
5537C87q7j019J087l9r96J007Kr63R30K8r05Q29R1r22Q13Q7q39P27J22q34O83
5558A89J26p72O16J60p76N88J83p39N20K08p32N10K33o91M43K23o49L98K53o46
5578c55L66K90o16L11L23o13K70L16n34K07L41n51K00L34m85J29L55m86J17L51
5598B70m54O1L83m10O5L40l75J3L41l26l0L63l38m6L60l19o1L65k61q8L36k62
5620g3p5L50k61j13L43k00j36L60k06j52L45j99j66L94k21j35L24j70j61L35j74
5641Ij80L44j67j81L44j60j75L42j75j88L63j57k02L41j43j77L30j61j94L54j68
$$ y = [847, 177, -1012, 788, 206, -965, 747, 225, -966, 689, 240, -931, 656, 232, -903, 626, 253, -880, 567, 264, -871, 547, 281, -839, 511, 289, -806, 484, 282, -746, 448, 320, -749, 387, 300, -719, 368, 329, -667, 340, 342, -621, 309, 337, -568, 261, 352, -570, 243, 330, -509, 218, 340, -494, 189, 315, -457, 159, 319, -457, 131, 314, -425, 95, 303, -429, 81, 314, -377, 66, 289, -360, 38, 291, -355, 11, 301, -315, -4, 319, -294, -24, 292, -242, -35, 306, -245, -45, 289, -196, -67, 288, -198, -81, 270, -184, -123, 260, -150, -85, 255, -120, -107, 234, -92, -122, 241, -97, -143, 217, -102, -163, 202, -59, -147, 189, -73, -148, 202, -59, -172, 171, -29, -165, 195, -11, -163, 182, -17, -183, 211, -10, -145, 179, 9, -152, 183, 9, -171, 173, 6, -175, 169, 9, -166, 176, 1, -187, 176, 19, -183, 158, 15, -162, 168, 7, -187, 167, -1]
5662aj55L15j83j58L37j75j60L30j79j53L34j76j42L44k06j27L15j70j44L42j96
5683hj30L12k04j27L55k21j33L79k77q8L46k60r9L67k75j09M31l33q5M09l47o7
5705a64M31l62r0M62l99l6M39m13o5N07m73m3N34m67m4N62n47l4N79n74k5O09
5727C87n77l3O35o09l2O72o51l2P04o72k4P23p25m0P49p27k9Q07p69n6Q53p95
5749b41n7Q69q33m9R01q63p8R64r00p3R85r12j09J039r34j33J119j007j13J170
5769G45j059j14J162j052j63J260j088k02J308j113k04J387j180k33J416j163
5785b93k72J472j206l21J544j218l54J586j237l69J618j261l78J675j260m48J718
5802I96j270m85J807j330n16J835j301n55J893j347n77J959j358o34J991j344
$$ y = [-1, -156, 159, -24, -182, 155, -20, -180, 150, -29, -182, 152, -24, -166, 178, -28, -155, 160, -10, -154, 188, -8, -138, 174, -30, -157, 198, -23, -156, 223, -54, -142, 204, -56, -155, 212, -63, -172, 259, -74, -159, 250, -97, -164, 267, -95, -185, 277, -122, -158, 281, -132, -197, 310, -163, -206, 328, -139, -183, 379, -168, -202, 377, -197, -222, 387, -190, -223, 412, -197, -229, 443, -208, -240, 464, -208, -232, 491, -234, -274, 475, -252, -281, 526, -243, -299, 554, -241, -298, 571, -262, -311, 590, -273, -351, 613, -287, -360, 625, -287, -396, 643, -291, -424, 695, -312, -425, 745, -314, -428, 734, -318, -481, 779, -309, -511, 797, -316, -520, 867, -313, -546, 870, -293, -565, 907, -299, -620, 924, -294, -648, 938, -299, -668, 950, -311, -689, 986, -274, -722, 996, -274, -759, 1048, -282, -798, 1037, -264, -819, 1074, -273, -850, 1109, -249, -883, 1108, -236]
5818b36o75K062j373p39K139j396p80K178j382q26K234j402q48K271j366r27K302
5835A236j391r57K381j394j026K448j394j101K498j423j117K555j392j202K621
5850A342j389j270K659j393j310K733j390j371K742j346j445K812j339j492K837
5865A380j325j540K888j314j600K910j282j632K899j242j656K897j214j713K934
5880A390j177j807K979j136j848K997j139j882L017j123j934L049j090j985L091
5895A402j059k070L111j014k119L145j003k169L143r56k225L183r26k286L197
5910A354q74k331L183q29k380L223q25k396L205p58k479L219p21k490L195o91
5926F05k495L154o51k518L153n78k551L102n36k590L099n12k590L072m31k645
$$ y = [-236, -911, 1151, -222, -961, 1178, -218, -998, 1180, -202, -1028, 1206, -196, -1044, 1227, -139, -1066, 1236, -155, -1112, 1269, -125, -1151, 1297, -97, -1198, 1300, -123, -1240, 1315, -77, -1279, 1342, -47, -1317, 1342, -51, -1361, 1372, -18, -1389, 1353, 7, -1438, 1374, 35, -1457, 1380, 55, -1485, 1403, 89, -1511, 1399, 117, -1515, 1384, 142, -1514, 1383, 169, -1544, 1390, 213, -1594, 1385, 249, -1599, 1398, 259, -1623, 1394, 271, -1663, 1386, 296, -1689, 1402, 343, -1727, 1384, 370, -1749, 1396, 393, -1776, 1367, 411, -1814, 1369, 443, -1843, 1354, 480, -1851, 1332, 503, -1877, 1346, 521, -1875, 1330, 572, -1907, 1312, 591, -1899, 1296, 605, -1890, 1264, 613, -1905, 1248, 670, -1881, 1221, 685, -1905, 1194, 682, -1908, 1164, 733, -1912]
5942a912L034l64k629K973l49k628K940k67k651K906k52k670K871j62k691K846
5958I95j65k690K827j00k705K797r1k691K777n9k700K728K2k776K716M5k700K605
5976H35J23k749K630J41k754K576J83k733K522K50k750K451K66k701K410K80k661
5993a681K350L26k651K277L68k637K218M19k593K158M63k591K102M68k548K048
6009D96N10k522J952N75k472J886O07k460J833O16k415J770O11k313J677O53k334
6026a330J634O94k308J600P21k255J515P01k223J478P49k182J410P77k157J337
6042A61Q15k122J315P52k026J246Q15k025J157Q41j965J129Q27j894J019Q71j890
6059i74J023Q40j807R44Q22j725Q47Q93j699Q06Q64j626P20Q51j553O86Q73j487
$$ y = [-1912, 1122, 758, -1871, 1102, 753, -1875, 1065, 798, -1853, 1053, 801, -1869, 1002, 840, -1851, 995, 830, -1860, 967, 867, -1838, 959, 868, -1823, 954, 895, -1805, 923, 945, -1831, 885, 930, -1770, 835, 958, -1791, 839, 980, -1774, 802, 985, -1748, 774, 1024, -1726, 725, 991, -1710, 700, 980, -1681, 669, 995, -1656, 621, 989, -1648, 570, 989, -1604, 554, 1017, -1574, 528, 996, -1552, 496, 1006, -1516, 436, 1011, -1461, 425, 1032, -1428, 405, 1021, -1394, 376, 987, -1326, 351, 1004, -1330, 304, 998, -1310, 290, 1011, -1244, 271, 972, -1251, 227, 976, -1206, 204, 981, -1176, 161, 976, -1146, 169, 921, -1105, 141, 956, -1069, 88, 929, -1036, 93, 920, -974, 45, 916, -974, 49, 889, -918, 26, 848, -877, -30, 863, -836, -30, 834, -792, -72, 779, -774, -88, 785, -702]
6077g02O01Q62j439N58Q49j359M88Q45j323M56Q44j263M42Q20j220L75Q17j143
6095d92L10Q31j125K77Q09j037K35P91j011K04P78r70J82P76r19J39P61q46R1
6114b16P43q18O8P26p72M5P12p36K1O98o86l0O95o56l0O09n58l3N92n12r6N73
6136C39m54j32N76m41j12N27l86j52N14l49j52M71l04j64M73k92j80M41k52k06
6156b35M69k48k04M30k07j91L82j77k30L80j29k27L49j17k35L36j05k54L47o9
6176F5k67L06l9k69L17m4k32K28lk67K49O0l01K71J8k66K12L3k22J84Q3k54J78
6199D0O2k52J58R0k58J78J07k38J23J25k40J15J38k50J07J26k18Q7J50k59J03
6220fJ15j93M4J41k10P1J55k42J08J49k29P1J33j92M5J94k60P9J39k22N5J69k04
$$ y = [-702, -101, 761, -678, -120, 729, -630, -142, 703, -620, -164, 680, -583, -141, 679, -541, -166, 651, -492, -182, 649, -476, -199, 610, -427, -192, 599, -412, -208, 570, -400, -218, 558, -361, -222, 539, -307, -216, 527, -291, -223, 503, -269, -224, 488, -248, -227, 471, -215, -245, 450, -206, -236, 373, -185, -218, 374, -138, -234, 339, -115, -247, 329, -112, -224, 303, -83, -235, 279, -70, -222, 249, -55, -219, 254, -38, -218, 223, -29, -235, 234, -14, -218, 212, 5, -186, 196, 19, -211, 169, 40, -187, 162, 45, -190, 146, 41, -213, 134, 65, -202, 104, 65, -204, 113, 69, -163, 65, 62, -205, 44, 104, -197, 74, 92, -174, 38, 71, -151, 33, 116, -138, 40, 102, -150, 8, 98, -160, 18, 125, -113, 10, 135, -105, 10, 148, -102, 5, 131, -87, 0, 150, -109, -6, 109, -84, -40, 101, -109, -38, 117, -125, -17, 132, -97, -26, 107, -85, -40, 154, -106, -27, 112, -110, -55, 114, -90]
6243i0K8J90k29P7J31j99O0J57k16O6J54k35P5J42j94M5J69k46R0J43k20Q6J40
6266A24k31R7J37k28Q1J27k26P5J71k24R2J13k46J33J20k55J07J50k46J22J35
6287A28k72J40J23k66J51J24l08K14R8k83J76J23l17K02J36l43K31R3l26K13J10
6308A47l42K45J18l77K66J40m14K80J19l83K62J15m39L17J35m55L39J34m87L41
6328F1J53n29L84J50n22L53J57n08L81J72n92L93J83n78M17J87o01M32J84o28
6348c51M44J74o43M53K28o79M39K23o89M75K41p18N01K50p50M96K49p76N29K64
6368C60q12N25L07q38N39L08q81N64L57r02N51L33r15N65L64r46N96M04r93N74
6388F0M06j013N93M51j016N88M35j026N64M85j060N79M81j081N97M91j093N62
$$ y = [-90, -62, 128, -101, -24, 107, -92, -32, 125, -91, -25, 129, -106, -31, 111, -83, -38, 131, -115, -25, 118, -102, -16, 124, -107, -10, 127, -101, -20, 107, -119, -44, 127, -97, -5, 108, -138, -5, 115, -140, -33, 117, -129, -7, 128, -144, -4, 119, -147, 4, 128, -180, 34, 132, -151, 25, 148, -169, 33, 169, -174, 57, 150, -176, 37, 147, -195, 50, 168, -209, 57, 197, -217, 63, 182, -201, 61, 176, -263, 54, 189, -266, 73, 207, -280, 61, 214, -315, 69, 219, -303, 50, 207, -301, 80, 252, -340, 53, 236, -342, 75, 262, -339, 93, 277, -351, 93, 267, -376, 77, 305, -374, 65, 288, -401, 74, 315, -403, 98, 348, -402, 94, 343, -433, 96, 360, -452, 73, 380, -458, 81, 389, -492, 72, 429, -473, 78, 411, -504, 61, 425, -521, 75, 479, -514, 60, 466, -547, 46, 497, -519, 69, 504, -522, 42, 527, -533, 46, 527, -554, 43, 534, -559, 3]
6406CN44j125N83N71j149N72N88j160N59O08j180N70O12j180N52O52j242N64P13
6425F55j262N41P03j269N43P61j284N28P66j302N22Q04j318M89Q39j350N21Q53
6443G40j339M66Q89j351M61R00j370M61R22j359M08R66j371L89R72j365L81R87
6461G87j342L31J036j363L11J060j373L02J076j404K97J081j359K58J143j376
6477e35K02J150j327J94J144j331J80J164j324J12J223j308Q3J224j305P5J244
6494H65j327M0J273j289K9J285j329J1J323j307k0J321j303n4J346j282q3J368
6512H67j258j16J382j267j27J370j221j91J425j217k13J424j188k47J423j138
6528b92k74J399j113l04J425j082l56J430j054l78J434j022m03J394r59m53J412
$$ y = [3, 547, -578, 5, 576, -573, -1, 587, -573, -14, 594, -586, -16, 596, -584, -32, 620, -622, -58, 655, -607, -66, 637, -632, -89, 672, -612, -84, 682, -620, -98, 706, -612, -123, 716, -634, -113, 740, -599, -133, 756, -595, -134, 766, -604, -143, 779, -580, -172, 794, -577, -188, 784, -581, -200, 787, -555, -224, 812, -551, -240, 820, -553, -251, 825, -579, -282, 799, -560, -302, 841, -535, -333, 817, -510, -316, 828, -503, -323, 841, -483, -371, 852, -456, -373, 851, -454, -379, 865, -462, -422, 851, -438, -409, 876, -453, -442, 881, -426, -446, 875, -428, -482, 864, -418, -501, 867, -391, -507, 875, -392, -519, 851, -370, -561, 864, -353, -566, 858, -330, -577, 846, -292, -566, 833, -280, -584, 841, -241, -597, 833, -221, -599, 835, -187, -590, 804, -155, -608, 804]
6545H04r62m40J401r29m94J400r09n08J398q76n57J433q44n69J392q37n78J411
6563G36q10n89J399p78o67J401p47o48J419p41o79J410p31o77J391o63p17J351
6581F60o02p69J366n93p73J357n39q11J323n04q09J299m64q30J263m16q30J223
6599E51m15q44J249l71q49J198l55q68J195l02q67J172k97q68J121k67q64J127
6617D46k27r06J125j91q93J078k00q71J042j51q87J015j17q79R74q6q75R56n3
6636C00q86R23l7q91R22k6q93R05mq70Q68qq48Q26L8q62P96L7q25P53R0q41P22
6659A89J30q54P00J47q30O86J57q15O34J87p92N84J85p93O03J92p52N56K17p35
6679d04M93K27p22M82K58p25M84K32p08M34K72o85M12K58o35L63K95o73L67K91
$$ y = [804, -158, -598, 803, -126, -620, 780, -129, -637, 761, -115, -672, 761, -83, -652, 740, -97, -675, 736, -74, -663, 736, -42, -709, 692, -55, -703, 716, -25, -704, 706, -25, -702, 689, 26, -691, 660, 58, -711, 655, 62, -711, 646, 107, -704, 619, 115, -694, 605, 141, -689, 574, 158, -672, 551, 136, -708, 541, 170, -679, 519, 164, -704, 491, 189, -678, 494, 197, -671, 450, 183, -681, 446, 219, -687, 438, 247, -646, 432, 232, -639, 403, 252, -635, 380, 263, -616, 358, 272, -603, 353, 300, -586, 337, 300, -591, 331, 305, -588, 317, 313, -557, 311, 303, -545, 281, 319, -543, 253, 290, -535, 218, 308, -533, 189, 319, -535, 165, 312, -518, 168, 325, -490, 144, 331, -461, 123, 308, -485, 118, 310, -442, 114, 331, -404, 89, 316, -406, 76, 334, -391, 93, 325, -383, 51, 323, -362, 50, 308, -327, 36, 331, -342, 25, 316]
6699C16o51L49K88o23L47K87o06K76K90n54K71K98n65K61L03n46K33K95n13K15
6719b9L01n17K06K88m54J52L25m63J27L42m63J46K91m23R8K95l71P4L21m04Q9
6740f9K92l49L0L13l22ML00k78k6L22l03k7L30l13k3K94k66l9L08k55l4K61k12
6763f2o5K79j94p6K87k13n1K64k03r9K78j48r5K15j30r7K47j37j16K52j16j40
6785a20K71j45j30K46j03j36K45j19j56K54r9j30K33j03j43K29p9j76K70p3j64
6806a28K29q3j66K21l8j64K08l8j73K30n3j94K16j8j93K28m4j78K14k6j88K19
6828H1k0j91K05j8j53J68pj85K17o4j47J89l8j70K02k7j73K02k5j64K02n8j71
6851a45K04l5j70K21o0j84K42m4j73K21n1j86K62q0j41K31r7j55K40p0j58K33
$$ y = [316, -335, 14, 302, -321, 26, 313, -293, -17, 273, -281, -10, 288, -277, -16, 287, -259, -26, 269, -244, -29, 272, -245, -39, 249, -205, -53, 272, -191, -64, 278, -185, -39, 252, -171, -73, 222, -149, -75, 246, -158, -69, 223, -126, -96, 217, -105, -101, 199, -79, -105, 217, -86, -113, 217, -96, -119, 175, -91, -130, 178, -77, -111, 150, -62, -127, 152, -42, -118, 169, -44, -95, 169, -34, -133, 145, -3, -98, 117, -13, -110, 137, 0, -116, 136, 20, -120, 151, 6, -124, 122, 19, -117, 128, 9, -147, 107, 8, -122, 111, 8, -135, 94, 15, -161, 109, 36, -128, 101, 18, -148, 73, 35, -129, 79, 41, -132, 98, 45, -149, 67, 49, -144, 84, 40, -138, 76, 50, -138, 81, 61, -130, 75, 57, -96, 72, 65, -120, 97, 33, -114, 75, 37, -133, 69, 42, -131, 71, 46, -118, 84, 26, -145, 59, 24, -146, 75, 15, -169, 73, 29, -144, 77, 26, -160, 102, 22, -119, 112, 15, -140, 100, 30, -128, 105]
6873A05p1j66K48q2j59K54j16j48K57r1j76K61r5j67K88j26j57K98j50j55L07
6894A59j56j74L23j57j75L24j49j76L35j45j88L55j87j69L57k13j76M40k18k18
6914b08M18k23j97M38k38j98M38k41k21M35k24j97M55k42k49N03k71k18N03k75
6934a2k46M97k55k61N13k61k18M99k75k72N56k87k53N74l10l11O04k94l01O26
6954C13l22l15O55l22l29O35l18l13O59l12l49O61l34l76O94l01l73P05l32m10
6974c84P42l20m04P41l27m19P51l44m10P26l23m44P78k92n00P61k64n01P94l09
6994E2m86P93k87n09Q18k90n51Q27l05n25Q21k84n46Q42k45n83Q43k81n83Q53
7014C74k59o08Q73k68n94Q45k21o54Q93k33o70R04k21o74Q83j99p06Q95j97o83
$$ y = [105, 34, -132, 116, 34, -125, 129, 13, -135, 122, 31, -145, 116, 21, -146, 142, 16, -141, 157, 7, -148, 159, 3, -171, 152, -5, -180, 144, -5, -181, 154, 9, -179, 176, -11, -180, 177, -36, -212, 228, 10, -208, 210, -13, -210, 228, -10, -208, 230, -11, -232, 203, -21, -218, 237, -5, -254, 249, -22, -240, 263, -12, -258, 239, -16, -277, 236, -25, -243, 256, -19, -291, 265, -22, -275, 299, -11, -322, 282, -12, -313, 313, -9, -324, 331, 9, -320, 315, -3, -316, 343, 31, -318, 343, 9, -367, 327, 26, -347, 358, 26, -384, 358, 38, -366, 375, 48, -371, 380, 36, -374, 352, 29, -415, 363, 71, -429, 332, 68, -433, 361, 52, -434, 359, 72, -437, 381, 91, -460, 367, 62, -463, 358, 74, -472, 370, 125, -458, 385, 104, -479, 374, 115, -493, 380, 112, -482, 363, 142, -512, 381, 148, -522, 382, 161, -513, 370, 171, -535, 360, 163, -520]
7034e20Q78j79p39R22j92p19R07j59p43Q82j34p48R01j50p72R00j08p92R01j10
7054B26p73Q71n6q15Q72m6q31Q83o1q12Q44qq41Q27Pq38Q33M1q61P89Q1r15Q02
7077B19R0q82Q23P6q86P79J42r27P64J39r26P95J31r06P59J72r32P48J91r40P35
7098A64K18r57P24K51r60P11K63r65P27K49r48O88K83r98O74K97r42O50L16r57
7118e12O29L11r37O06L47r52N76L76r46N44M04r20N06M30r24N04M16r35M78M59
7138D60r28M79M39q99M64M47r03M21M87r06L94N35r10L66N32q75L18N50q83L52
7158f0N52q76L23N43q62L14N67q83K50O30q49K39N86q05K06O00q24K00O34q27
7178c42J92O12p95J68O21p69J48O13p65J33O52p52J09O37p31N6O43o93M9O49o58
$$ y = [-520, 358, 179, -560, 362, 170, -549, 358, 199, -544, 338, 204, -544, 357, 207, -565, 335, 227, -565, 336, 226, -547, 324, 268, -547, 325, 279, -552, 331, 270, -542, 302, 294, -547, 280, 287, -551, 282, 323, -538, 251, 332, -583, 219, 309, -573, 250, 326, -560, 219, 361, -566, 198, 337, -589, 206, 337, -569, 190, 362, -570, 178, 369, -571, 164, 382, -575, 149, 400, -560, 151, 414, -551, 176, 425, -523, 165, 448, -550, 124, 421, -521, 129, 445, -512, 117, 428, -509, 97, 444, -508, 68, 444, -502, 42, 446, -474, 32, 462, -462, 42, 458, -477, 1, 460, -468, 11, 450, -449, 15, 462, -441, -20, 467, -439, -45, 490, -420, -54, 478, -397, -79, 471, -412, -60, 492, -384, -61, 482, -380, -66, 501, -382, -132, 498, -351, -112, 474, -331, -125, 475, -349, -149, 485, -342, -150, 462, -333, -165, 456, -313, -165, 448, -317, -184, 468, -284, -175, 462, -269, -213, 430, -263, -214, 435, -223]
7199b23J3O49o55MO50o27j7O47o40JO28n95m4O35o12o7O63n57j14O71n77o8O32
7222C97n43r6O31n18j27O41n16j12O28n21j29O17m74j30O00m48j80O14m22j59
7242b47N85m23j82N86l91j93O01l98j91N63l31k42N76l42k23N62l14k32N20l19
7262c5k24N18k81k29M97k30k63M76k12k70N03k36k71M55j91k57M48j77k70M75
7282B26j78l09M41j37k72M14j43k62M19j28k82L89j20k54L44r3k79M00r5k92L67
7303A56q2k44L32q2k58K84qk87L07m6k56K81k7k67K75J2k88K78J8k70K42J2k68
7326a86K38L8k53K13N7k64K02O9k90K13O5k38J69P8k38J66P4k41J71Q0k42J43
7348B4Q9k42J33J01k15J08J14j94J09J00k04O5J24k02Q6J37k19P8J26k07R0J18
$$ y = [-223, -210, 439, -216, -212, 438, -189, -206, 441, -199, -198, 430, -165, -209, 426, -186, -253, 410, -147, -261, 410, -167, -235, 397, -146, -242, 389, -129, -256, 385, -131, -243, 385, -136, -265, 352, -122, -252, 348, -100, -280, 334, -88, -247, 338, -85, -267, 319, -72, -265, 336, -62, -253, 310, -21, -263, 313, -29, -252, 310, -4, -236, 284, -35, -259, 259, -22, -251, 246, 16, -247, 229, 17, -253, 250, 14, -257, 198, 7, -250, 198, 21, -249, 226, 48, -261, 180, 43, -229, 185, 42, -220, 199, 71, -211, 178, 58, -196, 148, 55, -224, 176, 81, -211, 156, 74, -170, 162, 80, -178, 106, 98, -189, 118, 72, -184, 97, 70, -197, 78, 90, -198, 80, 98, -172, 70, 82, -186, 52, 90, -163, 50, 107, -157, 45, 114, -176, 37, 102, -136, 33, 111, -127, 39, 113, -128, 43, 123, -119, 24, 113, -129, 4, 105, -110, -2, 112, -82, 27, 127, -77, -12, 112, -90, -4, 133, -86, -8, 118, -89, 1, 119]
7370A19k16Q1J20j81O0J39k00M3J25j73M7J28j75M6J20j43M0J40j86L1J47j43
7392c1jJ51j46K1J37j98J7J66j75J7J50j71J7J71j68j1J55j49MJ41j59NJ50j70
7416g7K4J35j54nJ60j32J0J39j56JJ39j40rJ72j52j6J82j48k3J61j61NJ68j65
7440d2J3J46j54jJ50j69K2J63j89M2J36j70J4J58j69OJ73j97L8J48j75mJ81j88
7464f8K1J44j73L3J61j97N4J51j87J4J84j96K2J63k22O2J63j95L4J84k08L6J70
7487A50k11L3J66k18O5J77k37M9J97k51L9K11k94P0J94k78J05J99k74N8K30k98
7509a18P0K19l18J12J94k91P8K10k97P1K75l41Q2K55l40R4K42l40P8K74l33Q6
7531c8K50l40P8K91l79J02K73l73O7L20l81N6L50m23N2L43m06O8L55l93K5L47
$$ y = [119, -97, -16, 104, -77, -17, 122, -78, -35, 90, -83, -36, 92, -83, -37, 83, -60, -20, 120, -66, -35, 112, -31, -32, 119, -27, -6, 131, -67, -50, 116, -59, -42, 108, -63, -46, 125, -43, -54, 101, -48, -44, 97, -62, -57, 93, -77, -53, 82, -72, -77, 83, -49, -39, 100, -56, -55, 84, -56, -65, 107, -45, -61, 121, -27, -50, 111, -50, -45, 123, -42, -29, 117, -37, -38, 112, -57, -35, 128, -61, -19, 117, -53, -39, 119, -50, -44, 129, -68, -30, 118, -57, -61, 120, -68, -47, 97, -76, -43, 118, -79, -25, 126, -61, -47, 137, -59, -37, 126, -96, -34, 129, -66, -32, 152, -56, -20, 150, -61, -28, 138, -80, -15, 162, -75, -26, 171, -80, -41, 170, -124, -54, 140, -138, -33, 166, -108, -50, 180, -118, -48, 171, -147, -35, 159, -132, -54, 156, -141, -70, 205, -136, -54, 201, -139, -45, 197, -143, -65, 209, -124, -38, 212, -128, -50, 241, -138, -36, 237, -136, -69, 251, -130, -74, 276, -147, -95, 248, -158, -90, 265, -128, -103, 244]
7553B44m09O9L66m40N9L92m47N4L89m67P9M01m59K2M31m40L3M09m61M1M18m71
7575a87N4M24m77L6M56m68J3M87n03KN14n09k1N35m98k8N15m98l1N53n30m5N72
7598C66n28l6N80n49k8N83n48p2O14n43r0O33n32j05O17n10o4O12n53j01O73n48
7620a29j35O60n18j21O67n51j32P05n68j70P23n55j42O96n47j57P15n65j59P30
7640D47n46j99P45n63k26P80n40k34P77n41k59P90n20k86Q02m98k90P80n11l04
7660c96Q10m88l36Q28m70l25P75m45l72Q73m81l65Q16m73l48Q48m64m10Q64m53
7680a2m05Q38m05m39Q63m38m22Q74m33m45Q25l89m64Q70l88m75Q37l62m67Q41
7700D04l74m90Q80l59n14Q60l46n22Q71l61n34Q82l40n16Q43l08n25Q48l27n22
$$ y = [244, -165, -96, 270, -170, -111, 281, -166, -112, 277, -190, -111, 290, -169, -147, 284, -156, -123, 286, -175, -134, 284, -187, -133, 291, -186, -150, 306, -162, -149, 338, -165, -163, 351, -158, -179, 356, -142, -170, 345, -153, -184, 369, -161, -206, 366, -162, -198, 382, -167, -195, 388, -160, -232, 382, -161, -251, 382, -150, -255, 362, -148, -212, 400, -153, -254, 419, -129, -264, 396, -122, -243, 424, -127, -259, 446, -122, -292, 431, -124, -266, 430, -117, -274, 441, -124, -283, 447, -99, -298, 447, -116, -342, 438, -102, -336, 441, -100, -359, 431, -89, -375, 427, -71, -361, 419, -92, -396, 414, -74, -410, 418, -52, -377, 398, -47, -419, 454, -27, -392, 424, -49, -397, 451, -13, -423, 441, -12, -417, 421, 16, -423, 440, 2, -420, 454, 21, -424, 401, 12, -452, 418, 30, -445, 392, 30, -437, 404, 30, -460, 420, 61, -453, 407, 61, -461, 410, 49, -485, 397, 57, -459, 384, 76, -449, 399, 72, -450]
7720d50Q48l12n29Q28k80n57Q27k73n87Q39k35n85Q15k37n76P89j80o02Q11k15
7740A39o12P71j74n85P83j87o01P60j66n90P49j32o19P52j32o23P47j13o28P38
7760B77p9o59P34r7n93O72p2o19O97m1o38O63k5o25O61l9o48O54Po39O30lo21
7783d03O26l3o01O03M2o20N77L6o31N72N9o12N34N8n95N31P2n96N20O9n73M88
7805A23J12n98M76J04n57M41J12n63M47J45n78M34J20n62M27J23n14L90J47n31
7825c02L84J55n27L59J38m94L37J74n24L43J78m73L06J59m68K75J78m45K75J75
7845B03m40K45J88m69K79J95m24K39J77m09K03K17m23K25J80l93J96K30l79J31
7865b9K46l86J63K46l97J35K39l54J22K34l40Q3K50l48P7K48l18Q0K41l07O1K22
$$ y = [-450, 398, 86, -443, 385, 105, -452, 375, 102, -485, 354, 119, -466, 349, 112, -464, 325, 145, -457, 354, 139, -473, 298, 124, -461, 322, 135, -466, 294, 128, -462, 287, 155, -464, 288, 156, -467, 280, 167, -461, 277, 198, -461, 273, 176, -417, 255, 183, -436, 261, 220, -418, 245, 220, -405, 256, 217, -431, 223, 230, -409, 221, 218, -403, 223, 190, -411, 192, 234, -386, 191, 227, -404, 168, 227, -385, 149, 207, -388, 143, 215, -381, 139, 208, -365, 123, 235, -363, 113, 217, -340, 101, 213, -350, 97, 242, -336, 98, 218, -344, 83, 206, -308, 82, 229, -302, 82, 237, -290, 69, 207, -287, 50, 224, -300, 43, 221, -252, 54, 213, -255, 20, 198, -247, 28, 203, -237, 8, 196, -273, 6, 201, -223, 16, 193, -216, -13, 204, -219, 6, 186, -207, -11, 219, -160, -29, 217, -169, -6, 240, -157, -22, 217, -137, -15, 219, -121, -38, 212, -136, -59, 189, -129, -49, 192, -115, -54, 168]
7887A68k70M5K46k97N7K13k89Q6K07k70K9K09k41M6J90k23L1K06k16MK03k04K8
7910d2J86j85j4J75j69m3K34j70n1K18j27l9J85j72o5J92j39o6J91j25p3K15j15
7933Ar5K07j26q8J94j03r4K04j26p3J76r2n8J58q8j13J93p5j01J71p2o8J44m7
7957B9q4J48p4j32J88m8j00J63m7j13J26l5r9J63n6p9J06oj31J33j6j22J33%j31
7982h4J35l9j01J24k2j32J58pj30J28j0j19J11J9j13J03Nj28J60j7j34J33qj21
8006h9J19J6j19J13J0j14J18Nj45J39j8r1J05%j09Q6J4j10J31pj24J04mj12J06
8031B4K3j19J16oj39J41j4j23J30Jj30J38k7j16J24K6j52J49j5j23J54j9j16J19
8055D6Rj36J41Kj58J68k9j31J59l5j43J54J6j71J85k6j63J75k3j39J61j7j74J73
$$ y = [168, -102, -57, 189, -108, -51, 162, -127, -41, 166, -104, -75, 134, -107, -61, 129, -94, -63, 143, -73, -69, 134, -70, -42, 144, -41, -55, 120, -49, -92, 142, -28, -79, 139, 12, -27, 158, -14, -79, 113, -26, -92, 99, -26, -99, 116, 1, -94, 113, -13, -101, 93, -10, -104, 100, -26, -99, 77, -15, -73, 85, -3, -116, 77, 2, -99, 72, 0, -68, 76, 29, -55, 93, 19, -113, 75, 27, -73, 90, 43, -70, 56, 21, -78, 85, 29, -50, 56, 50, -81, 52, 36, -86, 47, 47, -84, 51, 12, -89, 35, 13, -119, 39, 32, -98, 30, 20, -99, 12, 31, -82, 21, 26, -102, 58, 41, -93, 40, 32, -89, 30, 46, -73, 40, 50, -64, 54, 59, -86, 53, 35, -56, 49, 49, -60, 26, 40, -70, 61, 54, -70, 34, 30, -82, 24, 47, -72, 44, 38, -101, 40, 26, -97, 33, 34, -96, 42, 15, -101, 23, 49, -103, 46, 31, -92, 62, 43, -73, 46, 55, -81, 60, 62, -96, 72, 43, -88, 71, 36, -107, 47, 63, -108, 77, 51, -112, 63, 40, -99, 62, 45, -129, 44]
8079D4%j71J83j2j55J70k8j44J86p0j43K11l6j58J87l4j77K20k4j99K33l4j64
8102a15J85l1j70K32l6j99K40n9k03K73o5j78K26l9j99K48m7k08K89n5k45K74
8124A18m8k46K73m4k15K90m7k49K62j2k68L07k8k88K85j2k72K95k5l01L38k5k83
8147a95L24k6l10L30j2l44L61pl40L93o5l29L49Kl74L83j3l60L72j3l64L64Kl78
8171b50L62ml91L82Ql65L53K1m05L87K4l82L76J9m18L87N8m42L85L6m16L92O2
8194A79m49L91M1m37M14N8m57L77J00m85L82R4m90L97Q3m95M00J01n03M05Q4m88
8216b98M05J20n04L92J15n53M11J04n31M27J27n60M15J44n26L99J45n48L96J70
8236B50n48L84J55n65L99J58n67M13J52n60L76K35n80L72J96n81L80J86n67L55
$$ y = [44, 44, -127, 56, 44, -111, 59, 31, -113, 73, 3, -140, 71, 35, -123, 64, 30, -147, 73, 49, -150, 83, 49, -115, 70, 39, -131, 101, 65, -134, 106, 47, -156, 117, 52, -126, 100, 61, -138, 110, 63, -145, 144, 89, -156, 118, 70, -176, 97, 53, -162, 128, 81, -168, 94, 82, -186, 121, 93, -195, 90, 78, -194, 101, 76, -225, 113, 88, -195, 129, 103, -207, 123, 111, -233, 128, 121, -219, 174, 109, -220, 129, 131, -243, 140, 127, -233, 139, 126, -238, 126, 128, -250, 112, 108, -283, 99, 107, -258, 95, 116, -289, 98, 122, -260, 116, 135, -283, 104, 162, -280, 105, 141, -275, 117, 179, -270, 121, 162, -275, 139, 197, -260, 117, 217, -268, 114, 208, -282, 115, 198, -297, 103, 204, -299, 106, 190, -298, 107, 227, -277, 115, 230, -323, 88, 192, -339, 88, 215, -345, 70, 214, -312, 87, 232, -316, 80, 250, -298, 86, 241, -324, 75, 233, -334, 79, 231, -329, 47, 282, -298, 74, 270, -311, 69, 255, -312, 43]
8256D3K31o04L74K34n80L21K51n83L52K41n74L32K19n56L20K37n81L37K41n58
8276c03L37K59o04L16K66n90L23K63n82L25L02o04L24K65n77K67K83n42K88K61
8296B77n45K73K82n43K83K74n40K44K96n48K22L05n42K61K98n56K34L25n36K30
8316fK84n20K21K84n11K03L10n09K04L38n31J86L19n11J87L21m78J46L40m73J23
8337g3L31m51J13L70n03J38L49m56J06L56m38R9L17m12R5L24m20Q3L21l96O0L44
8359B57m11P3L39m06P8L19m11P0L30l71M7K97l47M6L21l61K6L33l57L7L27l28
8381i2%L22l22kL18l05lL03l03pK78k41l5L04k56l6K69k31p0L08k31q0L12k28
8405b8r3L16k55m6K71k05p6K64j72q5K70j81r0K57j90q7K71j61r1K53j74p6K26
$$ y = [43, 274, -330, 44, 278, -302, 19, 270, -313, 39, 280, -294, 38, 257, -299, 21, 258, -323, 14, 255, -303, 34, 293, -311, 5, 271, -319, 4, 267, -315, 10, 312, -292, 32, 297, -280, -13, 270, -272, 16, 277, -268, 5, 287, -256, 27, 301, -239, 5, 301, -247, -25, 280, -262, -1, 297, -259, -25, 300, -236, -6, 278, -242, -21, 263, -248, -45, 265, -244, -40, 298, -233, -47, 272, -239, -52, 269, -209, -63, 277, -196, -73, 258, -193, -80, 290, -213, -75, 274, -182, -76, 280, -158, -59, 258, -154, -59, 265, -155, -72, 249, -147, -87, 257, -154, -81, 258, -148, -70, 249, -162, -92, 238, -133, -86, 211, -136, -90, 231, -130, -104, 229, -128, -91, 236, -92, -92, 230, -92, -94, 224, -81, -84, 219, -84, -91, 187, -54, -89, 215, -41, -77, 192, -39, -109, 199, -32, -112, 200, -28, -121, 195, -60, -106, 165, -40, -116, 148, -24, -109, 161, -20, -110, 147, -43, -130, 141, -20, -111, 142, -32, -108, 118]
8428A18j45p4K23j30q8K22j27r0K29j19j12K17j24j01K06o4j31K07r0j27K25q8
8450C7j14J85p6j22J67n4j11J50o1j20J86n4j33J87l9j24J40Kj39J52j2j36J32
8473D3k1q6J19nj30J23J4j31J10K6j24Q6L9j22R4L5j30Q3K5j13R8M1j33Q1N9j34
8499e3O7M5j25N9O8j46Q5M8j42Q1M0j05O3O9j11N5P0j31N6P0j29N7Q0j16L0P1
8525E6r9L4R8j20L1R3j15PJ06j02J0J00j12J9R6j29QQ3j12M8Q2r7RP6j06J9Q7
8552G0r7J7R6j24rJ11r7KJ03j18LJ01j02jJ15q9k7R6o8l8J09o3qQ2o1l3Q3n0l3
8581c0J05n7n4J18r2m0J20p0m0J04r1j3R6p3k2J27j18k9J44r9m0J25p4p7J29n5
8607fl7R0o1n1J29r7l4J26q2l3J37p6l4J20j09k0J06p9k3J04o1m9J31j03jJ21
$$ y = [118, -27, -101, 122, -8, -96, 126, -1, -91, 138, 19, -93, 124, 0, -101, 105, 41, -90, 117, 27, -100, 125, 37, -77, 108, 32, -90, 77, 23, -88, 62, 1, -119, 67, 13, -120, 67, 28, -96, 44, 46, -93, 59, 47, -89, 43, 22, -64, 55, 50, -80, 43, 57, -74, 36, 62, -62, 24, 63, -59, 35, 70, -60, 23, 48, -65, 33, 74, -59, 22, 81, -53, 14, 59, -66, -7, 61, -85, 0, 48, -94, -13, 27, -78, -15, 54, -57, -2, 68, -63, -7, 63, -66, -9, 71, -45, -15, 56, -43, -9, 89, -31, 0, 93, -22, -15, 91, -11, -1, 99, -13, 6, 102, -27, -19, 64, -48, 0, 82, -15, -6, 70, -36, -17, 70, -27, -10, 86, -38, -47, 64, -33, -31, 72, -46, -43, 58, -44, -45, 70, -19, -46, 50, -18, -56, 53, -10, -18, 64, 3, -30, 53, 3, -30, 75, 18, -36, 82, -10, -50, 70, 0, -40, 64, -27, -40, 56, -17, -39, 88, -30, -59, 85, -14, -54, 71, -3, -80, 49, -6, -43, 47, -14, -65, 64, -33, -67, 59, -23, -56, 81, 5, -29, 91, -18, -38, 68, -11, -34, 70, 9, -40, 91, -12, -13, 108]
8633A08q5k9R6j05oJ13j07l5J31j17k0J44j20j4J10p2n9J36r6k5J35j08l0J31
8657G6j26k1J57j28nJ28j10j4J38j21k5J49j29k5J57j24l3J58j42j4J65j52PJ67
8681A33j53l6K02k01jJ91j64j2J64j55k6J59j80RJ84j71j7K20k14j5J99j64j5
8704f3J80j90jK06j81k8J97j68J0J88j96k6K09j95j1K30k41kK50k19k0K47k31
8727e5l8K45k10k9K51k11j7K45k43k6K59k35m5K69k46k5K77k39l7K78k47j5K66
8750A72k51k3K69k49l6L06k47o7L17k97l0L24k73k5L15k95j0L08k91k2L22k81
8772f4m0L04k40p6L51k92o9L49l03n2L56k71p8L48l04l1L24k87q0L73k48j43L87
8795B14k88q4L63k50q6L60k64j27L66k88p9L99l03r3L76k66j13L92k65j19L86
$$ y = [108, 23, -6, 90, -15, -21, 92, -15, -50, 81, -36, -56, 88, -32, -46, 64, -8, -67, 69, -27, -52, 83, -25, -55, 76, -50, -71, 86, -42, -47, 81, -29, -43, 95, -26, -51, 98, -31, -56, 101, -23, -56, 102, -40, -54, 111, -41, -34, 133, -20, -56, 146, -55, -56, 135, -29, -41, 123, -32, -58, 101, -79, -70, 114, -57, -74, 146, -68, -83, 116, -48, -63, 117, -73, -74, 132, -49, -77, 120, -48, -38, 150, -46, -72, 137, -58, -69, 161, -80, -82, 168, -51, -71, 176, -55, -93, 152, -58, -87, 164, -47, -64, 181, -62, -88, 171, -64, -109, 160, -86, -111, 166, -73, -110, 168, -79, -94, 172, -79, -102, 167, -82, -118, 188, -59, -126, 191, -106, -136, 188, -85, -110, 205, -90, -100, 208, -83, -105, 217, -64, -104, 200, -40, -116, 235, -57, -126, 223, -80, -132, 224, -47, -125, 223, -81, -112, 212, -75, -155, 218, -30, -173, 214, -74, -158, 205, -45, -131, 229, -35, -162, 204, -84, -163, 236, -67, -160, 216, -50, -163, 229, -36, -155, 231]
8816B31k66j39M34k89j23L78k60j44L93k58j32M12k70j52M16k56j85M16k42j40
8836a76M02k73j36M13k55j93M27k31j75M10k12k01M27k54j91M41k44j57L89k22
8856a1j89M37k33k21M45k15k24M47k01k34M36j70k70M27j89k53M48j96k31M09
8876B12j57k63M10j59k51M19j52k80M15j60k65M09j45k61M18j39k86M11j33k74
8896b31M14j25k77L87j35k53L96j25k54L56p2l16M14j16k67L75p7k88L61q7k67
8917a87L67q3k69L45m5l42L56m5l11L58l8k97L50n0l33L60m5l13L30j0l08L21
8939A11jl11L22Ll02K83j4k98L21mk86K94Kl02K81K1l17L00Jl06L11J2k77K51
8963I5K4k98K80L5k83K26M9l09K52N7l11K33P8k84K13N7k85K29P6k90J88P2k77
$$ y = [231, -35, -174, 260, -29, -152, 226, -34, -178, 215, -43, -175, 237, -33, -185, 231, -25, -210, 206, -36, -176, 226, -47, -183, 230, -25, -218, 209, -22, -197, 213, 1, -200, 227, -27, -218, 223, -21, -178, 211, -11, -200, 237, 4, -217, 228, 13, -211, 236, 35, -199, 237, 67, -203, 224, 35, -218, 230, 34, -197, 212, 55, -208, 202, 43, -208, 211, 59, -221, 194, 34, -231, 178, 33, -228, 190, 51, -235, 176, 43, -231, 183, 58, -219, 168, 33, -220, 176, 51, -203, 153, 81, -235, 179, 63, -204, 171, 94, -194, 167, 80, -187, 180, 97, -172, 173, 128, -214, 142, 97, -214, 144, 106, -191, 159, 109, -224, 136, 91, -222, 108, 98, -210, 111, 110, -201, 121, 124, -178, 105, 91, -207, 114, 110, -176, 118, 120, -182, 99, 120, -197, 103, 104, -202, 109, 121, -156, 95, 119, -179, 101, 136, -147, 79, 128, -181, 71, 128, -183, 50, 128, -156, 57, 114, -171, 58, 134, -156, 32, 104, -173]
8986a73K05O8k67J94J00l11K11R5k78J98Q1k53J52J17k74J58J20k71J48J11k56
9007a25J29J33k56J46J46k74J32J02k51J26J37k33P2J35k09J00J16k34J15R1j99
9028a01Q2J29j96P9J17k24J01J39k22P9J30j97N2J37j75M2J32j94P4J14j73N6
9050a9J24j52LJ55j62L9J38j80M2J29j44kJ24j36K2J28j65MJ47j35MR3j21J2J15
9075F3j07J1J16j28k7J50j25oJ32j06k4J12r2j9J16j05J9J04j18JJ08q8k1J19
9099H5r0k2J04m8o7J18q0k9J20o5n9R7n0n7J24m6p4J20o0p6R5n7l8J03l2o3J09
9126F2n8o4J07l1m3Q4k2o5O7l8m2Q7l2n7R3j0q1J08l5q4J01rr4J25m9j9N5j3q3
9155d0P4mm4P2k0o4Q7k8p3Q4nr5P3op4J02l5n4Q7lq3N8J4o0P2j3p7P7Jp8R6j7
$$ y = [-173, 32, 100, -167, 27, 127, -184, 27, 122, -156, 42, 123, -130, 22, 139, -135, 23, 143, -128, 20, 131, -125, 4, 137, -119, 27, 173, -101, 31, 133, -118, 8, 145, -88, -16, 119, -90, 10, 126, -108, 7, 98, -101, -19, 110, -86, -7, 110, -114, -13, 126, -96, -17, 113, -84, -32, 105, -70, -28, 104, -90, -16, 98, -75, -19, 105, -47, -44, 111, -51, -12, 126, -54, -12, 117, -27, -29, 95, -41, -19, 109, -56, -52, 95, -40, -36, 57, -64, -52, 63, -44, -33, 83, -45, -72, 78, -47, -53, 79, -27, -51, 61, -31, -50, 66, -39, -20, 84, -34, -33, 75, -13, -34, 85, -5, -27, 77, 29, -38, 80, 0, -29, 91, 26, -33, 64, 14, -43, 81, 35, -39, 81, 21, -55, 40, -17, -55, 48, 16, -47, 62, 4, -60, 47, 16, -27, 57, 35, -30, 37, -1, -43, 44, 12, -45, 48, 38, -43, 65, 30, -54, 47, 38, -56, 69, 20, 1, 56, 43, -40, 34, 30, -14, 58, 38, -26, 61, 33, -40, 44, 39, -56, 17, 11, -63, 39, 4, -50, 37, 34, -49, 9, 23, -37, 35, 22, -55, 22, 23, -55, 41, 24]
9187B4m9P8qq5R9j6p0Q3m0k5N1jo5Q8l3n3O2K1p3O3%q5Q8k3m4N9Qp2N6j0p6P1
9219B3j9o4O9Qp9Q7rn9Q4pq7Q4j3p5P3ko9J09k8r9J03J4q4R5k2m3N3j4o6P9jp9
9251c8P1j7n9P7Jq2Q5J8j06R0j7p9Q7j9q2R2J3j20J15j8o1P1lr1Q4K6j10J15l4
9280Io4Q9oq1R2pr1R0Qr0R9kj06J41m6r3J25k0j06J14j9q4J01j2j10J29j7j04
9308f1J07j6j04J12J1j36J40k4j15J24j9j01Q0L8j24J04J6j33J39k1j15J36lj19
9332h4J32J7j40J22Lj16J26%j38J26K7j32J08oj38J55j1j52J49Qj57J45J7j34
9356g3J17K5j75J31L8j47J28J4j63J36K6j86J53J8j66J50O1j73J12P0j86J26O1
9379I7j89J25O2j71J06N6j72Q9Q5j76J00Q4j61Q5Q3j89R2J09j86Q1R1j91J02Q8
$$ y = [24, -25, 53, 45, -40, 59, 43, -27, 56, 16, -9, 42, 41, -24, 64, 31, -22, 40, 61, -12, 51, 51, -34, 54, 31, -13, 46, 54, -18, 38, 28, -48, 23, 4, -60, 9, 17, -62, 25, 16, -43, 41, 34, -53, 31, 18, -57, 16, 14, -55, 54, 26, -73, 30, 44, -40, 55, 33, -10, 43, 29, -37, 42, 41, -38, 33, 16, -43, 34, 35, -47, 38, 56, -50, 40, 23, -56, 31, 12, -70, 22, 35, -85, 30, 12, -49, 22, 19, -72, 12, 38, -72, 43, 9, -55, 34, 28, -53, 39, 32, -59, 31, 39, -51, 48, 46, -60, 81, 35, -58, 67, 47, -59, 55, 36, -48, 53, 41, -69, 60, 43, -61, 46, 30, -74, 38, 49, -87, 53, 29, -86, 38, 19, -82, -2, 36, -88, 16, 32, -101, 38, 17, -98, 38, 35, -84, 48, 65, -75, 47, 50, -66, 60, 60, -78, 48, 75, -57, 51, 45, -93, 62, 51, -101, 48, 56, -101, 44, 61, -73, 44, 69, -106, 25, 63, -84, 44, 58, -105, 31, 57, -129, 24, 42, -124, 26, 87, -86, 26, 96, -90, 36, 97, -92, 33, 95, -76, 30, 86, -86, 3, 88, -88, 12, 96, -65, 20, 103, -86, 6, 115, -71, 10, 101, -90, 12, 100]
9403A00k10J07R8k15J03J05j89R0J12j75P8R2j80Q3J09k17J01J01j91Q9J20k17
9425a06J14R7j83R1J16k17R1J29k06M8J54k00P4J38k21Q1J36k07L7J83k31O5J41
9448A24k18O2J49j88M0J51k15P8J27j87J5J93k03K7J56j94K5J55j86M5J61j97
9470h0K8J86j95L1J59k09N1J65j99J1J87j72PJ75j93OJ84j76l5K13j97nK17k19
9494f0K1J68k08L5J50j75oJ95j78k7J90j76j0J93j62m1J89j59j4K13j65n8K07
9517A22j59m6K08j68l8K05j51m0J95j43m6J90j46m2J94j27p7J86j12o8J87j41
9539a7p9K13j11p6J95j33p7K08j21j04J80q5q8K00j21r6K03j08q6J83p5q8J71
9562H8p9j18J95r0j07J92o3j36J95q0r7J96p6r7J59n4j26J69m1j10J76q2q0J49
$$ y = [100, -110, -3, 95, -120, -17, 88, -101, -11, 101, -74, 4, 96, -84, -1, 108, -109, -8, 93, -98, -9, 111, -106, 8, 105, -78, 13, 129, -88, 3, 132, -74, -26, 128, -72, 2, 140, -81, 0, 136, -71, -34, 149, -82, -17, 124, -94, -32, 117, -71, -31, 120, -95, -17, 110, -77, -62, 131, -72, -45, 111, -83, -58, 97, -89, -44, 117, -80, -52, 134, -61, -30, 129, -80, -29, 136, -63, -52, 135, -37, -30, 145, -48, -42, 142, -34, -69, 144, -53, -58, 159, -60, -39, 129, -79, -44, 106, -69, -75, 120, -58, -85, 105, -71, -81, 112, -50, -91, 98, -61, -75, 138, -27, -85, 122, -37, -83, 125, -43, -81, 124, -27, -67, 128, -15, -61, 129, -17, -59, 135, 8, -69, 117, 5, -63, 124, -17, -96, 117, 6, -70, 125, -8, -85, 123, 2, -102, 78, -7, -95, 105, -16, -112, 91, -17, -103, 80, 5, -83, 88, 9, -109, 86, -4, -111, 81, 18, -118, 77, -3, -100, 96, 20, -77, 82, 28, -98, 71, 30, -80, 96, 14, -66, 83]
9586H3o2j26J59kj39J34l4j32J78m9j11J36j9j02J40l5j30J42k0r9J27k8j19J44
9610C6Mj35J34nj20J27k4r4J07J8r4R6Qj16J00J1j01P5Rq5P5J4j03R6J1j28J17
9637C3J4j29J18Kj14Q6K4j09P2O0j17N0L0p0M6L8j44P0O9j06P5K7q0O5K9j08O4
9664eO4j41R3L0j10P1N5q2L2N6j11N6N7q7L1N8r7L7M7r3M7L6o4jN9q4L5M5m8J6
9694BL8o4J6L7q1L4L9n4qP6o5PN4o4K3P0q2L3L9o7nR2r7PO2m2k4Q6o1k1O8o4J8
9727BJ3k7PN3p8JM2k8j8O7m8j9O8l5o0J00p8KP9o3j6O6n4k7P5p1LQ6p1jO7o2r
$$ y = [83, 21, -105, 54, 52, -87, 47, 13, -119, 59, 10, -101, 35, 16, -86, 54, 19, -111, 31, 11, -88, 39, 11, -108, 36, 40, -95, 39, 34, -86, 41, 17, -77, 30, 48, -46, 50, 58, -58, 42, 53, -48, 27, 36, -49, 26, 40, -63, 33, 44, -84, 33, 47, -82, 36, 38, -76, 10, 34, -75, -3, 57, -60, -10, 20, -50, -4, 34, -110, -40, 29, -77, -2, 25, -55, 10, 39, -69, -5, 59, -82, 11, 41, -69, 2, 57, -25, 7, 63, -48, 8, 65, -22, 9, 67, -30, 7, 54, -39, 8, 44, -20, -21, 38, -46, -11, 34, -14, 2, 40, -24, -8, 29, -52, -18, 21, -33, -41, 35, -30, -23, 31, -33, -10, 60, -22, 11, 50, -17, -22, 70, -27, -20, 42, 0, -24, 62, 1, -20, 48, -16, 2, 15, -12, -5, 48, -30, -29, 13, -15, -33, 34, -14, -33, 35, 0, -60, 40, -38, -36, 43, -20, -36, 30, -24, -51, 24, -47, -44, 42, -29, -30, 37, -25, -34]
$$ [...]
16381@Jp
16383f
##END NTUPLES=NMR FID
##END=
