##TITLE=abcd
##JCAMPDX= 6.0         $$ Bruker NMR JCAMP-DX V2.0
##DATA TYPE= NMR SPECTRUM
##DATA CLASS= NTUPLES
##ORIGIN= UXNMR, Bruker Analytische Messtechnik GmbH
##OWNER= root
$$ XWIN-NMR		Version 3.5
$$ Wed Aug 13 12:37:31 2025 Russian Standard Time (UT+4h)  servis@DPX200
##.OBSERVE FREQUENCY= 200.131235884673
##.OBSERVE NUCLEUS= ^1H
##.ACQUISITION MODE= SIMULTANEOUS
##.ACQUISITION SCHEME= undefined
##.AVERAGES= 32
##.DIGITISER RES= 18
##SPECTROMETER/DATA SYSTEM= spect
##.PULSE SEQUENCE= zg
##.SOLVENT NAME= CDCl3
##.SHIFT REFERENCE= (INTERNAL, CDCl3, 0, 16.4885)
##AUDIT TRAIL= $$ (NUMBER, WHEN, WHO, WHERE, WHAT)
$$ ##TITLE= Audit trail, XWIN-NMR		Version 3.5
$$ ##JCAMPDX= 5.01
$$ ##ORIGIN= Bruker BioSpin GmbH
$$ ##OWNER= servis
$$ F:\spectra/data/av/nmr/H1/1/pdata/1/auditp.txt
$$ ##AUDIT TRAIL=  $$ (NUMBER, WHEN, WHO, WHERE, WHAT)
(   1,<2025-08-13 12:36:55.96 +0400>,<servis>,<DPX200>,
      <created by zg, POWCHK disabled, PULCHK disabled
       configuration hash MD5:
       00 E9 B6 7A A2 85 ED C7 34 08 36 98 17 FE 4E 26
       data hash MD5: 32K
       24 12 72 61 DC 94 5B BF 91 27 EF CF 97 7A 24 7C>)
(   2,<2025-08-13 12:36:57.62 +0400>,<servis>,<DPX200>,
      <Start of raw data processing
       efp BC_mod = 2 LB = 0.05 FT_mod = 6 PKNL = 1 PHC0 = -199.0202 PHC1 = 0.101552 SI = 16K 
       data hash MD5: 16K
       AB D2 7A 17 09 FF 6B 16 B7 27 60 16 D5 2B 04 D8>)
(   3,<2025-08-13 12:37:08.93 +0400>,<servis>,<DPX200>,
      <pk PHC0 = 2.8 PHC1 = 0 
       data hash MD5: 16K
       24 DE 2E D5 47 23 C8 52 5B 63 10 06 36 B2 CA BE>)
$$ ##END=
$$ 
$$ hash MD5
$$ 23 71 57 F4 73 7C D0 08 AB 46 A6 86 98 90 7B C1
##$RELAX= 
##$RELAX= 
##$RELAX= 
##$RELAX= 
##$RELAX= 
##$RELAX= 
##$RELAX= 
##$RELAX= 
$$ Bruker specific parameters
$$ --------------------------
##$DU= <F:\spectra>
##$EXPNO= 1
##$NAME= <H1>
##$PROCNO= 1
##$TYPE= <nmr>
##$USER= <av>
##$AMP= (0..31)
100 100 100 100 100 100 100 100 100 100 100 100 100 100 100 100 100 100 
100 100 100 100 100 100 100 100 100 100 100 100 100 100 
##$AQSEQ= 0
##$AQ_mod= 1
##$AUNM= <au_zg>
##$AUTOPOS= <>
##$BF1= 200.13
##$BF2= 200.13
##$BF3= 200.13
##$BF4= 200.13
##$BF5= 500.13
##$BF6= 500.13
##$BF7= 500.13
##$BF8= 500.13
##$BYTORDA= 1
##$CFDGTYP= 0
##$CFRGTYP= 5
##$CHEMSTR= <none>
##$CNST= (0..31)
1 1 145 1 1 1 1 1 1 1 1 1 1 1 1 1 1 1 1 1 1 1 1 1 1 1 1 1 1 1 1 1 
##$CPDPRG= <>
##$CPDPRG1= <>
##$CPDPRG2= <>
##$CPDPRG3= <>
##$CPDPRG4= <mlev>
##$CPDPRG5= <mlev>
##$CPDPRG6= <mlev>
##$CPDPRG7= <mlev>
##$CPDPRG8= <mlev>
##$CPDPRGB= <>
##$CPDPRGT= <>
##$D= (0..31)
0 2 0 0 0 0 0 0 0 0.06 0 0 0 0 0 0 0.0002 0 0 0 0 0 0 0 0 0 0 0 0 0 0 
0 
##$DATE= 1755074215
##$DBL= (0..7)
120 120 120 120 120 120 120 120 
##$DBP= (0..7)
150 150 150 150 150 150 150 150 
##$DBP07= 0
##$DBPNAM0= <>
##$DBPNAM1= <>
##$DBPNAM2= <>
##$DBPNAM3= <>
##$DBPNAM4= <>
##$DBPNAM5= <>
##$DBPNAM6= <>
##$DBPNAM7= <>
##$DBPOAL= (0..7)
0.5 0.5 0.5 0.5 0.5 0.5 0.5 0.5 
##$DBPOFFS= (0..7)
0 0 0 0 0 0 0 0 
##$DE= 6
##$DECBNUC= <off>
##$DECIM= 32
$$ [...]
##$SUBNAM4= <"">
##$SUBNAM5= <"">
##$SUBNAM6= <"">
##$SUBNAM7= <"">
##$SUBNAM8= <"">
##$SUBNAM9= <"">
##$SW= 20.6817932712277
##$SWIBOX= (0..15)
0 0 3 0 0 0 0 0 0 0 0 0 0 0 0 0 
##$SW_h= 4139.07284768212
##$TD= 32768
##$TD0= 1
##$TE= 0
##$TE2= 300
##$TE3= 300
##$TEG= 300
##$TL= (0..7)
0 120 120 120 120 120 120 120 
##$TP= (0..7)
150 150 150 150 150 150 150 150 
##$TP07= 0
##$TPNAME0= <>
##$TPNAME1= <>
##$TPNAME2= <>
##$TPNAME3= <>
##$TPNAME4= <>
##$TPNAME5= <>
##$TPNAME6= <>
##$TPNAME7= <>
##$TPOAL= (0..7)
0.5 0.5 0.5 0.5 0.5 0.5 0.5 0.5 
##$TPOFFS= (0..7)
0 0 0 0 0 0 0 0 
##$TUNHIN= 0
##$TUNHOUT= 0
##$TUNXOUT= 0
##$USERA1= <user>
##$USERA2= <user>
##$USERA3= <user>
##$USERA4= <user>
##$USERA5= <user>
##$V9= 5
##$VALIST= <valist>
##$VCLIST= <CCCCCCCCCCCCCCC>
##$VD= 0
##$VDLIST= <DDDDDDDDDDDDDDD>
##$VPLIST= <PPPPPPPPPPPPPPP>
##$VTLIST= <TTTTTTTTTTTTTTT>
##$WBST= 1024
##$WBSW= 30
##$XGAIN= (0..3)
0 0 0 0 
##$XL= 0
##$YL= 0
##$YMAX_a= 2565094
##$YMIN_a= -2321557
##$ZGOPTNS= <>
##$ZL1= 120
##$ZL2= 120
##$ZL3= 120
##$ZL4= 120
##$ABSF1= 0
##$ABSF2= 0
##$ABSG= 0
##$ABSL= 0
##$ALPHA= 0
##$AQORDER= 0
##$ASSFAC= 0
##$ASSFACI= 0
##$ASSFACX= 0
##$ASSWID= 0
##$AUNMP= <proc_1d>
##$AZFE= 0.1
##$AZFW= 0.1
##$BCFW= 0
##$BC_mod= 2
##$BYTORDP= 0
##$COROFFS= 0
##$CY= 18.4799938201904
##$DATMOD= 1
##$DC= 0
##$DFILT= <>
##$DTYPP= 0
##$F1P= 9.9274215381318
##$F2P= -0.165520771350173
##$FCOR= 1
##$FTSIZE= 16384
##$FT_mod= 6
##$GAMMA= 0
##$GB= 0
##$INTBC= 1
##$INTSCL= 4.127829e-11
##$ISEN= 128
##$LB= 0.05
##$LEV0= 0
##$LPBIN= 0
##$MAXI= 10000
##$MC2= 0
##$MEAN= 0
##$ME_mod= 0
##$MI= 50
##$NCOEF= 0
##$NC_proc= -3
##$NLEV= 6
##$NOISF1= 3.799351
##$NOISF2= 2.8
##$NSP= 0
##$NTH_PI= 0
##$NZP= 0
##$OFFSET= 16.48848
##$PC= 4
##$PHC0= -196.2202
##$PHC1= 0.101552
##$PH_mod= 1
##$PKNL= yes
##$PPARMOD= 0
##$PSCAL= 4
##$PSIGN= 0
##$REVERSE= no
##$SF= 200.130005582386
##$SI= 16384
##$SIGF1= 3
##$SIGF2= 2
##$SINO= 400
##$SIOLD= 16384
##$SREGLST= <1H.CDCl3>
##$SSB= 0
##$STSI= 16384
##$STSR= 0
##$SW_p= 4139.07284768211
##$SYMM= 0
##$S_DEV= 0
##$TDeff= 32768
##$TDoff= 0
##$TI= <>
##$TILT= no
##$TM1= 0
##$TM2= 0
##$TOPLEV= 0
##$USERP1= <user>
##$USERP2= <user>
##$USERP3= <user>
##$USERP4= <user>
##$USERP5= <user>
##$WDW= 1
##$XDIM= 16384
##$YMAX_p= 440786610
##$YMIN_p= -721556
$$ End of Bruker specific parameters
$$ ---------------------------------
##NTUPLES= NMR SPECTRUM
##VAR_NAME=  FREQUENCY,     SPECTRUM/REAL,   SPECTRUM/IMAG
##SYMBOL=    X,             R,               I
##VAR_TYPE=  INDEPENDENT,   DEPENDENT,       DEPENDENT
##VAR_FORM=  AFFN,          ASDF,            ASDF
##VAR_DIM=   16384,         16384,           16384
##UNITS=     HZ,            ARBITRARY UNITS, ARBITRARY UNITS
##FACTOR=    0.252644378177508, 1,           1
##FIRST=     3299.83951724647, 0,            0
##LAST=      -839.233330435636, 0,           0
##MIN=       -839.233330435636, -721556,     0
##MAX=       3299.83951724647, 440786610,    0
$$ Real data points
##PAGE= N=1
##DATA TABLE= (X++(R..R)), XYDATA
$$ [...]
5951B777370m1306l0508l3822l7492l1239l1809l7632l2991m2545l5259m0342
$$ 2777370 2736064 2705556 2671734 2634242 2603003 2571194 2533562 2500571 2458026 2422767 2382425
5940B382425l2527l6656l0270l7654l0894l3158l3767l1684l3291l1582k8492
$$ 2382425 2349898 2313242 2282972 2245318 2214424 2181266 2147499 2115815 2082524 2050942 2022450
5929B022450l3109l2307l2414k7077l1300k3075l1772k8553l1636k6120k7104
$$ 2022450 1989341 1957034 1924620 1897543 1866243 1843168 1811396 1782843 1751207 1725087 1697983
5918A697983k7478k6947k7472k5710k7187k2767k5882k5051k9781k0693k6895
$$ 1697983 1670505 1643558 1616086 1590376 1563189 1540422 1514540 1489489 1459708 1439015 1412120
5907A412120j8913j8028k5035j7242j9023j6135k2434j6021k3965j8646k3841
$$ 1412120 1393207 1375179 1350144 1332902 1313879 1297744 1275310 1259289 1235324 1216678 1192837
5896A192837j6560j7510j8808j3105j5850k1199j5976j8721r709j6267j4763j2468
$$ 1192837 1176277 1158767 1139959 1126854 1111004 1089805 1073829 1055108 1045399 1029132 1014369 1001901
5884A001901j7101j3216j0118j2497j6887j5740j4635n456j6373j5901j0434j2934
$$ 1001901 984800 971584 961466 948969 932082 916342 901707 896251 879878 863977 853543 840609
5872H40609j8056l715j0354o982j4069q466j9373q718r033j0653o894j7892m603
$$ 840609 822553 818838 808484 801502 787433 778967 759594 750876 741843 731190 724296 706404 701801
5859G01801j3819m204j4459o127r680o002j3656n162p624j3165k460q053j4198
$$ 701801 687982 683778 669319 663192 653512 647510 633854 628692 621068 607903 605443 597390 583192
5846E83192l799j5448N83n231r177l872o327j1111p136n025n753p191o333n349
$$ 583192 579393 563945 564528 559297 550120 546248 539921 528810 521674 516649 510896 503705 497372 492023
5832D92023j0028n039q63q822l095n607j1400m625n068q42n998n914n12l798q262
$$ 492023 481995 476956 476093 467271 464176 458569 447169 442544 437476 436634 430636 424722 424210 420412 412150
5817D12150m28r007o333j015j0032J130l377p220l584l639p385J752n769o478
$$ 412150 411722 402715 396382 395367 385335 386465 383088 375868 372284 368645 361260 363012 357243 350765
5803C50765k909k078k410l480l398m249k425J491o030j762q233k708J912m428
$$ 350765 347856 345778 343368 339888 336490 332241 329816 331307 325277 323515 315282 312574 314486 310058
5789C10058q189P50o459p49K02n400n13l299o68m219l058j019R89o855n86J06
$$ 310058 301869 302619 296160 295411 295613 290213 289700 286401 285733 281514 278456 277437 278426 271571 270985 271091
5773B71091p438j382l468J110j160l679q60n298J052P70q258J41l074O897n368
$$ 271091 263653 262271 258803 259913 258753 255074 254214 248916 249968 250738 242480 242621 239547 246444 241076
5758B41076k981R17l390j531P74k046n218k561L00j916j015L770q085N480m666
$$ 241076 238095 239012 235622 234091 234865 232819 227601 225040 225340 223424 222409 226179 218094 223574 218908
5743B18908J918k518K4J574j0004N907j394m004K870j797K193j897n062j130J552
$$ 218908 220826 218308 218332 219906 209902 215809 214415 210411 213281 211484 213677 211780 206718 205588 207140
5728B07140J516j672N748k629J417M034k619K58K166K21J281p72k149M015n6L683
$$ 207140 208656 206984 212732 210103 211520 215554 212935 213193 215359 215580 216861 216089 213940 217955 217899 221582
5712B21582N824j810j114N33J690k91N992k320J86J062L666K286M50N73J177J53
$$ 221582 227406 225596 224482 225015 226705 226414 232406 230086 230272 231334 235000 237286 237736 238309 239486 239639
5696B39639L385K711J553M04P63J042M905M026j767M098K568J708J523Q52K253
$$ 239639 243024 245735 247288 247692 248455 249497 254402 258428 256661 260759 263327 265035 266558 267410 269663
5681B69663k271P156j221M399M457M483P778K279M717O36L537M865k609R907j492
$$ 269663 267392 274548 273327 277726 282183 286666 294444 296723 301440 302076 305613 310478 307869 317776 316284
5666C16284O724R48P34M515P644j941M52K284P02P938M332Q335l59R111O736L144
$$ 316284 323008 323956 324690 329205 336849 334908 335360 337644 338346 346284 350616 358951 358592 367703 374439 377583
5650C77583M781P973o85R186K007M46P584J884Q977J089R140J0279N484M808P092
$$ 377583 382364 390337 389652 398838 400845 401291 408875 410759 419736 420825 429965 440244 445728 450536 457628
5635D57628N925L462Q558P270P699Q689R175P684Q623M419J0119O501R062M751
$$ 457628 463553 467015 475573 482843 490542 499231 508406 516090 524713 529132 539251 545752 554814 559565
5621E59565J0681J1558o908K3285J4044M574J4355J2780Q232M366R997J0258N518
$$ 559565 570246 581804 574896 598181 612225 616799 631154 643934 652166 656532 666529 676787 682305
5608F82305J1401J0907P349J1709J2054R788Q454J0666J1210J6668J0696R209
$$ 682305 693706 704613 711962 723671 735725 745513 753967 764633 775843 792511 803207 812416
5596H12416J0715J2453J3494J5225J6309J4603J1972J6324Q706K2550J2920J8766
$$ 812416 823131 835584 849078 864303 880612 895215 907187 923511 932217 954767 967687 986453
5584I86453K1450K0857K0675K1491K2839J8178K4026J4645K1497K0713K3744K0628
$$ 986453 1007903 1028760 1049435 1070926 1093765 1111943 1135969 1150614 1172111 1192824 1216568 1237196
5572A237196K6535L1324K2381L1652L0206L0848L5473K4692L1643L7401K9819
$$ 1237196 1263731 1295055 1317436 1349088 1379294 1410142 1445615 1470307 1501950 1539351 1569170
5561A569170L5746M2882M1482M3239M5609M9998M7743M9680M9137N9751O0041
$$ 1569170 1604916 1647798 1689280 1732519 1778128 1828126 1875869 1925549 1974686 2034437 2094478
5550B094478O0064P2639P2896P5629P6811Q9361Q9733Q9076R7373J12208J11826
$$ 2094478 2154542 2227181 2300077 2375706 2452517 2541878 2631611 2720687 2818060 2930268 3042094
5539C042094J24542J26065J39119J56708J63212J83724J95727K09907K19646K44902
$$ 3042094 3166636 3292701 3431820 3588528 3751740 3935464 4131191 4341098 4560744 4805646
5529D805646K59512K79280L05819L37552L65190L94751M33363M67506N16314N77311
$$ 4805646 5065158 5344438 5650257 5987809 6352999 6747750 7181113 7648619 8164933 8742244
5519H742244O45594P26418Q13263R20721J027150J167983J312436J470950J679923
$$ 8742244 9387838 10114256 10927519 11848240 12875390 14043373 15355809 16826759 18506682
5510A8506682J897110K164071K496150K890184L354516L865920M361344M797158
$$ 18506682 20403792 22567863 25064013 27954197 31308713 35174633 39535977 44333135
5502D4333135N068211M944251M079327K329314K02742j413995k223408k420006
$$ 44333135 49401346 54345597 58424924 60754238 60956980 59542985 57319577 54899571
5494E4899571k323337k139700j986204j874550j786410j663328j531137j364137
$$ 54899571 52576234 50436534 48450330 46575780 44789370 43126042 41594905 40230768
5486D0230768j208537j092834j056260j055018j041481j021048j031118j109733
$$ 40230768 39022231 37929397 36873137 35818119 34776638 33755590 32724472 31614739
5478C1614739j215868j309429j361347j343740j306823j250643j204926j138232
$$ 31614739 30398871 29089442 27728095 26384355 25077532 23826889 22621963 21483731
5470B1483731j088417j018128r57963q97824q39981q01963p58974p16695o82617
$$ 21483731 20395314 19377186 18419223 17521399 16681418 15879455 15120481 14403786 13721169
5461A3721169o49913o06353n63092n14790m83771m40798m10479l71151l52215
$$ 13721169 13071256 12464903 11901811 11387021 10903250 10462452 10051973 9680822 9328607
5452I328607l28912l12409k85727k69908k47203k28910k20450k07647j95731j82680
$$ 9328607 8999695 8687286 8401559 8131651 7884448 7655538 7435088 7227441 7031710 6849030
5442F849030j74599j68233j54587j46704j46199j39614j43195j42096j45551j37536
$$ 6849030 6674431 6506198 6351611 6204907 6058708 5919094 5775899 5633803 5488252 5350716
5432E350716j29622j25991j24216j16722j04078r7895j03882r5426p8603q8479
$$ 5350716 5221094 5095103 4970887 4854165 4750087 4652192 4548310 4452884 4374281 4285802
5422D285802q0466q1855q3241p4873p5198p3499p1296p2891q2040q0843r0145
$$ 4285802 4205336 4123481 4040240 3965367 3890169 3816670 3745374 3672483 3590443 3509600 3419455
5411C419455r4420r3157q9980r1403q5475p6336q0433o3382o8356o0251n8879
$$ 3419455 3325035 3231878 3141898 3050495 2965020 2888684 2808251 2744869 2676513 2616262 2557383
5400B557383n9532m6978n0448n2739m5433m4933m8690m4961l5716l8895l8396
$$ 2557383 2497851 2450873 2400425 2347686 2302253 2257320 2208630 2163669 2127953 2089058 2050662
5389B050662l6203l5358l5355k6378l3435k6053l1561l1378k5457l0359k7454
$$ 2050662 2014459 1979101 1943746 1917368 1883933 1857880 1826319 1794941 1769484 1739125 1711671
5378A711671k7873k6547k3067k5621j9400j4104k1603k6595j8744j8167j9025
$$ 1711671 1683798 1657251 1634184 1608563 1589163 1575059 1553456 1526861 1508117 1489950 1470925
5367A470925k6009j7962j8059j8873j8749j4875k0622j4560j4629j8390j5486
$$ 1470925 1444916 1426954 1408895 1390022 1371273 1356398 1335776 1321216 1306587 1288197 1272711
5356A272711j9470j0672j7322j6004j6794j2405j1359j4965j0138j4210j5901
$$ 1272711 1253241 1242569 1225247 1209243 1192449 1180044 1168685 1153720 1143582 1129372 1113471
5345A113471j1806j1973q334j5102j3845n475k1018r883j2064j5823r196j3852
$$ 1113471 1101665 1089692 1081358 1066256 1052411 1046936 1025918 1016035 1003971 988148 978952 965100
5333I65100j3391r472r247j5711r463j6670r479j0192o805j7569j2544r089j5527
$$ 965100 951709 942237 932990 917279 907816 891146 881667 871475 864670 847101 834557 825468 809941
5320H09941j0159j0860j2891j0375j2818j3766o126j0504j2632r929q482j0799
$$ 809941 799782 788922 776031 765656 752838 739072 732946 722442 709810 699881 691399 680600
5308F80600j6487j0720r723r090q121j4898o167j2284q347r566n499r382p772
$$ 680600 664113 653393 643670 634580 626459 611561 605394 593110 584763 575197 569698 560316 552544
5295E52544j0919j2626j0988m744j0542o450o368o561m528j3115m342o359n093
$$ 552544 541625 528999 518011 513267 502725 496275 489907 483346 478818 465703 461361 455002 449909
5282D49909q870p067r91j2350o545l572q144k099o252k989j1067p274n188o16
$$ 449909 441039 433972 432981 420631 414086 410514 402370 400271 394019 391030 379963 372689 367501 366885
5268C66885j1401J684l494k043o700m522n689n78j0011J406p258n301l416j601
$$ 366885 355484 357168 353674 351631 344931 340409 334720 334142 324131 325537 318279 312978 309562 307961
5254C07961k407n951j718N81q005K80n950m008l116K074m626k277k922m913j193
$$ 307961 305554 299603 297885 298466 290461 290741 284791 280783 277667 279741 275115 272838 269916 265003 263810
5239B63810o545j118k969m901R70q330K920l512L48k457p925J764k236n405m726
$$ 263810 257265 256147 253178 248277 249247 240917 243837 240325 240673 238216 230291 232055 229819 224414 219688
5224B19688P292p926p61J041q615j493j331K29k398K740m622M26p413J324J334
$$ 219688 226980 219054 218293 219334 210719 209226 207895 208124 205726 208466 203844 204270 196857 198181 199515
5209A99515l003n16p178K22N9k311k358j100K0j831K553k094q50l449l803O754
$$ 199515 196512 195996 188818 189040 189099 186788 184430 183330 183350 181519 184072 181978 181128 177679 173876 180630
5193A80630j1454L261O046k590l947j653n31k566j449J617l041M216o535P274
$$ 180630 169176 172437 178483 175893 171946 170293 169762 167196 165747 167364 164323 168539 162004 169278
5179A69278l607M4k005p81m889L21l11M395L499m777m61o19k480L223n407O046
$$ 169278 165671 165715 163710 162929 158040 158361 158050 162445 165944 161167 160706 160087 157607 160830 155423 161469
5163A61469l339l388N120r74M15l702p94M158j31j053j264k628L621k487j534
$$ 161469 158130 154742 159862 158888 159303 155601 154807 158965 158834 157781 156517 153889 157510 155023 153489
5148A53489j005p47J212j553O062l822N538o509k374M51O563m412m585K605K97
$$ 153489 152484 151737 152949 151396 157458 153636 159174 152665 150291 150742 157305 152893 148308 150913 151210
5133A51210q53M86Q66Q49K192j630J440J416O71j466K390n49N47M23j449K357
$$ 151210 150357 150843 151709 152558 154750 153120 154560 155976 156647 155181 157571 157022 157569 157992 156543 158900
5117A58900Q16k09r71p6J610L913k27j255k983K440L040j660R07J918j038J694
$$ 158900 159716 159507 158536 158460 160070 163983 163756 162501 159518 161958 164998 163338 164245 166163 165125 166819
5101A66819J64L00O490j833L97n72n271N777M602J87k768J471K361J41L727K720
$$ 166819 166983 167283 173773 171940 172337 171765 166494 172271 176873 177060 174292 175763 178124 178265 181992 184712
5085A84712j654J495J00K281L486M629j577k895J174L035N020J391J504K05J170
$$ 184712 183058 184553 184653 186934 190420 195049 193472 190577 191751 194786 199806 201197 202701 202906 204076
5070B04076L262K768l579M150K186L035K454k455N314K33P509m616k265M594M578
$$ 204076 207338 210106 206527 210677 212863 215898 218352 215897 221211 221444 228953 224337 222072 226666 231244
5055B31244l974K431M920K540J503K189J876m319O264N954r83M347k118M736K557
$$ 231244 227270 229701 234621 237161 238664 240853 242729 238410 244674 250628 249645 253992 251874 256610 259167
5040B59167l23p171J3261j291M885O762j46O307K160J227j407M766P660M712m45
$$ 259167 258844 251673 264934 263643 268528 275290 275144 281451 283611 284838 283431 288197 295857 300569 300124
5025C00124J0489Q725K641J259J2171P078P157J1010Q691J2121J1276K3990J5968
$$ 300124 310613 319338 321979 323238 335409 342487 349644 360654 369345 381466 392742 416732 432700
5012D32700K2112K2328J3138j660M208j642k426Q315N462M877O531J0605L390
$$ 432700 454812 477140 490278 488618 492826 491184 488758 497073 502535 507412 513943 524548 527938
4999E27938J4221J2994J1445K1620K2871J6903L4468K7816K7288J9233J7712K1990
$$ 527938 542159 555153 566598 588218 611089 627992 662460 690276 717564 736797 754509 776499
4987G76499K7518L5324M6491N3866N0568K2323q500j6668j9484q761o718l744
$$ 776499 804017 839341 885832 939698 990266 1012589 1004089 987421 967937 959176 952458 948714
4975I48714n211J0650K74J1261J0396K1843K7022L4844M1298M3098M7287N8690
$$ 948714 943503 954153 954427 965688 976084 997927 1024949 1059793 1101091 1144189 1191476 1250166
4963A250166K5393Q607q225o465L201J8146K8400L9003L4460O264k6821l0213
$$ 1250166 1275559 1284166 1275941 1269476 1272677 1290823 1319223 1358226 1392686 1398950 1372129 1341916
4951A341916k9356j9822j4920j0780q651j0232l510J929K273J4977J2711K3744
$$ 1341916 1312560 1292738 1277818 1267038 1258387 1248155 1244645 1246574 1248847 1263824 1276535 1300279
4939A300279J8272L7814L8730L6711J1749j2300l1742l5661k5829p887j0723k324
$$ 1300279 1318551 1356365 1395095 1431806 1443555 1431255 1399513 1363852 1338023 1330136 1319413 1317089
4927A317089n548j2692k0663k0666k5688j4405q295j1306r282p897l159o029j224
$$ 1317089 1311541 1298849 1278186 1257520 1231832 1217427 1209132 1197826 1188544 1180647 1177488 1171459 1170235
4914A170235m428p63J809P011L401J1120O303J352j3399j4744j0986j3385r823
$$ 1170235 1165807 1165044 1166853 1173864 1177265 1188385 1194688 1196040 1182641 1167897 1156911 1143526 1133703
4901A133703k433n930r340n004K24j487P54p078O308k681L504J0257j625M224
$$ 1133703 1131270 1125340 1116000 1110996 1111220 1109733 1110487 1103409 1109717 1107036 1110540 1120797 1119172 1123396
4887A123396M291k36K973O464J2588M818O162N085O830Q165Q673P420R379J2832
$$ 1123396 1127687 1127451 1130424 1136888 1149476 1154294 1160456 1165541 1172371 1180536 1189209 1196629 1206008 1218840
4873A218840J776J6920P958J0247P054J0955N999Q456J4935J4208J3072J5982
$$ 1218840 1220616 1237536 1245494 1255741 1262795 1273750 1279749 1288205 1303140 1317348 1330420 1346402
4861A346402J5606J0313J7244J8996K2064J7421J6417J2366J5250J4238J3467
$$ 1346402 1362008 1372321 1389565 1408561 1430625 1448046 1464463 1476829 1492079 1506317 1519784
4850A519784J9732J6363J7873J7340J5277K2847K0984K1189J8770J6952K3504
$$ 1519784 1539516 1555879 1573752 1591092 1606369 1629216 1650200 1671389 1690159 1707111 1730615
4839A730615K0274K0194K7352J5927K4705K2872K5207K8742K8238L2389L0698
$$ 1730615 1750889 1771083 1798435 1814362 1839067 1861939 1887146 1915888 1944126 1976515 2007213
4828B007213K6813K1431K5593L0792K9101K6271K5717L0556K3127L3912L1149
$$ 2007213 2034026 2055457 2081050 2111842 2140943 2167214 2192931 2223487 2246614 2280526 2311675
4817B311675L4671L6268L1512M0477L1886L5574L8736M0267K9001L5727L9760
$$ 2311675 2346346 2382614 2414126 2454603 2486489 2522063 2560799 2601066 2630067 2665794 2705554
4806B705554L7299L9437M2821M5455M8468M1262M6772M8111M2803N4198M3270
$$ 2705554 2742853 2782290 2825111 2870566 2919034 2960296 3007068 3055179 3097982 3152180 3195450
4795C195450M4745M5530M6242N8570N3602N5904O5316N7561O1183O3179O4965
$$ 3195450 3240195 3285725 3331967 3390537 3444139 3500043 3565359 3622920 3684103 3747282 3812247
4784C812247P3406O8265P1299O8783P0329P6385Q2695Q5973Q0432Q6328R0391
$$ 3812247 3885653 3953918 4025217 4094000 4164329 4240714 4323409 4409382 4489814 4576142 4666533
4773D666533J04984J10948J15264J16155J12079J18566J27578J34915J49181J70500
$$ 4666533 4771517 4882465 4997729 5113884 5225963 5344529 5472107 5607022 5756203 5926703
4763E926703J71250J77294J91249J88192K08969K26212K40792K67420K80539L05913
$$ 5926703 6097953 6275247 6466496 6654688 6863657 7089869 7330661 7598081 7878620 8184533
4753H184533L39199L77416M05400M56733N07177N68457O37710P13587Q13289R13355
$$ 8184533 8523732 8901148 9306548 9763281 10270458 10838915 11476625 12190212 13003501 13916856
4743A3916856J044551J212183J430868J739646K100184K474774K881045L374577
$$ 13916856 14961407 16173590 17604458 19344104 21444288 23919062 26800107 30174684
4735C0174684L750851L274191J422806j60711o32313n10905j69205J47176M11657
$$ 30174684 33925535 37199726 38622532 38461821 37829508 37318603 37149398 37296574 37708231
4726C7708231O02904P50961J002403J308832J679316K199428K778837L312177
$$ 37708231 38311135 39062096 40064499 41373331 43052647 45252075 48030912 51343089
4718E1343089L749101M273602M853004M943524L907213K695020K781021L875216
$$ 51343089 55092190 59365792 64218796 69162320 73069533 75764553 78545574 82420790
4710H2420790N258668O701024Q321601R318316P584884J647286l048145m181384
$$ 82420790 87679458 94380482 102702083 112020399 119605283 121252569 118204424 114023040
4702A14023040l538148k360461j391191p13694k76955K4967O85814J411196K267200
$$ 114023040 110484892 108124431 106733240 106019546 105742591 105767558 106453372 107864568 110131768
4693A10131768L435356M841961O011145O862950P920090R000846Q376827L887028
$$ 110131768 113567124 118409085 124420230 131283180 139203270 148204116 156580943 160467971
4685A60467971j331090k557308j213938R19639L066221N098997O144432L951700
$$ 160467971 159136881 156579573 155365635 156285274 159351495 164450492 170594924 174546624
4677A74546624j996460o118851o818827n787542m282068l177748k577800k309574
$$ 174546624 172550164 166431313 159612486 153824944 149542876 146365128 143787328 141477754
4669A41477754j944479j204118m90431J77982J118095K335093L387377M207976
$$ 141477754 139533275 138329157 137838726 138016708 139134803 141469896 144857273 149065249
4661A49065249N269226O183673N060434k20306n733949p183237o333441m760497
$$ 149065249 154334475 160518148 165578582 165358276 159624327 152441090 146107649 141347152
4653A41347152l284484k100015j546350k503928m308110n271475n171216m444582
$$ 141347152 138062668 135962653 134416303 131912375 127604265 122332790 117161574 112716992
4645A12716992l581648l037414k899907k879352k618182k205185j917532j808457
$$ 112716992 109135344 106097930 103198023 100318671 97700489 95495304 93577772 91769315
4637I1769315j657410j305250r00122m93103J2916L29098k61532k270928l922704
$$ 91769315 90111905 88806655 87906533 87413430 87426346 87755444 87493912 85222984 81300280
4628H1300280m296762l986681l493115l086885k792307k634233k571528k457874
$$ 81300280 77003518 73016837 69523722 66436837 63644530 61010297 58438769 55980895
4620E5980895k294338k093434j867645j646543j521943j523947j514940j419214
$$ 55980895 53686557 51593123 49725478 48078935 46556992 45033045 43518105 42098891
4612D2098891j310327j266546j306644j369536j346377j289078j210693j115608
$$ 42098891 40788564 39522018 38215374 36845838 35499461 34210383 32999690 31884082
4604C1884082j048381j004070r53292r04486q52691q16060p86852p45987p15097
$$ 31884082 30835701 29831631 28878339 27973853 27121162 26305102 25518250 24772263 24057166
4595B4057166p04839o92961o62404o31071n97113n76802n52836n18916m94949
$$ 24057166 23352327 22659366 21996962 21365891 20768778 20191976 19639140 19120224 18625275
4586A8625275m77787m57958m13474m00404l68992l46294l39855l14236l14770
$$ 18625275 18147488 17689530 17276056 16875652 16506660 16160366 15820511 15506275 15191505
4577A5191505k96063k84088k73339k61070k69875k62913k78781k90674k74206
$$ 15191505 14895442 14611354 14338015 14076945 13807070 13544157 13265376 12974702 12700496
4568A2700496k75574k67853k50820k42092k26339k21602k16420k15059k04726
$$ 12700496 12424922 12157069 11906249 11664157 11437818 11216216 10999796 10784737 10580011
4559A0580011j96788j96228j86707j66292j69485j57737j56158j41815j46253
$$ 10580011 10383223 10186995 10000288 9833996 9664511 9506774 9350616 9208801 9062548
4550I062548j41354j33370j31485j35397j29345j33319j29044j40857j42064j36772
$$ 9062548 8921194 8787824 8656339 8520942 8391597 8258278 8129234 7988377 7846313 7709541
4540G709541j27866j25281j21483j17796j04865j01607j02449j00978r9597r2742
$$ 7709541 7581675 7456394 7334911 7217115 7112250 7010643 6908194 6807216 6707619 6614877
4530F614877r3471q6925r4268r1252r5075q6437q7928q0108p7082p5255p6088
$$ 6614877 6521406 6434481 6340213 6248961 6153886 6067449 5979521 5899413 5822331 5747076 5670988
4519E670988p5599q6286p6652q0504o9307p9107p3830p4939p6535o8825p0240
$$ 5670988 5595389 5509103 5432451 5351947 5282640 5203533 5129703 5054764 4978229 4909404 4839164
4508D839164o5499o9573o3906o7134o3393o3329o0669n8024o3162o9842o5355
$$ 4839164 4773665 4704092 4640186 4573052 4509659 4446330 4385661 4327637 4264475 4194633 4129278
4497D129278o4764n8221o1661o3199n7347n9252n5993n8139n5332n5018n8584
$$ 4129278 4064514 4006293 3944632 3881433 3824086 3764834 3708841 3650702 3595370 3540352 3481768
4486C481768n1427n2938m8393n1489n3249m9579n0236m8805m6625m1916m4974
$$ 3481768 3430341 3377403 3329010 3277521 3224272 3174693 3124457 3075652 3029027 2987111 2942137
4475B942137m9489m7089m9184l9736m9015m5540l8014m3582l8304m3008l6639
$$ 2942137 2892648 2845559 2796375 2756639 2707624 2662084 2624070 2580488 2542184 2499176 2462537
4464B462537l7695l2123l3421l2983k6087l2363k5269j8831k0243j8278k1933
$$ 2462537 2424842 2392719 2359298 2326315 2300228 2267865 2242596 2223765 2203522 2185244 2163311
4453B163311k4814l8016m1267l5310l6945l5456l1848l1667k7206k5898k4114
$$ 2163311 2138497 2100481 2059214 2023904 1986959 1951503 1919655 1887988 1860782 1834884 1810770
4442A810770k5454j3141k0788j4349p247o266l372M374k007o495j6542p881j407
$$ 1810770 1785316 1772175 1751387 1737038 1729791 1723525 1720153 1724527 1722520 1716025 1699483 1691602 1690195
4429A690195M187J6201K1008K4365J1769k7888m0679m3092l8174k7622k3411k6613
$$ 1690195 1694382 1710583 1731591 1755956 1767725 1739837 1699158 1656066 1617892 1590270 1566859 1540246
4417A540246j7070j1887j9877j0632l301m467K2328J1587K6267K8442L1402K3245
$$ 1540246 1523176 1511289 1491412 1480780 1477479 1473012 1495340 1506927 1533194 1561636 1593038 1616283
4405A616283j1304k1997l5510r567n140O325J2781K1204j4700l0880m6644n2016
$$ 1616283 1604979 1582982 1547472 1537905 1532765 1539090 1551871 1573075 1558375 1527495 1480851 1428835
4393A428835m4265l4369l0117k2988k3875k1943j5829j6950o926k860O022J2722
$$ 1428835 1384570 1350201 1320084 1297096 1273221 1251278 1235449 1218499 1211573 1208713 1214735 1227457
4381A227457J5571J5939J8034P277k4464m8559m2462m3214k8084k8022j9913j6732
$$ 1227457 1243028 1258967 1277001 1284278 1259814 1211255 1168793 1125579 1097495 1069473 1049560 1032828
4369A032828k8338l8802m0217l3431k9232k6140k2706k7331k3599k2341k0951
$$ 1032828 1004490 965688 925471 892040 862808 836668 813962 786631 763032 740691 719740
4358G19740j5101j7844j5869j4913p867j1162r043j605j5189k8683k4821k7426
$$ 719740 704639 686795 670926 656013 648146 636984 627941 626336 611147 582464 557643 530217
4346E30217l5298k3892k2914j8566k4098j6390k2165k2193j5757j4691j4080j5004
$$ 530217 494919 471027 448113 429547 405449 389059 366894 344701 328944 314253 300173 285169
4334B85169j6241j3012r682j8924p544j1136j5606j3042j7378j0324j0371q321
$$ 285169 268928 255916 246234 227310 219766 208630 193024 179982 162604 152280 141909 133588
4322A33588j0362r993j4645r153r125o888p441r238j2689m003r337r625m769r244
$$ 133588 123226 113233 98588 89435 80310 73422 65981 56743 44054 40051 30714 21089 16320 7076
4308G076q067q461m336o620m153k953q617j776j1914l459p352l554m989p475o617
$$ 7076 -991 -9452 -13788 -20408 -24561 -27514 -36131 -37907 -49821 -53280 -60632 -64186 -69175 -76650 -83267
4293h3267m913m504n152k440o238m168p611k948k581n514r722N573n672K221q596
$$ -83267 -88180 -92684 -97836 -100276 -106514 -110682 -118293 -121241 -123822 -129336 -139058 -133485 -139157 -136936 -145532
4278a45532n355o933l100j319m513q74j308r049J545l735j742n756k024o419k676
$$ -145532 -150887 -157820 -160920 -162239 -166752 -167626 -168934 -177983 -176438 -180173 -181915 -187671 -189695 -196114 -198790
4263a98790k002K461l646k054r511L325k913J289p610J771o521l079n424K328
$$ -198790 -200792 -198331 -201977 -204031 -213542 -210217 -213130 -211841 -219451 -217680 -224201 -227280 -232704 -230376
4249b30376k833N065p179k245q950J761j800M784K999q367k756k160o37j46j388
$$ -230376 -233209 -228144 -235323 -237568 -246518 -244757 -246557 -241773 -238774 -247141 -249897 -252057 -252694 -252840 -254228
4234b54228n052m802l008K832k343K117n944o94k830n114L117j899K07L528J349
$$ -254228 -259280 -264082 -267090 -264258 -266601 -264484 -270428 -271122 -273952 -279066 -275949 -277848 -277641 -274113 -272764
4219b72764K122l443j568p422M30J546j981m136M96l237P83k394J176k560J57
$$ -272764 -270642 -274085 -275653 -283075 -282645 -281099 -283080 -287216 -286720 -289957 -289174 -291568 -290392 -292952 -292795
4204b92795l133P072K725m37n321M521J377o242k023j047O498l313l802J472K381
$$ -292795 -295928 -288856 -286131 -286568 -291889 -287368 -285991 -292233 -294256 -295303 -288805 -292118 -295920 -294448 -292067
4189b92067n662m60k251n147O632K612o785L188n740K617l908P084n282k383J0865
$$ -292067 -297729 -298189 -300440 -305587 -298955 -296343 -303128 -299940 -305680 -303063 -306971 -299887 -305169 -307552 -296687
4174b96687l793n20P7n84m21k994o77l269j835K78L402Q15l486J13k724M333R29
$$ -296687 -300480 -301000 -300923 -301507 -301928 -304922 -305599 -308868 -310703 -310425 -307023 -306208 -309694 -309581 -312305 -307972 -307043
4157c07043P50K500N81m631J918K288J601p769r5J962k141K93j285O39r32N41
$$ -307043 -306293 -303793 -303212 -307843 -305925 -303637 -302036 -309805 -309900 -307938 -310079 -309786 -311071 -310432 -311364 -310823
4141c10823J178j238K033L083k237k608L312j172k77r46P474j658j22l476m815
$$ -310823 -309645 -310883 -308850 -305767 -308004 -310612 -307300 -308472 -308749 -309695 -302221 -303879 -304001 -307477 -312292
4126c12292O80L619N97K305k572K638r71N39m374L68k373N813l059K611O639l25
$$ -312292 -311612 -307993 -307396 -305091 -307663 -305025 -305996 -305457 -309831 -309463 -311836 -306023 -309082 -306471 -299832 -300157
4110c00157L1M46p303k39M016K23L290O83k367l517J743K829j310n46l419O962
$$ -300157 -300126 -299680 -306983 -307222 -303206 -302983 -299693 -299010 -301377 -304894 -303151 -300322 -301632 -302178 -305597 -298635
4094b98635j525P40J379l720M066k658m26J809l26n054P767l849O11k917l948
$$ -298635 -300160 -299420 -298041 -301761 -297695 -300353 -300779 -298970 -299296 -304350 -296583 -300432 -299821 -302738 -306686
4079c06686K474M280l942J938m076M86J474L840n70L83r15L039q152J117K606
$$ -306686 -304212 -299932 -303874 -301936 -306012 -305526 -304052 -300212 -300782 -300399 -301314 -298275 -306427 -305310 -302704
4064c02704k511J734M967L37k424K512j090L837j508k388J257N94l620O405J616
$$ -302704 -305215 -303481 -298514 -298177 -300601 -298089 -299179 -295342 -296850 -299238 -297981 -297387 -301007 -294602 -292986
4049b92986J55o324p23k645P419K588j338K062K373K30p35J486l555j472P19L991
$$ -292986 -292831 -299155 -299878 -302523 -295104 -292516 -293854 -291792 -289419 -289189 -289924 -288438 -291993 -293465 -292746 -288755
4033b88755l333j831M097j160l738P110j968k454J96m24N685p68k79J822k162
$$ -288755 -292088 -293919 -289822 -290982 -294720 -287610 -289578 -292032 -291836 -292260 -286575 -287343 -287622 -285800 -287962
4018b87962K274k473P38k148M79n071N993L01M469j882n47l416j634M574J892
$$ -287962 -285688 -288161 -287423 -289571 -289092 -294163 -288170 -287869 -283400 -285282 -285829 -289245 -290879 -286305 -284413
4003b84413K771l849p06Q247j415m90j257L38m704K272L086M196j043k161J631
$$ -284413 -281642 -285491 -286197 -277950 -279365 -279855 -281112 -280774 -285478 -283206 -280120 -275924 -276967 -279128 -277497
3988b77497j459o504R144m79l11j558J227j489M207k041O485m644J066M092m313
$$ -277497 -278956 -285460 -276316 -276795 -277106 -278664 -277437 -278926 -274719 -276760 -270275 -274919 -273853 -269761 -274074
3973b74074k510K41j516L5J152j015K995L388k433k674K951K956k407N03J200
$$ -274074 -276584 -276343 -277859 -277824 -276672 -277687 -274692 -271304 -273737 -276411 -273460 -270504 -272911 -272408 -271208
3958b71208N84j695K24O5R11m49L6K153j901O31N108l650j296m27Q791n469j267
$$ -271208 -270624 -272319 -272095 -272030 -271119 -271568 -271532 -269379 -271280 -270649 -265541 -269191 -270487 -270914 -262123 -267592 -268859
3941b68859L51M481k943M187l104k57K171l995N093m100O468K145k675p50K866
$$ -268859 -268508 -264027 -266970 -262783 -265887 -266144 -263973 -267968 -262875 -266975 -260507 -258362 -261037 -261787 -258921
3926b58921j921k040K349N66L830m63k315K742J87k311N259j369R72k901r7J317
$$ -258921 -260842 -262882 -260533 -259967 -256137 -256600 -258915 -256173 -255986 -258297 -253038 -254407 -253435 -256336 -256433 -255116
3910b55116K4J841K398k79P24r9j099J238k971L042J139j809J205L374k417K136
$$ -255116 -255092 -253251 -250853 -251132 -250408 -250507 -251606 -250368 -253339 -250297 -249158 -250967 -249762 -246388 -248805 -246669
3894b46669p563P464j959k299P130P94n330K937k816N137J336L46O18J541R68
$$ -246669 -254232 -246768 -248727 -251026 -243896 -243102 -248432 -245495 -248311 -243174 -241838 -241492 -240874 -239333 -238365
3879b38365J364l943Q30K553k417j432r88k838Q110m511N122l057J982k979m41
$$ -238365 -237001 -240944 -240114 -237561 -239978 -241410 -242398 -245236 -237126 -241637 -236515 -239572 -237590 -240569 -241010
3864b41010O104J768k969K000o6j036J442k194M526l552J290M849l779k65L18
$$ -241010 -234906 -233138 -236107 -234107 -234173 -235209 -233767 -235961 -231435 -234987 -233697 -228848 -232627 -232892 -232574
3849b32574Q75N82L02L97N172R54J202q67M56j78op54m90NK135m915J600L092
$$ -232574 -231699 -231117 -230815 -230418 -225246 -224292 -223090 -223957 -223501 -223679 -223685 -224439 -224929 -224924 -222789 -227704 -226104 -223012
3831b23012k866N24N528j883O38L091J053j086m1K065K338k150J877O111n984
$$ -223012 -225878 -225354 -219826 -221709 -221071 -217980 -216927 -218013 -218054 -215989 -213651 -215801 -213924 -207813 -213797
3816b13797p0p09J131j733K682l129r37P906l992M974m923M283n24P113l944l039
$$ -213797 -213867 -214576 -213445 -215178 -212496 -215625 -216562 -208656 -212648 -207674 -212597 -208314 -208838 -201725 -205669 -208708
3800b08708J397K337m1P84k685L246l142l29j505N90p81Q573n455k20L632J380
$$ -208708 -207311 -204974 -205015 -204231 -206916 -203670 -206812 -207141 -208646 -208056 -208837 -200264 -205719 -205939 -202307 -200927
3784b00927K920K685m233K543M480n326K899O19J676k855K568O19k811J044K252
$$ -200927 -198007 -195322 -199555 -197012 -192532 -197858 -194959 -194340 -192664 -195519 -192951 -192332 -195143 -194099 -191847
3769a91847J304n309M803j704k9O117j500j514K559M327p453L664N969o44O86
$$ -191847 -190543 -195852 -191049 -192753 -192782 -186665 -188165 -189679 -187120 -182793 -190246 -186582 -180613 -181257 -180571
3754a80571j436j577K987k327l540N98K998J288J674l403N633j677l331L754o16
$$ -180571 -182007 -183584 -180597 -182924 -186464 -185866 -182868 -181580 -179906 -183309 -177676 -179353 -182684 -178930 -179546
3739a79546l73L019m661L096K83L69J833l239J129J00k028N852j247M43r02L790
$$ -179546 -179919 -176900 -181561 -178465 -178182 -177813 -175980 -179219 -178090 -177990 -180018 -174166 -175413 -174970 -175872 -172082
3723a72082N330o084J05N669o52K25J133J907k809k94M38k264N219j272N16k26
$$ -172082 -166752 -172836 -172731 -167062 -167714 -167489 -166356 -164449 -167258 -167552 -167114 -169378 -164159 -165431 -164915 -165141
3707a65141L387M52l133k46J842r37M707L118m865N214m083j524L081J105l273
$$ -165141 -161754 -161302 -164435 -164681 -162839 -163776 -159069 -155951 -160816 -155602 -159685 -161209 -158128 -157023 -160296
3692a60296Q76J986l75n083P942m130K236K386j213L009l094J989J044j427L814
$$ -160296 -159420 -157434 -157809 -162892 -154950 -159080 -156844 -154458 -155671 -152662 -155756 -153767 -152723 -154150 -150336
3677a50336K643n419L495J602j616M98m660N852L6k262N595L228l238K723j001
$$ -150336 -147693 -153112 -149617 -148015 -149631 -149133 -153793 -147941 -147905 -150167 -144572 -141344 -144582 -141859 -142860
3662a42860P50J985l31l621N191l560M733n324K830J473K686j355j701J440L818
$$ -142860 -142110 -140125 -140456 -144077 -138886 -142446 -137713 -143037 -140207 -138734 -136048 -137403 -139104 -137664 -133846
3647a33846J615J722l781m20j763R26J271M701n402J796j28J050J420j059J177
$$ -133846 -132231 -130509 -134290 -134710 -136473 -135547 -134276 -129575 -134977 -133181 -133309 -132259 -130839 -131898 -130721
3632a30721l16K179j152l083M144r36K712l835J789J089M047l649K122l854M319
$$ -130721 -131037 -128858 -130010 -133093 -128949 -129885 -127173 -131008 -129219 -128130 -124083 -127732 -125610 -129464 -125145
3617a25145k607r69M470K80J703m007O080M784o007N448m058m3K51O124K537J136
$$ -125145 -127752 -128721 -124251 -123971 -122268 -126275 -120195 -115411 -121418 -115970 -120028 -120071 -119820 -113696 -111159 -110023
3601a10023n454o66N743n415M098K236L305k022L18m61p36M906k813l446J543
$$ -110023 -115477 -116143 -110400 -115815 -111717 -109481 -106176 -108198 -107880 -108341 -109077 -104171 -106984 -110430 -108887
3586a08887K366l80J787k632L828L37J51j824L41N271r14J691J432J844o22J078
$$ -108887 -106521 -106901 -105114 -107746 -103918 -103581 -103430 -105254 -104913 -99642 -100556 -98865 -97433 -95589 -96211 -95133
3570i5133l314K647k354M269K262l874K408J520J650l824O135j73l225L286m719
$$ -95133 -98447 -95800 -98154 -93885 -91623 -95497 -93089 -91569 -89919 -93743 -87608 -87781 -91006 -87720 -92439
3555i2439j95J052P380j934L078o28j721O088P9J51l481M612J382n12p56L944
$$ -92439 -92634 -91582 -84202 -86136 -83058 -83686 -85407 -79319 -79240 -79089 -82570 -77958 -76576 -77088 -77844 -73900
3539g3900o84l70Q82L623m713M634N87k348L057j519M519M70n852Q190j594n92
$$ -73900 -74584 -74954 -74072 -70449 -75162 -70528 -69941 -72289 -69232 -70751 -66232 -65762 -71614 -63424 -65018 -65610
3523f5610L054L385m59j298q38J106L25K009M504l815J981l50j153L020m57K231
$$ -65610 -62556 -59171 -59630 -60928 -61766 -60660 -60335 -58326 -53822 -57637 -55656 -56006 -57159 -54139 -54596 -52365
3507e2365p11j465L717O2J041M415K176m896l25O604o348o2J328K448J379j307
$$ -52365 -53076 -54541 -50824 -50762 -49721 -45306 -43130 -48026 -48351 -41747 -48095 -48157 -46829 -44381 -43002 -44309
3491d4309M421m198J950j131K445J358n312L599P01M256K070L118K773l917M143
$$ -44309 -39888 -44086 -42136 -43267 -40822 -39464 -44776 -41177 -40476 -36220 -34150 -31032 -28259 -32176 -28033
3476b8033m374l200J201J468J859R93j16L37L147j608O508m543j749L678K760
$$ -28033 -32407 -35607 -34406 -32938 -31079 -30086 -30202 -29865 -26718 -28326 -21818 -26361 -28110 -24432 -21672
3461b1672R84k100Q627n700K230K563j446m322P040l277k769N390J195k055K60
$$ -21672 -20688 -22788 -14161 -19861 -17631 -15068 -16514 -20836 -13796 -17073 -19842 -14452 -13257 -15312 -15052
3446a5052J570K243K508l4m179N256k491J446K180L283n657j880L30N793r080
$$ -15052 -13482 -11239 -8731 -8765 -12944 -7688 -10179 -8733 -6553 -3270 -8927 -10807 -10477 -4684 -13764
3431a3764L146J302K865M025k871N548m831M343P19m49j171K608M45j228J186
$$ -13764 -10618 -9316 -6451 -2426 -5297 251 -4580 -237 482 33 -1138 1470 1915 687 1873
3416A873l378K666j873K50M540q60J142k112K793K698r34l27R91M932j14O57K270
$$ 1873 -1505 1161 -712 -462 4078 3218 4360 2248 5041 7739 6805 6478 7469 12401 12287 12944 15214
3399A5214N32j348k719O807K682j563J204L104o062M776J696O676o772Q453k400
$$ 15214 15746 14398 11679 18486 21168 19605 20809 23913 17851 22627 24323 30999 24227 32680 30280
3384C0280J861l643O149k508K958p97N273J973L195n681J225j764L930l676K067
$$ 30280 32141 28498 34647 32139 35097 34300 39573 41546 44741 39060 40285 38521 42451 38775 40842
3369D0842n607P217l024N480n50j905L202O96N852m162j486k867K473j78r68L274
$$ 40842 35235 42452 39428 44908 44358 42453 45655 46351 52203 48041 46555 43688 46161 45983 45015 48289
3353D8289n450L665k2M006k713Q83R06J500O593J379l894O875M884o149j872J222
$$ 48289 42839 46504 46482 50488 47775 48658 49564 51064 57657 59036 55142 62017 66901 60752 58880 60102
3337F0102R84L571J836K229l535M309J350j46K410j641J221L812n900O389M053
$$ 60102 61086 64657 66493 68722 65187 69496 70846 70700 73110 71469 72690 76502 70602 76991 81044
3322H1044o07R61N571n241J671K05K0P237m091n36N22L212K08L845M703l89j377
$$ 81044 80437 81398 86969 81728 83399 83604 83624 90861 86770 86234 86756 89968 90176 94021 98724 98335 96958
3305I6958K604j863L20L985M374j961N553q30J725j904m585M453M498R25K796
$$ 96958 99562 97699 98019 102004 106378 104417 109970 109140 110865 108961 104376 108829 113327 114252 117048
3290A17048l216K153J163l12L65L690j357M156J37O103m129J491K003j172K387
$$ 117048 113832 115985 117148 116836 117201 120891 119534 123690 123827 129930 125801 127292 129295 128123 130510
3275A30510j661R72O61M603L330r64j847J131N009l44M0M033k294K796k55m67
$$ 130510 128849 129821 130482 135085 138415 137451 135604 136735 141744 141400 141440 145473 143179 145975 145720 145253
3259A45253L745L978l34K277K160l870J843j070J960L097J547J285M058M20M197
$$ 145253 148998 152976 152642 154919 157079 153209 155052 153982 155942 159039 160586 161871 165929 166349 170546
3244A70546j511m01N565r21N903K923K488o22K389K035M1j315o22K954J115M531
$$ 170546 169035 168634 174199 173278 179181 182104 184592 183970 186359 188394 188435 187120 186498 189452 190567 195098
3228A95098m150P872o74J805M138j238M892j069j766P060j955N296o586N880K688
$$ 195098 190948 198820 198146 199951 204089 202851 207743 206674 204908 211968 210013 215309 208723 214603 217291
3213B17291L164l257O115Q60M343k45r02k349L752K92J637M774k055J704O195
$$ 217291 220455 217198 223313 224173 228516 228271 227369 225020 228772 229064 230701 235475 233420 235124 241319
3198B41319L913j771n62N123l988j398O053j119M770N930j514M808K402J25L639
$$ 241319 245232 243461 242899 248022 244034 242636 248689 247570 252340 258270 256756 261564 263966 264091 267730
3183B67730K181N383m2j909J193P033N351L155m921N522M734M732o573M504j43
$$ 267730 269911 275294 275252 273343 274536 281569 286920 290075 285154 290676 295410 300142 293569 298073 297930
3168B97930J957J766M490K145k434O831J884j55P163J647l430M23O624L640R20
$$ 297930 299887 301653 306143 308288 305854 312685 314569 314414 321577 323224 319794 320217 326841 330481 331401
3153C31401M200j151O620Q315P633J481k0l984P139L94l348O886L152K734J29
$$ 331401 335601 334450 341070 349385 357018 358499 358479 354495 361634 362028 358680 365566 368718 371452 371581
3138C71581r32O675M577L60O289j90p63K786M395O683M72J018N267J83L226O465
$$ 371581 370649 377324 381901 382261 388550 388360 387597 390383 394778 401461 401933 402951 408218 408401 411627 418092
3122D18092P498K622P857n911N612K50M806N602L068j533P021P96M437j290J582
$$ 418092 425590 428212 436069 430158 435770 436020 440826 446428 449496 447963 454984 455780 460217 458927 460509
3107D60509L481L922K323O136p81O115O64L205l335N297O342j261J1246K991J696
$$ 460509 463990 467912 470235 476371 475590 481705 482369 485574 482239 487536 493878 492617 503863 506854 508550
3092E08550K133L745Q499j230J0457J706K063K624l97P038R699L595O418R037
$$ 508550 510683 514428 522927 521697 532154 533860 535923 538547 538150 545188 554887 558482 564900 573937
3078E73937M157L050N011J068M008L541J0736k250P028Q065J3696N114L34O021
$$ 573937 578094 581144 586155 587223 591231 594772 605508 603258 610286 618351 632047 637161 637495 643516
3064F43516L074J4352j349J1694J1318N203P312n67J4366K948J7318N176J5133
$$ 643516 646590 660942 659593 671287 682605 687808 695120 694553 708919 711867 729185 734361 749494
3051G49494R146Q661J1290J3006J7542J0054K0141J8341J7991K1827K5678K4282
$$ 749494 758640 767301 778591 791597 809139 819193 839334 857675 875666 897493 923171 947453
3039I47453L2117L5042L7974M0752N9052P2221R2415R9266J21444J64409K00628
$$ 947453 979570 1014612 1052586 1093338 1152390 1224611 1317026 1416292 1537736 1702145 1902773
3028A902773L9252r4421r8285p0094l8057k0253q600j794j4855K318q799P827
$$ 1902773 1942025 1847604 1749319 1679225 1641168 1620915 1612315 1610521 1595666 1597984 1589185 1597012
3016A597012J1294K3568K9395L0928K8517L6783N2351O7347P1088Q0502J14351
$$ 1597012 1608306 1631874 1661269 1692197 1720714 1757497 1809848 1877195 1948283 2028785 2143136
3005B143136J43732J63173K25941L03016L92406m7926k28253k08831j56367q8887
$$ 2143136 2286868 2450041 2675982 2978998 3371404 3323478 3095225 2886394 2730027 2641140
2995B641140o5411m4530l1399n5746m2149m3816m3701k1622J3481J2135m414j0858
$$ 2641140 2575729 2531199 2499800 2444054 2401905 2358089 2314388 2292766 2306247 2318382 2313968 2303110
2983B303110J621J7908K8953J9862J2977K6105M5200N3676R7450J25345J43623
$$ 2303110 2304731 2322639 2351592 2371454 2384431 2410536 2455736 2509412 2606862 2732207 2875830
2972B875830l9147j24642j05470p7473m6808m4610k8404k9003m0429k7532k8333
$$ 2875830 2836683 2712041 2606571 2529098 2482290 2437680 2409276 2380273 2339844 2312312 2283979
2961B283979j6327j6507K753k843p163l910n788N763L626j241q813j2393M34n691
$$ 2283979 2267652 2251145 2253898 2251055 2243892 2239982 2234194 2239957 2243583 2242342 2233529 2221136 2221570 2215879
2947B215879K597o266r343q277j71O770K506J5680J0711J2268L741J8468K3073
$$ 2215879 2218476 2212210 2202867 2194590 2194419 2201189 2203695 2219375 2230086 2242354 2246095 2264563 2287636
2934B287636J9503J5422J9243J0336K592J1356J7361K6483K7125K8410L1776K6150
$$ 2287636 2307139 2322561 2341804 2352140 2354732 2366088 2383449 2409932 2437057 2465467 2497243 2523393
2922B523393K2865K9391L3949K2748J5192P634R142J2434J3711K6774L5146L9328
$$ 2523393 2546258 2575649 2609598 2632346 2647538 2655172 2664314 2676748 2690459 2717233 2752379 2791707
2910B791707M1631L8586M3089M9624M4229M4481L5325L1263K3747L0196L5794
$$ 2791707 2833338 2871924 2915013 2964637 3008866 3053347 3088672 3119935 3143682 3173878 3209672
2899C209672M1484M1835M5423O0962M0795L6663M6431M3105M7935M4018L9086
$$ 3209672 3251156 3292991 3338414 3399376 3440171 3476834 3523265 3566370 3614305 3658323 3697409
2888C697409M0504L5858M0894L2492M7604N3725N9982O0124P0990O9970N8605
$$ 3697409 3737913 3773771 3814665 3847157 3894761 3948486 4008468 4068592 4139582 4209552 4268157
2877D268157N5925P5238O8311N1680N3460M0846M7414N0453O8316Q3408Q6315
$$ 4268157 4324082 4399320 4467631 4519311 4572771 4613617 4661031 4711484 4779800 4863208 4949523
2866D949523J01148Q6575P1589O2921P0740P7329P7227P7578P4345O6628O8761
$$ 4949523 5050671 5137246 5208835 5271756 5342496 5419825 5497052 5574630 5648975 5715603 5784364
2855E784364P7460R1845J06142J10418J14714J08252J13756J10673J02686Q7233
$$ 5784364 5861824 5953669 6059811 6170229 6284943 6393195 6506951 6617624 6720310 6807543
2845F807543Q4205Q1712R5996J02840J56449K01356K03081J68403J45773J24160
$$ 6807543 6891748 6973460 7069456 7172296 7328745 7530101 7733182 7901585 8047358 8171518
2835H171518J32413J45724J67428J87949K06316K01939K10101K08115K16579K26884
$$ 8171518 8303931 8449655 8617083 8805032 9011348 9213287 9423388 9631503 9848082 10074966
2825A0074966K44157K64875K92535L06032L16330L26148L47213L66082M07706
$$ 10074966 10319123 10583998 10876533 11182565 11498895 11825043 12172256 12538338 12946044
2816A2946044M37428M79210N45797N92619O06779N88088O89945P72303P89789
$$ 12946044 13383472 13862682 14408479 15001098 15607877 16195965 16885910 17658213 18448002
2807A8448002Q52698Q92335R68197J068642J192007J351240J533657J750145J961729
$$ 18448002 19300700 20193035 21161232 22229874 23421881 24773121 26306778 28056923 30018652
2798C0018652K237428K541737K905434L413682L797753M226067M898933N711550
$$ 30018652 32256080 34797817 37703251 41116933 44914686 49140753 54039686 59751236
2790E9751236O649648Q265522J0903052J4470861J6138498J9428912K6585774
$$ 59751236 66400884 74666406 85569458 100040319 116178817 135607729 162193503
2783A62193503L3919459K6829966j5560638k0043790j6651188j0682651o267700
$$ 162193503 196112962 222942928 207382290 187338500 170687312 160004661 153736961
2776A53736961m564582k139643l042497l233668j548722j407029k70186K191808
$$ 153736961 149172379 147032736 143990239 140756571 139207849 137800820 137530634 139722442
2768A39722442M607078M918809L653249M597492P267507R771959J0748448J2118988
$$ 139722442 144329520 149248329 152901578 157499070 164766577 174538536 185286984 197405972
2760A97405972J6576673K3148306K5618110L3596820M7532599O2767326L4140804
$$ 197405972 213982645 237130951 262749061 296345881 343878480 406645806 440786610
2753D40786610l9703242m1374364l4424509k3290786j5515937j2928545p262523
$$ 440786610 401083368 359709004 325284495 301993709 286477772 273549227 266286704
2746B66286704j1672243j0691553r079382r226800p551499l140812K28938n84980
$$ 266286704 254614461 243922908 234843526 225616726 218065227 214924415 215153353 214568373
2738B14568373m548770k959439L97425L140633J959628M0144J126151M137131
$$ 214568373 210019603 207060164 207457589 210598222 212557850 212597994 213724145 217861276
2730B17861276O612164J1295678J8450026K5636994J0515433k3635648k4449923
$$ 217861276 224473440 235769118 254219144 279856138 290371571 266735923 242286000
2723B42286000k0362825j4673188j0907401r317828p022074q657272q504598p936351
$$ 242286000 221923175 207249987 196342586 187024758 180002684 171345412 162840814 154904463
2715A54904463p664767o580867m388924k871882l477730n073091m413457l019989
$$ 154904463 147239696 140658829 136269905 133398023 129920293 124847202 120433745 117413756
2707A17413756k100274l031517m663062n308340n217525m575835m054283l754175
$$ 117413756 115313482 112281965 107618903 102310563 97093038 92517203 88462920 84708745
2699H4708745l652882l635222l350156l011931k745713k666109k460940k248928
$$ 84708745 81055863 77420641 74070485 71058554 68312841 65646732 63185792 60936864
2691F0936864k508737k411679k350961k340418k064551j810563j636032j484185
$$ 60936864 58428127 56016448 53665487 51325069 49260518 47449955 45813923 44329738
2683D4329738j350260j243083j149182j075314j021251r72614r20016q73961q36050
$$ 44329738 42979478 41736395 40587213 39511899 38490648 37518034 36598018 35724057 34888007
2674C4888007p75235p19721o59438o31342o09096o10573n81663o65361r26271
$$ 34888007 34112772 33393051 32733613 32102271 31493175 30882602 30300939 29635578 28709307
2665B8709307p68818o69053q26549q31507p09588o45052n87134n45730m93859
$$ 28709307 27940489 27271436 26444887 25613380 24903792 24258740 23671606 23125876 22632017
2656B2632017m70334m49598m29699m20507l88506l67002l60602l44104l48291
$$ 22632017 22161683 21712085 21282386 20861879 20473373 20106371 19745769 19401665 19053374
2647A9053374l33642l32018l11665l00132k71938k55085k48107k61217l24223
$$ 19053374 18719732 18387714 18076049 17775917 17503979 17248894 17000787 16739570 16415347
2638A6415347m63433m19922l74231l50773l26616l10165k74180k38083k23575
$$ 16415347 15951914 15531992 15157761 14806988 14480372 14170207 13896027 13657944 13434369
2629A3434369k01137j93015k01504k01588k03606j84829j99766j95772j95484
$$ 13434369 13233232 13040217 12838713 12637125 12433519 12248690 12048924 11853152 11657668
2620A1657668j77886j75306j72021j45252j42567j54944j46831j50951j36677
$$ 11657668 11479782 11304476 11132455 10987203 10844636 10689692 10542861 10391910 10255233
2611A0255233j30213j46772j39289j41706j39105j44269j43887j15577j16711
$$ 10255233 10125020 9978248 9838959 9697253 9558148 9413879 9269992 9154415 9037704
2602I037704j10600j07612j03445j00755j10635r2328r9483j17287j30899j23589
$$ 9037704 8927104 8819492 8716047 8615292 8504657 8412329 8312846 8195559 8064660 7941071
2592G941071j19811j22931j16763r3162q9534j00947j04591j08014r2452r6749
$$ 7941071 7821260 7698329 7581566 7488404 7398870 7297923 7193332 7085318 6992866 6896117
2582F896117j02447r7876r3544r2880r4195r1891r2151r4819r9299r4369q7723
$$ 6896117 6793670 6695794 6602250 6509370 6415175 6323284 6231133 6136314 6037015 5942646 5854923
2571E854923q7325p9581p3790p4891q0160q8437r2309r3419q8166q5946q0914
$$ 5854923 5767598 5688017 5614227 5539336 5459176 5370739 5278430 5185011 5096845 5010899 4929985
2560D929985p1187p4246o9309o5176o2594n5280n3517o7557q2136p5422o8799
$$ 4929985 4858798 4784552 4715243 4650067 4587473 4532193 4478676 4411119 4328983 4253561 4184762
2549D184762o7735o3293o1292m9315m5134l7673l6917m6351k7485k8135m160J2709
$$ 4184762 4117027 4053734 3992442 3943127 3897993 3860320 3823403 3777052 3749567 3721432 3717272 3729981
2537C729981K3613L1445P0636J06074J30441p7480j55774j45634j07608p9886
$$ 3729981 3753594 3785039 3855675 3961749 4092190 4014710 3858936 3713302 3605694 3525808
2527C525808q4960p5701p2264o8792o2347o7051n6524m3193k3169j0725j7398
$$ 3525808 3440848 3365147 3292883 3224091 3161744 3094693 3038169 2994976 2971807 2961082 2943684
2516B943684k5819j6433J273R848J5320M0631P7301R6316J23700J97541K75922
$$ 2943684 2917865 2901432 2902705 2912553 2927873 2968504 3045805 3142121 3265821 3463362 3739284
2505C739284L07327j97642k66780k38803j75580j30618j14454p4372r3752r9558
$$ 3739284 4046611 3848969 3582189 3343386 3167806 3037188 2922734 2848362 2754610 2655052
2495B655052p9342q0978p7007n3930l6604l0954n1988m4736k8503j1395m401k5536
$$ 2655052 2575710 2494732 2417725 2363795 2327191 2296237 2244249 2199513 2171010 2159615 2155214 2129678
2483B129678k4276l735J0501K5178O2122J03050Q7912j29928j53536j42902j05273
$$ 2129678 2105402 2101667 2112168 2137346 2199468 2302518 2390430 2260502 2106966 1964064 1858791
2472A858791q0944p6309n8438o5224o6895o5749n3900o0572m9222l5525m0663
$$ 1858791 1777847 1701538 1643100 1577876 1510981 1445232 1391332 1330760 1281538 1246013 1205350
2461A205350m3699m6778l2344k6879k4341m0062m7846m4222m2704l4709m1872
$$ 1205350 1161651 1114873 1082529 1055650 1031309 991247 943401 899179 856475 821766 779894
2450G79894k5312m2369k8249l1690l8132k8527k1430k7730k2352l0560k2506k2540
$$ 779894 754582 712213 683964 652274 614142 585615 564185 536455 514103 483543 461037 438497
2438D38497k5521k1909k2118k2884j7002k3496j8383j1684k1324j3220j6511j6661
$$ 438497 412976 391067 368949 346065 329063 305567 287184 275500 254176 240956 224445 207784
2426B07784j8020j3368j5160j1659j4212r770j6452j4988j3454j7053p528j5822
$$ 207784 189764 176396 161236 149577 135365 125595 109143 94155 80701 63648 56120 40298
2414D0298j1964j0919j8903r369j3042j8247m380j6241p654j2343q623j6177j1182
$$ 40298 28334 17415 -1488 -10857 -23899 -42146 -46526 -62767 -70421 -82764 -91387 -107564 -118746
2401a18746n301j0445p617p000j2036j0143j1003j0560o834j5576r196j1440l849
$$ -118746 -124047 -134492 -142109 -149109 -161145 -171288 -182291 -192851 -199685 -215261 -224457 -235897 -239746
2388b39746j3360j0657m656n258o907m301j0243q990o085p528n372r317p195l924
$$ -239746 -253106 -263763 -268419 -273677 -280584 -284885 -295128 -304118 -310203 -317731 -323103 -332420 -339615 -343539
2374c43539o748r364p451p288j0913l091r968o633m239p842m004r551n956k992
$$ -343539 -350287 -359651 -367102 -374390 -385303 -388394 -398362 -404995 -409234 -417076 -421080 -430631 -436587 -439579
2360d39579q804k086j526o250k035K067l250p978n290p821J487q885k631n094
$$ -439579 -448383 -450469 -451995 -458245 -460280 -458213 -461463 -469441 -474731 -482552 -481065 -489950 -492581 -497675
2346d97675L042q082m770p781J875m698o521l310j934l713m977l903n305Mp080
$$ -497675 -494633 -502715 -507485 -515266 -513391 -518089 -524610 -527920 -529854 -533567 -538544 -542447 -547752 -547748 -554828
2331e54828k727J074j958n229J673n945l753o48m473m056J332k886p480j010Q86
$$ -554828 -557555 -556481 -558439 -563668 -561995 -567940 -571693 -572341 -576814 -580870 -579538 -582424 -589904 -590914 -590028
2316e90028p171p40p85K892m176l458j674P34o127k846l913mm202o46j316n115
$$ -590028 -597199 -597939 -598724 -595832 -600008 -603466 -605140 -604406 -610533 -613379 -617292 -617296 -621498 -622144 -623460 -628575
2300f28575N256o817j991k549O93j815j627l683K12J195j564l84p716K229n242
$$ -628575 -623319 -630136 -632127 -634676 -633983 -635798 -637425 -641108 -640896 -639701 -641265 -641649 -649365 -647136 -652378
2285f52378k753k154L029m548K998j820l441L550l453k357o5j550L105k081m254
$$ -652378 -655131 -657285 -654256 -658804 -655806 -657626 -661067 -657517 -660970 -663327 -663392 -664942 -661837 -663918 -668172
2270f68172q35j449l100j233Q58J160l458J522j478r65q33l549l30j859J147q67
$$ -668172 -669007 -670456 -673556 -674789 -673931 -672771 -676229 -674707 -676185 -677150 -677983 -681532 -681862 -683721 -682574 -683441
2254f83441J446k745k338L54k964J684n349k08j775M60j133N905q533K301k850
$$ -683441 -681995 -684740 -687078 -686724 -689688 -688004 -693353 -693561 -695336 -694876 -696009 -690104 -698637 -696336 -699186
2239f99186o126M480M127N63j821J448j166k206J698K97j58m456r10L532l696
$$ -699186 -705312 -700832 -696705 -696142 -697963 -696515 -697681 -699887 -698189 -697892 -698050 -702506 -703416 -699884 -703580
2224g03580p58J812P12p720J1210m443M08M48r82m772M904n98o02J390m564R715
$$ -703580 -704338 -702526 -701814 -709534 -698324 -702767 -702359 -701911 -702893 -707665 -702761 -703359 -703961 -702571 -707135 -697420
2208f97420p737k686K733k009P336q247J41j610j855j76K419R35n72J701l874
$$ -697420 -705157 -707843 -705110 -707119 -699783 -708030 -707889 -709499 -711354 -711530 -709111 -708176 -708748 -707047 -710921
2193g10921R10J558p85l673N211k027m26N08j390j782k845J296J555J860m924
$$ -710921 -710011 -708453 -709238 -712911 -707700 -709727 -710153 -709645 -711035 -712817 -715662 -714366 -712811 -710951 -715875
2178g15875J554j758L27P170l590N61j997k579K793r67n79l91K152n783k266L655
$$ -715875 -714321 -716079 -715752 -708582 -712172 -711611 -713608 -716187 -713394 -714361 -714940 -715331 -713179 -718962 -721228 -717573
2162g17573j437J134J462j946M326o484L764m802L906l87J899j139Q83L368L703
$$ -717573 -719010 -717876 -716414 -718360 -714034 -720518 -716754 -721556 -717650 -718037 -716138 -717277 -716394 -713026 -709323
2147g09323k974k473p55k58L25q09K683q60j969M313M240L476p519K611K32K064
$$ -709323 -712297 -714770 -715525 -715783 -715458 -716267 -713584 -714444 -716413 -712100 -707860 -704384 -711903 -709292 -709060 -706996
2131g06996K178L489k496L235l518j288r43j750l94j888J636K70k105L256l844
$$ -706996 -704818 -701329 -703825 -700590 -704108 -705396 -706339 -708089 -708483 -710371 -708735 -708465 -710570 -707314 -711158
2116g11158Q540l358j211K66K417m852K238R04l128o47J848j34p25k102J07k713
$$ -711158 -702618 -705976 -707187 -706921 -704504 -709356 -707118 -706214 -709342 -709989 -708141 -708275 -709000 -711102 -710995 -713708
2100g13708P43l830L272K034l63J372L912l531J068k144N60l143M395M96l210
$$ -713708 -712965 -716795 -713523 -711489 -711852 -710480 -706568 -710099 -709031 -711175 -710615 -713758 -709363 -708867 -712077
2085g12077K47M26L748k546L143m18l744O046j424j158k944L953j153N403o198
$$ -712077 -711830 -711404 -707656 -710202 -707059 -707477 -711221 -705175 -706599 -707757 -710701 -706748 -707901 -702498 -708696
2070g08696k301O902L26j132J266M010N66l957K781k835k149J302k620j81K601
$$ -708696 -710997 -704095 -703769 -704901 -703635 -699625 -699059 -703016 -700235 -703070 -705219 -703917 -706537 -706718 -704117
2055g04117J548K65M136k362M834m157M23L191l370L054k920k279N192j531O13
$$ -704117 -702569 -702304 -698168 -700530 -695696 -699853 -699430 -696239 -699609 -696555 -699475 -701754 -696562 -698093 -697480
2040f97480L051m321M005m515L504k27k263K286J307m275K974K021J08m387M27
$$ -697480 -694429 -698750 -694745 -699260 -695756 -695983 -698246 -695960 -694653 -698928 -695954 -693933 -693825 -698212 -697785
2025f97785J112K480l243q10n69M685l017J015k69n753O867j632K590k452K836
$$ -697785 -696673 -694193 -697436 -698246 -698815 -694130 -697147 -696132 -696401 -702154 -695287 -696919 -694329 -696781 -693945
2010f93945k479L23K015J163k469O247p86l801j367o19L479J053k270J750L226
$$ -693945 -696424 -696101 -694086 -692923 -695392 -689145 -689931 -693732 -695099 -695718 -692239 -691186 -693456 -691706 -688480
1995f88480j965r04O503k473j174l056M832K385K308m934J942M00R86l871J211
$$ -688480 -690445 -691349 -684846 -687319 -688493 -691549 -686717 -684332 -682024 -686958 -685016 -684616 -683630 -687501 -686290
1980f86290J811n360M579k437j359K992J085L30o79O137k214m946L166k846R4
$$ -686290 -684479 -689839 -685260 -687697 -689056 -686064 -684979 -684649 -685328 -679191 -681405 -686351 -683185 -686031 -685937
1965f85937j076K170r85L583l260O997l159J668O61j463k19m998L979j856K786
$$ -685937 -687013 -684843 -685828 -682245 -685505 -678508 -681667 -679999 -679338 -680801 -681020 -686018 -682039 -683895 -681109
1950f81109J191L529l050K285m556N198k053M687k269q9K77L370k413N26k863
$$ -681109 -679918 -676389 -679439 -677154 -681710 -676512 -678565 -673878 -676147 -676236 -675959 -672589 -675002 -674476 -677339
1935f77339K375O639n641P488n129N213k756q227Q276L194l912L3K650l130M212
$$ -677339 -674964 -668325 -673966 -666478 -671607 -666394 -669150 -677377 -669101 -665907 -669819 -669786 -667136 -670266 -666054
1920f66054J483k725K132J846j87l723Q50j744J677L582n46n550N48p96K805j777
$$ -666054 -664571 -667296 -665164 -663318 -663505 -667228 -666378 -668122 -666445 -662863 -663409 -668959 -668411 -669207 -666402 -668179
1904f68179N12N773m856l8L902O71K457m670J453M265k624N76m253n74p51R749
$$ -668179 -667667 -661894 -666750 -666788 -662886 -662215 -659758 -664428 -662975 -658710 -661334 -660758 -665011 -665585 -666336 -656587
1888f56587r36o4m185J801M688p32J431m941K525J149N70k583L181L232n373j482
$$ -656587 -657523 -657587 -661772 -659971 -655283 -656015 -654584 -659525 -657000 -655851 -655281 -657864 -654683 -651451 -656824 -658306
1872f58306j162R297n355k403R739j961k740j410L161j272P112n16m965j018j886
$$ -658306 -659468 -650171 -655526 -657929 -648190 -650151 -652891 -654301 -651140 -652412 -645300 -645816 -650781 -651799 -653685
1857f53685J795K066L20m097L844L390j639l574K471j647N550n17k19l37j432
$$ -653685 -651890 -649824 -649504 -653601 -649757 -646367 -648006 -651580 -649109 -650756 -645206 -645723 -645942 -646279 -647711
1842f47711k859O308j835K397l305M272k399N201m986L31N032o014M673j579R47
$$ -647711 -650570 -644262 -646097 -643700 -647005 -642733 -645132 -639931 -644917 -644586 -639554 -645568 -640895 -642474 -641527
1827f41527l175L505L815m254J921l436J771J741j986Q35J187k286M548k097J043
$$ -641527 -644702 -641197 -637382 -641636 -639715 -643151 -641380 -639639 -641625 -640790 -639603 -641889 -637341 -639438 -638395
1812f38395j186r90J539j247K3rR33K023n054O829l085L864k93k184M192n787
$$ -638395 -639581 -640571 -639032 -640279 -640256 -640265 -639332 -637309 -642363 -635534 -638619 -634755 -635048 -637232 -633040 -638827
1796f38827P05r47N836k135n20M259k697K246j639L160k024j880m89M038R40j449
$$ -638827 -638122 -639069 -633233 -635368 -635888 -631629 -634326 -632080 -633719 -630559 -632583 -634463 -634952 -630914 -629974 -631423
1780f31423Q91j777N480m926K775O28N35j339k015K663o138O201j02K475n857
$$ -631423 -630532 -632309 -626829 -631755 -628980 -628352 -627817 -629156 -631171 -628508 -634646 -628445 -628547 -626072 -631929
1765f31929O684n301L082J881J699o601J216N589k789O3L97j104k35J235L420
$$ -631929 -625245 -630546 -627464 -625583 -623884 -630485 -629269 -623680 -626469 -626406 -626009 -627113 -627348 -626113 -622693
1750f22693J754k409n68J838K182l52J08j541L077j312k079j853K192M454N48
$$ -622693 -620939 -623348 -623916 -622078 -619896 -620248 -620140 -621681 -618604 -619916 -621995 -623848 -621656 -617202 -616654
1735f16654l979O77l30Q83N29j141R66R94K47k777M449k221l44k334O010l427
$$ -616654 -620633 -619956 -620286 -619403 -618874 -620015 -619049 -618055 -617808 -620585 -616136 -618357 -618701 -621035 -615025 -618452
1719f18452J525r73J872k142k115M137m744K004L322k892l112K976J610K733J754
$$ -618452 -616927 -617900 -616028 -618170 -620285 -616148 -620892 -618888 -615566 -618458 -621570 -618594 -616984 -614251 -612497
1704f12497j689J487M67l946J057J424J669O09J654m119N9j570J430J826L875
$$ -612497 -614186 -612699 -612232 -616178 -615121 -613697 -612028 -611419 -609765 -613884 -613825 -615395 -613965 -612139 -608264
1689f08264j098j684j99j458qO272m4N47j810n67m309k74J690M402O99n109P26
$$ -608264 -609362 -611046 -611245 -612703 -612711 -606439 -606483 -605936 -607746 -608313 -612622 -612896 -611206 -606804 -606105 -611214 -610488
1672f10488M795l791k84J586P50k00j2K382K136m671j395J535L835l333l25J355
$$ -610488 -605693 -609484 -609768 -608182 -607432 -607632 -607644 -605262 -603126 -607797 -609192 -607657 -603822 -607155 -607480 -606125
1656f06125k932L111k998l746O179r19L450n423J002K356L384O82k944j582M965
$$ -606125 -609057 -605946 -608944 -612690 -606511 -607430 -603980 -609403 -608401 -606045 -602661 -601979 -604923 -606505 -601540
1641f01540m717M914j631j620o8J182k467j981N910K66q85J51l54M541j967j005
$$ -601540 -606257 -601343 -602974 -604594 -604662 -603480 -605947 -607928 -602018 -601752 -602637 -602486 -602840 -598299 -600266 -601271
1625f01271j418K556J742k073J009j39J842o95m43J047P77m1r57J212m220P638
$$ -601271 -602689 -600133 -598391 -600464 -599455 -599594 -597752 -598447 -598890 -597843 -597066 -597107 -598064 -596852 -601072 -593434
1609e93434n290L514M96K013K35k745J757l48r31M7Q45J229M48N84k860M662j445
$$ -593434 -598724 -595210 -594714 -592701 -592466 -595211 -593454 -593802 -594733 -594686 -593841 -592612 -592164 -591580 -594440 -589778 -591223
1592e91223k607k68j275O660r265Q255l65L658m730K182n906J994Q46M384m062
$$ -591223 -593830 -594098 -595373 -588713 -597978 -589723 -590088 -586430 -591160 -588978 -594884 -592890 -592044 -587660 -591722
1577e91722M855L07l954j415m60O94M017j300l062K930k201l23K006j10j271L458
$$ -591722 -586867 -586560 -590514 -591929 -592389 -591695 -587678 -588978 -592040 -589110 -591311 -591634 -589628 -589738 -591009 -587551
1561e87551n25k023K906N75k829k29O46j516M55J629L888l103M880m412j000L160
$$ -587551 -588076 -590099 -587193 -586618 -589447 -589676 -589030 -590546 -590091 -588462 -584574 -587677 -582797 -587209 -588209 -585049
1545e85049L032l366j447q8M849j818j443J42L870j636j619l24N22j421K673k199
$$ -585049 -582017 -585383 -586830 -586918 -582069 -583887 -585330 -585188 -581318 -582954 -584573 -584897 -584375 -585796 -583123 -585322
1529e85322K007L062q69k40L537m633q77J045J163k934K976K077j208K533k527
$$ -585322 -583315 -580253 -581122 -581362 -577825 -582458 -583335 -582290 -581127 -584061 -581085 -579008 -580216 -577683 -580210
1514e80210k372n325Q690j969N84O84p96K583L15m386M903P26j879j810J590K26
$$ -580210 -582582 -587907 -579217 -581186 -580602 -579918 -580714 -578131 -577816 -582202 -577299 -576573 -578452 -580262 -578672 -578446
1498e78446Q63J471j23l561r54K375O08L95M231n751l65L667P75l40J880m894
$$ -578446 -577583 -576112 -576235 -579796 -580750 -578375 -577767 -577372 -573141 -578892 -579257 -575590 -574815 -575155 -573275 -578169
1482e78169M792m441O600m568l53l02j40Q62l671K678k27j965j300M535K236j605
$$ -578169 -573377 -577818 -571218 -575786 -576139 -576441 -576581 -575719 -579390 -576712 -576939 -578904 -580204 -575669 -573433 -575038
1466e75038L661j761m98j26k026K814l753k46N257m507J309j684K680l518K660
$$ -575038 -571377 -573138 -573636 -573762 -575788 -572974 -576727 -576973 -571716 -576223 -574914 -576598 -573918 -577436 -574776
1451e74776J794K127j117l616Q59j301J416L065n997k018L225O063M094n362P88
$$ -574776 -572982 -570855 -571972 -575588 -574729 -576030 -574614 -571549 -577546 -579564 -576339 -570276 -566182 -571544 -570756
1436e70756l377L948n512K260m11q16k208K438j115L026K721l591L332m467J362
$$ -570756 -574133 -570185 -575697 -573437 -573848 -574664 -576872 -574434 -575549 -572523 -569802 -573393 -570061 -574528 -573166
1421e73166J253L01N186j526n24j42j406k228Q57m82j7J0o18M093J871k947N287
$$ -573166 -571913 -571612 -566426 -567952 -568476 -568618 -570024 -572252 -571395 -571877 -571894 -571884 -572502 -568409 -566538 -569485 -564198
1404e64198R30j035k330L253k416J090P42N67j416l228l16k859K752j054P51K677
$$ -564198 -563268 -564303 -566633 -563380 -565796 -564706 -563964 -563397 -564813 -568041 -568357 -571216 -568464 -569518 -568767 -566090
1388e66090R05j720L473j541J21k322o7J647n65J23K601l389j724l25l210J207
$$ -566090 -565185 -566905 -563432 -564973 -564852 -567174 -567241 -565594 -566159 -566036 -563435 -566824 -568548 -568873 -572083 -570876
1372e70876N89n03L570k177N68m529N296l28J138M067j0068K653M18L731m621
$$ -570876 -570287 -570790 -567220 -569397 -568829 -573358 -568062 -568390 -567252 -563185 -573253 -570600 -570182 -566451 -571072
1357e71072L807o678M215N014m204O95J184k618M297k936P30K697j504l171L063
$$ -571072 -567265 -573943 -569728 -564714 -568918 -568223 -567039 -569657 -565360 -568296 -567566 -564869 -566373 -569544 -566481
1342e66481p08J546j762M143M453l005k75L142k566J783j412L502j833l08k092
$$ -566481 -567189 -565643 -567405 -563262 -558809 -561814 -562089 -558947 -561513 -559730 -561142 -557640 -559473 -559781 -561873
1327e61873M767k527K090m662K474k238M520j513L447K283M345m348Q10k551N72
$$ -561873 -557106 -559633 -557543 -562205 -559731 -561969 -557449 -558962 -555515 -553232 -548887 -553235 -552425 -554976 -554404
1312e54404K243l677M668L918p94r15n884N824k713m897Q685l62l049r98j38K226
$$ -554404 -552161 -555838 -551170 -547252 -548046 -548961 -554845 -549021 -551734 -556631 -547946 -548308 -551357 -552355 -552493 -550267
1296e50267L07j074K667j081N947k321j109L849J333j620m777J090K061j169K562
$$ -550267 -549960 -551034 -548367 -549448 -543501 -545822 -546931 -543082 -541749 -543369 -548146 -547056 -544995 -546164 -543602
1281e43602K657l443K101m76R77o346K843J575j90O660l11J344l084J866j442
$$ -543602 -540945 -544388 -542287 -542763 -541786 -548132 -545289 -543714 -543904 -537244 -537555 -536211 -539295 -537429 -538871
1266e38871K0p863M268K231Q31L110j17l61m27J049o648M808J029k55J959m429
$$ -538871 -538851 -546714 -542446 -540215 -539384 -536274 -536391 -536752 -537179 -536130 -542778 -537970 -536941 -537196 -535237 -539666
1250e39666M730k456K148M816J128r051L739J739l0K989n62n58Q67j341m55m281
$$ -539666 -534936 -537392 -535244 -530428 -529300 -538351 -534612 -532873 -532903 -529914 -530476 -531034 -530167 -531508 -531963 -536244
1234e36244J307j070R60J577N359K077K938l521j224k684K849J861O63L137L18
$$ -536244 -534937 -536007 -535047 -533470 -528111 -526034 -523096 -526617 -527841 -530525 -527676 -525815 -525152 -522015 -521697
1219e21697l884k575J26l708l267L865L95J875K693m2k05M133j025J770j576m09
$$ -521697 -525581 -528156 -528030 -531738 -535005 -531140 -530745 -528870 -526177 -526219 -526424 -522291 -523316 -521546 -523122 -523531
1203e23531p33p54R54N3j168j088l040M383k391l68K993j68k524K873L39O387
$$ -523531 -524264 -525018 -524064 -524011 -525179 -526267 -529307 -524924 -527315 -527683 -524690 -524858 -527382 -524509 -524170 -517783
1187e17783k244l73K85l227o356K459L500j950N493m889M034l700m30N12K496
$$ -517783 -520027 -520400 -520115 -523342 -529698 -527239 -523739 -525689 -520196 -525085 -521051 -524751 -525181 -524669 -522173
1172e22173j073N422q588L952n28q60J779j421k27m1K188M999K025n312n607L695
$$ -522173 -523246 -517824 -526412 -522460 -522988 -523848 -522069 -523490 -523717 -523758 -521570 -516571 -514546 -519858 -525465 -521770
1156e21770K814j965L08n70j918r6J885M36M812n98K26p05q39q3M476l413N31
$$ -521770 -518956 -520921 -520613 -521183 -523101 -523197 -521312 -520876 -516064 -516662 -516436 -517141 -517980 -518063 -513587 -517000 -516469
1139e16469J570Q54j562k317M772l280K12j054j964p02L75J964R009p300k141
$$ -516469 -514899 -514045 -515607 -517924 -513152 -516432 -516220 -517274 -519238 -519940 -519565 -517601 -508592 -515892 -518033
1124e18033L559p630L979J834J081M69m509l78K075j641K186O26j369l94j103
$$ -518033 -514474 -522104 -518125 -516291 -515210 -514741 -519250 -519628 -517553 -519194 -517008 -516382 -517751 -518145 -519248
1109e19248L206J32L125O45j510l858J43K632j795j382K742j773J885l245O226
$$ -519248 -516042 -515910 -512785 -512140 -513650 -517508 -517365 -514733 -516528 -517910 -515168 -516941 -515056 -518301 -512075
1094e12075p90l251J977j700K530m648L203J808J218K494n484K153j242L765o403
$$ -512075 -512865 -516116 -514139 -515839 -513309 -517957 -514754 -512946 -511728 -509234 -514718 -512565 -513807 -510042 -516445
1079e16445K166p33Q80M27k530N281k591J046o186J888L140J095K627l008k122
$$ -516445 -514279 -515012 -514132 -513705 -516235 -510954 -513545 -512499 -518685 -516797 -513657 -512562 -509935 -512943 -515065
1064e15065K692N11q16R7K995m06k141Q1k821j67J540K955J980k934o17J292P90
$$ -515065 -512373 -511862 -512678 -512581 -509586 -509992 -512133 -512052 -514873 -515040 -513500 -510545 -508565 -511499 -512116 -510824 -510034
1047e10034O97L7r81j741j033L327M648k687l62l587K309n252L862J269O403n474
$$ -510034 -509337 -509300 -510281 -512022 -513055 -509728 -505080 -507767 -508129 -511716 -509407 -514659 -510797 -509528 -503125 -508599
1031e08599O85j306j979L924L169j853l684K673l088J089k794K983k320K457L5
$$ -508599 -507914 -509220 -511199 -507275 -504106 -505959 -509643 -506970 -510058 -508969 -511763 -508780 -511100 -508643 -508608
1016e08608k114L567n22L204l924R50K437K757p717O917q00o029K982l756M564
$$ -508608 -510722 -507155 -507677 -504473 -508397 -507447 -505010 -502253 -509970 -503053 -503853 -509882 -506900 -510656 -506092
1001e06092R71J304j358r14k29m298K336N371m160J246N19J337M689m729J637
$$ -506092 -505121 -503817 -505175 -506089 -506318 -510616 -508280 -502909 -507069 -505823 -505304 -503967 -499278 -504007 -502370
986e02370n530j914n6N259J569m181R085q251M503q270K811O410O50k44l495k826
$$ -502370 -507900 -509814 -509870 -504611 -503042 -507223 -498138 -506389 -501886 -510156 -507345 -500935 -500285 -500529 -504024 -506850
970e06850j603M510m111L409J555m923K285k069J761l169O749m534J184J242N843
$$ -506850 -508453 -503943 -508054 -504645 -503090 -508013 -505728 -507797 -506036 -509205 -502456 -506990 -505806 -504564 -498721
955d98721k815l73l822l160p00J827m77J318L705j883J063l786k521O806J795
$$ -498721 -501536 -501909 -505731 -508891 -509591 -507764 -508241 -506923 -503218 -505101 -504038 -507824 -510345 -503539 -501744
940e01744Q58J328l204j879l186J519m01o72J110j001N483j893O68K862O85j0135
$$ -501744 -500886 -499558 -502762 -504641 -507827 -506308 -506709 -507381 -506271 -507272 -501789 -503682 -503014 -500152 -499467 -509602
924e09602L502J429J381O309j180n244j363P87m788K682M58Q952j0035k859j480
$$ -509602 -506100 -504671 -503290 -496981 -498161 -503405 -504768 -503981 -508769 -506087 -505629 -496677 -506712 -509571 -511051
909e11051l24M110L053L279o638p706N105l94J052N13J871k609p272P082J841
$$ -511051 -511375 -507265 -504212 -500933 -507571 -515277 -510172 -510566 -509514 -509001 -507130 -509739 -517011 -509929 -508088
894e08088M773m806m064Q35m040J830R616R43l131o450p563m299R191K347J0687
$$ -508088 -503315 -508121 -512185 -511350 -515390 -513560 -503944 -503001 -506132 -512582 -520145 -524444 -515253 -512906 -502219
879e02219J0895k593j029o890l278o576l099M411j62j981R178n194O162p249k650
$$ -502219 -491324 -493917 -494946 -501836 -505114 -511690 -514789 -510378 -510540 -512521 -503343 -508537 -502375 -509624 -512274
864e12274r059K897N842R249O038o374M075r534j8m847M540J1641J0723p910N069
$$ -512274 -521333 -518436 -512594 -503345 -497307 -503681 -499606 -509140 -509158 -514005 -509465 -497824 -487101 -495011 -489942
849d89942j588L188K131j1487p914n961k395M836l474L181n225l200K990J622
$$ -489942 -491530 -488342 -486211 -497698 -505612 -511573 -513968 -509132 -512606 -509425 -514650 -517850 -514860 -513238
835e13238J2490L034J4964o495j303k846J767J335q887K059N142R62p513J2238
$$ -513238 -500748 -497714 -482750 -489245 -490548 -493394 -491627 -490292 -499179 -497120 -491978 -491016 -498529 -486291
821d86291O976K621n021j0048m607p929N46N648l1r05k621k20k085Q329J71J5873
$$ -486291 -479315 -476694 -481715 -491763 -496370 -504299 -503753 -498105 -498136 -499041 -501662 -501882 -503967 -495638 -495467 -479594
805d79594M154l821Q007J197K471l844j3473n825K585o31N783P69M475j602n216
$$ -479594 -475440 -479261 -471254 -470057 -467586 -471430 -484903 -490728 -488143 -488774 -482991 -482222 -477747 -479349 -484565
790d84565l420q385O595M679M321k142K881p131L989k451k711q44O68J3007L720
$$ -484565 -487985 -496370 -489775 -485096 -480775 -482917 -480036 -487167 -483178 -485629 -488340 -489184 -488516 -475509 -471789
775d71789L85R08r47n217o061p495K229J0659M973l876k522l005q90p87O948K677
$$ -471789 -471404 -470496 -471443 -476660 -482721 -490216 -487987 -477328 -472355 -476231 -478753 -481758 -482648 -483435 -476487 -473810
759d73810k001M202j951m743O694J369k866p671L807l987j96J0550k541j88L154
$$ -473810 -475811 -471609 -473560 -478303 -471609 -470240 -473106 -480777 -476970 -480957 -481153 -470603 -473144 -473332 -470178
744d70178l851l055K003N681m72L634L96o686Q63m941J2255Q0l232M44k693l711
$$ -470178 -474029 -477084 -475081 -469400 -469872 -466238 -465842 -472528 -471665 -476606 -464351 -464271 -467503 -467059 -469752 -473463
728d73463J632K320J145J780P177l438j104l433K392q251K013M936K686m403N013
$$ -473463 -471831 -469511 -468366 -466586 -459409 -462847 -463951 -467384 -464992 -473243 -471230 -466294 -463608 -468011 -462998
713d62998n515N658k786l524n714M410M164J478J960k467K03k361j956K521j185
$$ -462998 -468513 -462855 -465641 -469165 -474879 -470469 -466305 -464827 -462867 -465334 -465131 -467492 -469448 -466927 -468112
698d68112l176P240m839N237n118J1843l200m687l553K069L194j816N971o003
$$ -468112 -471288 -464048 -468887 -463650 -468768 -456925 -460125 -464812 -468365 -466296 -463102 -464918 -458947 -464950
684d64950r66J618p90J943L298l191l13M524p561p73P064k233L881l98m232j589
$$ -464950 -465916 -464298 -465088 -463145 -459847 -463038 -463351 -458827 -466388 -467161 -460097 -462330 -458449 -458847 -463079 -464668
668d64668J112M59L83N511m304R56l319L300k169J096j91J362J106l918J324m130
$$ -464668 -463556 -463097 -462714 -457203 -461507 -460551 -463870 -460570 -462739 -461643 -461834 -460472 -459366 -463284 -461960 -466090
652d66090P306p154K298m87l839L831j194J210J518j361K375k602l349M293O69
$$ -466090 -458784 -465938 -463640 -464127 -467966 -464135 -465329 -464119 -462601 -463962 -461587 -464189 -467538 -463245 -462576
637d62576K766j673k216L311j692j357K189l877J921J963K451j725k523k853L253
$$ -462576 -459810 -461483 -463699 -460388 -462080 -463437 -461248 -465125 -463204 -461241 -458790 -460515 -463038 -465891 -462638
622d62638N915l620L320j488j283p63J197P07n13L763m921m679J577L825k649
$$ -462638 -456723 -460343 -457023 -458511 -459794 -460557 -459360 -458653 -459166 -455403 -460324 -465003 -463426 -459601 -462250
607d62250J362n16R85m20K548j223j07O441k185j85m536k409N212k406r27k264
$$ -462250 -460888 -461404 -460419 -460839 -458291 -459514 -459621 -453180 -455365 -455550 -460086 -462495 -457283 -459689 -460616 -462880
591d62880R10o2k447N473p24J208K110P39p97N2K081n143j91j0K260j167k650
$$ -462880 -461970 -462032 -464479 -459006 -459730 -458522 -456412 -455673 -456470 -456418 -454337 -459480 -459671 -459681 -457421 -458588 -461238
574d61238K967k359p08k852K402j609L635j756R60M364o211L199L401j245k674
$$ -461238 -458271 -460630 -461338 -464190 -461788 -463397 -459762 -461518 -460558 -456194 -462405 -459206 -455805 -457050 -459724
559d59724J79M290l303p17K074m981K314j632J491q40J910l1J737k373L308M66
$$ -459724 -459545 -455255 -458558 -459275 -457201 -462182 -459868 -461500 -460009 -460849 -458939 -458970 -457233 -459606 -456298 -455832
543d55832j550j506J637J936n74m371o76P481l773k283J302M553m253j765P615
$$ -455832 -457382 -458888 -457251 -455315 -455889 -460260 -460936 -453455 -457228 -459511 -458209 -453656 -457909 -459674 -452059
528d52059o296L607j628L40J471K797m160j349L101L393m775M402o356j075q76
$$ -452059 -458355 -454748 -456376 -456036 -454565 -451768 -455928 -457277 -454176 -450783 -455558 -451156 -457512 -458587 -459463
513d59463M422l45m781L565J11K569K445m119k54O30N72K495L414n588j672N409
$$ -459463 -455041 -455386 -460167 -456602 -456491 -453922 -451477 -455596 -455850 -455220 -454648 -452153 -448739 -454327 -455999 -450590
497d50590n617K350j520k199L254j831r60O848n484M156k585J97K451L363j829
$$ -450590 -456207 -453857 -455377 -457576 -454322 -456153 -457113 -450265 -455749 -451593 -454178 -453981 -451530 -448167 -449996
482d49996j8J585m49r84o714J691J445L219m847Q72k157J277j765l725Q261j404
$$ -449996 -450014 -448429 -448878 -449862 -456576 -454885 -453440 -450221 -455068 -454196 -456353 -455076 -456841 -460566 -452305 -453709
466d53709m952M192N025k547l446M893k810K210J292o7q124J978k819M712Q21
$$ -453709 -458661 -454469 -449444 -451991 -455437 -450544 -453354 -451144 -449852 -449919 -458043 -456065 -458884 -454172 -453351
451d53351k012L762l346L283j688L586j479k280K170J382j066J777J470L71l790
$$ -453351 -455363 -451601 -454947 -451664 -453352 -449766 -451245 -453525 -451355 -449973 -451039 -449262 -447792 -447421 -451211
436d51211j270K195l231J7n41J325q4K873M743m889m56J768k099O02K428l929
$$ -451211 -452481 -450286 -453517 -453500 -454041 -452716 -452800 -449927 -445184 -450073 -450529 -448761 -450860 -450258 -447830 -451759
420d51759L268n286J455l330K580L523J31j756k550M672k043J54P109n107Q28
$$ -451759 -448491 -453777 -452322 -455652 -453072 -449549 -449418 -451174 -453724 -449052 -451095 -450941 -443832 -448939 -448111
405d48111j66P27r29Q00j523K396j049J118m985P32L079k522k116L614L912k71
$$ -448111 -448277 -447550 -448479 -447679 -449202 -446806 -447855 -446737 -451722 -450990 -447911 -450433 -452549 -448935 -445023 -445294
389d45294p128Q054o511J730P57J481j370K200l672J210m21k84K674k170J686
$$ -445294 -452422 -444368 -450879 -449149 -448392 -446911 -448281 -446081 -449753 -448543 -448964 -449248 -446574 -448744 -447058
374d47058j772J228j427j75M10j249J289K033j410L973k148j852J289J293j748
$$ -447058 -448830 -447602 -449029 -449204 -448794 -450043 -448754 -446721 -448131 -444158 -446306 -448158 -446869 -445576 -447324
359d47324L469l891J611j55L263n538J721M227k023j723P14J424m624L884m909
$$ -447324 -443855 -447746 -446135 -446290 -443027 -448565 -446844 -442617 -444640 -446363 -445649 -444225 -448849 -444965 -449874
344d49874O796j675K060k278J296m56j492J075J203j653j514J308k637M263k175
$$ -449874 -443078 -444753 -442693 -444971 -443675 -444131 -445623 -444548 -443345 -444998 -446512 -445204 -447841 -443578 -445753
329d45753J983O59J94o81K479k451m716M451K504o983M271J807j331J366l690
$$ -445753 -443770 -443111 -442917 -443598 -441119 -443570 -448286 -443835 -441331 -448314 -444043 -442236 -443567 -442201 -445891
314d45891P83P99K1k606N355Q31k060K834k312k738j766J161L003k020J635k688
$$ -445891 -445108 -444309 -444288 -446894 -441539 -440708 -442768 -439934 -442246 -444984 -446750 -445589 -442586 -444606 -442971 -445659
298d45659L641k975L199K238p229r44n450M606K584j432Q693r673J180N736l427
$$ -445659 -442018 -444993 -441794 -439556 -446785 -447729 -453179 -448573 -445989 -447421 -438728 -448401 -447221 -441485 -444912
283d44912n75P055m138k152j364L120k239K166r5k388M46R09M975m207R78q82
$$ -444912 -445487 -438432 -442570 -444722 -446086 -442966 -445205 -443039 -443134 -445522 -445076 -444167 -439192 -443399 -442421 -443303
267d43303O57O170m604M624o344p85J459K722j075M76j930m00N406k865m019K326
$$ -443303 -442646 -436476 -441080 -436456 -442800 -443585 -442126 -439404 -440479 -440003 -441933 -442333 -436927 -439792 -443811 -441485
251d41485J592L94r32J912j06l773L485L22m307L83j910j230M404p01K743M88
$$ -441485 -439893 -439499 -440431 -438519 -438625 -442398 -438913 -438591 -442898 -442515 -444425 -445655 -441251 -441952 -439209 -438721
235d38721m36j673k751K339J000N098q702L517J56j320m61K446L59j17L151j720
$$ -438721 -439157 -440830 -443581 -441242 -440242 -435144 -443846 -440329 -440173 -441493 -441954 -439508 -439149 -439266 -436115 -437835
219d37835l532k110m80L259r64L588j676N775k241p230J45M132l248Q681n453
$$ -437835 -441367 -443477 -443957 -440698 -441662 -438074 -439750 -433975 -436216 -443446 -443301 -439169 -442417 -433736 -439189
204d39189Q79m477J678j103J309L831o212K081O29K083l723K073k81j356L085
$$ -439189 -438310 -442787 -441109 -442212 -440903 -437072 -443284 -441203 -440574 -438491 -442214 -440141 -440422 -441778 -438693
189d38693k168J128P0K59M773l890K726m706J999j323k194M401N491k985j730
$$ -438693 -440861 -439733 -439663 -439404 -434631 -438521 -435795 -440501 -438502 -439825 -442019 -437618 -432127 -435112 -436842
174d36842L129j618J553n62j848l44K369q00m245J099Q30K207L604n494J209j214
$$ -436842 -433713 -435331 -433778 -434340 -436188 -436532 -434163 -434963 -439208 -438109 -437279 -435072 -431468 -436962 -435753 -436967
158d36967J737j018M87j194P52K213r96j994j117M711n706M228j654j731K752
$$ -436967 -435230 -436248 -435761 -436955 -436203 -433990 -434986 -436980 -438097 -433386 -439092 -434864 -436518 -438249 -435497
143d35497L28K465k967M052J07O98J796k881j451Q33OR73j896j58J908j687K098
$$ -435497 -435169 -432704 -435671 -431619 -431512 -430814 -429018 -431899 -433350 -432517 -432511 -431538 -433434 -433592 -431684 -433371 -431273
126d31273j18K394k483r86n7O83r76P05L719k611L91j234N63j906J173k105K371
$$ -431273 -431391 -428997 -431480 -432466 -432523 -431840 -432816 -432111 -428392 -431003 -430612 -431846 -431283 -433189 -432016 -434121 -431750
109d31750K43n088m30M467m731L684K289K659J84j622N71j848J437l400n43j272
$$ -431750 -431507 -436595 -437025 -432558 -437289 -433605 -431316 -428657 -428473 -430095 -429524 -431372 -429935 -433335 -433878 -435150
93d35150L434K019O65j103M90J167l872K687m636N417J330l530M212m425L707
$$ -435150 -431716 -429697 -429032 -430135 -429645 -428478 -432350 -429663 -434299 -428882 -427552 -431082 -426870 -431295 -427588
78d27588k633r28L622m940L873l168j960M507m302Q29j101L052R80J52q38n21
$$ -427588 -430221 -431149 -427527 -432467 -428594 -431762 -433722 -429215 -433517 -432688 -433789 -430737 -429757 -429605 -430443 -430964
62d30964l871L778j434J530N505j919m86J284l819M081k300R76o99q00K487j522
$$ -430964 -434835 -431057 -432491 -430961 -425456 -427375 -427861 -426577 -430396 -426315 -428615 -427639 -428338 -429138 -426651 -428173
46d28173p1K328j533K080j289l36J145K264O11n82l377J211k199l89k085J648
$$ -428173 -428244 -425916 -427449 -425369 -426658 -426994 -425849 -423585 -422974 -423556 -426933 -425722 -427921 -428310 -430395 -428747
30d28747J126l067J050o42K166J122k175k078K242j762J03K416j150j89K898Q58
$$ -428747 -427621 -430688 -429638 -430280 -428114 -426992 -429167 -431245 -429003 -430765 -430662 -428246 -429396 -429585 -426687 -425829
14d25829K823L662l205K017n41M849r31o66L43l228r80k688l26P03
$$ -425829 -423006 -419344 -422549 -420532 -421073 -416224 -417155 -417821 -417478 -420706 -421686 -424374 -424700 -423997
0d23997
$$ -423997
$$ Imaginary data points
##PAGE= N=2
##DATA TABLE= (X++(I..I)), XYDATA
16383a458934K0140J5723J9633J7853J6752J9081J6811J6970J4991J8940K0174
$$ -1458934 -1438794 -1423071 -1403438 -1385585 -1368833 -1349752 -1332941 -1315971 -1300980 -1282040 -1261866
16372a261866J5121J7747K1532J9010J4829J6207K0690J9098J2612J7335J9255
$$ -1261866 -1246745 -1228998 -1207466 -1188456 -1173627 -1157420 -1136730 -1117632 -1105020 -1087685 -1068430
16361a068430J7926J8180J3061J8087J9191J6659J6944J7882J5157J6869J5738
$$ -1068430 -1050504 -1032324 -1019263 -1001176 -981985 -965326 -948382 -930500 -915343 -898474 -882736
16350h82736J8267J8962J5205J3450K0800J8025J3745J3496J5819J9501J4798
$$ -882736 -864469 -845507 -830302 -816852 -796052 -778027 -764282 -750786 -734967 -715466 -700668
16339g00668J6851J4608J5504J7604J6964J3876J9516J5472J9008J5874J1736
$$ -700668 -683817 -669209 -653705 -636101 -619137 -605261 -585745 -570273 -551265 -535391 -523655
16328e23655J6642J7753J9176J2100J5537J7688J3087J6131J4764J6518J6529
$$ -523655 -507013 -489260 -470084 -457984 -442447 -424759 -411672 -395541 -380777 -364259 -347730
16317c47730J6237J4219J0780J4837J9719J5513J4365J7156J2406J6643J1490
$$ -347730 -331493 -317274 -306494 -291657 -271938 -256425 -242060 -224904 -212498 -195855 -184365
16306a84365J3217J4716J7426R646J7697J2065J6897J3116J1948J6373J0223J6379
$$ -184365 -171148 -156432 -139006 -129360 -111663 -99598 -82701 -69585 -57637 -41264 -31041 -14662
16294a4662J2327J6740J1436J4071J2720Q267J7882J1864J3976J1758J2435J3754
$$ -14662 -2335 14405 25841 39912 52632 60899 78781 90645 104621 116379 128814 142568
16282A42568J3855R976J5068J2432R418J5648J1697J1290J2389J1352J4088P136
$$ 142568 156423 166399 181467 193899 203317 218965 230662 241952 254341 265693 279781 286917
16270B86917J3327J4812J0978P457J2211J7256O300J5002P347J2058J1550J0687
$$ 286917 300244 315056 326034 333491 345702 362958 369258 384260 391607 403665 415215 425902
16258D25902J4129P954J3083N840J1916J1370J2098R803P684J3539O964J2111
$$ 425902 440031 447985 461068 466908 478824 490194 502292 512095 519779 533318 540282 552393
16246E52393Q811P786R255J4517O762R923J1254Q356R256N365J0591Q186N335
$$ 552393 561204 568990 578245 592762 599524 609447 620701 629057 638313 643678 654269 662455 667790
16233F67790J2893R238M229Q864J2290O346Q539O586O416J0957P237P801P916
$$ 667790 680683 689921 694150 703014 715304 721650 730189 736775 743191 754148 761385 769186 777102
16220G77102P790P432R728O623Q025K961R631R486O741M736J0796N520O756P549
$$ 777102 784892 792324 802052 808675 816700 819661 829292 838778 845519 850255 861051 866571 873327 880876
16206H80876M577Q052O423P256N628O326P152O769O428L893M999P170N994M777
$$ 880876 885453 893505 899928 907184 912812 919138 926290 933059 939487 943380 948379 955549 961543 966320
16192I66320M582J0249L044N608M004M628L820P873M814P810j422J1137J890K531
$$ 966320 970902 981151 984195 989803 993807 998435 1002255 1010128 1014942 1022752 1021330 1032467 1034357 1036888
16178A036888O094R229M64O027M378L300N278N03N712M876O861K154L159R402
$$ 1036888 1042982 1052211 1052675 1058702 1063080 1066380 1071658 1072161 1077873 1082749 1089610 1091764 1094923 1104325
16164A104325m792M624M439P964O501j751P542L661Q912m9j894M881J724J786
$$ 1104325 1099533 1104157 1108596 1116560 1123061 1121310 1128852 1132513 1141425 1141376 1139482 1144363 1146087 1147873
16150A147873N331N018O38O547M39L035P864r12O471k631J0633j605J964j443
$$ 1147873 1153204 1158222 1158860 1165407 1165846 1168881 1176745 1175833 1182304 1179673 1190306 1188701 1190665 1189222
16136A189222M690M033l131O462J018M05R04N988J70K762J447M991L09L626J36
$$ 1189222 1193912 1197945 1194814 1201276 1202294 1202699 1203603 1209591 1209761 1212523 1213970 1218961 1219270 1222896 1223032
16121A223032N825j541J116N184j362L753L536l179J129o46Q591j853L329K701
$$ 1223032 1228857 1227316 1228432 1233616 1232254 1236007 1239543 1236364 1237493 1236847 1245438 1243585 1246914 1249615
16107A249615J818p29P868J999m475K625J944K08k229O180J555l277N130J104
$$ 1249615 1251433 1250704 1258572 1260571 1256096 1258721 1260665 1260873 1258644 1264824 1266379 1263102 1268232 1269336
16093A269336j111L149L98N14K092n50K824J47K624L412m888J555J385J175K95
$$ 1269336 1268225 1271374 1271772 1272286 1274378 1273828 1276652 1276799 1279423 1282835 1277947 1279502 1280887 1282062 1282357
16078A282357M580m226K819N960j590k222R3J173K598n296K621l84K728j473K248
$$ 1282357 1286937 1282711 1285530 1291490 1289900 1287678 1287771 1288944 1291542 1286246 1288867 1288483 1291211 1289738 1291986
16063A291986l363J304M869J146O24K824k475J076J509l918O728k69J687j635
$$ 1291986 1288623 1289927 1294796 1295942 1296566 1299390 1296915 1297991 1299500 1295582 1302310 1302041 1303728 1302093
16049A302093l763K496K70k038J751M122K130k893M761j844K52K151k067P6K960
$$ 1302093 1298330 1300826 1301096 1299058 1300809 1304931 1307061 1304168 1308929 1307085 1307337 1309488 1307421 1307497 1310457
16034A310457k612K619j467j37j573j726K643K56R29j261N51L384k495M000N49
$$ 1310457 1307845 1310464 1308997 1308860 1307287 1305561 1308204 1308460 1309389 1308128 1308679 1312063 1309568 1313568 1314117
16019A314117k793K314o373L383k537L640l06j203J146j642j99M511K84k483m24
$$ 1314117 1311324 1313638 1307265 1310648 1308111 1311751 1311445 1310242 1311388 1309746 1309547 1314058 1314342 1311859 1311435
16004A311435J324K784o633K132K575r34k555L259j725J449L208j932O601l98
$$ 1311435 1312759 1315543 1308910 1311042 1313617 1312683 1310128 1313387 1311662 1313111 1316319 1314387 1320988 1320590
15990A320590k441k551l35j338J070K958Q40l513M09K258L284m251O508q124L694
$$ 1320590 1318149 1315598 1315263 1313925 1314995 1317953 1318793 1315280 1315689 1317947 1321231 1316980 1323488 1315364 1319058
15975A319058o39J920j600J519N45K72K757l345l837L233j33M91P42k276j766
$$ 1319058 1318419 1320339 1318739 1320258 1320803 1321075 1323832 1320487 1316650 1319883 1319750 1320241 1320983 1318707 1316941
15960A316941L526J523l52l178K605J336k15L408n753J33K048l00n25L647p169
$$ 1316941 1320467 1321990 1321638 1318460 1321065 1322401 1322186 1325594 1319841 1319974 1322022 1321722 1321197 1324844 1317675
15945A317675J01J501L820m652J931N351o111K613M733m300k483J251J027K641
$$ 1317675 1317776 1319277 1323097 1318445 1320376 1325727 1319616 1322229 1326962 1322662 1320179 1321430 1322457 1325098
15931A325098o39k309L156Q68m511M097l7m029K531j594K457J614j608P36J067
$$ 1325098 1324459 1322150 1325306 1326174 1321663 1325760 1325723 1321694 1324225 1322631 1325088 1326702 1325094 1325830 1326897
15916A326897k21k499J533K65k940M297l756M322K616j317j873l59k508K930R81
$$ 1326897 1326676 1324177 1325710 1325975 1323035 1327332 1323576 1327898 1330514 1329197 1327324 1326965 1324457 1327387 1328368
15901A328368o95J098k35j711j722L223K254o456M423m068M138k12J689n519K363
$$ 1328368 1327673 1328771 1328536 1326825 1325103 1328326 1330580 1324124 1328547 1324479 1328617 1328405 1330094 1324575 1326938
15886A326938L126k345k99j575j6M674J088r47o14m91L009Mj292j081l125O360
$$ 1326938 1330064 1327719 1327420 1325845 1325829 1330503 1331591 1330644 1330030 1329539 1332548 1332552 1331260 1330179 1327054 1333414
15870A333414p26l210L113L772m424J821j022m128L916m66K744l363j09J825K9
$$ 1333414 1332688 1329478 1332591 1336363 1331939 1333760 1332738 1328610 1332526 1332060 1334804 1331441 1331332 1333157 1333186
15855A333186l192L549j77j075p90L802J486k828J623j617l115J798K31R71m82
$$ 1333186 1329994 1333543 1333366 1332291 1331501 1335303 1336789 1333961 1335584 1333967 1330852 1332650 1332881 1333852 1333370
15840A333370r20K108L781n113K538Q2j417L207m209K542k425k975P360k239j507
$$ 1333370 1332450 1334558 1338339 1333226 1335764 1335846 1334429 1337636 1333427 1335969 1333544 1330569 1337929 1335690 1334183
15825A334183M340m857M581k499O2J342l539J926L322j665J972j597l010J422
$$ 1334183 1338523 1333666 1338247 1335748 1335810 1337152 1333613 1335539 1338861 1337196 1339168 1337571 1334561 1335983
15811A335983P82k539K937N6j646L643m316M176j29l70J130K15J918k824J901
$$ 1335983 1336765 1334226 1337163 1337219 1335573 1339216 1334900 1339076 1338947 1338577 1339707 1339922 1341840 1339016 1340917
15796A340917n044P304k285l371L188m909M153K69Q0j557K91j037K374o67K449
$$ 1340917 1335873 1343177 1340892 1337521 1340709 1335800 1339953 1340222 1340302 1338745 1339036 1337999 1340373 1339706 1342155
15781A342155K524n319r99K36L010Q08K98l28j750j660J879L325J28j702M616
$$ 1342155 1344679 1339360 1338361 1338597 1341607 1342415 1342713 1342385 1340635 1338975 1340854 1344179 1344307 1342605 1347221
15766A347221j992j821j372J756l553O412n731J422J833L965l31m764K987M331
$$ 1347221 1345229 1343408 1342036 1343792 1340239 1346651 1340920 1342342 1344175 1348140 1347809 1343045 1346032 1350363
15752A350363j063n777L841k381N424m025J519M19m50K163q21l86O55Q5k380j943
$$ 1350363 1349300 1343523 1347364 1344983 1350407 1346382 1347901 1348320 1347870 1350033 1349212 1348826 1349481 1349566 1347186 1345243
15736A345243K242j373L351j807q45K375l592L284m702P98N399k521L61k856L953
$$ 1345243 1347485 1346112 1349463 1347656 1346811 1349186 1345594 1348878 1344176 1344974 1350373 1347852 1348213 1345357 1349310
15721A349310l256j209Q18L854m841M345r25r85l40P58J795O34Lq60j263J50Q138
$$ 1349310 1346054 1344845 1345663 1349517 1344676 1349021 1348096 1347111 1346771 1347529 1349324 1349958 1349961 1349101 1347838 1347988 1356126
15704A356126n562m37N130o862N180l48M347j999j492q12K653L310n877L959o4
$$ 1356126 1350564 1350127 1355257 1348395 1353575 1353227 1357574 1355575 1354083 1353271 1355924 1359234 1353357 1357316 1357252
15689A357252r98N75J8K412l426K463l830K961j523k262L585l784J085P69J424
$$ 1357252 1356254 1356829 1356847 1359259 1355833 1358296 1354466 1357427 1355904 1353642 1357227 1353443 1354528 1355297 1356721
15674A356721N39J746J93m624R11L831p549P42%K276l142L255%j009R21N53j194
$$ 1356721 1357260 1359006 1359199 1354575 1355486 1359317 1351768 1352510 1352510 1354786 1351644 1354899 1354899 1353890 1354811 1355364 1354170
15657A354170l081O920p960O708n605R846k378j14k105q86k491K563L104j975
$$ 1354170 1351089 1358009 1350049 1356757 1351152 1360998 1358620 1358506 1356401 1355515 1353024 1355587 1358691 1356716
15643A356716m51j626K759K365m030P352K69l261o01L118Q06J185j283r47j475
$$ 1356716 1356265 1354639 1357398 1359763 1355733 1363085 1363354 1360093 1359492 1362610 1363416 1364601 1363318 1362371 1360896
15628A360896m52J132J272j631M753R37N20K668l509j379K395R99l345K286n983
$$ 1360896 1360444 1361576 1362848 1361217 1365970 1366907 1367427 1370095 1366586 1365207 1367602 1368601 1365256 1367542 1361559
15613A361559N606k082L916m455N39q69j836K768l05k837L185k613l32O29m552
$$ 1361559 1367165 1365083 1368999 1364544 1365083 1364214 1362378 1365146 1364841 1362004 1365189 1362576 1362244 1362873 1358321
15598A358321N87R47L21l20R44m771K863K77L633n334J896N508j394k128O09L546
$$ 1358321 1358908 1359855 1360176 1359856 1360800 1356029 1358892 1359169 1362802 1357468 1359364 1364872 1363478 1361350 1361959 1365505
15582A365505n40L47K994j563k002J1J503n416N540j616N12K934R44l220L466
$$ 1365505 1364965 1365312 1368306 1366743 1364741 1364752 1366255 1360839 1366379 1364763 1365275 1368209 1369153 1365933 1369399
$$ [...]
##END NTUPLES=NMR SPECTRUM
##END=
