##TITLE=abcd
##JCAMPDX= 6.0         $$ Bruker NMR JCAMP-DX V2.0
##DATA TYPE= NMR SPECTRUM
##DATA CLASS= NTUPLES
##ORIGIN= UXNMR, Bruker Analytische Messtechnik GmbH
##OWNER= root
$$ XWIN-NMR		Version 3.5
$$ Wed Aug 13 12:00:52 2025 Russian Standard Time (UT+4h)  servis@DPX200
##.OBSERVE FREQUENCY= 200.131235884673
##.OBSERVE NUCLEUS= ^1H
##.ACQUISITION MODE= SIMULTANEOUS
##.ACQUISITION SCHEME= undefined
##.AVERAGES= 32
##.DIGITISER RES= 18
##SPECTROMETER/DATA SYSTEM= spect
##.PULSE SEQUENCE= zg
##.SOLVENT NAME= CDCl3
##.SHIFT REFERENCE= (INTERNAL, CDCl3, 0, 16.4885)
##AUDIT TRAIL= $$ (NUMBER, WHEN, WHO, WHERE, WHAT)
$$ ##TITLE= Audit trail, XWIN-NMR		Version 3.5
$$ ##JCAMPDX= 5.01
$$ ##ORIGIN= Bruker BioSpin GmbH
$$ ##OWNER= servis
$$ F:\spectra/data/av/nmr/H1/1/pdata/1/auditp.txt
$$ ##AUDIT TRAIL=  $$ (NUMBER, WHEN, WHO, WHERE, WHAT)
(   1,<2025-08-13 11:58:37.26 +0400>,<servis>,<DPX200>,
      <created by zg, POWCHK disabled, PULCHK disabled
       configuration hash MD5:
       00 E9 B6 7A A2 85 ED C7 34 08 36 98 17 FE 4E 26
       data hash MD5: 32K
       0A F7 63 F6 92 FE A8 92 64 A1 03 49 83 DB 47 1F>)
(   2,<2025-08-13 11:59:27.93 +0400>,<servis>,<DPX200>,
      <Start of raw data processing
       efp BC_mod = 2 LB = 0.05 FT_mod = 6 PKNL = 1 PHC0 = -201.7426 PHC1 = 6.301552 SI = 16K 
       data hash MD5: 16K
       E2 43 45 C5 7A 23 F2 E6 44 17 58 0B C6 DA D3 8C>)
(   3,<2025-08-13 11:59:43.78 +0400>,<servis>,<DPX200>,
      <pk PHC0 = 10.6 PHC1 = 0 
       data hash MD5: 16K
       40 C8 FD 10 1C B4 EE 9D A9 6C 46 30 CA D6 99 AB>)
$$ ##END=
$$ 
$$ hash MD5
$$ 71 02 92 A4 07 C0 88 1D 0E D5 35 54 21 7F A1 5B
##$RELAX= 
##$RELAX= 
##$RELAX= 
##$RELAX= 
##$RELAX= 
##$RELAX= 
##$RELAX= 
##$RELAX= 
$$ Bruker specific parameters
$$ --------------------------
##$DU= <F:\spectra>
##$EXPNO= 1
##$NAME= <H1>
##$PROCNO= 1
##$TYPE= <nmr>
##$USER= <av>
##$AMP= (0..31)
100 100 100 100 100 100 100 100 100 100 100 100 100 100 100 100 100 100 
100 100 100 100 100 100 100 100 100 100 100 100 100 100 
##$AQSEQ= 0
##$AQ_mod= 1
##$AUNM= <au_zg>
##$AUTOPOS= <>
##$BF1= 200.13
##$BF2= 200.13
##$BF3= 200.13
##$BF4= 200.13
##$BF5= 500.13
##$BF6= 500.13
##$BF7= 500.13
##$BF8= 500.13
##$BYTORDA= 1
##$CFDGTYP= 0
##$CFRGTYP= 5
##$CHEMSTR= <none>
##$CNST= (0..31)
1 1 145 1 1 1 1 1 1 1 1 1 1 1 1 1 1 1 1 1 1 1 1 1 1 1 1 1 1 1 1 1 
##$CPDPRG= <>
##$CPDPRG1= <>
##$CPDPRG2= <>
##$CPDPRG3= <>
##$CPDPRG4= <mlev>
##$CPDPRG5= <mlev>
##$CPDPRG6= <mlev>
##$CPDPRG7= <mlev>
##$CPDPRG8= <mlev>
##$CPDPRGB= <>
##$CPDPRGT= <>
##$D= (0..31)
0 2 0 0 0 0 0 0 0 0.06 0 0 0 0 0 0 0.0002 0 0 0 0 0 0 0 0 0 0 0 0 0 0 
0 
##$DATE= 1755071916
##$DBL= (0..7)
120 120 120 120 120 120 120 120 
##$DBP= (0..7)
150 150 150 150 150 150 150 150 
##$DBP07= 0
##$DBPNAM0= <>
##$DBPNAM1= <>
##$DBPNAM2= <>
##$DBPNAM3= <>
##$DBPNAM4= <>
##$DBPNAM5= <>
##$DBPNAM6= <>
##$DBPNAM7= <>
##$DBPOAL= (0..7)
0.5 0.5 0.5 0.5 0.5 0.5 0.5 0.5 
##$DBPOFFS= (0..7)
0 0 0 0 0 0 0 0 
##$DE= 6
##$DECBNUC= <off>
##$DECIM= 32
$$ [...]
##$SUBNAM4= <"">
##$SUBNAM5= <"">
##$SUBNAM6= <"">
##$SUBNAM7= <"">
##$SUBNAM8= <"">
##$SUBNAM9= <"">
##$SW= 20.6817932712277
##$SWIBOX= (0..15)
0 0 3 0 0 0 0 0 0 0 0 0 0 0 0 0 
##$SW_h= 4139.07284768212
##$TD= 32768
##$TD0= 1
##$TE= 0
##$TE2= 300
##$TE3= 300
##$TEG= 300
##$TL= (0..7)
0 120 120 120 120 120 120 120 
##$TP= (0..7)
150 150 150 150 150 150 150 150 
##$TP07= 0
##$TPNAME0= <>
##$TPNAME1= <>
##$TPNAME2= <>
##$TPNAME3= <>
##$TPNAME4= <>
##$TPNAME5= <>
##$TPNAME6= <>
##$TPNAME7= <>
##$TPOAL= (0..7)
0.5 0.5 0.5 0.5 0.5 0.5 0.5 0.5 
##$TPOFFS= (0..7)
0 0 0 0 0 0 0 0 
##$TUNHIN= 0
##$TUNHOUT= 0
##$TUNXOUT= 0
##$USERA1= <user>
##$USERA2= <user>
##$USERA3= <user>
##$USERA4= <user>
##$USERA5= <user>
##$V9= 5
##$VALIST= <valist>
##$VCLIST= <CCCCCCCCCCCCCCC>
##$VD= 0
##$VDLIST= <DDDDDDDDDDDDDDD>
##$VPLIST= <PPPPPPPPPPPPPPP>
##$VTLIST= <TTTTTTTTTTTTTTT>
##$WBST= 1024
##$WBSW= 30
##$XGAIN= (0..3)
0 0 0 0 
##$XL= 0
##$YL= 0
##$YMAX_a= 43420
##$YMIN_a= -33200
##$ZGOPTNS= <>
##$ZL1= 120
##$ZL2= 120
##$ZL3= 120
##$ZL4= 120
##$ABSF1= 0
##$ABSF2= 0
##$ABSG= 0
##$ABSL= 0
##$ALPHA= 0
##$AQORDER= 0
##$ASSFAC= 0
##$ASSFACI= 0
##$ASSFACX= 0
##$ASSWID= 0
##$AUNMP= <proc_1d>
##$AZFE= 0.1
##$AZFW= 0.1
##$BCFW= 0
##$BC_mod= 2
##$BYTORDP= 0
##$COROFFS= 0
##$CY= 18.4799938201904
##$DATMOD= 1
##$DC= 0
##$DFILT= <>
##$DTYPP= 0
##$F1P= 9.9274215381318
##$F2P= -0.165520771350173
##$FCOR= 1
##$FTSIZE= 16384
##$FT_mod= 6
##$GAMMA= 0
##$GB= 0
##$INTBC= 1
##$INTSCL= 4.127829e-11
##$ISEN= 128
##$LB= 0.05
##$LEV0= 0
##$LPBIN= 0
##$MAXI= 10000
##$MC2= 0
##$MEAN= 0
##$ME_mod= 0
##$MI= 50
##$NCOEF= 0
##$NC_proc= -10
##$NLEV= 6
##$NOISF1= 3.799351
##$NOISF2= 2.8
##$NSP= 0
##$NTH_PI= 0
##$NZP= 0
##$OFFSET= 16.48848
##$PC= 4
##$PHC0= -191.1426
##$PHC1= 6.301552
##$PH_mod= 1
##$PKNL= yes
##$PPARMOD= 0
##$PSCAL= 4
##$PSIGN= 0
##$REVERSE= no
##$SF= 200.130005582386
##$SI= 16384
##$SIGF1= 3
##$SIGF2= 2
##$SINO= 400
##$SIOLD= 16384
##$SREGLST= <1H.CDCl3>
##$SSB= 0
##$STSI= 16384
##$STSR= 0
##$SW_p= 4139.07284768211
##$SYMM= 0
##$S_DEV= 0
##$TDeff= 32768
##$TDoff= 0
##$TI= <>
##$TILT= no
##$TM1= 0
##$TM2= 0
##$TOPLEV= 0
##$USERP1= <user>
##$USERP2= <user>
##$USERP3= <user>
##$USERP4= <user>
##$USERP5= <user>
##$WDW= 1
##$XDIM= 16384
##$YMAX_p= 433215151
##$YMIN_p= -23002842
$$ End of Bruker specific parameters
$$ ---------------------------------
##NTUPLES= NMR SPECTRUM
##VAR_NAME=  FREQUENCY,     SPECTRUM/REAL,   SPECTRUM/IMAG
##SYMBOL=    X,             R,               I
##VAR_TYPE=  INDEPENDENT,   DEPENDENT,       DEPENDENT
##VAR_FORM=  AFFN,          ASDF,            ASDF
##VAR_DIM=   16384,         16384,           16384
##UNITS=     HZ,            ARBITRARY UNITS, ARBITRARY UNITS
##FACTOR=    0.252644378177508, 1,           1
##FIRST=     3299.83951724647, 0,            0
##LAST=      -839.233330435636, 0,           0
##MIN=       -839.233330435636, -23002842,   0
##MAX=       3299.83951724647, 433215151,    0
$$ Real data points
##PAGE= N=1
##DATA TABLE= (X++(R..R)), XYDATA
$$ [...]
7542A255776l70207k92971P3077R3123m70911J66538J56547N04367j40342J99989
$$ 1255776 885569 592598 665675 758798 287887 454425 610972 1115339 974997 1174986
7532A174986l82643L17364n27162R0415K40754o03112o5647N93540j44778l05512
$$ 1174986 792343 1109707 582545 672960 913714 310602 244955 838495 693717 388205
7522C88205J17114L40637N00940j013859P33102k18439k36707j0473M05272k98953
$$ 388205 505319 845956 1346896 333037 1066139 847700 610993 600520 1005792 706839
7512G06839M01649l92544O39621j46868j10020J02318K12261k07549p4869J78937
$$ 706839 1108488 715944 1355565 1208697 1098677 1200995 1413256 1205707 1130838 1309775
7502A309775p23548N36911r9782J9299m8026l04961J209j44689L07320k98120
$$ 1309775 586227 1123138 1023356 1042655 994629 689668 690877 546188 853508 555388
7492E55388P06360P4465j11847k10226J28482l29242J28750l33075L54020P3963
$$ 555388 1261748 1336213 1224366 1014140 1142622 813380 942130 609055 963075 1037038
7482A037038K11638N42534n49128l85015L6940Q61802p15291j1040J53518j55400
$$ 1037038 1248676 1791210 1242082 857067 894007 1755809 1040518 1029478 1182996 1027596
7472A027596J07241K0481M82007o3669l84322M01140R878O0966N51J88481M9494
$$ 1027596 1134837 1155318 1637325 1573656 1189334 1590474 1600352 1661318 1661869 1850350 1899844
7461A899844Q9088K38086r03436O34480L2554K23903n23706L54178L2447N3099
$$ 1899844 1988932 2227018 1323582 1958062 1990616 2214519 1690813 2044991 2077438 2130537
7451B130537K89147K12395k38575q7220o5510N03177K20717k4707k26820J06971
$$ 2130537 2419684 2632079 2393504 2306284 2240774 2743951 2964668 2939961 2713141 2820112
7441B820112l37597O19574O7495n9975j10534M52654k31805K61022M39692j23507
$$ 2820112 2482515 3102089 3169584 3109609 2999075 3451729 3219924 3480946 3920638 3797131
7431C797131l37064K39775j23826l87078p622M3892j96216k2795k47374O73091
$$ 3797131 3460067 3699842 3576016 3188938 3181316 3225208 3028992 3006197 2758823 3431914
7421C431914k70971P1142n08663L22956J07028k61672r1258R6069M3320O4648
$$ 3431914 3160943 3232085 2723422 3046378 3153406 2891734 2800476 2896545 2939865 3004513
7411C004513l10724k41415k37587L17842n73629r118O97643J15405n9367P6933
$$ 3004513 2693789 2452374 2214787 2532629 1959000 1949882 2647525 2762930 2703563 2780496
7401B780496q66107l79896O16198m38222O89005l99340J03297k33089L546M43317
$$ 2780496 1914389 1534493 2150691 1712469 2401474 2002134 2105431 1872342 1875888 2319205
7391B319205j47583k4824n6773p3794M26060q07141O06355m96202K54969K85867
$$ 2319205 2171622 2146798 2090025 2016231 2442291 1635150 2241505 1745303 2000272 2286139
7381B286139q10156M19977O4155k83407P8388L80046k54657O9588M20307m67481
$$ 2286139 1475983 1895960 1960115 1676708 1755096 2135142 1880485 1950073 2370380 1902899
7371A902899L65808r5342o42620Q08449j5634k42602Q9628J04761L91221m1224
$$ 1902899 2268707 2173365 1530745 2339194 2323560 2080958 2170586 2275347 2666568 2625344
7361B625344k53785M69835o51798j01856N10424j69557k13777L73712j90127R3734
$$ 2625344 2371559 2841394 2189596 2087740 2598164 2428607 2214830 2588542 2398415 2492149
7351B492149j65396R62248o18376L16413J74808o53048k54260N80810k2866K64253
$$ 2492149 2326753 3289001 2670625 2987038 3161846 2508798 2254538 2835348 2812482 3076735
7341C076735j99647N896J30612n89258N40620J42602k67315P24449k76540L52216
$$ 3076735 2877088 2882984 3013596 2424338 2964958 3107560 2840245 3564694 3288154 3640370
7331C640370l92563N52062l99900j7659N9540k17649k58708L66545j46536N21276
$$ 3640370 3247807 3799869 3399969 3382310 3441850 3224201 2965493 3332038 3185502 3706778
7321C706778o26399M28106K45130j82987N36756o10902J07993j98093N40705k42303
$$ 3706778 3080379 3508485 3753615 3570628 4107384 3496482 3604475 3406382 3947087 3704784
7311C704784k53700j63380n8452M26449n573L10429o322O6873k82384Q6403J0566
$$ 3704784 3451084 3287704 3229252 3655701 3650128 3960557 3954235 4021108 3738724 3825127 3835693
7300C835693k74940O10352o15039L80105K51540p82933N27777O00656k31964k09950
$$ 3835693 3560753 4171105 3556066 3936171 4187711 3404778 3932555 4533211 4301247 4091297
7290D091297m58033M12988O14701k79891j13134L83503m65403l9264J06932M7313
$$ 4091297 3633264 4046252 4660953 4381062 4267928 4651431 4186028 4146764 4253696 4301009
7280D301009J17504k30146j21371N45906k70233k9571K71957J12992K9661l07276
$$ 4301009 4418513 4188367 4066996 4612902 4342669 4313098 4585055 4698047 4727708 4420432
7270D420432M17249l07842N58202m00934N57599j91242J85313Q9637j51908P77148
$$ 4420432 4837681 4529839 5088041 4687107 5244706 5053464 5238777 5328414 5176506 5953654
7260E953654o29860N50414r495l21645j07530O09943Q335J3731O59316l30462
$$ 5953654 5323794 5874208 5864713 5543068 5435538 6045481 6053816 6067547 6726863 6396401
7250F396401k21110K01115k9471k92713Q31839m92270P4951J86034L30086k38903
$$ 6396401 6175291 6376406 6346935 6054222 6886061 6393791 6468742 6654776 6984862 6745959
7240F745959K93570o19175L96076P48593q3905L30041k33475m97010O35162j45394
$$ 6745959 7039529 6420354 6816430 7565023 7481118 7811159 7577684 7080674 7715836 7570442
7230G570442N11734O03686j34780n57566O70953l731P0441M56293l0503J47806
$$ 7570442 8082176 8685862 8551082 7993516 8664469 8660738 8731179 9187472 9156969 9304775
7220I304775l8986r2929L23546J13690L06501k68229M12118L24029M17672M04147
$$ 9304775 9265789 9172860 9496406 9610096 9916597 9648368 10060486 10384515 10802187 11206334
7210A1206334K28043k9833L87606l82318M61034M43851J14970k297559M502523
$$ 11206334 11434377 11404544 11792150 11409832 11870866 12314717 12429687 10132128 14634651
7201A4634651o80496K76765j73505L60784Q27085j41137N12068K80550K48093
$$ 14634651 13954155 14230920 14057415 14418199 15245284 15104147 15616215 15896765 16144858
7192A6144858L87856P28611m3107O52314O26103m04148N27670P35950R75669l72858
$$ 16144858 16532714 17261325 17218218 17870532 18496635 18092487 18620157 19356107 20331776 19958918
7182A9958918R82506Q48353N36182J019147P83726L0822L13437J142320N08487
$$ 19958918 20941424 21789777 22325959 23345106 24128832 24159654 24473091 25615411 26123898
7173B6123898P81019J70420R82499P96269O08038J847125k3343O65237R32749
$$ 26123898 26904917 27075337 28057836 28854105 29462143 31309268 31285925 31951162 32883911
7164C2883911O83158J794369R56354K270872J071396J082282R71220J099238K213471
$$ 32883911 33567069 35361438 36317792 38588664 39660060 40742342 41713562 42812800 45026271
7155D5026271K064345J979880J612429J549485J794967J764074K834290K408190
$$ 45026271 47090616 49070496 50682925 52232410 54027377 55791451 58625741 61033931
7147F1033931J593529J677541J592402K009541K077543K431708J650512J913782
$$ 61033931 62627460 64305001 65897403 67906944 69984487 72416195 74066707 75980489
7139G5980489J763169K635635O85539J151102j083211m43711j82109L77123r39641
$$ 75980489 77743658 80379293 81064832 82215934 81132723 80689012 80506903 80884026 79944385
7130G9944385j098538j449726k134364j926565k868239k249802k222629l149971
$$ 79944385 78845847 77396121 75261757 73335192 70466953 68217151 65994522 62844551
7122F2844551k024768k769856k595071l294308j910898j546578j511878k552709
$$ 62844551 60819783 58049927 55454856 52160548 50249650 48703072 47191194 44638485
7114D4638485j351580k151739j463483j178537r26420j956664j244659j38608
$$ 44638485 43286905 41135166 39671683 38493146 37566726 35610062 34365403 34226795
7106C4226795j837953q08672o44993n53995p93787j049205o52862l30448l95529
$$ 34226795 32388842 31580170 30935177 30381182 29587395 28538190 27885328 27554880 27159351
7097B7159351j318228m74936j123438r5270j012635l48076J3224n41659p74560
$$ 27159351 25841123 25366187 24242749 24147479 23134844 22786768 22799992 22258333 21483773
7088B1483773q19246l55283n97751o28606R4728r97543j042300M51763m57469
$$ 21483773 20664527 20309244 19711493 19082887 19177615 18180072 17137772 17589535 17132066
7079A7132066p28400l69352r7558o2955n23269l2167l55329l80807r5783o13229
$$ 17132066 16403666 16034314 15936756 15873801 15350532 15318365 14963036 14582229 14486446 13873217
7069A3873217K32196m38795k94915m7133J09732o32493j455370M72775j02947
$$ 13873217 14105413 13666618 13371703 13324570 13434302 12801809 11346439 11819214 11716267
7060A1716267J56612j067792L9818j38866J62046o14729N84301o36028m61079
$$ 11716267 11872879 10805087 10844905 10706039 10868085 10253356 10837657 10201629 9740550
7051I740550M20885n19215k44015J49587L13310j056902J96063k28790L32524
$$ 9740550 10161435 9642220 9398205 9547792 9861102 8804200 9000263 8771473 9103997
7042I103997o66541P5053l03185K23899k63761n27376L91848K166m18714O7511
$$ 9103997 8437456 8512509 8209324 8433223 8169462 7642086 8033934 8036100 7617386 7684897
7032G684897J90151o85732m20983K13343M35614o00289j54137M27443r08859K5781
$$ 7684897 7875048 7189316 6768333 6981676 7417290 6817001 6662864 7090307 6181448 6207229
7022F207229J60245m27638K06622l40628K51964j94061J95368k89033n21749L08408
$$ 6207229 6367474 5939836 6146458 5805830 6057794 5863733 6059101 5770068 5248319 5556727
7012E556727j94521L66888n76970J84357p83032J73397M82104k17952j1671j83195
$$ 5556727 5362206 5729094 5152124 5336481 4553449 4726846 5208950 4990998 4979327 4796132
7002D796132L07800k52174N9297M21449p18594J58454k33510L87473k82287K10731
$$ 4796132 5103932 4851758 4911055 5332504 4613910 4772364 4538854 4926327 4644040 4854771
6992D854771o80071L16100p8319J37277j20690k22256P56695m15677l29776K2074
$$ 4854771 4174700 4490800 4412481 4549758 4429068 4206812 4963507 4547830 4218054 4240128
6982D240128l86493O84676n31930o53756K61600L295m16134L04261J26267o1913
$$ 4240128 3853635 4538311 4006381 3352625 3614225 3617520 3201386 3505647 3631914 3570001
6972C570001J15880K78913m79045L08477l937l18319J71933j66868N3653j90383
$$ 3570001 3685881 3964794 3485749 3794226 3790289 3471970 3643903 3477035 3530688 3340305
6962C340305n82742M23173q7885K04504l20220L86488l46099M50401q50223n7250
$$ 3340305 2757563 3180736 3092851 3297355 2977135 3363623 3017524 3467925 2617702 2560452
6952B560452J65431r5712Q6061N07112l73235O2991m25708K59076p46146L04145
$$ 2560452 2725883 2630171 2716232 3223344 2850109 2913100 2487392 2746468 2000322 2304467
6942B304467M74679k93996j58190k47883j60570M95037K68166k58642j9181m5458
$$ 2304467 2779146 2485150 2326960 2079077 1918507 2413544 2681710 2423068 2403887 2358429
6932B358429m80984Q91882q1429J07147m75406O65428o35652L9812K11538n71395
$$ 2358429 1877445 2769327 2687898 2795045 2319639 2985067 2349415 2389227 2600765 2029370
6922B029370N27857M3711l62769j29383m6271k41327M69135m16882L17763j3969
$$ 2029370 2557227 2600938 2238169 2108786 2062515 1821188 2290323 1873441 2191204 2177235
6912B177235l67412J316L98172m38692M86701j89839n54366K63959l38678M80843
$$ 2177235 1809823 1811139 2209311 1770619 2257320 2067481 1513115 1777074 1438396 1919239
6902A919239j29480N5803k60926l46151O59360j030K41697m94101K2395O74312
$$ 1919239 1789759 1845562 1584636 1238485 1897845 1896815 2138512 1644411 1666806 2341118
6892B341118j151872N55396J85371j70682J27069J10151n29611K58552j02298
$$ 2341118 1189246 1744642 1930013 1759331 1886400 1996551 1466940 1725492 1623194
6883A623194J62261k83274M87491j4329k67857K52794l08086n44575K53369N5637
$$ 1623194 1785455 1502181 1989672 1975343 1707486 1960280 1652194 1107619 1360988 1416625
6873A416625L8139J32283n30722O05935l24348l0249j51612N43386n70879K39400
$$ 1416625 1454764 1587047 1056325 1662260 1337912 1307663 1156051 1699437 1128558 1367958
6863A367958j77030j21465j47080L77958m51707R34050p17235P25732j43363q4760
$$ 1367958 1190928 1069463 922383 1300341 848634 1782684 1065449 1791181 1647818 1563058
6853A563058j25678k29119M25702l48806j2861l15819K71109L76510p93970P85799
$$ 1563058 1437380 1208261 1633963 1285157 1272296 956477 1227586 1604096 810126 1595925
6843A595925p1507o66150K87825O16944l88767m06901j35156J908M73512K64652
$$ 1595925 1524418 858268 1146093 1763037 1374270 967369 832213 834121 1307633 1572285
6833A572285k53175k52474L74226q648k37210l06631M55996N47598q36974p153
$$ 1572285 1319110 1066636 1440862 1432214 1195004 888373 1344369 1891967 1054993 1047840
6823A047840O5904L941K67182m8764k80032M05854l522m85891K56028O63738p03348
$$ 1047840 1113744 1117685 1384867 1336103 1056071 1461925 1458403 972512 1228540 1892278 1188930
6812A188930q5067N87708l00379j9938j55669R110k57402M77082L3324k91145
$$ 1188930 1103863 1691571 1391192 1371254 1215585 1224695 967293 1444375 1477699 1186554
6802A186554K94501m50080L54976k47531j22904o02870P14061n8372P32833m78459
$$ 1186554 1481055 1030975 1385951 1138420 1015516 412646 1126707 1068335 1801168 1322709
6792A322709M45438o74007K75768o3902m27653J80066m3815j95428N44092j21750
$$ 1322709 1768147 1094140 1369908 1306006 878353 1058419 1014604 819176 1363268 1241518
6782A241518O71362r63857K49099L21131k70572K2157l58966K12133k57894J22435
$$ 1241518 1912880 949023 1198122 1519253 1248681 1270838 911872 1124005 866111 988546
6772I88546J81056j04002R15K64308m92307P30657l23939m34093O31783l05148
$$ 988546 1169602 1065600 1066515 1330823 838516 1569173 1245234 811141 1442924 1137776
6762A137776K98349k36624O3147k77599J30014k48950N1395k72144N27163l23134
$$ 1137776 1436125 1199501 1262648 985049 1115063 866113 917508 645364 1172527 849393
6752H49393J066774l69102r18536M67863J76235N6947l28890k57124N07661m5310
$$ 849393 1916167 1547065 628529 1096392 1272627 1329574 1000684 743560 1251221 1205911
6742A205911L4100J69473o58719O70853K63397o16551J11165J17373L17602m28170
$$ 1205911 1240011 1409484 750765 1421618 1685015 1068464 1179629 1297002 1614604 1186434
6732A186434J69431j2918k02836k63749Q30542o41252j17317J08064M76871K46671
$$ 1186434 1355865 1342947 1140111 876362 1706904 1065652 948335 1056399 1533270 1779941
6722A779941o28298l52525M55124p36659K38814J96209j93782K75111J01680m50636
$$ 1779941 1151643 799118 1254242 517583 756397 952606 758824 1033935 1135615 684979
6712F84979N54783K5446l31373j2752K44058l28462J50517m1627j7342K73756
$$ 684979 1239762 1265208 933835 921083 1165141 836679 987196 945569 928227 1201983
6702A201983n15923N34930o7074n90342J063934p03361O6897j75783j18002K20011
$$ 1201983 686060 1220990 1153916 563574 1627508 924147 991044 815261 697259 917270
6692I17270N21799o85129N26495k94847J1320j12294M28668L177l72579L20751
$$ 917270 1439069 753940 1280435 985588 996908 884614 1313282 1316459 943880 1264631
6682A264631Q2774k48295o89717M77035J2665l62011K20412M7485J67257J63860
$$ 1264631 1347405 1099110 409393 886428 899093 537082 757494 804979 972236 1136096
6672A136096L01935j74654j73118k95407L25779P19360l28821o58645N18687l55720
$$ 1136096 1438031 1263377 1090259 794852 1120631 1839991 1511170 852525 1371212 1015492
6662A015492l75343m6337K63295q8961L68700j41153j68336k58714l01495M27899
$$ 1015492 640149 593812 857107 768146 1136846 995693 827357 568643 267148 695047
6652F95047m01499J038579p39658M76131J09185n71574L71941l678o4706k97898
$$ 695047 293548 1332127 592469 1068600 1177785 606211 978152 974474 909768 611870
6642F11870P06091o09149o89922Q94041J85515K21519o89169J54027K41412l83439
$$ 611870 1317961 708812 18890 912931 1098446 1319965 630796 784823 1026235 642796
6632F42796l42795L74174J50107o5274l27416L45209p6098j34344K56173p3162
$$ 642796 300001 674175 824282 759008 431592 776801 700703 566359 822532 749370
6622G49370K36689j85490q3064L43803o15486J60562m34447J141207j076724k52768
$$ 749370 986059 800569 717505 1061308 445822 606384 171937 1313144 236420 -16348
6612a6348N90920k27844M07177j47708q2776r583n00886N50274Q4654r7321q4458
$$ -16348 574572 346728 753905 606197 523421 513838 12952 563226 647880 550559 466101
6601D66101J64368l89750K85321j21120O99518p74809L25176l09191K21499m03537
$$ 466101 630469 240719 526040 404920 1104438 329629 654805 345614 567113 163576
6591A63576K26379L44833J17628k39231j02910j37174m5246L6351L40992J83127
$$ 163576 389955 734788 852416 613185 510275 373101 327855 364206 705198 888325
6581H88325l76796j86189M22934L32839j11726J15148k33395N6599o61981M97211
$$ 888325 511529 325340 748274 1081113 969387 1084535 851140 907739 245758 742969
6571G42969j13239j29134j8496K40823K91531l35355k33197J22718N5261K32890
$$ 742969 629730 500596 482100 722923 1014454 679099 445902 568620 623881 856771
6561H56771r8116j9969j73168j42574M53440p3071J7384j8297M43216m67613m6822
$$ 856771 758655 738686 565518 422944 876384 803313 820697 802400 1245616 778003 731181
6550G31181K99600k13921J657J94159L5202k15371p1973R4496L78073m95070O96920
$$ 731181 1030781 816860 818517 1012676 1047878 832507 760534 855030 1233103 738033 1434953
6539A434953r51020M98932p5608J25250n25385N07870m24070J78471j73956L90802
$$ 1434953 483933 982865 907257 1032507 507122 1014992 590922 769393 595437 986239
6529I86239m75829L96792k79005m6747n17878M61829M92944q42524K67380j37214
$$ 986239 510410 907202 628197 581450 63572 525401 1018345 175821 443201 305987
6519C05987J22492J35061J32930m67787L85670J1789n3232M49778l79187k16280
$$ 305987 428479 563540 696470 228683 614353 626142 572910 1022688 643501 427221
6509D27221Q9403k42265L26097l87053J11822N42646j72696J73149J92823o30999
$$ 427221 516624 274359 600456 213403 325225 867871 695175 868324 1061147 430148
6499D30148K754M2382n49327R28493O6133m74501K42736L21010j82080K85555
$$ 430148 432902 475284 -74043 854450 920583 446082 688818 1009828 827748 1113303
6489A113303l50605K35136j18842m0388n39347P94905k90013K14245j70158K20655
$$ 1113303 762698 997834 878992 838604 299257 1094162 804149 1018394 848236 1068891
6479A068891J73801o15619r6504j28825N14290j89407R0582j13664r0583Q2758
$$ 1068891 1242692 627073 530569 401744 916034 726627 817209 703545 612962 695720
6469F95720J84661l48094K03173l35884M19078l067J49511J45477o65889P02828
$$ 695720 880381 532287 735460 399576 818654 815587 965098 1110575 444686 1147514
6459A147514M37989k92889l02269p96600L06650K54978M84589n66762O84704p92221
$$ 1147514 1585503 1292614 990345 193745 500395 755373 1239962 673200 1357904 565683
6449E65683r0356J50776M79297n18405n01220P65696m97923K18214l26042R4492
$$ 565683 475327 626103 1105400 586995 85775 851471 353548 571762 245720 340212
6439C40212m76046O50637M18001j93645l64885K30863k38597N14514o80477M05413
$$ 340212 -135834 514803 932804 739159 374274 605137 366540 881054 200577 605990
6429F05990k61725J4314K31234j57936M3298j38964J52712l22697k56377N32861
$$ 605990 344265 358579 589813 431877 475175 336211 488923 166226 -90151 442710
6419D42710k36634K7417P6755m7352J0564K21470j63628J82661j034648J222417
$$ 442710 206076 233493 310248 262896 273460 494930 331302 513963 -520685 701732
6409G01732n39603Q17026n86259O8621o0725n1663O63852q65033L93188l35789
$$ 701732 162129 979155 392896 461517 400792 349129 1012981 147948 541136 205347
6399B05347m89372m40030P51709J111611j341862K33697J06007Q59167q23161
$$ 205347 -284025 -724055 27654 1139265 -202597 31100 137107 996274 173113
6390A73113J19685Q117M17843j72881K21992J90408q66606M90547J50796K42696
$$ 173113 292798 300915 718758 545877 767869 958277 91671 582218 733014 975710
6380I75710j49006K10544k30697M07544m19836Q5557J58798k86569k30165J24114
$$ 975710 826704 1037248 806551 1214095 794259 879816 1038614 752045 521880 645994
6370F45994Q7007J65975k07020k54112K36243q35348Q33888M58715m00415N2691
$$ 645994 733001 898976 691956 437844 674087 -161261 672627 1131342 730927 783618
6360G83618o7672k46028L39894k43199J03563Q7441n44250K20175K15178L12048
$$ 783618 715946 469918 809812 566613 670176 757617 213367 433542 648720 960768
6350I60768q7974Q137p8101q2342J35020R3783l32085Q6899m26337J56379M8068
$$ 960768 872794 880931 802830 720488 855508 949291 617206 704105 277768 434147 482215
6339D82215K42043L08476r9099l65745k40517J165703q67872j45963J04307K83629
$$ 482215 724258 1032734 933635 567890 327373 1493076 625204 479241 583548 867177
6329H67177p37935P51733k77974J14956J14416j12650M34328m88980M530P3817
$$ 867177 129242 880975 603001 717957 832373 719723 1154051 665071 669601 743418
6319G43418M05269o48746O06164k88631J56549l00579M37570k93279L09453o8731
$$ 743418 1148687 499941 1106105 817474 974023 673444 1111014 817735 1127188 1058457
6309A058457K32377p00931M24309m13464L17753j12729J71712q5553l99841L37500
$$ 1058457 1290834 589903 1014212 600748 918501 805772 977484 891931 492090 829590
6299H29590J78124P6281J1366L287l31975r7779L92533j85964Q93612q95167L66422
$$ 829590 1007714 1083995 1095361 1098648 766673 668894 1061427 875463 1769075 873908 1240330
6288A240330n05540O18247P0362m35723J24311N9522j00033K4612N08636m11912
$$ 1240330 734790 1353037 1423399 987676 1111987 1171509 1071476 1096088 1604724 1192812
6278A192812L15675q31978K75092J6690N45092o87455j84384j59489N23138p8879
$$ 1192812 1508487 676509 951601 968291 1513383 825928 641544 482055 1005193 926314
6268I26314k85084L32782P1839j00400N50765n35916J57148K70043n69998K94014
$$ 926314 641230 974012 1045851 945451 1496216 960300 1117448 1387491 817493 1111507
6258A111507p1054j29460O54752r12044M42377n77038L64920N300N54479Q4487
$$ 1111507 1040453 910993 1565745 653701 1096078 519040 883960 889260 1443739 1528226
6248A528226p59763L41654n90889M05469j25952N10539o73701L63184n95911P00440
$$ 1528226 768463 1110117 519228 924697 798745 1309284 635583 998767 402856 1103296
6238A103296L46077J03701k61413l16293k63362R03050m54304o87111Q31171L1431
$$ 1103296 1449373 1553074 1291661 975368 712006 1615056 1160752 473641 1304812 1336243
6228A336243j12584k29616K84685Q1017p64615O15310j3907n67127N97645L1528
$$ 1336243 1223659 994043 1278728 1359745 595130 1210440 1196533 629406 1227051 1258579
6218A258579k46110q8218O32634l69534J56215N97580q25871J52029o258l24648
$$ 1258579 1012469 924251 1556885 1187351 1343566 1941146 1115275 1267304 1261046 936398
6208I36398M94225l30108M02575l62954k9165M17684m30675p0511J58373M0986
$$ 936398 1430623 1100515 1503090 1140136 1110971 1528655 1097980 1027469 1185842 1226828
6198A226828n36438M33907l44217Q50554k12305L19203o79570N41594K20197m17348
$$ 1226828 690390 1124297 780080 1630634 1418329 1737532 1057962 1599556 1819753 1402405
6188A402405J3067m43786K24496N43971m35622k81331P60241m47762L85164l03267
$$ 1402405 1415472 971686 1196182 1740153 1304531 1023200 1783441 1335679 1720843 1417576
6178A417576j09024j34793L36025J23688j24334l14162O43680m48172M61879j36223
$$ 1417576 1308552 1173759 1509784 1633472 1509138 1194976 1838656 1390484 1852363 1716140
6168A716140l94666N524K9747N58043O5222o95149M39738k42604l35562M13391
$$ 1716140 1321474 1326998 1356745 1914788 1980010 1284861 1724599 1481995 1146433 1559824
6158A559824M7020m15991K28984M08606n13884M72919k56136J24541l3286j13722
$$ 1559824 1606844 1190853 1419837 1828443 1314559 1787478 1531342 1655883 1622597 1508875
6148A508875J48343l13602O33933k55010P6007P3483P6995k09685m87085N42537
$$ 1508875 1657218 1343616 1977549 1722539 1798546 1872029 1949024 1739339 1252254 1794791
6138A794791l68487L26002j793l17349J40062J01647j0868P3981o6542O30929
$$ 1794791 1426304 1752306 1750513 1433164 1573226 1674873 1664005 1737986 1671444 2302373
6128B302373l53025k59627m54079Q05914n32634J34393j7165K94623k59967m27316
$$ 2302373 1949348 1689721 1235642 2041556 1508922 1643315 1626150 1920773 1660806 1233490
6118A233490M17539j05362K46697j82392k92937q5861M66210n2767M05687l03742
$$ 1233490 1651029 1545667 1792364 1609972 1317035 1231174 1697384 1644617 2050304 1746562
6108A746562p5126N1717J60233p6698M72919p88314N30298l65317N55568n08436
$$ 1746562 1671436 1723153 1883386 1806688 2279607 1491293 2021591 1656274 2211842 1703406
6098A703406j85715O82112j57161n8889j53897j37992M07780n78568K94788L39216
$$ 1703406 1517691 2199803 2042642 1983753 1829856 1691864 2099644 1521076 1815864 2155080
6088B155080p87905j55569P87641J2264p13683K14092P21491m60003J71892J45456
$$ 2155080 1367175 1211606 1999247 2011511 1297828 1511920 2233411 1773408 1945300 2090756
6078B090756o18311O83866l68517L43747L90787j73592j303252J227560m13453
$$ 2090756 1472445 2156311 1787794 2131541 2522328 2348736 1045484 2273044 1859591
6069A859591p1522K01327j44340j94963l06141K46825N33455l69658L20020j69424
$$ 1859591 1788069 1989396 1845056 1650093 1343952 1590777 2124232 1754574 2074594 1905170
6059A905170k25463o9785K41984J43916m30186J21956M48044L06049n04672R579
$$ 1905170 1679707 1609922 1851906 1995822 1565636 1687592 2135636 2441685 1937013 1946592
6049A946592k9789M55743N525o41445j99295J95971M23538k82783m84811Q72588
$$ 1946592 1916803 2372546 2378071 1736626 1537331 1733302 2156840 1874057 1389246 2261834
6039B261834l76306K69525k13187k44598K01943J17835j11649N07172l46910J72002
$$ 2261834 1885528 2155053 1941866 1697268 1899211 2017046 1905397 2412569 2065659 2237661
6029B237661j25283j42245j55009k04972P20088k64853l3981q43048R63366j92783
$$ 2237661 2112378 1970133 1815124 1610152 2330240 2065387 2031406 1188358 2151724 1958941
6019A958941k83415M54640L52439N55535j055967K8035K79286l93980N4102l38275
$$ 1958941 1675526 2130166 2482605 3038140 1982173 2010208 2289494 1895514 1949616 1611341
6009A611341Q41321n83586K50637N54353l65015m68978N06886J15413k62438N7607
$$ 1611341 2452662 1869076 2119713 2674066 2309051 1840073 2346959 2462372 2199934 2257541
5999B257541l71082O78916l06801l14679Q66781m42625p61970N74070N06554K41226
$$ 2257541 1886459 2565375 2258574 1943895 2810676 2368051 1606081 2180151 2686705 2927931
5989B927931j36940K02107q2771P616j29702O2081J13667K79025P31474p02791
$$ 2927931 2790991 2993098 2910327 2917943 2788241 2850322 2963989 3243014 3974488 3271697
5979C271697J604001n20086J13158k03947j75950L08278l00914L1551l33105p5062
$$ 3271697 4875698 4355612 4468770 4264823 4088873 4397151 4096237 4127788 3794683 3719621
5969C719621M66475o31532L425j3695p6312K22155M98036o14092J08967k16726
$$ 3719621 4186096 3554564 3557989 3544294 3467982 3690137 4188173 3574081 3683048 3466322
5959C466322L93885j23042N94282m33819N26080m8870P52319j31865l4698N35387
$$ 3466322 3860207 3737165 4331447 3897628 4423708 4374838 5127157 4995292 4960594 5495981
5949E495981J03725M31048N08375Q1865N8583O63508j091915k14784M34125o75996
$$ 5495981 5599706 6030754 6539129 6620994 6679577 7343085 6251170 6036386 6470511 5794515
5939E794515k26486j06740K6870q66322j88259K78320r44110O98634n56085J30534
$$ 5794515 5568029 5461289 5488159 4621837 4433578 4711898 3767788 4466422 3910337 4040871
5929D040871J88916K74354m20879M04316n08011K94190K89482j2842K10207j62294
$$ 4040871 4229787 4504141 4083262 4487578 3979567 4273757 4563239 4550397 4760604 4598310
5919D598310r8306O91692L93804p90012O28491P0873K56447l65825k04474n92793
$$ 4598310 4500004 5191696 5585500 4795488 5423979 5494852 5751299 5385474 5181000 4588207
5909D588207K05989j49317m4349m10106o87080L88620P3020r1554q8931k84857
$$ 4588207 4794196 4644879 4600530 4190424 3503344 3891964 3964984 3873430 3784499 3499642
5899C499642j55655K72154K96398N1852j22400k58765J58179L2434o36575K76856
$$ 3499642 3343987 3616141 3912539 3964391 3841991 3583226 3741405 3773839 3137264 3414120
5889C414120m67608M57925J92135J85523k98168J29219M5285K14877k51471l8669
$$ 3414120 2946512 3404437 3596572 3782095 3483927 3613146 3658431 3873308 3621837 3583168
5879C583168K85947j40414k28257M91919J94825l71061N3669J09365M45104l25816
$$ 3583168 3869115 3728701 3500444 3992363 4187188 3816127 3869796 3979161 4424265 4098449
5869D098449J60603K3187K16152L58176j06091M68877k38467p01685P32402K22295
$$ 4098449 4259052 4282239 4498391 4856567 4750476 5219353 4980886 4279201 5011603 5233898
5859E233898n43306j07010L54647P0630k99964K82561N29209J9888K52641l67018
$$ 5233898 4690592 4583582 4938229 5008859 4708895 4991456 5520665 5540553 5793194 5426176
5849E426176L80586K8577O0507J97541k69049J4944M59147n24264K97484K52059
$$ 5426176 5806762 5835339 5895846 6093387 5824338 5839282 6298429 5774165 6071649 6323708
5839F323708p8261K90355K92938j98254k8522n4464J6707L38760L0536m33456
$$ 6323708 6245447 6535802 6828740 6630486 6601964 6547500 6564207 6902967 6933503 6500047
5829F500047N24408j83723L69236m53371O14345l27177K84655K60596M74925j092006
$$ 6500047 7024455 6840732 7209968 6756597 7370942 7043765 7328420 7589016 8063941 6971935
5819F971935J170888n47663L2390J94843J10921P22555J61307L70681m38305k09188
$$ 6971935 8142823 7595160 7627550 7822393 7933314 8655869 8817176 9187857 8749552 8540364
5809H540364O12042K30928j61862l5426J55358o2572R1237j72956O24140M8825
$$ 8540364 9152406 9383334 9221472 9186046 9341404 9278832 9370069 9197113 9821253 9870078
5799I870078k24531L48261m17455l3246k24353L05199K68614j113992P88978N31271
$$ 9870078 9645547 9993808 9576353 9543107 9318754 9623953 9892567 8778575 9567553 10098824
5789A0098824m65139K93048J54246k51577J70338N58932k19188N03388n46847
$$ 10098824 9633685 9926733 10080979 9829402 9999740 10558672 10339484 10842872 10296025
5780A0296025O69380P870J27216J21222L16967n48866R46419L8034K70498n03292
$$ 10296025 10965405 10973275 11100491 11221713 11538680 10989814 11936233 11974267 12244765 11741473
5770A1741473R76093J93452L77591o22775M82568O2864O73627L61635j73498M91177
$$ 11741473 12717566 12911018 13288609 12665834 13148402 13211266 13884893 14246528 14073030 14564207
5760A4564207m52573L43711P54056L8891P51167K56135P18842J65843L71312R2782
$$ 14564207 14111634 14455345 15209401 15248292 15999459 16255594 16974436 17140279 17511591 17604373
5750A7604373J110988Q05879N68497R68347J005233Q07649P69684R44615Q95353
$$ 17604373 18715361 19521240 20089737 21058084 22063317 22870966 23640650 24585265 25480618
5741B5480618J707111J471278J108609J786339J606446J690304K815020K364954
$$ 25480618 27187729 28659007 29767616 31553955 33160401 34850705 37665725 40030679
5733D0030679L393669L446948M336230M682959N447140P219889P236890Q872024
$$ 40030679 43424348 46871296 51207526 55890485 61337625 68557514 75794404 84666428
5725H4666428J0364361J1618730J3356368J3406408J4330792J4317115J4422370
$$ 84666428 95030789 106649519 120005887 133412295 147743087 162060202 176482572
5718A76482572J3128615J0724859Q858971M468118K956952j284652l357388n485412
$$ 176482572 189611187 200336046 209195017 213663135 216620087 215335435 211978047 206492635
5710B06492635o805474p390182p500094o972382n858243n025559m492486k418655
$$ 206492635 199687161 192296979 184796885 177824503 171966260 166940701 162448215 160029560
5702A60029560q17474L98416K982264N257879P540447J0142852J2671259J6360682
$$ 160029560 159212086 159610502 162592766 167850645 175391092 185533944 198205203 214565885
5694B14565885J9053574K2003608K4888854K6654064K7827996K7909641K5605591
$$ 214565885 233619459 255623067 280511921 307165985 334993981 362903622 388509213
5687C88509213K1916908J5430633P358397j697007q001472j4730770j8791404
$$ 388509213 410426121 425856754 433215151 431518144 423516672 408785902 389994498
5680C89994498k1782376k2641523k2370925k1379351k1092536j8968498j6751061
$$ 389994498 368212122 345570599 323199674 301820323 280727787 261759289 245008228
5673B45008228j4972615j1819668j0166915p140173n615492k898347j129759J782156
$$ 245008228 230035613 218215945 208049030 200908857 195293365 192395018 191265259 193047415
5665A93047415L645039O027944Q525561J0700172J3018791J3896891J4232192
$$ 193047415 196692454 202720398 211245959 221946131 234964922 248861813 263094005
5658B63094005J2309366J2260166O960912K425582j656685o127265j0271639j3471469
$$ 263094005 275403371 287663537 294624449 297050031 295393346 289266081 278994442 265522973
5650B65522973j5988464j5587867j6764343j5349113j4443355j3585240j2381651
$$ 265522973 249534509 233946642 217182299 201833186 187389831 173804591 161422940
5643A61422940j0583760r020018q763833o452675n478568n075556l706222l221689
$$ 161422940 150839180 141819162 133055329 126602654 121124086 116048530 112342308 109120619
5635A09120619j293050j056263M4009M14970J61995K648693J915615L429484K518411
$$ 109120619 107827569 106771306 106815315 107230285 107392280 110040973 111956588 115386072 117904483
5626A17904483M118051L882804L583764L422074M329075L322226K569914L499745
$$ 117904483 122022534 125905338 129489102 132911176 137240251 140562477 143132391 146632136
5618A46632136K683759K756294K814549K610716K314312K596099K262694K860808
$$ 146632136 149315895 152072189 154886738 157497454 159811766 162407865 164670559 167531367
5610A67531367L764631M486593M955639M769408M736486M944924N815956N335443
$$ 167531367 171295998 175782591 180738230 185507638 190244124 195189048 201005004 206340447
5602B06340447L913278L893936K722927K350940Q42183j24298j443091k584140
$$ 206340447 210253725 214147661 216870588 219221528 220063711 219939413 218496322 215912182
5594B15912182l898364m885496n648095n450885n908093o318442n121556n596606
$$ 215912182 212013818 207128322 201480227 196029342 190121249 183802807 178681251 173084645
5586A73084645n006113n124364m295659k869099l681058j836274k370587j976261
$$ 173084645 168078532 162954168 158658509 155789410 152108352 150272078 147901491 145925230
5578A45925230j268486j353826k428546j840527l380542k604993l580737m246332
$$ 145925230 144656744 143302918 140874372 139033845 135653303 133048310 129467573 125221241
5570A25221241m750230m977597n884607m942949n415244n892804m613588m056609
$$ 125221241 120471011 115493414 109608807 104665858 99250614 93357810 88744222 84687613
5562H4687613n058969m091005m011898k915236l590704k391196k470065l202461
$$ 84687613 79628644 75537639 71525741 68610505 65019801 62628605 60158540 56956079
5554E6956079j946727k067528j410796j724364j160097j032248j363992q07869
$$ 56956079 55009352 52941824 51531028 49806664 48646567 47614319 46250327 45442458
5546D5442458l31392r54454p31681l18295Q43191p09725N67328N21248P87393
$$ 45442458 45111066 44156612 43424931 43106636 43949827 43240102 43807430 44328678 45116071
5537D5116071L05391K46453P23240P09488J865665R94390K017589J168961K670908
$$ 45116071 45421462 45667915 46391155 47100643 48966308 49960698 51978287 53147248 55818156
5528E5818156K522624K571434L340398L922142M406482M009125N230377L885313
$$ 55818156 58340780 60912214 64252612 68174754 72581236 76590361 81820738 85706051
5520H5706051N082424N074293M016908L735874L495696L402580K335253K275400
$$ 85706051 90788475 95862768 99879676 103615550 107111246 110513826 112849079 115124479
5512A15124479K207190K226214J852138K315018K203494K121724L532904L747305
$$ 115124479 117331669 119557883 121410021 123725039 125928533 128050257 131583161 135330466
5504A35330466L569701N008350N412155N284416O932318O151137O673814P442745
$$ 135330466 138900167 143908517 149320672 154605088 161537406 167688543 174362357 181805102
5496A81805102O582758O528982N016766M661393L793869J972936M67835k79817
$$ 181805102 188387860 194916842 199933608 204595001 208388870 210361806 210829641 210549824
5488B10549824j789015l542512k474961m163869m539105m047180m511308m620672
$$ 210549824 208760809 205218297 202743336 198579467 194040362 189993182 185481874 180861202
5480A80861202l557966l184097m387457l355683k019910k537264l255232k657378
$$ 180861202 177303236 174119139 169731682 166375999 164356089 161818825 158563593 155906215
5472A55906215l013403l586569l627809m430826m736419n239177n813287n462573
$$ 155906215 152892812 149306243 145678434 141247608 136511189 131272012 125458725 119996152
5464A19996152n430779o463655n845071o132992m890009n434328m880713n012520
$$ 119996152 114565373 108101718 102256647 96123655 91233646 85799318 80918605 75906085
5456G5906085m357094l574743m282905k834192l235976k870947k170606k592631
$$ 75906085 71548991 67974248 63691343 60857151 57621175 54750228 52579622 49986991
5448D9986991k447618j934421k276820j444644k088305j385062j652210j060124
$$ 49986991 47539373 45604952 43328132 41883488 39795183 38410121 36757911 35697787
5440C5697787j322373j012117j204972j143957q96356r35818n73470j017217q49356
$$ 35697787 34375414 33363297 32158325 31014368 30118012 29182194 28608724 27591507 26742151
5431B6742151p43984m52373j286100m359n74997j61245j024015o24231l46740
$$ 26742151 25998167 25545794 24259694 24255335 23680338 23519093 22495078 21870847 21524107
5422B1524107k38517o30244o04802q93049k41960o22952o74672M1889p97016r82246
$$ 21524107 21285590 20655346 20050544 19157495 18915535 18292583 17617911 17659800 16862784 15880538
5412A5880538l22134J02797j140778l3257l95141J22279p21955J70134n61808
$$ 15880538 15558404 15661201 14520423 14487166 14092025 14214304 13492349 13662483 13100675
5403A3100675K29691k28963o1266n11543Q776j57021K09211k89367k59578l55120
$$ 13100675 13330366 13101403 13040137 12528594 12537370 12380349 12589560 12300193 12040615 11685495
5393A1685495J34808k78012r3898m05362k53906P7922q90839O55172n94210J02404
$$ 11685495 11820303 11542291 11448393 11043031 10789125 10867047 9976208 10631380 10037170 10139574
5383A0139574m53912l44905Q3621j4651o91130M58828m58053K0994J22331q40054
$$ 10139574 9685662 9340757 9424378 9409727 8718597 9177425 8719372 8740366 8862697 8022643
5373H022643N68557R4679m74277R4472m39001L22849p3595l39773M68116n95214
$$ 8022643 8591200 8685879 8211602 8306074 7867073 8189922 8116327 7776554 8244670 7649456
5363G649456L34924j39300r5498Q5346J67527k59563n02560k11636M09248p2835
$$ 7649456 7984380 7845080 7749582 7834928 8002455 7742892 7240332 7028696 7437944 7365109
5353G365109k74682P46N90408R3809m58697o30418Q26334M12936m33458J43537
$$ 7365109 7090427 7091173 7681581 7775390 7316693 6686275 7512609 7925545 7492087 7635624
5343G635624j88342j45606p7024j05501j94942L37330p84721P91902p17024k14581
$$ 7635624 7447282 7301676 7224652 7119151 6924209 7261539 6476818 7268720 6551696 6337115
5333F337115J287862p44950K15289L44681r26060P68080o21416J97849o48877
$$ 6337115 7624977 6880027 7095316 7439997 6513937 7282017 6660601 6858450 6209573
5324F209573K62917l1548k39784N43999m91865L34633j08525J48411p38588M54430
$$ 6209573 6472490 6440942 6201158 6745157 6253292 6587925 6479400 6627811 5889223 6343653
5314F343653k08517M24677O1926j96986P9279l58586r4523N32161k80066k25044
$$ 6343653 6135136 6559813 6621739 6424753 6504032 6145446 6050923 6583084 6303018 6077974
5304F077974K33849l36526K85447K29289j26090k15285K90763n74715J86808l4024
$$ 6077974 6311823 5975297 6260744 6490033 6363943 6148658 6439421 5864706 6051514 6017490
5294F017490k84971M95328j83543p18428K53262j15221P14175l95305M68790n20146
$$ 6017490 5732519 6227847 6044304 5325876 5579138 5463917 6178092 5782787 6251577 5731431
5284E731431L74016l02344N48847m81296j09582M29650J51383n6121J77672k18391
$$ 5731431 6105447 5803103 6351950 5870654 5761072 6190722 6342105 6285984 6463656 6245265
5274F245265L40063K02645J19004J11697j52169K27673j31093l14863J04867k15330
$$ 6245265 6585328 6787973 6906977 7018674 6866505 7094178 6963085 6648222 6753089 6537759
5264F537759k32363L92148L48451k82060N48604o96158k83355P82933K21193k69264
$$ 6537759 6305396 6697544 7045995 6763935 7312539 6616381 6333026 7115959 7337152 7067888
5254G067888J97657j02845L1472J52668O22644n91436L36670l22075j06080J02180
$$ 7067888 7265545 7162700 7194172 7346840 7969484 7378048 7714718 7392643 7286563 7388743
5244G388743P0695k42104K25070l37037m3412k2955o18487Q06032p64198J7855
$$ 7388743 7459438 7217334 7442404 7105367 7061955 7039000 6420513 7226545 6462347 6480202
5234F480202L73583k84452k01422M00937j40063l96998O41282m05923l00479J75774
$$ 6480202 6853785 6569333 6367911 6768848 6628785 6231787 6873069 6467146 6166667 6342441
5224F342441l09971l96019K50350l12581m82153N61530N3877J18954n10444k74621
$$ 6342441 6032470 5636451 5886801 5574220 5092067 5653597 5707474 5826428 5315984 5041363
5214E041363K10448p47744N50718n19170R1698K14348O9854J34779n82955l75312
$$ 5041363 5251811 4504067 5054785 4535615 4627313 4841661 4911515 5046294 4463339 4088027
5204D088027M8450L29727m25789O97825K19216l12480k69349o44712J89941K01818
$$ 4088027 4136477 4466204 4040415 4738240 4957456 4644976 4375627 3730915 3920856 4122674
5194D122674J25273Q04l87214J50546l74162J21889M15558J17719J80110n94124
$$ 4122674 4247947 4248751 3861537 4012083 3637921 3759810 4175368 4293087 4473197 3879073
5184C879073k30761O93223o43618Q22115K40097l1372k66265N2328J92344p48583
$$ 3879073 3648312 4341535 3697917 4520032 4760129 4728757 4462492 4514820 4707164 3958581
5174C958581J78864K45305N54900j26963j26295P7413l4110l6010J01246k76929
$$ 3958581 4137445 4382750 4937650 4810687 4684392 4761805 4727695 4691685 4792931 4516002
5164D516002Q14161o88676N14784m80811N6265L04643j65693K59512k69527L19754
$$ 4516002 5330163 4641487 5156271 4675460 4731725 5036368 4870675 5130187 4860660 5180414
5154E180414K59621n04417O43275L26362n95375k82426O74109j34203j50181K42940
$$ 5180414 5440035 4935618 5578893 5905255 5309880 5027454 5701563 5567360 5417179 5660119
5144E660119K6052k00832K70029N86153o7254O4367M83499l19037L05957l48727
$$ 5660119 5686171 5485339 5755368 6341521 6274267 6338634 6822133 6503096 6809053 6460326
5134F460326L46007L73593o71495K63682m575q4809M64309q83763L19401L58886
$$ 6460326 6806333 7179926 6508431 6772113 6767538 6682729 7147038 6263275 6582676 6941562
5124F941562r63382Q21962K75169k91461O12649j79389K98501m61186l99745J362355
$$ 6941562 5978180 6800142 7075311 6783850 7396499 7217110 7515611 7054425 6654680 8017035
5114H017035J11854o10043M63448M49391J0143K22397N23361k65145Q30815l30545
$$ 8017035 8128889 7518846 7982294 8431685 8441828 8664225 9187586 8922441 9753256 9422711
5104I422711N14676k41438o9560K42695N48648j62360J05247K00201J43115N45528
$$ 9422711 9937387 9695949 9626389 9869084 10417732 10255372 10360619 10560820 10703935 11249463
5094A1249463N29690L99630P12914L20843N54782J047514O83034J702366L09696
$$ 11249463 11779153 12178783 12891697 13212540 13767322 14814836 15497870 17200236 17509932
5085A7509932J328677J973622J799984J658801K695538L408779M414136M756845
$$ 17509932 18838609 20812231 22612215 24271016 26966554 30375333 34789469 39546314
5077C9546314M779235M476968L101959J057236j063707j650127k608459l451236
$$ 39546314 44325549 48802517 51904476 52961712 51898005 50247878 47639419 44188183
5069D4188183k162757o73034j818188n10183l14294L57506K81700J37279P22945
$$ 44188183 42025426 41352392 39534204 39024021 38709727 39067233 39348933 39486212 40209157
5060D0209157R09655Q16770K403149J603746K619822M286482M581069N835808
$$ 40209157 41118812 41935582 44338731 45942477 48562299 52848781 57429850 63265658
5052F3265658P507143Q692254R513456J1976828J1945403J0996998J0718771O824442
$$ 63265658 70772801 79465055 88978511 100955339 112900742 123897740 134616511 141440953
5044A41440953M075103O01281m916816q867996j1426942r720256p967930o567166
$$ 141440953 145516056 146117337 141200521 132332525 120905583 111185327 103217397 96650231
5036I6650231m600811m087029k791376k673095j810690k186221j091211N70J053929
$$ 96650231 92049420 87962391 85171015 82497920 80687230 78501009 77409798 77410368 78464297
5027G8464297M94911K918036L500393N082295O270898Q057209R936755J2119433
$$ 78464297 78959208 81877244 85377637 90459932 96730830 104788039 114724794 126844227
5019A26844227J3891445J3865252J2954251J3487294R742615M913798o10712r649951
$$ 126844227 140735672 154600924 167555175 181042469 190785084 195698882 195088170 185438219
5011A85438219j3309175j3886949j5188316j1391041j0744799q365107p060750
$$ 185438219 172129044 158242095 143053779 131662738 120917939 112552832 105492082
5004A05492082n652852n595865l735053l613932k455362k219386j427638n82332
$$ 105492082 99839230 94243365 90508312 86894380 84439018 82219632 80791994 80209662
4996H0209662o08228j29696J704894J603774K696428N210738P009838Q374955
$$ 80209662 79601434 79471738 81176632 82780406 85476834 90687572 97697410 106072365
4988A06072365J0140508J0175348P543755N552119q2081m068307p960427r793550
$$ 106072365 116212873 126388221 133931976 139484095 139402014 135333707 127373280 117579730
4980A17579730r938873q931453q198144o297941n896857m589353m505132l664467
$$ 117579730 107640857 98709404 90511260 84213319 78316462 73727109 69221977 65557510
4972F5557510k906768k586411k167291j970526k042611j612004p31223k154310
$$ 65557510 62650742 60064331 57897040 55926514 53883903 52271899 51540676 49386366
4964D9386366j67610n56698l5868O79075J513011J693004K125897K608140J632351
$$ 49386366 49218756 48662058 48626190 49305265 50818276 52511280 54637177 57245317 58877668
4955E8877668J324560J02967j305965k441363k368242k859122j997561k011768
$$ 58877668 60202228 60305195 58999230 56557867 54189625 51330503 49332942 47321174
4947D7321174j644475j210989q15655j272117k65684q02938m07249o99796j08083
$$ 47321174 45676699 44465710 43650055 42377938 42112254 41309316 40902067 40202271 40094188
4938D0094188J93411K60926M58462M8278J044278j37069R12222J087159R55514
$$ 40094188 40287599 40548525 41006987 41055265 42099543 41962474 42874696 43961855 44917369
4929D4917369J128582J192625J127311J577814Q24434J887997J967946J690568
$$ 44917369 46045951 47238576 48365887 49943701 50768135 52656132 54624078 56314646
4921E6314646K359153J901015K570273K436349K457901L473128K986420L166827
$$ 56314646 58673799 60574814 63145087 65581436 68039337 71512465 74498885 77665712
4913G7665712L021627M154511L466227L717458M819688L804033M095528M237055
$$ 77665712 80687339 84841850 88308077 92025535 96845223 100649256 104744784 108981839
4905A08981839L954411M366980K644663M054846K559668K185548K229197P85801
$$ 108981839 112936250 117303230 119947893 124002739 126562407 128747955 130977152 131762953
4897A31762953L70228O93158j243303j287964j813367k196845l266758l351576
$$ 131762953 132133181 132826339 131583036 130295072 128481705 126284860 123018102 119666526
4889A19666526l528532l315771l610991l675272m343516l303673m115364l405345
$$ 119666526 116137994 112822223 109211232 105535960 101192444 97888771 93773407 90368062
4881I0368062l222533l030139l159763l291025k317841l371178k169358k586116
$$ 90368062 87145529 84115390 80955627 77664602 75346761 71975583 69806225 67220109
4873F7220109k092054k287018k490395j753829j525447j331914k336197j298184
$$ 67220109 65128055 62841037 60350642 58596813 57071366 55739452 53403255 52105071
4865E2105071j192874j315082j472308p05787j682731n03164q93074p13690j042310
$$ 52105071 50912197 49597115 48124807 47419020 45736289 45233125 44340051 43626361 42584051
4856D2584051n48895q50415o26678K1049n98998m11164n3360M53182l88597M06760
$$ 42584051 42035156 41184741 40558063 40579112 39980114 39568950 39515590 39968772 39580175 39986935
4846C9986935L91857P78730R27617k63597P70403J051215P26344j1478J047556
$$ 39986935 40378792 41157522 42085139 41821542 42591945 43643160 44369504 44358026 45405582
4837D5405582J165485Q23129R11648J465693J630323J087322R72336M61751J221239
$$ 45405582 46571067 47394196 48305844 49771537 51401860 52489182 53461518 53923269 55144508
4828E5144508J055823J557907J834510R41903J344791R33421J217290M01467K265622
$$ 55144508 56200331 57758238 59592748 60534651 61879442 62812863 64030153 64431620 66697242
4819F6697242J388090J554255J958484K409638M156940L171322M545819M160245
$$ 66697242 68085332 69639587 71598071 74007709 78164649 81335971 85881790 90042035
4811I0042035N522465O105650N997070O670571P320732Q292945R248756Q881655
$$ 90042035 95564500 101670150 107667220 114337791 121658523 129951468 139200224 148081879
4803A48081879R913672R634050Q623579P250672O261004N026810N645362M786977
$$ 148081879 157995551 167629601 176253180 183503852 189764856 194791666 200437028 205224005
4795B05224005N804486O933896P794085J2339759J3301329J5175613J5023088
$$ 205224005 211028491 217962387 225756472 238096231 251397560 266573173 281596261
4788B81596261J5296164J0747355O451412j47539k578558J006240M642374Q148149
$$ 281596261 296892425 307639780 314091192 313943653 311365095 312371335 317013709 325161858
4780C25161858J1254282J2961454J3768919J3391641J0968899Q541450M426569
$$ 325161858 336416140 349377594 363146513 376538154 387507053 396048503 400475072
4773D00475072L65390l477348p531135j0238503j2417654j2707357j0426942p689441
$$ 400475072 400840462 397363114 389831979 379593476 367175822 354468465 344041523 336352082
4765C36352082n023710k510109L1086J0263k095207n735265j1663811j6730105
$$ 336352082 331328372 328818263 328849349 328859612 326764405 321029140 309365329 292635224
4757B92635224j5477121j3147623j0161798q609247o942735p002149n993980n808183
$$ 292635224 277158103 264010480 253848682 245239435 238296700 231294551 225300571 219492388
4749B19492388o062504n822380o912148p557754r052933r347947r834783q635103
$$ 219492388 213429884 207607504 200695356 193137602 184084669 174736722 164901939 156266836
4741A56266836p971461q928806p005350p438978o941312o936195n545897n496654
$$ 156266836 148295375 139366569 132361219 124922241 117980929 111044734 105498837 100002183
4733A00002183m664650m717972l804170l286469k599161k448444k336699k153090
$$ 100002183 95337533 90619561 86815391 83528922 80929761 78481317 76144618 73991528
4725G3991528j811144k370764j438447j721038k738209j884574j412937k517099
$$ 73991528 72180384 69809620 68371173 66650135 63911926 62027352 60614415 58097316
4717E8097316r28736k293224j585131k272946j948842j574380k521250j745291
$$ 58097316 57168580 54875356 53290225 51017279 49068437 47494057 44972807 43227516
4709D3227516j006062k160995p56747p29869j516206j721286p21606j882549p24719
$$ 43227516 42221454 40060459 39303712 38573843 37057637 35336351 34614745 32732196 32007477
4700C2007477j607416o22147j227248r51712j157271n58147o25016r68389q12670
$$ 32007477 30400061 29777914 28550666 27598954 26441683 25883536 25258520 24290131 23477461
4691B3477461l13411j339281k6853j24548q28238r15308n97524l13657n29428
$$ 23477461 23164050 21824769 21797916 21673368 20845130 19929822 19332298 19018641 18489213
4682A8489213j25036k71853l63224n78842j07029p49298j26533m49697j07798
$$ 18489213 18364177 18092324 17729100 17150258 17043229 16293931 16167398 15717701 15609903
4673A5609903p2498l07981n4048o8239r15175m74246M01690r0010n26372j5310
$$ 15609903 15537405 15229424 15175376 15107137 14191962 13717716 14119406 14029396 13503024 13487714
4663A3487714k74003n30910L60596m60683l73699o2829K61753k76340m79481N21829
$$ 13487714 13213711 12682801 13043397 12582714 12209015 12146186 12407939 12131599 11652118 12173947
4653A2173947m12533k9358k69622l12631k17151K5727j81000j58578q16241J27309
$$ 12173947 11761414 11732056 11462434 11149803 10932652 10958379 10777379 10618801 9802560 9929869
4643I929869J41597K02764j202039L17360j98246L66257l26254J25847J72607
$$ 9929869 10071466 10274230 9072191 9389551 9191305 9557562 9231308 9357155 9529762
4634I529762J79815r68358Q30652k47953k36767p14884K07354j884j30770l6193
$$ 9529762 9709577 8741219 9571871 9323918 9087151 8372267 8579621 8577737 8446967 8410774
4624H410774l5833m43623K96609m06637J026709j101677k0209M7947J39589M7268
$$ 8410774 8374941 7931318 8227927 7821290 8847999 7746322 7726113 7774060 7913649 7960917
4614G960917k97470j67388o53349R21467J01600j95781l87017J56421j731l94890
$$ 7960917 7663447 7496059 6842710 7764177 7865777 7669996 7282979 7439400 7437669 7042779
4604G042779J93589m4616j33530k64595K82162l35295l61785J035779r35943k4849
$$ 7042779 7236368 7191752 7058222 6793627 7075789 6740494 6378709 7414488 6478545 6453696
4594F453696j6216L36758q19065L2615K93416l99833M21208o88867L42629k92949
$$ 6453696 6437480 6774238 5955173 5987788 6281204 5881371 6302579 5613712 5956341 5663392
4584E663392K76208l00620K17013O22n30001j03171j15956J58440M02270o49829
$$ 5663392 5939600 5638980 5855993 5856615 5326614 5223443 5107487 5265927 5668197 5018368
4574E018368k4838j72989L98633k10361P382p83688N73217l20831o8423M83115
$$ 5018368 4993530 4820541 5219174 5008813 5016195 4232507 4805724 4484893 4416470 4899585
4564D899585N0665j65241k94074L12357q70163M35039L92231j48024j41692k70300
$$ 4899585 4950250 4785009 4490935 4803292 3933129 4368168 4760399 4612375 4470683 4200383
4554D200383J84149M43325j12249J4200Q1140k37828o06495n2175P46406m71070
$$ 4200383 4384532 4827857 4715608 4729808 4810948 4573120 3966625 3914450 4660856 4189786
4544D189786K99672k67526L65511l49167k61956K05516k76253l27227L53490P4784
$$ 4189786 4489458 4221932 4587443 4238276 3976320 4181836 3905583 3578356 3931846 4006630
4534D006630L00713l42488L22917m69608L59202L63069k55399K81885j87003l11266
$$ 4006630 4307343 3964855 4287772 3818164 4177366 4540435 4285036 4566921 4379918 4068652
4524D068652r5465l34180M37383m98445L28778L20097m17533k50043K50898k70254
$$ 4068652 3973187 3639007 4076390 3577945 3906723 4226820 3809287 3559244 3810142 3539888
4514C539888k76937K70214L33220J29157m15406K75239p56687N10085O34238k59645
$$ 3539888 3262951 3533165 3866385 3995542 3580136 3855375 3098688 3608773 4243011 3983366
4504C983366o31665K72951J54561o65070N79543m07541j90222j2194J73712O62319
$$ 3983366 3351701 3624652 3779213 3114143 3693686 3286145 3095923 3083729 3257441 3919760
4494C919760q97381j51999L5642L46363j5929n74172J67435o18509N96160j95301
$$ 3919760 3022379 2870380 2906022 3252385 3236456 2662284 2829719 2211210 2807370 2612069
4484B612069M78474n73363j59754P60567P2390j42780m02721l87263P2661L12366
$$ 2612069 3090543 2517180 2357426 3117993 3190383 3047603 2644882 2257619 2330280 2642646
4474B642646n91826K27915P5879k07089p4727P4869Q9477l21241N59570m60292
$$ 2642646 2050820 2278735 2354614 2147525 2072798 2147667 2237144 1915903 2475473 2015181
4464B015181m36294Q52930m00875K67583n06740J51828k50439J27749j93844J68800
$$ 2015181 1578887 2431817 2030942 2298525 1791785 1943613 1693174 1820923 1627079 1795879
4454A795879K27287J83495l08652J30561K61832k56310l67959k82024P58927p16050
$$ 1795879 2023166 2206661 1898009 2028570 2290402 2034092 1666133 1384109 2143036 1426986
4444A426986m7757L89322l82619j1222j51200Q96257k60478J40090k67919K44592
$$ 1426986 1379229 1768551 1385932 1374710 1223510 2119767 1859289 1999379 1731460 1976052
4434A976052J2603o61107L76342L32004N2203m39133l71908k0286J97613j08638
$$ 1976052 1988655 1327548 1703890 2035894 2088097 1648964 1277056 1256770 1454383 1345745
4424A345745M24343J3555l43417J98292k94874K43293j88368K58753k01224J88678
$$ 1345745 1770088 1783643 1440226 1638518 1343644 1586937 1398569 1657322 1456098 1644776
4414A644776m76105k41017N41851Q6557N3215j50301O73145l50132l16588M11280
$$ 1644776 1168671 927654 1469505 1556062 1609277 1458976 2132121 1781989 1465401 1876681
4404A876681k77337L44872p42312M17377K57255J0082J69074j34614m93757M34648
$$ 1876681 1599344 1944216 1201904 1619281 1876536 1886618 2055692 1921078 1427321 1861969
4394A861969j52568J31571j86338K43392j63711K46884r6052K58266n58099O84983
$$ 1861969 1709401 1840972 1654634 1898026 1734315 1981199 1885147 2143413 1585314 2270297
4384B270297n14502r170N87153J8479p1324r07891M43239J09179j62608o2860
$$ 2270297 1755795 1746625 2333778 2352257 2280933 1373042 1816281 1925460 1762852 1699992
4374A699992P20417j80816R3842o62432J096881J30679p11518K203Q52890R0562
$$ 1699992 2420409 2239593 2333435 1671003 2767884 2898563 2187045 2189248 3042138 3132700
4364C132700J09665j10960l43960K00150J12318O9348k29608M38583J4069l49738
$$ 3132700 3242365 3131405 2787445 2987595 3099913 3169261 2939653 3378236 3392305 3042567
4354C042567j46869O04359L27004o16252N3643m18279L66039L00291q7204l3419
$$ 3042567 2895698 3500057 3827061 3210809 3264452 2846173 3212212 3512503 3425299 3391880
4344C391880L62448K26264o4784Q1884L15765J02371K3611N91913J22338L78998
$$ 3391880 3754328 3980592 3915808 3997692 4313457 4415828 4439439 5031352 5153690 5532688
4334E532688M40503l36234L11358R3194Q47406J25313L89235K74581Q00504K04355
$$ 5532688 5973191 5636957 5948315 6041509 6888915 7014228 7403463 7678044 8478548 8682903
4324H682903k0119j57765P94165K27622J45074j47466O10222K02024M05409L13433
$$ 8682903 8662784 8505019 9299184 9526806 9671880 9524414 10134636 10336660 10742069 11055502
4314A1055502j2959n71240N7519j94622n16226q85540m87214l94431j223836j34639
$$ 11055502 11042543 10471303 10528822 10334200 9817974 8932434 8445220 8050789 6826953 6692314
4304F692314l24097o4236o79284p56030o5433n6867n33088L20904q40374j92279
$$ 6692314 6368217 6303981 5624697 4868667 4803234 4746367 4213279 4534183 3693809 3501530
4294C501530p16614M83729l12032j00925N93717k78258o23241O70802n17130M4124
$$ 3501530 2784916 3268645 2956613 2855688 3449405 3171147 2547906 3218708 2701578 2745702
4284B745702q60240j9150Q05794k52824l16901K88506q1434k23961k15671m42823
$$ 2745702 1885462 1866312 2672106 2419282 2102381 2390887 2309453 2085492 1869821 1426998
4274A426998M96684m38131J78351l00954L84235L4820l79323k23808l52727M57834
$$ 1426998 1923682 1485551 1663902 1362948 1747183 1782003 1402680 1178872 826145 1283979
4264A283979l22300M63067j04044p58285O07970k58217J01583M77949j90020j7955
$$ 1283979 961679 1424746 1320702 562417 1170387 912170 1013753 1491702 1301682 1283727
4254A283727k93941J91452J06788j92261k37311N32736o95209K0707p2484K00095
$$ 1283727 989786 1181238 1288026 1095765 858454 1391190 695981 716688 644204 844299
4244H44299M63545j73682l01529k9242J86549m49691M8822K03911k4744n02419
$$ 844299 1307844 1134162 832633 803391 989940 540249 589071 792982 768238 265819
4234B65819M26081k93658j0204J09236j83480j50307N08319k77977L01345Q4239
$$ 265819 691900 398242 388038 497274 313794 163487 671806 393829 695174 779413
4224G79413j70496L5764L16464l89702m04489K32901m58571N88458l88552K10778
$$ 779413 608917 644681 961145 571443 166954 399855 -58716 529742 141190 351968
4214C51968L56333j84839J09355n89283K11410O44101l95320k8626l7395l43244
$$ 351968 708301 523462 632817 43534 254944 899045 503725 475099 437704 94460
4204I4460L56408N4575P8907k25975L41763p13858P2094K26922l0601N00337j51636
$$ 94460 450868 505443 584350 358375 700138 -13720 58374 285296 254695 755032 603396
4193F03396o14030M1794N05966n5629n74725Q09946J9370k85811j41245r3952
$$ 603396 -10634 31160 537126 481497 -93228 716718 736088 450277 309032 215080
4183B15080P9072n82677J190223k64256o43435M17201j08333o8357K10432L05831
$$ 215080 294152 -288525 901698 637442 -5993 411208 302875 234518 444950 750781
4173G50781m64411l39791P74274m02930o0537j33081J80266k61299N99251o55387
$$ 750781 286370 -53421 720853 317923 257386 124305 304571 43272 642523 -12864
4163a2864o56809N28310M90750k03027p5402j25833L37149J74914r89145J267063
$$ -12864 -669673 -141363 349387 146360 70958 -54875 282274 457188 -531957 735106
4153G35106o62153K24972K21462O14502r06056K22148p51931L03382J85379J43812
$$ 735106 72953 297925 519387 1133889 227833 449981 -301950 1432 186811 330623
4143C30623n54006O31022m56573N42317J19399k72056l15498K00958k68991j5739
$$ 330623 -223383 407639 -48934 493383 612782 340726 25228 226186 -42805 -58544
4133e8544k5161M4066K36395K49697m83865l57141O95463n60411O66852n63182
$$ -58544 -83705 -39639 196756 446453 -37412 -394553 300910 -259501 407351 -155831
4123a55831j82611J002585n46558q8489O764k14753J20756k40723m2341P69997
$$ -155831 -338442 664143 117585 29096 35860 -178893 -58137 -298860 -341201 428796
4113D28796m64945J59573J64157l54807K09285k14758J58598r7910N80652o66647
$$ 428796 -36149 123424 287581 -67226 142059 -72699 85899 -12011 568641 -98006
4103i8006r8603K95452O0911K74323j121963P08374l51590M86472k05383O60478
$$ -98006 -196609 98843 159754 434077 -687886 20488 -331102 155370 -50013 610465
4093F10465q54302R1995N22424L34733n69327k06651J01065p4453P6369J8091
$$ 610465 -243837 -151842 370582 705315 135988 -70663 30402 -44051 32318 50409
4083E0409l35294j56607L60632l30983O10532k81195o037N23315k10611j00433
$$ 50409 -284885 -441492 -80860 -411843 198689 -82506 -88543 434772 224161 123728
4073A23728j34451J41786R537L60116l75891J54047k641K14128L00800p1954m62500
$$ 123728 -10723 131063 140600 500716 124825 278872 276231 490359 791159 719205 256705
4062B56705K7650J95003o0501K16844k10797L43911M84698k29058J28609l85342
$$ 256705 284355 479358 418857 635701 424904 768815 1253513 1024455 1153064 767722
4052G67722N68570j35366O95047j02905m15604P28452k98356J14442R0107P2506
$$ 767722 1336292 1200926 1895973 1793068 1377464 2105916 1807560 1922002 2012109 2084615
4042B084615r3127j75672N55369m73037O13187n13315m95009N33895M69927k1664
$$ 2084615 1991488 1815816 2371185 1898148 2511335 1998020 1503011 2036906 2506833 2485169
4032B485169k9393J23722j88464L94803K74534j60654J58952O24294l654l9061
$$ 2485169 2455776 2579498 2391034 2785837 3060371 2899717 3058669 3682963 3679309 3640248
4022C640248P45807l03698L61868k62808k76806J74680l64807J15306r33695m047
$$ 3640248 4386055 4082357 4444225 4181417 3904611 4079291 3714484 3829790 2896095 2892048
4012B892048n4077K6913N4916l41790k07693J42905K9986n64221N14072j22055
$$ 2892048 2837971 2864884 2919800 2578010 2370317 2513222 2543208 1978987 2493059 2371004
4002B371004l17448K49044j96351L24681k99975J52924J27997j47746M86189l79276
$$ 2371004 2053556 2302600 2106249 2430930 2130955 2283879 2411876 2264130 2750319 2371043
3992B371043j73194P0602k42117J65071K50867p82683o35797O61803J54411k9549
$$ 2371043 2197849 2268451 2026334 2191405 2442272 1659589 1023792 1685595 1840006 1810457
3982A810457o76695L7228N02202m13639p1707l00454j48183P45296o76819J9951
$$ 1810457 1133762 1170990 1673192 1259553 1187846 887392 739209 1484505 807686 827637
3972H27637L395q0321L51598o60267N02563n76069M0948K84496J73859k83941
$$ 827637 831032 750711 1102309 442042 944605 368536 409484 693980 867839 583898
3962E83898M25837m51616l23022N18922j92313m6395o6763n99371M79605L17629
$$ 583898 1009735 558119 235097 754019 561706 515311 448548 -150823 328782 646411
3952F46411k7209k78542l24036N87918l46355M5257J32613l36155J4332M12821
$$ 646411 619202 340660 16624 604542 258187 303444 436057 99902 114234 527055
3942E27055J85393m37302j87697N15452k94601k60169l6351L25089n8631k21142
$$ 527055 712448 275146 87449 602901 308300 48131 11780 336869 278238 57096
3932E7096k3059J97907j42284Q8558J44749j25202J00643m11724K14161l26228
$$ 57096 34037 231944 89660 178218 322967 197765 298408 -113316 100845 -225383
3922b25383K85441L73343q82469P18243L95531k67764n07912l62L23644N3936
$$ -225383 60058 433401 -449068 269175 664706 396942 -110970 -111332 212312 266248
3912B66248k56543j3734J27873j70227k24598k17607N41736L06531l93777K05260
$$ 266248 9705 -4029 123844 -46383 -270981 -488588 53148 359679 -34098 171162
3902A71162k15173K10806L0075n94605M72598k72501K50469o6065p5778J7145
$$ 171162 -44011 166795 196870 -397735 74863 -197638 52831 -13234 -89012 -71867
3892g1867J48662N3917j32040j7126o2321k27264O6010J57864l13826P52630j275259
$$ -71867 76795 130712 -1328 -18454 -80775 -308039 -242029 -84165 -397991 354639 -920620
3881i20620Q16752l77874K45479o3630j34784K62507O33310n64678l82885L52213
$$ -920620 -103868 -481742 -236263 -299893 -434677 -172170 461140 -103538 -486423 -134210
3871a34210J92206J33590l14823n68406l2406P7796M47298k34028l31056L01075
$$ -134210 57996 191586 -123237 -691643 -724049 -646253 -198955 -432983 -764039 -462964
3861d62964L49868l10372M18478m57634K5936J06302R9145j02683J40651q77566
$$ -462964 -113096 -423468 -4990 -462624 -436688 -330386 -231241 -333924 -193273 -1070839
3851a070839N96604o6288L4965J99673j55753L57677J70865j52493p089k86451
$$ -1070839 -474235 -540523 -505558 -305885 -461638 -103961 66904 -85589 -92678 -379129
3841c79129J60324k05194L17036o6733j60114K20422K43983o99326M56728J91670
$$ -379129 -218805 -423999 -106963 -173696 -333810 -113388 130595 -568731 -112003 79667
3831G9667M3640k71636M93387m42153J48699J14903j03393n54990M69595l77769
$$ 79667 123307 -148329 345058 -97095 51604 166507 63114 -491876 -22281 -400050
3821d00050P48730r49216J18811Q04914m07116k41240N85730n17740M50350r7324
$$ -400050 348680 -600536 -481725 323189 -83927 -325167 260563 -257177 193173 95849
3811I5849j38516k82891N67368l9109o29518L93447l705J01414l74371L40272
$$ 95849 -42667 -325558 241810 202701 -426817 -33370 -37075 64339 -310032 30240
3801C0240K58469k71421j48654K01797q7142K79782j22967L02030m42214M48341
$$ 30240 288709 17288 -131366 70431 -16711 263071 140104 442134 -80 448261
3791D48261o57442J77336N07622l39925o12366L37195P21597m00090k94973j04593
$$ 448261 -209181 -31845 475777 135852 -476514 -139319 582278 182188 -112785 -217378
3781b17378K05705N5734j65431j07251J51893K46240M64595p00772j13110R1792
$$ -217378 -11673 44061 -121370 -228621 -76728 169512 634107 -66665 -179775 -87983
3771h7983r2072K16778k2277k60835M86005m50191L67777n04118P87459m14130
$$ -87983 -180055 36723 14446 -246389 239616 -210575 157202 -346916 440543 26413
3761B6413m80061Q41739k16671p08001K80653K999L24719K77447l15997K68559
$$ 26413 -453648 388091 171420 -536581 -255928 -252929 71790 349237 33240 301799
3751C01799k31717j48824K8500L7741m13022O21829j82913k25195k50837M41666
$$ 301799 70082 -78742 -50242 -12501 -425523 196306 13393 -211802 -462639 -20973
3741b0973n00772J74180K77881M5579l17686N81507o15723J35251j21863L21142
$$ -20973 -521745 -347565 -69684 -24105 -341791 239716 -376007 -240756 -362619 -41477
3731d1477L05843j025068R38709n55090J020646n50761j0627k3688o56517L68120
$$ -41477 264366 -760702 178007 -377083 643563 92802 82175 58487 -598030 -229910
3721b29910J94901k4202j63364N20412k18782n035l13456M11223p2603J23709
$$ -229910 -35009 -59211 -222575 297837 79055 74020 -239436 171787 99184 222893
3711B22893j80758J22778j46826l19364J155565n52551p28891K33105J34767j7845
$$ 222893 42135 164913 18087 -301277 854288 301737 -427154 -194049 -59282 -77127
3701g7127j41914j73155J62921J48756L93799k09787n08798K50796O9761n88521
$$ -77127 -219041 -392196 -229275 -80519 313280 103493 -405305 -154509 -84748 -673269
3691f73269L30554L66120n728m61156M88330l85748R3842L60946r807n03946l82155
$$ -673269 -342715 23405 17677 -443479 44851 -340897 -247055 113891 104084 -399862 -782017
3680g82017K54446L46772l55919P68918q44247O07594k84505k1991K67755m30563
$$ -782017 -527571 -180799 -536718 232200 -612047 -4453 -288958 -310949 -43194 -473757
3670d73757K95892K88471r8130m96931O92133l58661k38222K50288L92594n65985
$$ -473757 -177865 110606 12476 -484455 207678 -150983 -389205 -138917 253677 -312308
3660c12308J2235K0348K50049j89673j81877J94326q2047K48946O4629p9826m7500
$$ -312308 -300073 -279725 -29676 -219349 -401226 -206900 -288947 -40001 24628 -55198 -102698
3649a02698K54457K9312l22125J54856N86935o40972k56614k66270R9150L96326
$$ -102698 151759 181071 -141054 13802 600737 -40235 -296849 -563119 -463969 -67643
3639f7643m14998j11031K21000L50640o94524N18534j17999j59357m465M37865
$$ -67643 -482641 -593672 -372672 -22032 -716556 -198022 -316021 -475378 -479843 -41978
3629d1978l53996L83215J38202k32161j11825J83377o43130L36923K46670K15851
$$ -41978 -395974 -12759 125443 -106718 -218543 -35166 -678296 -341373 -94703 121148
3619A21148n89829J52337k47862N60203m85791J44445k0637j19867L72322k21732
$$ 121148 -468681 -316344 -564206 -4003 -489794 -345349 -365986 -485853 -113531 -335263
3609c35263L16922p11444J108530q62284L45546j38618J03579o0294k60459K79248
$$ -335263 -18341 -729785 378745 -483539 -137993 -276611 -173032 -233326 -493785 -214537
3599b14537j97911k34788j10238N94599K76495L8053j08895j31313l44047J13986
$$ -214537 -412448 -647236 -757474 -162875 113620 151673 42778 -88535 -432582 -318596
3589c18596o4228J93439j94739k54048M47496l34540P7570K24661o2506Q8060
$$ -318596 -382824 -189385 -384124 -638172 -190676 -525216 -447646 -222985 -285491 -197431
3579a97431L95082n08314j40213Q5266Q9073J62477k59934K13603k47915O27061
$$ -197431 197651 -310663 -450876 -365610 -276537 -114060 -373994 -160391 -408306 218755
3569B18755n87314M28863k93766L6764J43344n54323M83438k95843N91947n92940
$$ 218755 -368559 60304 -233462 -196698 -53354 -607677 -124239 -420082 171865 -421075
3559d21075Q65991j36075r3848K9393n7656K16617q3979j85616J01518r9151q3104
$$ -421075 444916 308841 214993 244386 186730 403347 319368 133752 235270 136119 53015
3548E3015M8958l58984l5497K38815L42578n51367l71257O56213m394J04303K34750
$$ 53015 101973 -257011 -292508 -53693 288885 -262482 -633739 22474 18080 122383 357133
3537C57133p83356L64019M1856m84954K32859J49807j1162j87931j30688M38720
$$ 357133 -426223 -62204 -20348 -505302 -272443 -122636 -133798 -321729 -452417 -13697
3527a3697L40737n15452K9860p4878L32195m66108J45741M46755p0498k78829
$$ -13697 327040 -188412 -158552 -233430 98765 -367343 -221602 225153 154655 -124174
3517a24174J58448m74105L08606o8550K58741m12969N01612M67577n11413p58647
$$ -124174 34274 -439831 -131225 -199775 58966 -354003 147609 615186 103773 -654874
3507f54874M68308M849K82824k44745J81055K0785J70314m74229J93282K12207
$$ -654874 -186566 -181717 101107 -143638 37417 58202 228516 -245713 -52431 159776
3497A59776n14774P39259j98958j97742o4769k99908J57204j06997M38024n61809
$$ 159776 -354998 384261 185303 -12439 -77208 -377116 -219912 -326909 111115 -450694
3487d50694k66936N85201j78540p4037L80508l53425O05110m67435R2695J17302
$$ -450694 -717630 -132429 -310969 -385006 -4498 -357923 247187 -220248 -127553 -10251
3477a0251M38448l33001K76502k02132K24283n89856J140N76692j51618m99375
$$ -10251 428197 95196 371698 169566 393849 -196007 -194867 381825 230207 -269168
3467b69168J89467N81436p96372P93422p55005M51416l71865K67936k90622J31269
$$ -269168 -79701 501735 -294637 498785 -256220 195196 -176669 91267 -199355 -68086
3457f8086n70404M98508K48831j70872P9904J6458L42381k31491m22537O08351
$$ -68086 -638490 -139982 108849 -62023 17881 34339 376720 145229 -277308 331043
3447C31043K87099m83902k57977K80841k71695K04437j4003l99535o9070Q12733
$$ 331043 618142 134240 -123737 157104 -114591 89846 75843 -323692 -392762 419971
3437D19971n79262M63753o74259L02480o5422l04456J113568n32553k31229o4893
$$ 419971 -159291 304462 -369797 -67317 -132739 -437195 676373 143820 -87409 -152302
3427a52302L43807J49472M110l0961j6366l52197J70247J98982n9206L44727k41676
$$ -152302 191505 340977 345087 314126 297760 -54437 115810 314792 255586 600313 358637
3416C58637L27218k66326L35731J9565p30879P2083j84024k34528J041225p4793
$$ 358637 685855 419529 755260 774825 43946 116029 -67995 -302523 738702 663909
3406F63909j087908K37441N44767K47215n3065L39119k63280J99897p07126M32305
$$ 663909 -423999 -186558 358209 605424 552359 891478 628198 828095 120969 553274
3396E53274n09217M62055j55251l757L0530M34532k62371j19031J47075O7700
$$ 553274 44057 506112 350861 347104 377634 812166 549795 430764 577839 645539
3386F45539M08872k63642K41009l6357o8699L0331N51780o13427J039400n12515
$$ 645539 1054411 790769 1031778 995421 926722 957053 1508833 895406 1934806 1422291
3376A422291L7748l50932K00124l07297j79426O46459p57388J59214K59012j30913
$$ 1422291 1460039 1109107 1309231 1001934 822508 1468967 711579 870793 1129805 998892
3366I98892n53649P31484n14926J32733O22473k7893j90391j8488r4797J47738
$$ 998892 445243 1176727 661801 794534 1417007 1389114 1198723 1180235 1085438 1233176
3356A233176N16374j88850L9713M09346j41196K19665k61570Q50910k02569P60719
$$ 1233176 1749550 1560700 1600413 2009759 1868563 2088228 1826658 2677568 2474999 3235718
3346C235718k9624M99595n8195J13802L16246L76203M37572L76555J616060J008606
$$ 3235718 3206094 3705689 3647494 3761296 4077542 4453745 4891317 5267872 6883932 7892538
3336G892538J374446R84735Q21225J238659R11010J460955J372954K354699L173522
$$ 7892538 9266984 10251719 11072944 12311603 13222613 14683568 16056522 18411221 21584743
3327B1584743M350885P785393Q432314P616772J0851205O149305K749393l85840
$$ 21584743 25935628 33721021 42153335 49770107 60621312 66770617 69520010 69134170
3319F9134170j3843144q754025o149698m796006m599092l005461k794572k530333
$$ 69134170 55291026 46537001 40387303 35591297 30992205 27986744 25192172 22661839
3311B2661839j007591k662212k207596o99180j356880j224220j621559j062389
$$ 22661839 21654248 18992036 16784440 16085260 14728380 13504160 11882601 10820212
3303A0820212j024802m99213r68656l21209l65320r30469K60326r38305o98563
$$ 10820212 9795410 9296197 8327541 8006332 7641012 6710543 6970869 6032564 5334001
3294E334001N81740q32948J73766k21654l47922O2349k46516q44621N22485n05542
$$ 5334001 5915741 5082793 5256559 5034905 4686983 4749332 4502816 3658195 4180680 3675138
3284C675138J43107k85805r7518l98134J0346j44204m71476k35412N8812K76784
$$ 3675138 3818245 3532440 3434922 3036788 3047134 2902930 2431454 2196042 2254854 2531638
3274B531638r4856n28135K00624k09775M34216o87168J01869j74349r7657O1743
$$ 2531638 2436782 1908647 2109271 1899496 2333712 1646544 1748413 1574064 1476407 1538150
3264A538150M33061j91918m77608P8893L54035l40634J25499l18023K83578k64700
$$ 1538150 1971211 1779293 1301685 1380578 1734613 1393979 1519478 1201455 1485033 1220333
3254A220333J10050L65027l54722l16020L96236j45695m32985J65762J70879r5413
$$ 1220333 1330383 1695410 1340688 1024668 1420904 1275209 842224 1007986 1178865 1083452
3244A083452r68207P62302J24214j45673R1738k46400R16713j260632N49651J0720
$$ 1083452 115245 877547 1001761 856088 947826 701426 1618139 357507 907158 917878
3234I17878k354j25312J22471m1129k68909P3943N28685j79271l57515O20466
$$ 917878 915524 790212 912683 871554 602645 676588 1205273 1026002 668487 1288953
3224A288953l95869k26219k77242J0633K5586R1255l37404k89244J107322q07495
$$ 1288953 893084 666865 389623 400256 425842 517097 179693 -109551 997771 190276
3214A90276P83767m50613P3407K554l73140L24082k09744j88286O55643j036547
$$ 190276 974043 523430 596837 599391 226251 550333 340589 152303 807946 -228601
3204b28601O30279M26441o11046K81159l99284N25446n47182Q79273p19681k89716
$$ -228601 401678 828119 217073 498232 98948 624394 77212 956485 236804 -52912
3194e2912N0849M55479J53281k61043M89402l88392j7201k55484J67293r6880
$$ -52912 -2063 453416 606697 345654 835056 446664 429463 173979 341272 244392
3184B44392Q83095o61168J08659n58316L6106j64093L69524N7237N99587k12268
$$ 244392 1127487 466319 574978 16662 52768 -111325 258199 315436 915023 702755
3174G02755l85736p66153O02295M50587k72294M27136j044411L21206K42213p3599
$$ 702755 317019 -449134 153161 603748 331454 758590 -285821 35385 277598 203999
3164B03999p3089l14173P0626M57285K4800m19728j41425K27696k47108N31371
$$ 203999 130910 -183263 -112637 344648 369448 -50280 -191705 35991 -211117 320254
3154C20254q2560m34138j21276Q0218K98164K52229r4194k57320K62373k00266
$$ 320254 237694 -196444 -317720 -237502 60662 312891 218697 -38623 223750 23484
3144B3484l03754K60138r5339q4293N15898k56512m83092N95J53469Q17485r67951
$$ 23484 -280270 -20132 -115471 -199764 316134 59622 -423470 -422875 -269406 548079 -419872
3133d19872K05109K40420k13828l08933j63053P59206m2958n16151N94293q5804
$$ -419872 -214763 25657 -188171 -497104 -660157 99049 56091 -460060 134233 48429
3123D8429k97276n1939M03939j71304J94315m67928n9579J06832j96393P30643
$$ 48429 -248847 -300786 103153 -68151 126164 -341764 -401343 -294511 -490904 239739
3113B39739n14076K65394k09759J9486K29183j84584Q1022l6168P3264J59187
$$ 239739 -274337 -8943 -218702 -199216 29967 -154617 -73595 -109763 -36499 122688
3103A22688J589M6895j96802M5587k00996O34730l44996J44933l8323m63351J88876
$$ 122688 124277 171172 -25630 19957 -181039 453691 108695 253628 215305 -248046 -59170
3092e9170l44066P01240j34366o74257L39302K34245K49068l18350K24769J90788
$$ -59170 -403236 298004 163638 -510619 -171317 62928 311996 -6354 218415 409203
3082D09203n58877K4789J18167l02262N90114k66290P02095q09634m34770P94778
$$ 409203 -149674 -124885 -6718 -308980 281134 14844 716939 -92695 -527465 267313
3072B67313k05675j29190K42040j17064m92788O08365l51633L92498m04520K81760
$$ 267313 61638 -67552 174488 57424 -435364 173001 -178632 213866 -190654 91106
3062I1106M32207p11245L24714k86892j44318J61095j66959O3681L63521l15876
$$ 91106 523313 -187932 136782 -150110 -294428 -133333 -300292 -236611 126910 -188966
3052a88966P01013p13740J28472p730j5127l36756O81809J45940m69115N5488
$$ -188966 512047 -201693 -73221 -80951 -96078 -432834 248975 394915 -74200 -18712
3042a8712m43841N51037n16599O03993o86755J01588K76951j66351P874m0060
$$ -18712 -462553 88484 -428115 175878 -510877 -409289 -132338 -298689 -290815 -330875
3032c30875K28859J24673J85671l71174K63286l97871M0950K40860M23426p45219
$$ -330875 -102016 22657 208328 -162846 100440 -297431 -256481 -15621 407805 -337414
3022c37414N30870o80034O04277J64845k79823m2657m9556m412k26555Q413L23275
$$ -337414 193456 -486578 117699 282544 2721 -39936 -89492 -93904 -320459 -312046 11229
3011A1229k60293K58414m03820K04096O14215o46184j82060O15521R1208l29580
$$ 11229 -249064 9350 -394470 -190374 423841 -222343 -404403 211118 302326 -27254
3001b7254n9578j83713n4122K12373m49962j20938K42250M35402J66565q6095
$$ -27254 -86832 -270545 -324667 -112294 -562256 -683194 -440944 -5542 161023 74928
2991G4928m12610L76674j05447K53077n33098L72096J60734o41942O69353n64823
$$ 74928 -337682 38992 -66455 186622 -346476 25620 186354 -455588 213765 -351058
2981c51058J78107j04316R3497k23597O59046k17751n265m69944K29407L0071
$$ -351058 -172951 -277267 -183770 -407367 251679 33928 28663 -441281 -211874 -181803
2971a81803J12405j28351L3494k81164K54421J33119J53154j072131O91238K53388
$$ -181803 -69398 -197749 -164255 -445419 -190998 -57879 95275 -976856 -285618 -32230
2961c2230r9013Q3688O3218j45735J02768K94973m33800N25244n37475n18884
$$ -32230 -131243 -47555 15663 -130072 -27304 267669 -166131 359113 -178362 -697246
2951f97246O62451m65321N12287k3679l08425p8984L04194l03868K29317k28694
$$ -697246 -34795 -500116 12171 -11508 -319933 -398917 -94723 -398591 -169274 -397968
2941c97968L23091N3128J6611Q5148k90715l32456K44114R7178j12550K72806
$$ -397968 -74877 -21749 -5138 80010 -210705 -543161 -299047 -201869 -314419 -41613
2931d1613l67510J16786l01013P05435p86887L24325J77481J44797k23426K83250
$$ -41613 -409123 -292337 -593350 112085 -674802 -350477 -172996 -28199 -251625 31625
2921C1625j87587J23710n72460K80043o0399J56909q14553J145519p37398O05771
$$ 31625 -155962 -32252 -604712 -324669 -385068 -228159 -1042712 102807 -634591 -28820
2911b8820o38148M53913l11668M53732n09166K15293L91717k04598J73133k44949
$$ -28820 -666968 -213055 -524723 -70991 -580157 -364864 26853 -177745 -4612 -249561
2901b49561Q3943l9760l81566R9635M43653k21152p7876k8839J87771J80349J54060
$$ -249561 -165618 -205378 -586944 -487309 -43656 -264808 -342684 -371523 -183752 -3403 150657
2890A50657m98501M72214l51684K01402m69960j47589m785L35739M11620k15130
$$ 150657 -347844 124370 -227314 -25912 -495872 -643461 -648246 -312507 99113 -116017
2880a16017m26089K84787n43758J05580l7730O49702l12549K50195l39376K22332
$$ -116017 -542106 -257319 -801077 -695497 -733227 -83525 -396074 -145879 -485255 -262923
2870b62923j24744p4473K09307o31541M24649N7506O29213m81938l90844J9659
$$ -262923 -387667 -462140 -252833 -884374 -459725 -402219 226994 -254944 -645788 -626129
2860f26129m2960J009390n03093n15444J025036n09166j65889O51287o96829O62867
$$ -626129 -669089 340301 -162792 -678236 346800 -162366 -328255 323032 -373797 289070
2850B89070q41788j19104K42178R6257j37473R9655l32964O63591j01980k10852
$$ 289070 -552718 -671822 -429644 -333387 -470860 -371205 -704169 -40578 -142558 -353410
2840c53410l29450m2482j6606J145576j457938J106371n60635M00918k010k47062
$$ -353410 -682860 -725342 -741948 403628 -1054310 52061 -508574 -107656 -109666 -356728
2830c56728m8877Q2065p4089N17248m45633K25190k69194J00525o821j03807k61820
$$ -356728 -405605 -323540 -397629 119619 -326014 -100824 -370018 -269493 -276314 -380121 -641941
2819f41941M6679l745K22090k49533N52219k60278J33599N970J33937N132m02305
$$ -641941 -595262 -599007 -376917 -626450 -74231 -334509 -200910 -194940 -61003 -55871 -458176
2808d58176J09669K07010j90591J18803N5039R5896m85519Q7678K9659j80094
$$ -458176 -348507 -141497 -332088 -213285 -158246 -62350 -547869 -460191 -430532 -610626
2798f10626P20946l46665K30497q34716M54615M39487j25651m20156P8459J3173
$$ -610626 110320 -236345 -5848 -840564 -385949 53538 -72113 -492269 -413810 -400637
2788d00637K79530R9694k81474N6079j16217M3599P29098n22665r30363Q10600
$$ -400637 -121107 -21413 -302887 -246808 -363025 -319426 409672 -112993 -1043356 -232756
2778b32756l66807O58927k92118p3841K64481m51282Q9787K19329L3050M17256
$$ -232756 -599563 59364 -232754 -306595 -42114 -493396 -403609 -184280 -151230 266026
2768B66026k88588j74793J93835m73879K58655J21671k91181J52579N58184l07724
$$ 266026 -22562 -197355 -3520 -477399 -218744 -97073 -388254 -235675 322509 14785
2758A4785j62217k31019P4558M82829p4327o42283M16226R2354n61237Q33o0472
$$ 14785 -147432 -378451 -303893 178936 104609 -537674 -121448 -29094 -590331 -589498 -649970
2747f49970K71120k10560J40560n1618n997K65417P23596p27052K74703k09849
$$ -649970 -378850 -589410 -448850 -500468 -506465 -241048 482548 -244504 30199 -179650
2737a79650q6449o8069J63030k31887L06320l5917n93823M77376l8129k65026
$$ -179650 -266099 -334168 -171138 -403025 -96705 -132622 -726445 -249069 -287198 -552224
2727e52224J58926K6760l5538M3509J68455k7915L29896m41837R7560n20373Q61537
$$ -552224 -393298 -366538 -402076 -358567 -190112 -218027 111869 -329968 -232408 -752781 108756
2716A08756m36409k78582M96961l55697J60463q2280K74067J58772p18650P0999
$$ 108756 -327653 -606235 -109274 -464971 -304508 -386788 -112721 46051 -672599 -601600
2706f01600j75466Q84170n03347M38605n63882j7741N42330l7728j31115N17615
$$ -601600 -777066 107104 -396243 42362 -521520 -539261 3069 -34659 -165774 351841
2696C51841m95256n78443N80474l41948r149N413j26127J52765M06244k90265
$$ 351841 -143415 -721858 -141384 -483332 -492481 -487068 -613195 -460430 -54186 -344451
2686c44451k86452O51276o04494k92844K27766P7876N65393n99040N25366j6360
$$ -344451 -630903 20373 -584121 -876965 -649199 -571323 -5930 -604970 -79604 -95964
2676i5964r16570K29382j5226N67297n69395Q82380k71817K03631l66315J73960
$$ -95964 -1012534 -783152 -798378 -231081 -800476 81904 -189913 13718 -352597 -178637
2666a78637k88707p2464O99795l20766k39700L25685o56849k55776O93246o18673
$$ -178637 -467344 -539808 159987 -160779 -400479 -74794 -731643 -987419 -294173 -912846
2656i12846N34353L56506q7250n37224O23628K07034n28052l54715k31298L14281
$$ -912846 -378493 -21987 -109237 -646461 -22833 184201 -343851 -698566 -929864 -615583
2646f15583K96187Q7101k82713M21477l65936J37998L58441n31659L37075J56027
$$ -615583 -319396 -232295 -515008 -93531 -459467 -321469 36972 -494687 -157612 -1585
2636a585l86282L43930m9680j37481k02375K21398j83628K06456o892Q4219j1447
$$ -1585 -387867 -43937 -93617 -231098 -433473 -212075 -395703 -189247 -196139 -111920 -123367
2625a23367j48330K45928k8466l89560O35562J09026n9041p4521n63899J34030
$$ -123367 -271697 -25769 -54235 -443795 191767 300793 241752 167231 -396668 -262638
2615b62638K73472o16851P06612m06902J93805k262q4548R6665k75444K38545
$$ -262638 10834 -606017 100595 -306307 -112502 -114764 -199312 -102647 -378091 -139546
2605a39546m01476l62396P01922j48203M9444N05535j000448R70987m06287K63223
$$ -139546 -541022 -903418 -201496 -349699 -300255 205280 -795168 175819 -230468 32755
2595C2755l40577J91573J88804l29672m0283K96640m58178K6801k3423K12860
$$ 32755 -307822 -116249 72555 -257117 -297400 -760 -458938 -432137 -455560 -242700
2585b42700j98820K11137J14384k52417k32166M05392K59392l98367O17895k0662
$$ -242700 -441520 -230383 -115999 -368416 -600582 -195190 64202 -334165 283730 263068
2575B63068m14846M01881o09508r7721k03088P87434l0985n64540J78425R746
$$ 263068 -151778 250103 -359405 -457126 -660214 127220 96235 -468305 -289880 -280134
2565b80134p5907J80043n03446L76820N19992o85313J57480m8626l21423M69821
$$ -280134 -356041 -175998 -679444 -302624 217368 -467945 -310465 -359091 -680514 -210693
2555b10693q5341J7680L44892o82366J15430L48634j96021J65412P3336k70m69696
$$ -210693 -296034 -278354 66538 -615828 -500398 -151764 -347785 -182373 -109037 -109307 -579003
2544e79003M63375n26698J53380L23058k24491M20422l95412M92922k68568O1536
$$ -579003 -115628 -642326 -488946 -165888 -390379 30043 -365369 127553 -141015 -79479
2534g9479J61631o00875O43454k55874o36216J43252L62502m51535L42802Q2666
$$ -79479 82152 -518723 124731 -131143 -767359 -624107 -261605 -713140 -370338 -287672
2524b87672J9716J96537n76811J145289q28197L59740j94721l27307J23597L18797
$$ -287672 -267956 -71419 -648230 497059 -331138 28602 -166119 -493426 -369829 -51032
2514e1032m18058J981J73968j08923j6112L21281j42021P0025k31497J91999K77322
$$ -51032 -469090 -467109 -293141 -402064 -418176 -96895 -238916 -168891 -400388 -208389 68933
2503F8933k27560O5108K54133o13381J97400K03662o8342m47193Q76790r49177
$$ 68933 -158627 -93519 160614 -452767 -255367 -51705 -120047 -567240 309550 -639627
2493f39627J17162K50442j0087j53060n81613Q69970l4079m0344K91528j97869
$$ -639627 -522465 -272023 -282110 -435170 -1016783 -146813 -180892 -221236 70292 -127577
2483a27577L29095o92726l49193P67327j06720l4843l23068M31208k27247l7940
$$ -127577 201518 -491208 -840401 -73074 -179794 -214637 -537705 -106497 -333744 -371684
2473c71684O6016L80440k71947J24443j42251K39463k4872O43033j118989M32461
$$ -371684 -305668 74772 -197175 -72732 -214983 24480 -392 642641 -476348 -43887
2463d3887j27168l06273K42582K50380o05883J13950l2055O3854k8314j75497
$$ -43887 -171055 -477328 -234746 15634 -590249 -476299 -508354 -444500 -472814 -648311
2453f48311M22600L21842j80169j06018k25180J72612L08093j80125J33249O4387
$$ -648311 -225711 96131 -84038 -190056 -415236 -242624 65469 -114656 18593 82980
2443H2980M9686l97383J77659K79665l10345P0972l85533k48181M81552J63339
$$ 82980 132666 -264717 -87058 192607 -117738 -46766 -432299 -680480 -198928 -35589
2433c5589m12782n1131Q6272Q3824J64366n85822N40148J72527k48437l03470
$$ -35589 -448371 -499502 -413230 -329406 -165040 -750862 -210714 -38187 -286624 -590094
2423e90094K46375J79226l11k60046r7816L38062m70126R52610q49508M53880
$$ -590094 -343719 -164493 -164804 -424850 -522666 -184604 -654730 297880 -551628 -97748
2413i7748j41425j19054p2756o6621K48970k24400n92598P14355N75359p98821
$$ -97748 -239173 -358227 -430983 -497604 -248634 -473034 -1065632 -351277 224082 -574739
2403e74739Q8893l2234R0268L67956k92046L06635K20514m7257k02390n9777n13966
$$ -574739 -485846 -518080 -427812 -59856 -351902 -45267 175247 127990 -74400 -134177 -648143
2392f48143P79232m53647j17580J131425p50913j46189M0749l08169J77824m4607
$$ -648143 131089 -322558 -440138 691287 -59626 -205815 -165066 -473235 -295411 -340018
2382c40018j01413N22672l71848N3960M4449K50195l87575R5569K51586l87793
$$ -340018 -441431 81241 -290607 -236647 -192198 57997 -329578 -234009 17577 -370216
2372c70216j08580N70679l28188m761k08476N51251n82260K83702K92499l07439
$$ -370216 -478796 91883 -236305 -241066 -449542 101709 -480551 -196849 95650 -211789
2362b11789P0400j74000J69124R7296J4604N7605j90384K24366r77232N94851
$$ -211789 -141389 -315389 -146265 -48969 -34365 23240 -167144 57222 -920010 -325159
2352c25159j51655K34686j28778n8952k75668N80169n27030L09583k78367M98371
$$ -325159 -476814 -242128 -370906 -429858 -705526 -125357 -652387 -342804 -621171 -122800
2342a22800l51006m01543N04384K09928l4214j58867N31606q13272N21881l18642
$$ -122800 -473806 -875349 -370965 -161037 -195251 -354118 177488 -635784 -113903 -432545
2332d32545M45011k31791l5886k64466j62821L24512P04686r06797K98587J5152
$$ -432545 12466 -219325 -255211 -519677 -682498 -357986 346700 -560097 -261510 -246358
2322b46358K03886J28886m69359K22360K04447p948O0446l50352o66464N07246
$$ -246358 -42472 86414 -382945 -160585 43862 35914 96360 -253992 -920456 -413210
2312d13210O96515l57220l21794L7418N84753m82497l60660N45295M5370K69109
$$ -413210 283305 -73915 -395709 -358291 226462 -256035 -616695 -71400 -26030 243079
2302B43079j96616n06065k094m18841P38206k67103q6943K31733R1710m26290
$$ 243079 46463 -459602 -461696 -880537 -142331 -409434 -496377 -264644 -172934 -599224
2292e99224K64020K94314J3579l64731J74078n8485K46123n1728o5675J09258
$$ -599224 -335204 -40890 -27311 -392042 -217964 -276449 -30326 -82054 -147729 -38471
2282c8471o04983L70592R2356k95369O66818o09213N45302j88542j8953n9967
$$ -38471 -643454 -272862 -180506 -475875 190943 -418270 127032 -61510 -80463 -140430
2272a40430r711l43636N26894k9697j1510n98898K79702j55310M3760k42775N40991
$$ -140430 -150141 -493777 33117 3420 -8090 -606988 -327286 -482596 -438836 -681611 -140620
2261a40620J95240n04011r2116N87121k63559K1080q0384l0184m3773j50267K4007
$$ -140620 54620 -449391 -541507 45614 -217945 -196865 -277249 -307433 -351206 -501473 -477466
2250d77466O80948o50915L71286n36975L41852J27436J45308L1940P752n18428
$$ -477466 203482 -447433 -76147 -613122 -271270 -143834 1474 33414 41166 -477262
2240d77262O14222J86123m92665J41922n28993O34401o23156J98818J53930o9591
$$ -477262 136960 323083 -169582 -27660 -556653 77748 -545408 -346590 -192660 -262251
2230b62251j21942O54898l25629k57987K4329K57889r831K83231j52717n11853
$$ -262251 -384193 270705 -54924 -312911 -288582 -30693 -40524 242707 89990 -421863
2220d21863j19755K87260o97978Q35444l3282l1440m55424O64953o3604n63739
$$ -421863 -541618 -254358 -952336 -116892 -150174 -181614 -637038 27915 -35689 -599428
2210e99428J84627O0264O56844p86268n4755L04088m172l04795P7927m30036O14984
$$ -599428 -414801 -354537 302307 -483961 -538716 -234628 -238800 -543595 -465668 -895704 -280720
2199b80720N408K07928R4228j50586l12446K02329k28244j61339m2656Q36305
$$ -280720 -275312 -67384 26844 -123742 -436188 -233859 -462103 -623442 -666098 170207
2189A70207k35429m9856j85137J24558l83233O24147l85039k22645P01552r8780
$$ 170207 -65222 -115078 -300215 -175657 -558890 65257 -319782 -542427 159125 60345
2179F0345n21622M11963L98522n97935k57687M3294N55011n52715P10178m4161
$$ 60345 -461277 -49314 349208 -248727 -506414 -463120 91891 -460824 249354 205193
2169B05193r15464N81326J84838j25756l68145K05728k24564O4151o711j03286
$$ 205193 -710271 -128945 55893 -69863 -438008 -232280 -456844 -392693 -399404 -502690
2159e02690K36741k83704M19238m0138n06663J40347N89732l69104l18269O75065
$$ -502690 -265949 -549653 -130415 -170553 -677216 -536869 52863 -316241 -634510 40555
2149D0555j12869J79860K27205p76614K62589k64476K46050k20678K89435o55249
$$ 40555 -72314 107546 334751 -441863 -179274 -443750 -197700 -418378 -128943 -784192
2139g84192K36451R0013K02020J34834l28852K8987J39092k31336P23633m84782
$$ -784192 -547741 -457728 -255708 -120874 -449726 -420739 -281647 -512983 210650 -274132
2129b74132N98344K4357n67053J12538K01863l31706l79393K83384P1363Q0646
$$ -274132 324212 348569 -218484 -105946 95917 -235789 -615182 -331798 -260435 -179789
2119a79789m3574k51537j64347Q10866l60890o0253q352J8917M39527q8019p5584
$$ -179789 -223363 -474900 -639247 171619 -189271 -249524 -257876 -238959 200568 112549 36965
2108C6965m15927K67500K51605j64671n71062J56554O22202k15841P2685l99552
$$ 36965 -378962 -111462 140143 -24528 -595590 -439036 183166 -32675 40010 -359542
2098c59542J08733N96399r3915m75427M0849m25756p9622J32272N23462k42416
$$ -359542 -250809 345590 251675 -223752 -182903 -608659 -688281 -556009 -32547 -274963
2088b74963K42774o9264J40203N1991j29820J29182m27345j77625M01669L6866
$$ -274963 -32189 -101453 38750 90741 -39079 90103 -337242 -514867 -113198 -76332
2078g6332P2737n20589K52307l34608O86017K33711o94321M3141N89461k64283
$$ -76332 -3595 -524184 -271877 -606485 79532 313243 -381078 -337937 251524 -12759
2068a2759j70347k05610K01128J79492K78385l56224K03965L2918j61230j40656
$$ -12759 -183106 -388716 -187588 -8096 270289 -85935 118030 150948 -10282 -150938
2058a50938l6604L78325n27538K3474k50243O68330n24909N37650l86340M31370
$$ -150938 -187542 190783 -336755 -313281 -563524 104806 -420103 117547 -268793 162577
2048A62577j80773J33126n86553J66076O6364R7835K32780q9825J54282n65446
$$ 162577 -18196 114930 -471623 -305547 -239183 -141348 91432 1607 155889 -409557
2038d09557L44213k55296N09627l6427l05147k85396J77390L69074m41122J65609
$$ -409557 -65344 -320640 188987 152560 -152587 -437983 -260593 108481 -332641 -167032
2028a67032K25397k03222l29641K53086L92410j83987k91548K55227k33520q0444
$$ -167032 58365 -144857 -474498 -221412 170998 -12989 -304537 -49310 -282830 -363274
2018c63274L70036n50733R0620K85655l61927k7664K72005j28532M44119O6910
$$ -363274 6762 -543971 -453351 -167696 -529623 -557287 -285282 -413814 30305 97215
2008I7215o34667K35625j28525L65322j95376q4665J0758j11848Q92482q38375
$$ 97215 -537452 -301827 -430352 -65030 -260406 -345071 -334313 -446161 446321 -392054
1998c92054J32881L28406j50783k6348J35250m3354Q127R1960k70443l5720J31232
$$ -392054 -259173 69233 -81550 -107898 27352 -16002 -7875 84085 -186358 -222078 -90846
1987i0846j95894J114381j671893O45891N59448n83555j54644Q80221p29878n6990
$$ -90846 -286740 827641 -844252 -198361 361087 -222468 -377112 503109 -226769 -283759
1977b83759O24240m86203j14962J48286L14155m07063j6747O9861k45680K77751
$$ -283759 340481 -145722 -260684 -112398 201757 -205306 -222053 -152192 -397872 -120121
1967a20121j21945P4321J99343J47123m42527J63633J42068n9074j6161j36234
$$ -120121 -242066 -167745 31598 178721 -263806 -100173 41895 -17179 -33340 -169574
1957a69574l96730n4113N46023N45152n73581l5290K62434q30711O97429k3051
$$ -169574 -566304 -620417 -74394 470758 -102823 -138113 124321 -706390 -8961 -32012
1947c2012N618l97653N12379l67987r8370M90144l01089J13143K06666m72942
$$ -32012 -26394 -424047 88332 -279655 -378025 112119 -188970 -75827 130839 -342103
1937c42103N5132O5520o72778O46388j48848M10524L9185n10633K39712k31537
$$ -342103 -286971 -221451 -894229 -247841 -396689 13835 53020 -457613 -217901 -449438
1927d49438l18038O76011l19183O39512j024217R17339n56468O1074K37222K95192
$$ -449438 -767476 -91465 -410648 228864 -795353 121986 -434482 -373408 -136186 159006
1917A59006q6617k13229l44271J8244L39521k90315K48315N48154l41506j59250
$$ 159006 72389 -140840 -485111 -466867 -127346 -417661 -169346 378808 37302 -121948
1907a21948N5424P8791k05551j01615K37285m97149K06242J73650J10567l99415
$$ -121948 -66524 12267 -193284 -294899 -57614 -554763 -348521 -174871 -64304 -463719
1897d63719N90813k85593N00523J12547o38107L31985j98262p6791j81710r9447
$$ -463719 127094 -158499 342024 454571 -183536 148449 -49813 -126604 -308314 -407761
1887d07761q5630k40077R12586m38468j37842J92407k70523P54775n39989k47972
$$ -407761 -493391 -733468 179118 -259350 -397192 -204785 -475308 279467 -260522 -508494
1877e08494P40698j15124l56884M20415m01987l1104k98269O38518n33455l11233
$$ -508494 232204 117080 -239804 180611 -221376 -252480 -550749 87769 -445686 -756919
1867g56919P25257J1424L2824k34967K51832j63846K45719n93570M80534l09212
$$ -756919 -31662 -20238 12586 -222381 29451 -134395 111324 -482246 -1712 -310924
1857c10924Q4094p3202o1845N6009O92784k58562o68297J26921Q5540j12798K66145
$$ -310924 -226830 -300032 -361877 -305868 386916 128354 -539943 -413022 -327482 -440280 -174135
1846a74135K12517K71985o17687J80579P1448R6360Q6156p8803m29645N36417
$$ -174135 38382 310367 -307320 -126741 -55293 41067 127223 48420 -381225 155192
1836A55192k17187N16114m48374k52061K57184J66537o60550M39224q57510O32054
$$ 155192 -61995 454119 5745 -246316 10868 177405 -483145 -43921 -901431 -269377
$$ [...]
##END NTUPLES=NMR SPECTRUM
##END=
