##TITLE=abcd
##JCAMPDX= 6.0         $$ Bruker NMR JCAMP-DX V2.0
##DATA TYPE= NMR FID
##DATA CLASS= NTUPLES
##ORIGIN= UXNMR, Bruker Analytische Messtechnik GmbH
##OWNER= root
$$ XWIN-NMR		Version 3.5
$$ Fri Aug  8 18:39:02 2025 Russian Standard Time (UT+4h)  servis@DPX200
##.OBSERVE FREQUENCY= 200.131235884673
##.OBSERVE NUCLEUS= ^1H
##.DELAY= (6, 6)
##.ACQUISITION MODE= SIMULTANEOUS
##.ACQUISITION SCHEME= undefined
##.AVERAGES= 32
##.DIGITISER RES= 18
##SPECTROMETER/DATA SYSTEM= spect
##.PULSE SEQUENCE= zg
##.SOLVENT NAME= CDCl3
##.SHIFT REFERENCE= (INTERNAL, CDCl3, 0, 16.5164)
##AUDIT TRAIL= $$ (NUMBER, WHEN, WHO, WHERE, WHAT)
$$ ##TITLE= Audit trail, XWIN-NMR		Version 3.5
$$ ##JCAMPDX= 5.01
$$ ##ORIGIN= Bruker BioSpin GmbH
$$ ##OWNER= servis
$$ F:\spectra/data/av/nmr/H1/1/audita.txt
$$ ##AUDIT TRAIL=  $$ (NUMBER, WHEN, WHO, WHERE, WHAT)
(   1,<2025-08-08 18:35:52.85 +0400>,<servis>,<DPX200>,
      <created by zg, POWCHK disabled, PULCHK disabled
       configuration hash MD5:
       00 E9 B6 7A A2 85 ED C7 34 08 36 98 17 FE 4E 26
       data hash MD5: 32K
       54 8F 2A F9 24 5E 93 70 57 D8 FE 7D 19 DA DD 19>)
$$ ##END=
$$ 
$$ hash MD5
$$ 71 C6 27 8E 68 B7 AA 7B 4E 27 6B 44 74 30 3A 68
##$RELAX= 
##$RELAX= 
##$RELAX= 
##$RELAX= 
##$RELAX= 
##$RELAX= 
##$RELAX= 
##$RELAX= 
$$ Bruker specific parameters
$$ --------------------------
##$DU= <F:\spectra>
##$EXPNO= 1
##$NAME= <H1>
##$PROCNO= 1
##$TYPE= <nmr>
##$USER= <av>
##$AMP= (0..31)
100 100 100 100 100 100 100 100 100 100 100 100 100 100 100 100 100 100 
100 100 100 100 100 100 100 100 100 100 100 100 100 100 
##$AQSEQ= 0
##$AQ_mod= 1
##$AUNM= <au_zg>
##$AUTOPOS= <>
##$BF1= 200.13
##$BF2= 200.13
##$BF3= 200.13
##$BF4= 200.13
##$BF5= 500.13
##$BF6= 500.13
##$BF7= 500.13
##$BF8= 500.13
##$BYTORDA= 1
##$CFDGTYP= 0
##$CFRGTYP= 5
##$CHEMSTR= <none>
##$CNST= (0..31)
1 1 145 1 1 1 1 1 1 1 1 1 1 1 1 1 1 1 1 1 1 1 1 1 1 1 1 1 1 1 1 1 
##$CPDPRG= <>
##$CPDPRG1= <>
##$CPDPRG2= <>
##$CPDPRG3= <>
##$CPDPRG4= <mlev>
##$CPDPRG5= <mlev>
##$CPDPRG6= <mlev>
##$CPDPRG7= <mlev>
##$CPDPRG8= <mlev>
##$CPDPRGB= <>
##$CPDPRGT= <>
##$D= (0..31)
0 2 0 0 0 0 0 0 0 0.06 0 0 0 0 0 0 0.0002 0 0 0 0 0 0 0 0 0 0 0 0 0 0 
0 
##$DATE= 1754663752
##$DBL= (0..7)
120 120 120 120 120 120 120 120 
##$DBP= (0..7)
150 150 150 150 150 150 150 150 
##$DBP07= 0
##$DBPNAM0= <>
##$DBPNAM1= <>
##$DBPNAM2= <>
##$DBPNAM3= <>
##$DBPNAM4= <>
##$DBPNAM5= <>
##$DBPNAM6= <>
##$DBPNAM7= <>
##$DBPOAL= (0..7)
0.5 0.5 0.5 0.5 0.5 0.5 0.5 0.5 
##$DBPOFFS= (0..7)
0 0 0 0 0 0 0 0 
##$DE= 6
##$DECBNUC= <off>
##$DECIM= 32
##$DECNUC= <off>
##$DECSTAT= 4
##$DIGMOD= 1
##$DIGTYP= 9
##$DL= (0..7)
0 120 120 120 120 120 120 120 
##$DP= (0..7)
150 150 150 150 150 150 150 150 
##$DP07= 0
##$DPNAME0= <>
##$DPNAME1= <>
##$DPNAME2= <>
##$DPNAME3= <>
##$DPNAME4= <>
##$DPNAME5= <>
##$DPNAME6= <>
##$DPNAME7= <>
##$DPOAL= (0..7)
0.5 0.5 0.5 0.5 0.5 0.5 0.5 0.5 
##$DPOFFS= (0..7)
0 0 0 0 0 0 0 0 
##$DQDMODE= 0
##$DR= 18
##$DS= 0
##$DSLIST= <SSSSSSSSSSSSSSS>
##$DSPFIRM= 0
$$ [...]
##$SUBNAM0= <"">
##$SUBNAM1= <"">
##$SUBNAM2= <"">
##$SUBNAM3= <"">
##$SUBNAM4= <"">
##$SUBNAM5= <"">
##$SUBNAM6= <"">
##$SUBNAM7= <"">
##$SUBNAM8= <"">
##$SUBNAM9= <"">
##$SW= 20.6817932712277
##$SWIBOX= (0..15)
0 0 3 0 0 0 0 0 0 0 0 0 0 0 0 0 
##$SW_h= 4139.07284768212
##$TD= 32768
##$TD0= 1
##$TE= 0
##$TE2= 300
##$TE3= 300
##$TEG= 300
##$TL= (0..7)
0 120 120 120 120 120 120 120 
##$TP= (0..7)
150 150 150 150 150 150 150 150 
##$TP07= 0
##$TPNAME0= <>
##$TPNAME1= <>
##$TPNAME2= <>
##$TPNAME3= <>
##$TPNAME4= <>
##$TPNAME5= <>
##$TPNAME6= <>
##$TPNAME7= <>
##$TPOAL= (0..7)
0.5 0.5 0.5 0.5 0.5 0.5 0.5 0.5 
##$TPOFFS= (0..7)
0 0 0 0 0 0 0 0 
##$TUNHIN= 0
##$TUNHOUT= 0
##$TUNXOUT= 0
##$USERA1= <user>
##$USERA2= <user>
##$USERA3= <user>
##$USERA4= <user>
##$USERA5= <user>
##$V9= 5
##$VALIST= <valist>
##$VCLIST= <CCCCCCCCCCCCCCC>
##$VD= 0
##$VDLIST= <DDDDDDDDDDDDDDD>
##$VPLIST= <PPPPPPPPPPPPPPP>
##$VTLIST= <TTTTTTTTTTTTTTT>
##$WBST= 1024
##$WBSW= 30
##$XGAIN= (0..3)
0 0 0 0 
##$XL= 0
##$YL= 0
##$YMAX_a= 739384
##$YMIN_a= -699412
##$ZGOPTNS= <>
##$ZL1= 120
##$ZL2= 120
##$ZL3= 120
##$ZL4= 120
##$ABSF1= 10
##$ABSF2= 0
##$ABSG= 5
##$ABSL= 3
##$ALPHA= 0
##$AQORDER= 0
##$ASSFAC= 0
##$ASSFACI= 0
##$ASSFACX= 0
##$ASSWID= 0
##$AUNMP= <proc_1d>
##$AZFE= 0.1
##$AZFW= 0.1
##$BCFW= 1
##$BC_mod= 2
##$BYTORDP= 0
##$COROFFS= 0
##$CY= 19
##$DATMOD= 1
##$DC= 2
##$DFILT= <>
##$DTYPP= 0
##$F1P= 11.0000007629395
##$F2P= -0.999999237060547
##$FCOR= 0.5
##$FTSIZE= 0
##$FT_mod= 4
##$GAMMA= 1
##$GB= 1
##$INTBC= 1
##$INTSCL= 1
##$ISEN= 128
##$LB= 0.05
##$LEV0= 0
##$LPBIN= 0
##$MAXI= 10000
##$MC2= 0
##$MEAN= 0
##$ME_mod= 0
##$MI= 0
##$NCOEF= 0
##$NC_proc= 0
##$NLEV= 6
##$NOISF1= 0
##$NOISF2= 0
##$NSP= 1
##$NTH_PI= 0
##$NZP= 0
##$OFFSET= 16.51637
##$PC= 1
##$PHC0= -269.3513
##$PHC1= -3.69845
##$PH_mod= 0
##$PKNL= yes
##$PPARMOD= 0
##$PSCAL= 4
##$PSIGN= 0
##$REVERSE= no
##$SF= 200.13
##$SI= 16384
##$SIGF1= 0
##$SIGF2= 0
##$SINO= 400
##$SIOLD= 16384
##$SREGLST= <1H.CDCl3>
##$SSB= 0
##$STSI= 0
##$STSR= 0
##$SW_p= 4139.07284768211
##$SYMM= 0
##$S_DEV= 0
##$TDeff= 0
##$TDoff= 0
##$TI= <>
##$TILT= no
##$TM1= 0
##$TM2= 0
##$TOPLEV= 0
##$USERP1= <user>
##$USERP2= <user>
##$USERP3= <user>
##$USERP4= <user>
##$USERP5= <user>
##$WDW= 1
##$XDIM= 8192
##$YMAX_p= 0
##$YMIN_p= 0
$$ End of Bruker specific parameters
$$ ---------------------------------
##NTUPLES= NMR FID
##VAR_NAME=  TIME,          FID/REAL,        FID/IMAG
##SYMBOL=    X,             R,               I
##VAR_TYPE=  INDEPENDENT,   DEPENDENT,       DEPENDENT
##VAR_FORM=  AFFN,          ASDF,            ASDF
##VAR_DIM=   16384,         16384,           16384
##UNITS=     SECONDS,       ARBITRARY UNITS, ARBITRARY UNITS
##FACTOR=    0.0002416,     1,               1
##FIRST=     0,             0,               0
##LAST=      3.9581328,     0,               0
##MIN=       0,             -699412,         0
##MAX=       3.9581328,     739384,          0
$$ Real data points
##PAGE= N=1
##DATA TABLE= (X++(R..R)), XYDATA
$$ [...]
$$ plain form
9043 -9 29 -64 26 -118 20 56 25 -166 -74 34 43 57 33 -95 -38 4 -72 93 92 -42 -94 -9 131 15 55 184 -18
9070 -18 -2 22 -33 -30 -42 7 36 177 -108 102 -24 -41 35 -49 -36 -114 -113 33 -27 -4 42 21 -19 -82 -61 36 45 176 75
9099 75 -66 38 15 -18 -30 115 142 -8 -74 -87 7 -23 -38 113 10 55 -39 35 20 -24 -17 15 15 -7 -36 10 38 24
9127 24 18 128 -22 -16 -25 86 -93 163 50 -15 25 -38 118 70 -46 37 -8 66 45 43 -20 3 96 109 147 63 123 48
9155 48 91 -36 80 80 30 4 -23 13 42 95 173 101 54 -43 4 -29 17 -21 18 -54 -87 40 63 155 -16 -4 -125 -93
9183 -93 -5 21 24 98 66 -73 -2 133 -20 -64 84 73 24 99 13 -128 41 51 6 50 42 31 6 27 18 -58 -27 35 17
9212 17 -12 -109 62 107 -2 59 79 35 -52 -66 -31 33 -57 89 24 36 -38 33 103 -70 49 95 156 -2 -18 -8 -31
9239 -31 -8 36 26 -5 16 -27 92 88 88 -48 -12 43 29 57 -45 -22 113 -2 -3 3 85 -34 45 -21 -9 -49 -16 -89 44
$$ packed form
9043iL8r3R0j44J38L6l1j91R2J08RJ4k4j28N7M2p6J65jj34n2Q5J40j16M0J29k02
9070a8J6K4n5Lj2M9K9J41k85K10j26j7P6q4J3p8JJ46o0K3M6k1m0o3K1R7RJ31j01
9099G5j41J04k3l3j2J45K7j50o6j3R4l0j5J51j03M5r4P4j5m4PL2%k2k9M6K8j4
9127B4oJ10j50OrJ11j79K56j13o5M0o3J56m8j16Q3m5P4k1ko3K3R3J3L8q4O0p5
9155D8M3j27J16%n0k6k7L6K9N3P8p2m7r7M7l3M6l8L9p2l3J27K3R2j71J2j21L2
9183i3Q8K6LP4l2j39P1J35j53m4J48j1m9P5q6j41J69J0m5M4qj1k5K1rp6L1O2j8
9212A7k9r7J71M5j09O1K0m4q7j4L5O4r0J46o5J2p4P1P0j73J19M6O1j58j6J0k3
9239c1K3M4j0l1K1m3J19m%j36L6N5j4K8j02K3J35j15jOQ2j19P9o6J2m0L3p3J33
$$ plain form
9268 44 12 -15 88 60 -59 61 40 -12 -53 16 -92 44 49 23 34 -8 20 77 100 35 -53 10 89 -5 2 -11 -147 74
9296 74 21 -8 17 -1 -6 -34 -13 -95 39 15 -26 -8 37 -5 50 -91 -20 107 -114 -71 0 68 71 90 -18 52 -30 74
9324 74 50 94 -94 -30 42 82 -32 -13 -52 47 81 54 87 67 8 44 -49 -54 -3 -29 -32 8 -1 -10 6 35 63 -91 51 -26
9354 -26 -7 18 -87 -22 -41 85 52 90 -2 51 -20 -55 -56 67 -6 -17 38 -7 95 -85 14 -108 -34 -22 88 0 70
9381 70 -82 13 30 54 72 16 36 19 14 42 -29 127 21 24 18 143 77 62 9 -16 -31 53 -28 85 45 -69 44 53 74
9410 74 -21 46 -2 113 -30 -54 2 18 -108 34 19 12 -33 47 28 37 -25 26 110 29 -11 -58 -76 -90 -62 44 -19 27 70
9439 70 64 -10 45 133 -25 -54 -18 -25 -71 74 -11 -44 -84 -21 -32 58 49 -7 9 36 31 22 -64 -43 51 84 -16 28 -32 21 -174
9470 -174 -34 70 18 5 18 28 83 -27 3 36 -64 -8 119 -1 -91 56 20 1 132 37 -18 120 33 -74 -39
$$ packed form
9268D4l2k7J03k8j19J20k1n2m1O9j08J36Nk6J1m2K8N7K3o5q8O3P9r4Pj3j36K21
9296G4n3k9K5j8nk8K1q2J34k4m1J8M5m2N5j41P1J27k21M3P1O8LJ9j08P0q2J04
9324G4k4M4j88O4P2M0j14J9l9R9L4k7L3k0n9L6r3nN1k6lM0rrJ6K9K8j54J42p7
9354b6J9K5j05O5j9J26l3L8r2N3p1l5jJ23p3j1N5m5J02j80R9j22P4J2J10q8P0
9381G0j52R5J7K4J8n6K0j7nK8p1J56j06LoJ25o6j5n3k5j5Q4q1J13m0j14J13RK1
9410G4r5O7m8J15j43k4N6J6j26J42j5pm5Q0j9Ro2N1Q4q1m0m7j8j4K8J06o3M6M3
9439G0op4N5Q8j58k9L6pm6J45q5l3m0O3j1R0rn6J6K7nrq6K1R4L3j00M4o0N3j95
9470a74J40J04n2j3J3J0N5j10L0L3j00N6J27j20r0J47l6j9J31r5n5J38q7j07L5
$$ plain form
9495 -39 -18 -6 73 20 -50 -14 -18 -93 30 83 -30 82 81 53 42 -119 -139 26 -44 5 -7 -17 -28 4 47 32 13 66 -21
9524 -21 33 -73 90 66 -107 -42 138 26 26 36 29 54 78 -23 -50 137 8 44 -36 1 -109 107 -100 -27 131
9549 131 94 -9 95 26 -42 -28 -138 132 -48 25 17 -14 -98 -27 91 -41 84 -71 125 68 -3 -69 41 -111
9573 -111 14 57 132 24 86 142 36 73 16 13 20 -1 -50 19 27 13 -16 -92 17 37 -14 82 -99 -11 -141 -65 0 0 -29
9602 -29 4 55 -4 37 38 -36 -66 136 3 13 14 82 51 -68 -6 -58 -63 106 -19 63 -78 14 -59 -74 -20 74 -2 -67 -70
9631 -70 30 120 70 -42 -81 -13 -14 -21 43 9 42 -28 -51 108 -3 103 -73 -4 85 14 17 -31 29 -176 116 70 142 -44
9659 -44 27 -85 22 177 15 96 41 37 104 96 43 79 -36 -72 28 14 -92 27 20 0 83 28 55 1 -111 5 136
9686 136 114 85 -4 -115 -14 28 -15 -33 76 -148 -66 59 9 58 14 -2 114 0 -48 82 -44 -3 -55 40 14
$$ packed form
9495c9K1J2P9n3p0L6mp5J23N3j13J12jk8j1j61k0J65p0M9j2j0j1L2M3j5j9N3q7
9524b1N4j06J63k4j73O5J80j12%J0pK5K4j01k7J87j29L6q0L7j10K16k07P3J58
9549A31l7j03J04o9o8J4j10K70j80P3ql1q4P1J18j32J25j55J96n7p1o6J10j52
9573a11J25M3P5j08O2N6j06L7n7lPk1m9O9Qj4k9p6J09K0n1R6j81Q8j30P6O5%k9
9602b9L3N1n9M1Jp4l0K02j33J0JO8l1j19O2n2nJ69j25Q2j41R2p3j5N4R4p6o5l
9631g0J00R0n0j12l9O8jpO4l4L3p0k3J59j11J06j76O9Q9p1Lm8O0k05K92m6P2j86
9659d4P1j12J07J55j62Q1n5mO7qn3L6j15l6J00j4j06J19pk0Q3n5K7n4j12J16J31
9686A36k2k9q9j11J01M2m3j8J09k24Q2J25n0M9m4j6J16j14m8J30j26M1n2R5k6
$$ plain form
9711 14 58 26 13 -6 -56 -50 46 -15 -152 47 -5 -58 -98 12 -96 -22 -20 -60 193 77 96 20 4 -40 -81 -54 28 -39
9739 -39 57 66 77 77 24 -25 165 -97 -86 219 -53 41 81 -64 67 -24 42 -133 72 -15 -10 114 -106 -38 -26 75
9765 75 30 -76 -155 10 74 87 2 -51 -106 -29 -153 90 87 -40 26 -63 -12 67 43 -76 -61 109 -65 -57 67 27 130
9792 130 -44 110 35 -80 35 -17 -27 5 -26 80 26 25 124 36 -3 20 1 -28 -52 -29 140 85 -29 35 7 -54 -33
9819 -33 93 -66 -21 -26 17 43 -84 92 3 76 104 10 80 64 -21 2 -1 -23 17 -38 -90 -100 100 60 43 59 27 14 64
9848 64 -82 88 -76 45 78 -71 31 -23 22 13 -179 70 43 -33 35 18 15 1 -93 -132 24 -44 -68 -109 -64 27 15
9875 15 25 -99 -9 10 -114 -39 -25 32 -52 -46 74 -5 -10 -37 30 -28 -56 -55 -11 26 74 118 -42 42 -22 -83 -48 97 19
9904 19 37 -88 64 171 -50 -55 -57 14 -42 -43 -90 36 2 -19 4 -3 164 -19 6 0 -119 -9 -38 7 31 -20 -47 -11
$$ packed form
9711A4M4l2j3j9n0OR6o1j37J99n2n3m0J10j08P4Km0K53j16J9p6j6m4m1K7Q2o7
9739c9R6RJ1%n3m9J90k62J1L05k72R4M0j45J31r1O6j75K05q7NJ24k20O8J2J01
9765G5m5j06p9J65O4J3q5n3n5P7j24K43lj27O6q9N1P9k4j19J5J70j74QJ24m0J03
9792A30j74J54p5j15J15n2j0L2l1J06n4jR9q8l9K3j9k9k4K3J69n5j14O4k8o1K1
9819c3J26j59M5nM3K6j27J76q9P3K8r4P0j6q5K3lk2M0n5n2j0K00m0j7J6l2j3N0
9848F4j46J70j64J21L3j49J02n4M5rj92K49k7p6O8j7lj4r4l9J56o8k4m1M5R1j2
9875A5J0j24R0J9j24P5J4N7q4OJ20p9nk7O7n8k8JM4L7M8M4j60Q4o4o1L5J45p8
9904A9J8j25J52J07k21nkP1n6jm7J26l4k1K3pJ67j83K5oj19J10k9M5K4n1k7L6
$$ plain form
9932 -11 -82 74 -54 -11 -11 1 -27 62 57 15 -69 -84 44 -44 -10 14 102 -62 60 125 -1 -30 -28 56 99 26 -18 45 -40
9961 -40 -73 2 51 -176 140 -109 55 137 -10 -50 98 -19 26 50 -11 32 87 40 41 78 14 78 89 0 20 -20 -15 120
9989 120 -54 -1 -35 64 -91 -68 41 77 -15 -8 -106 18 -71 34 -51 -91 32 -133 -8 -38 5 21 55 -5 76 -19
10015 -19 -100 -45 35 64 -35 68 60 -10 27 2 -22 -47 57 -50 47 10 16 58 -42 43 -34 -12 -61 8 25 -54 -68 9 36
10044 36 67 79 72 29 -20 144 30 -61 75 58 -23 49 -42 38 53 -51 37 -24 -83 105 19 83 -93 34 118 91 -44
10071 -44 22 -74 -51 -116 -37 12 36 -115 -131 45 -49 8 22 50 1 49 51 32 -7 43 -30 66 -29 -43 0 22 141 -120
10099 -120 88 139 8 -110 -166 -8 -62 -45 -13 70 62 -41 -142 35 -131 9 -78 74 147 15 -13 67 10 59
10123 59 -14 15 5 -96 -27 -21 -109 -19 7 57 -44 36 -18 56 25 -15 -27 53 9 -93 -10 45 -8 9 29 12 -88 27
$$ packed form
9932a1p1J56j28M3%J2k8Q9nm2q4j5J28q8L4K4Q8j64J22O5j26k9KQ4M3p3m4O3q5
9961d0l3P5M9k27L16k49J64Q2j47m0J48j17M5K4o1M3N5m7JL7o4O4J1q9K0m0NJ35
9989A20j74N3l4R9j55K3J09L6r2Pr8J24q9J05q5m0J23j65J25l0M3J6L4o0Q1r5
10015a9q1N5Q0K9r9J03qp0L7k5k4k5J04j07R7l7OM2j00Q5p7K2m9O9J7p9j4P7K7
10044C6L1J2pm3m9J64j14r1J36j7q1P2r1Q0J5j04Q8o1n9J88q6O4j76J27Q4k7j35
10071d4O6r6K3o5P9M9K4j51j6J76r4N7J4K8m9M8Kj9l9N0p3R6r5j4M3K2J19k61
10099a20K08N1j31j18n6J58n4J7L2Q3qj03j01J77j66J40q7J52P3j32k8Q0n7M9
10123E9p3K9j0j01O9Oq8R0K6N0j01Q0n4P4l1m0j2Q0m4j02Q3N5n3J7K0j7j00J15
$$ plain form
10151 27 -63 -14 -26 -1 -13 3 -23 -36 -14 66 83 -21 -9 -41 -73 -24 -72 -17 24 71 104 -132 -5 -30 64 -67 -62 -43
10179 -43 -45 18 -88 -29 18 66 58 -22 -54 83 66 -24 52 -18 -37 1 -27 -5 23 17 -18 -13 -5 -9 2 -40 -30 61 12 -46 50 44
10211 44 -116 -111 -1 -2 21 209 90 90 28 49 36 33 -75 -33 15 -5 -95 34 -34 64 75 98 45 -98 1 30 28 87 -110
10240 -110 66 6 -39 56 19 59 18 -52 89 -60 -168 -15 26 48 45 -8 -50 72 -107 -12 -44 99 37 -12 63 139
10266 139 112 -50 1 33 1 92 25 109 -79 22 101 98 46 56 47 -7 -57 -2 129 -9 93 -13 -58 35 -26 -4 12
10293 12 -39 -5 -9 -101 -50 -5 96 2 21 115 -44 56 24 39 -22 -42 73 -41 4 19 -14 53 116 83 -47 -122 32
10320 32 -13 29 -43 -61 133 -20 -1 -33 -8 94 -11 20 -125 190 -1 2 -15 -88 2 18 14 -67 -60 31 50 20 -45 -80
10348 -80 128 22 23 -4 7 -31 -22 82 32 4 9 73 -28 9 68 38 -59 66 -87 -10 60 36 19 15 -13 45 59 91 -56
$$ packed form
10151B7r0M9j2K5j2J6k6j3K2Q0J7j04J2l2l2M9m8N5M1M7L3k36J27k5R4j31NJ9
10179d3kO3j06N9M7M8qq0l2J37j7r0P6p0j9L8k8K2K8ol5NQmJ1m2J0R1m9n8R6o
10211D4j60NJ10jK3J88j19%o2K1j3lj08M2M8k0r0J29o8R8J1K3n3j43R9K9kN9j97
10240a10J76o0m5R5l7M0m1p0J41j49j08J53M1K2ln3m2J22j79R5l2J43o2m9P5P6
10266A39k7j62N1L2l2R1o7Q4j88J01P9ln2J0rn4n0N5J31j38J02j06m5R3o1K2J6
10293A2n1L4mr2N1M5J01r4J9R4j59J00l2J5o1k0J15j14M5J5l3O7O3l3j30p5J54
10320C2m5M2p2j8J94j53J9l2K5J02j05L1j45L15j91Lj7p3R0J6mq1PR1J9l0o5l5
10348h0K08j06Jk7J1l8RJ04n0k8NO4j01L7N9l0r7J25j53P7P0k4j7mk8N8J4L2j47
$$ plain form
10377 -56 -32 27 -44 -143 -38 -68 40 33 43 161 13 -27 -83 89 86 22 83 16 -81 -15 37 51 44 -11 55 -61 21 -51
10405 -51 0 -32 -55 49 65 13 -36 -40 56 54 -2 8 19 18 107 6 5 53 -24 43 -30 44 -29 95 25 -1 9 1 -84 41
10435 41 -9 66 -43 120 33 -63 -34 69 -4 -114 64 -44 -20 -43 30 -3 89 31 -68 -1 -64 5 55 127 17 -99
10461 -99 18 -5 -61 -45 -58 -11 6 2 56 -20 63 -18 130 27 134 -84 77 27 -18 122 0 24 -106 -31 -71 32
10487 32 43 -82 13 149 41 -49 -46 35 -51 -41 -83 -45 -27 61 -64 -110 65 8 -40 50 70 -6 71 -20 -44 -83 -74 48
10515 48 64 103 98 -75 -39 83 -44 69 -8 -78 -53 36 103 -67 22 -62 61 34 24 37 98 148 106 -89 19 85
10541 85 71 41 68 -6 -5 23 18 -48 -33 26 49 -61 -13 19 48 1 -22 150 -94 43 -47 -65 -92 53 16 -54 41 -20
10569 -20 36 -43 94 38 60 -42 11 17 22 -64 33 85 -42 0 92 80 -73 -98 26 83 -136 -19 11 68 -122 -46 -118
$$ packed form
10377e6K4N9p1r9J05l0J08pJ0J18j48m0n6J72lo4O1o7r7O6N2J4pn5O6j16Q2p2
10405e1N1l2k3J04J6n2m9mR6kn6J0J1jQ9j01jM8p7O7p3P4p3J24p0k6J0qq5J25
10435D1n0P5j09J63q7r6K9J03p3j10J78j08K4k3P3l3R2n8r9O7o3O9N0P2j10j16
10461i9J17k3n6J6j3M7J7mN4p6Q3q1J48j03J07k18J61n0m5J40j22K4j30P5m0J03
10487C2J1j25R5J36j08r0LQ1q6J0m2L8J8Q8j25m6J75n7m8R0K0p6P7r1k4l9RJ22
10515D8J6L9nj73L6J22j27J13p7p0K5Q9O7j70Q9q4J23k7j0J3O1N0m2j95J08O6
10541H5j4l0K7p4JK8no6J5N9K3j10M8L2K9m7k3J72k44J37r0j8k7J45l7p0R5o1
10569b0N6p9J37n6K2j02N3ONq6R7N2j27M2R2j2j53k5J24N7k19J17L0N7j90P6p2
$$ plain form
10596 -118 -16 78 -98 83 -86 6 56 -95 35 37 -31 24 21 201 -34 15 26 -75 77 2 135 -82 88 72
10620 72 -138 123 33 -91 89 -5 18 -6 -17 -38 8 9 -27 12 -50 -15 -84 70 26 -109 -103 61 -114 28 93 83
10646 83 54 73 -72 35 70 7 7 62 91 57 -15 145 -65 22 -18 -74 98 -86 51 34 -37 92 18 -12 -68 -94
10672 -94 -30 48 126 -84 42 73 -24 85 163 14 -40 25 -80 -79 9 10 19 56 31 95 106 -104 45 -16 7 14 54 -72
10700 -72 4 29 -52 -87 -9 -19 -24 28 -32 39 2 36 72 44 67 42 46 21 55 25 13 -81 -24 17 -48 135 -99 101 48
10729 48 20 -6 51 87 -99 -17 -9 74 -21 42 7 -160 11 -8 148 10 49 -79 103 24 57 -34 86 31 -41 -76
10755 -76 18 -20 126 59 46 -64 8 46 -29 62 -59 2 -19 72 -7 -67 25 -26 19 -48 -10 4 -63 5 103 34 88 -5
10783 -5 -4 -122 -50 -22 99 12 2 82 -54 -44 23 40 152 120 -49 131 -6 -108 41 13 57 46 16 26 97 -43
$$ packed form
10596a18J02R4j76J81j69R2N0j51J30Ko8N5lJ80k35M9J1j01J52p5J33k17J70j6
10620G2k10K61r0j24J80r4K3k4j1k1M6Jl6L9o2L5o9J54m4j35OJ64j75J42O5j0
10646H3k9J9j45J07L5o3%N5K9l4p2J60k10Q7m0n6J72j84J37j7p1J29p4l0n6k6
10672i4O4P8P8k10J26L1r7J09P8j49n4O5j05JQ8JRL7k5O4J1k10J49o1K3PM0j26
10700g2P6K5q1l5P8j0nN2o0P1l7L4L6k8K3k5Mk5L4l0j2r4N7M1o5J83k34K00n3
10729D8k8k6N7L6j86Q2QQ3r5O3l5j67J71j9J56j38L9j28J82p9L3r1J20n5p2l5
10755g6R4l8J46o7j3j10P2L8p5R1j21O1k1R1p9o0R2n1M5o7L8J4o7O8R8o9N4r3
10783eJj18P2K8J21q7j0Q0j36J0O7J7J12l2j69J80j37j02J49k8M4j1l0J0P1j40
$$ plain form
10809 -43 -61 41 -12 15 1 16 -83 9 -34 29 42 -5 -60 -88 25 -50 19 148 -12 -68 77 -137 154 17 -69 71
10835 71 -66 45 80 23 -63 108 76 62 -21 -14 -23 -34 -118 26 5 -41 84 43 53 158 -10 56 80 -47 3 -162
10861 -162 26 27 -2 86 -79 46 -3 -87 45 -5 -41 27 -97 -68 -17 -3 4 -40 15 47 40 102 97 -111 -35 55 -25 -46
10889 -46 87 84 42 9 -29 40 48 -126 91 -81 13 -18 -79 94 47 -16 -13 0 -16 -44 64 -1 65 71 30 -30 -60 -54 -126
10918 -126 -69 14 43 -9 19 -11 8 -4 -61 -41 23 -2 52 87 2 29 25 -35 52 40 57 -18 -21 38 -174 62 57 -94 -47
10947 -47 87 -58 36 -36 -37 46 -22 -83 -71 -30 50 48 -8 46 44 -78 5 -46 -110 -10 -107 44 9 -111 70 -103 21
10974 21 37 -66 119 9 -54 -2 -22 -9 -62 15 31 -8 43 -20 -17 21 31 15 -105 -32 -56 -34 -53 -45 36 -71 -10 16
11002 16 87 -57 24 -47 -85 -42 -84 79 79 68 32 -66 39 -166 34 -86 77 -12 -36 -58 6 45 -16 -22 -26 59 42 -31
$$ packed form
10809d3j8J02n3K7j4J5r9R2m3O3J3m7n5k8J13p5O9J29j60n6J45k14K91j37q6J40
10835G1j37J11L5n7q6J71l2j4q3Prj1q4J44k1m6J25m1J0J05j68O6K4j27N0j65
10861a62J88Jk9Q8j65J25m9q4J32n0l6O8j24K9N1J4Pm4N5L2pO2nk08P6R0q0k1
10889d6J33lm2l3l8O9Qj74K17j72R4l1o1J73m7o3LJ3j6k8J08o5O6Om1o0l0Op2
10918a26N7Q3K9n2K8l0J9j2n7K0O4k5N4L5q5K7mo0Q7j2J7p5lN9k12K36nj51M7
10947d7J34j45R4p2jQ3o8o1J2M1Q0kn6N4kj22Q3n1o4J00r7J51l5j20J81j73J24
10974B1J6j03J85j10o3N2k0J3n3P7J6l9N1o3LL8J0j6j20P3k4K2j9QQ1j07O1K6
11002A6P1j44Q1p1l8M3m2J63%j1l6r8J05k05K00j20J63q9k4k2O4L9o1omQ5j7p3
$$ plain form
11030 -31 -70 74 27 -18 33 17 -97 -23 -30 -21 42 -1 6 -8 -87 -21 29 -31 76 -56 -20 -69 -198 52 27 -50 48 -82
11058 -82 -40 -11 -18 46 -96 -113 62 42 35 -2 -108 -97 43 -19 20 -51 9 44 -25 22 -69 -51 -39 56 -7 89 -42 -58
11086 -58 -47 91 28 76 -49 31 -15 19 8 -36 -14 28 43 -97 42 -31 17 39 -2 -16 -45 46 47 100 101 19 -68 21 -128
11115 -128 -44 133 -64 18 61 -5 41 -67 35 -48 39 -73 -124 -19 78 7 28 -82 -34 -39 -64 21 -38 20 -59 -25
11141 -25 48 -13 -4 39 -63 -14 -159 -11 98 -54 -5 -9 -36 -28 -21 4 96 -140 28 56 -160 77 -28 -1 -62 -43 21
11168 21 59 -9 -106 13 131 39 57 128 11 -69 -101 -1 -28 64 -70 -26 9 -127 -71 -28 5 -151 -106 75 16 104
11194 104 13 11 -90 103 0 -21 56 -45 17 63 -21 -4 23 41 31 7 -89 23 83 69 12 65 23 17 83 72 82 28
11222 28 -44 55 66 -26 40 -71 -21 -24 5 -43 47 -95 10 -74 24 -65 -79 31 -3 -61 -35 78 -71 46 47 119 -80
$$ packed form
11030c1l9J44m7m5N1j6j14P4pRO3m3Pj4p9O6N0o0J07j32L6m9j29K50k5p7R8j30
11058h2M2K9pO4j42j7J75k0pl7j06J1J40o2L9p1O0L5o9M7r1J8J2R5o3R6j31j6
11086e8J1J38o3M8j25Q0m6L4j1m4K2M2J5j40J39p3M8K2m1j4k9R1JN3Jq2q7Q9j49
11115a28Q4J77j97Q2M3o6M6j08J02q3Q7j12n1J05R7p1K1j10M8nk5Q5n9N8p9L4
11141b5P3o1RM3j02M9j45J48J09j52M9mk7QPK5R2k36J68K8k16K37j05K7o1J9O4
11168B1L8o8r7J19J18r2J8P1j17q0l2J00k7R2j34M4L5j36N6M3L3j56M5J81n9Q8
11194A04r1kj01J93j03k1P7j01O2M6q4J7K7J8j0k4r6J12O0j4n7N3m2oO6j1J0n4
11222B8p2R9J1r2O6j11N0lK9m8R0j42J05q4R8q9j4J10l4n8K6J13j49J17JP2j99
$$ plain form
11249 -80 -82 66 83 -91 -130 62 -1 35 -29 18 18 -42 3 46 -69 4 59 -84 27 -38 16 -4 17 -2 13 -29 -24 -73
11277 -73 -52 -12 14 -8 -14 127 83 19 40 -52 25 -122 57 -36 120 29 -120 -14 -9 -52 -56 80 2 9 129 6 54
11304 54 15 15 -9 94 -28 -3 -55 -52 21 -6 5 -18 58 36 69 -14 124 84 13 -116 71 80 8 22 80 -102 268 -92
11332 -92 52 62 -70 -58 -57 -78 -24 -46 107 -23 52 -131 -129 1 -32 -27 -4 44 47 -9 -39 43 97 -7 15 89 -85 -51
11360 -51 131 8 -9 112 9 -5 -6 -7 -30 -51 83 29 -75 -150 89 59 81 -25 -58 18 3 19 157 -12 65 -66
11386 -66 6 -92 -11 115 -83 -101 4 -6 -48 6 18 -22 83 -106 -47 -8 41 -21 -37 72 -8 15 -18 91 25 51
11412 51 -93 -41 13 94 -36 -11 -90 -3 -32 89 35 -102 -176 17 -70 -78 -39 -9 23 -1 -51 -1 71 1 -12 -37 -36 93
11440 93 25 -19 97 22 32 27 -32 6 56 5 -11 78 6 -122 135 30 19 -46 18 36 125 -112 -35 -50 6 -62 -43 -35
$$ packed form
11249h0kJ48J7j74l9J92o3L6o4M7%o0M5M3j15P3N5j43J11o5N4k0K1j9J5m2Nm9
11277g3K1M0K6k2oJ41m4o4K1r2P7j47J79r3J56r1j49J06Nm3mJ36p8PJ20j23M8
11304E4l9%k4J03j22K5n2LP3k7J1k3P6k2L3q3J38m0p1j29J87Rp2J4N8j82L70l60
11332i2J44J0j32J2Jk1N4k2J53j30P5j83KJ30l3NK3M8Ln6l0Q2N4j04K2P4j74L4
11360e1J82j23j7J21j03j4jjk3k1J34n4j04p5K39l0K2j06l3P6j5J6J38j69P7j31
11386f6P2r8Q1J26j98j8J05j0m2N4J2m0J05j89N9L9M9o2j6J09q0K3l3J09o6K6
11412E1j44N2N4Q1j30K5p9Q7k9J21n4j37p4J93q7qL9L0L2k4n0N0P2p0j3k5JJ29
11440I3o8m4J16p5J0nn9L8N0n1j6Q9p2j28K57j05j1o5O4J8Q9k37P7j5N6o8J9Q
$$ plain form
11468 -35 -101 44 -49 -19 76 47 -35 -16 -92 2 -85 -13 117 22 -20 19 -4 -7 -8 28 89 -111 -65 -55 -9 -62 31 -20 -28 -23
11498 -23 21 -51 57 54 -148 -38 -95 -74 -27 24 28 71 39 7 -73 7 18 13 -106 -3 71 32 65 25 48 27 -7 28 35
11527 35 -18 -78 66 25 35 84 79 31 18 10 -2 -85 -27 64 -1 -22 -68 -115 35 -2 -38 -103 -8 -39 4 -95 15 -26 3
11556 3 114 -15 -88 13 -16 -68 24 55 31 -13 53 -72 -155 34 -111 -60 -25 -156 1 127 37 -7 140 19 21
11581 21 117 81 11 58 89 60 60 -15 -95 107 -30 -49 36 3 85 -14 -60 95 42 -73 -36 22 53 17 90 66 -76 -5
11609 -5 0 -103 -66 -28 -64 -13 27 -55 -121 48 2 49 -56 9 -28 -38 -8 55 -30 -91 -69 -65 -23 -2 -47 -38 17 38 12 19 -108
11640 -108 69 -71 -42 42 -39 -93 -31 -25 24 71 -56 -31 43 12 54 -49 -56 32 -6 51 -60 9 -67 9 -36 76 81 -59
11668 -59 -20 79 12 -19 -39 71 82 29 -40 134 30 -151 15 81 -47 -62 -16 71 -77 58 169 22 11 -13 -67
$$ packed form
11468c5o6J45r3L0R5k9q2J9p6R4q7P2J30r5m2L9k3ljL6O1k00M6J0M6n3R3n1qN
11498b3M4p2J08lk02J10n7K1M7N1MM3l2l2q0Q0J1nj19J03P4l9L3m0K3k1l4L5P
11527C5n3o0J44m1J0M9nm8j3qj2q3N8R1o5k1m6m7J50l7l6o5R5l1M3r9J10m1K9
11556CJ11j29p3J01k9n2R2L1k4m4O6j25q3J89j45N1L5j31J57J26r0m4J47j21K
11581B1R6l6p0M7L1k9%p5q0K02j37j9Q5l3Q2r9m6J55n3j15L7N8L1l6P3k4j42P1
11609eNj03L7L8l6N1M0q2o6J69m6M7j05O5l7j0L0O3q5o1K2MM2K1m5RN5K1k6Pj27
11640a08J77j40K9Q4q1n4O2OM9M7j27K5P4l1M2j03pQ8l8N7j11O9p6P6m5J12Nj40
11668e9L9R9o7l1k0J10J1n3o9J74j04j81J66O6j28j5M6Q7j48J35J11j47j1k4n4
$$ plain form
11693 -67 -17 -102 -84 -28 -106 14 -55 -43 -4 -66 -50 90 57 65 87 -80 -36 40 -15 41 87 -67 60 45 34 65 -55
11720 -55 -11 94 -106 -7 -113 93 -119 22 -88 -56 36 44 90 -39 -12 83 -18 -11 63 14 -41 -20 -12 -19 -65 -93 -75
11747 -75 -143 20 -44 -67 -55 -79 15 76 52 119 25 63 -72 -11 56 28 -20 -108 64 128 105 3 -82 -82 33 8 -30 -132
11775 -132 76 -3 -97 -30 -56 -101 -10 -107 17 -37 -9 -97 -147 102 26 36 -69 -33 120 -25 79 42 -71 -10 -102
11800 -102 32 -89 27 23 19 40 29 -27 21 6 113 -48 2 -88 -58 106 13 -59 26 -65 34 -4 -45 61 -22 38 55
11827 55 14 -51 59 30 -10 -48 -85 -79 23 -29 105 73 8 50 -43 17 18 15 103 -75 53 -22 -8 -103 90 -51 -20 -20
11855 -20 -78 -53 -106 111 54 14 8 15 -131 90 -75 -46 41 -45 52 -70 -106 9 1 -100 -23 31 1 160 63 48 11
11882 11 205 -42 8 -150 113 -29 -85 20 -92 -28 -2 3 103 -5 15 -98 -51 -62 -133 131 -62 1 29 -41
$$ packed form
11693f7N0q5J8N6p8J20o9J2L9o2J6J40l3QK2j67M4P6n5N6M6j54J27j5j1L1j20
11720e5M4J05k00R9j06K06k12J41j10L2R2QM6j29K7R5j01PP4m9n5K1Qpm6k8J8
11747g5o8J63o4k3J2k4R4O1k4O7r4L8j35O1O7k8m8q8J72O4k3j02q5%J15k5l8j02
11775a32K08p9r4O7k6m5R1r7J24n4K8q8n0K49p6J0j05L6J53j45J04l7j13O1r2
11800a02J34j21J16mmK1j1n6M8j5J07j61N0r0L0J64r3p2Q5r1R9l8m1J06q3O0J7
11827E5m1o5J10k9m0l8l7OJ02n2J34l2o5M2r3O0JlQ8j78J28p5J4r5J93j41L1%
11855b0n8K5n3K17n7m0oPj46K21j65K9Q7q6R7j22l6J15qj01P7N4l0J59r7j5l7
11882A1J94k47N0j58K63j42n6J05j12O4K6NJ00j08K0j13M7j1p1K64j93O3K8p0
$$ plain form
11906 -41 -60 -28 -29 44 50 -57 25 40 -12 79 -72 17 71 -7 51 43 107 67 -4 36 -42 -13 63 -43 -67 -13 -46 13 -6 20
11936 20 5 -25 34 -20 87 90 -61 1 37 -53 66 -23 60 12 -44 -15 52 -38 -51 119 -23 125 1 8 -19 -32 28
11963 28 15 21 -34 -21 55 -122 40 -78 29 70 47 31 -17 -52 -30 -74 12 28 64 31 34 36 -22 85 -12 56 -18 79 -120
11992 -120 -8 -19 -85 -2 78 -96 178 -9 -35 -11 132 -57 -43 73 -67 89 -123 88 -116 -11 5 -123
12014 -123 60 115 -16 109 -71 10 65 -10 -6 69 16 61 38 -46 9 -82 25 -8 74 26 4 -42 47 -11 20 -102 -14
12041 -14 26 -50 16 36 -12 58 -49 55 -62 -5 -7 -113 -89 51 -52 96 24 -27 6 -45 108 -70 31 -15 64
12066 64 53 -120 23 53 40 40 103 -108 92 -146 -67 -106 17 -70 -4 4 -133 -71 10 6 71 62 21 -125 -77 69 20
12093 20 -43 -34 24 7 -159 57 -45 69 146 -74 -33 -72 -1 -40 42 74 -25 5 77 89 10 56 -44 100 -22 24
$$ packed form
11906d1j9L2jP3Oj07Q2J5n2R1j51Q9N4p8N8qO4m0p1M0p8K9P6j06k4N4l3N9j9K6
11936B0j5l0N9n4J07Lj51O2L6r0J19q9Q3m8n6K9O7r0j3J70j42J48j24Pk7j3O0
11963B8j3On5J3P6j77J62j18J07M1k3j6m8l5K2m4Q6J6L6l3LKn8J07r7O8p4R7j99
11992a20J12j1o6Q3Q0j74K74j87k6K4J43j89J4J16j40J56k12K11k04J05J6j28
12014a23J83N5j31J25j80Q1N5p5MP5n3M5k3q4N5r1J07l3Q2m8k2m6Q9n8L1j22Q8
12041a4M0p6O6K0m8P0j07J04j17N7kj06K4J40j03J48p2n1L3n1J53j78J01m6P9
12066F4j1j73J43L0j3%O3k11K00k38P9l9J23q7O6Qj37O2Q1mO5rm1j46M8J46m9
12093B0o3RN8j7j66K16j02J14P7k20M1l9P1l9Q2L2r9L0P2J2p9M6j00J44j22M6
$$ plain form
12119 24 64 -38 -9 -15 59 11 13 91 -38 59 80 -7 8 112 -122 -89 50 -14 -30 -246 7 -8 97 14 70 -48
12145 -48 32 -4 50 44 24 66 -36 -18 41 -32 43 -127 58 62 -87 36 21 -74 -36 -54 -42 11 1 -16 -17 -28 16 -36 -35
12174 -35 67 29 -75 -70 -106 103 -64 112 56 -10 3 -55 51 -61 -32 -88 37 -123 6 -52 -51 -51 -125 43 -119
12199 -119 -23 118 8 -135 10 -142 -84 -2 -137 -94 -15 65 20 62 -46 -44 18 -128 -75 -36 -26 84 -25 133
12223 133 -26 -11 13 88 -66 16 46 5 -92 27 40 -22 85 2 109 -3 54 -60 -52 85 25 -3 59 -108 44
12248 44 -60 80 3 13 16 17 17 133 28 44 83 70 -6 45 -51 -131 14 13 36 40 20 -156 -32 61 5 9 -7 -11 -84 -65
12278 -65 -21 10 92 -6 -29 -31 -88 -50 87 -114 91 88 12 65 41 26 -33 36 10 -10 45 14 -6 -39 35 -74 -76 108 -67
12307 -67 31 -19 1 7 -83 60 104 -73 -72 73 -4 -25 -78 13 -28 -128 -24 39 8 45 21 -80 -36 87 44 30 46
$$ packed form
12119B4M0j02K9oP4m8KP8j29R7K1q7J5J04k34L3J39o4j6k16K53j5J05q3N6j18
12145d8Q0l6N4ok0M2j02J8N9p3P5j70J85Mj49J23j5r5L8j8J2N3j0j7jj1M4n2J
12174c5J02l8j04Nl6K09j67J76n6o6J3n8J06j12K9n6J25j60J29n8J%p4J68j62
12199a19R6J41j10j43J45j52N8Q2j35M3P9Q0m5M2j08KO2j46N3L9J0J10j09J58
12223A33j59J5K4P5j54Q2L0m1r7J19J3o2J07q3J07j12N7j14QJ37o0k8O2j67J52
12248D4j04J40p7J0LJ%J16j05J6L9j3p6N1r6q0J45jK3Mk0j76J24R3n6Mj6mp3J9
12278f5M4L1Q2r8k3kn7L8J37k01K05lp6N3k4j5n9O9k6k0N5l1k0l3P4j09kJ84j75
12307f7R8n0K0Or0J43M4j77JJ45p7k1n3R1m1j00J04O3l1L7k4j01M4J23m3j4J6
$$ plain form
12334 46 41 -17 14 48 -98 80 50 38 -29 -100 10 -12 91 7 4 -1 -6 106 -58 -61 105 -80 -25 67 -52 1 116
12361 116 -13 -48 -68 98 75 0 -11 100 -19 -42 8 87 41 6 -22 -64 -65 -116 24 39 -51 -22 -45 22 -47 -4 77
12388 77 -29 21 37 -10 15 -142 70 49 24 47 30 13 60 39 63 41 -43 -5 45 7 -117 -14 -2 -7 -87 67 68 -64
12416 -64 -8 -8 1 11 -65 -48 -13 -55 -41 -20 -2 -1 73 21 -65 -94 51 -33 6 -2 -22 -6 -75 7 -51 -41 20 -52 104 3
12446 3 67 117 25 110 11 64 53 37 -54 -4 43 -78 15 52 0 -24 -52 -64 -7 51 -22 -72 -31 20 50 0 -50 6 10 88
12476 88 127 -59 2 32 13 -56 129 -86 -143 23 -33 108 68 126 30 -5 49 -60 75 111 -98 -16 -23 14 -7 -66
12502 -66 -47 0 -111 -80 -88 12 23 -5 35 2 127 14 -11 97 48 30 78 101 78 -158 -2 -75 -77 -129 24 -10 34
12529 34 -75 -3 -34 36 -23 -52 -82 75 -4 -90 -97 -17 -55 62 -120 58 48 43 36 38 159 -2 21 44 6 151 10
$$ packed form
12334D6nn8L1L4j46J78l0j2o7p1J10k2J03q4lnnJ12j64lJ66j85N5R2j19N3J15
12361A16j29l5k0J66k3p5j1J11j19k3N0P9m6l5k8m2jn1J40J5r0K9k3O7o9M3Q1
12388G7j06N0J6m7K5j57K12k1k5K3j7j7M7k1K4k2q4L8N0l8j24J03J2nq0J54Jj32
12416f4N6%RJ0p6J7L5m2J4K1J8JP4n2q6k9J45q4L9qk0J6o9Q2n8J0O1p2J56j01
12446CO4N0r2Q5r9N3j1j6r1N0M7j21R3L7n2k4k8j2N7N8p3n0M1N1L0n0n0N6MP8
12476H8L9j86O1L0j9o9J85k15n7J66n6J41m0N8r6l5N4j09J35L6k09Q2pL7k1n9
12502f6J9M7j11L1qJ00J1k8M0l3J25j13k5J08m9j8M8K3k3k36J56p3kn2J53l4M4
12529C4j09P2l1P0n9k9l0J57p9q6pQ0l8J17j82J78j0npKJ21j61K3K3l8J45j41
$$ plain form
12556 10 -58 16 3 -26 -47 -8 -79 31 44 -4 7 79 26 1 -7 -11 -5 -57 8 31 -17 31 -21 29 12 -20 59 7 -58 -34 94
12587 94 -57 83 29 -26 -64 -42 -4 58 -32 12 22 44 59 -61 15 22 -28 57 -41 -22 30 -6 54 11 -36 -58 49 155
12615 155 8 53 76 61 56 -40 1 -86 50 -40 7 -86 111 84 -120 77 -33 139 79 -57 77 23 51 47 114 13
12641 13 31 -82 107 -61 -5 -88 -20 28 -65 73 22 -130 7 -76 11 47 -151 5 -60 -23 57 86 -17 94 47
12666 47 29 151 125 11 103 -85 -60 -31 96 29 -159 59 -57 46 -29 -7 156 23 33 53 19 78 -9 76 44
12691 44 -32 32 -1 -140 -50 -8 -12 -30 75 21 -30 -3 -116 -44 -48 85 -39 21 -130 -19 42 113 16 -11 8 15 -69 -101
12719 -101 219 86 -31 33 73 -11 -40 150 -59 207 -52 19 69 -53 41 -23 83 -2 -10 59 -34 60 -7 -110 4
12744 4 43 -8 -17 4 34 53 -107 38 30 -141 -59 3 -38 -30 -141 -51 -44 25 37 -76 119 -11 -72 -90 80 -23 78
$$ packed form
12556A0o8P4j3k9k1L9p1J10J3m8J1P2n3k5qmOn2O5K3m8M8n2N0j7l2P9n2o5K4J28
12587I4j51J40n4n5l8K2L8O2r0M4J0K2J5j20P6Pn0Q5r8J9N2l6O0m3m7k2J07J06
12615A55j47M5K3j5nr6M1q7J36r0M7r3J97k7k04J97j10J72o0j36J34n4K8mO7j01
12641A3J8j13J89j68N6q3O8M8r3J38n1j52J37q3Q7L6j98J56o5L7Q0K9j03J11m7
12666D7j8J22k6j14R2j88K5K9J27o7j88K18j16J03p5K2J63j33J0K0l4N9q7Q5l2
12691D4p6O4l3j39R0M2mj8J05n4n1K7j13P2mJ33j24O0j51J11O1P1r7k7J9Pq4l2
12719a01L20j33j17O4M0q4k9J90k09K66k59P1N0j22R4o4J06q5qO9r3R4o7j03J14
12744DL9n1rK1L0J9j60J45qj71Q2O2m1Qj11R0PO9J2j13J95j30o1j8J70j03J01
$$ plain form
12771 78 -72 -18 -49 47 106 -33 21 -73 -5 -79 23 -70 91 -85 6 7 74 -62 8 -24 98 -39 8 88 33 52
12797 52 40 -37 55 62 -51 34 98 31 -26 106 -95 0 -55 69 29 104 -181 -75 101 -15 -29 -15 158 62 65 169
12823 169 62 42 61 58 -5 -82 53 2 -63 -73 -20 -2 -45 -103 39 -44 34 -71 78 51 60 26 42 20 -38 59 -126
12850 -126 -17 -3 1 86 119 29 69 -11 39 47 79 16 -131 24 88 -26 5 192 22 105 16 8 11 100 40 -70 5 20
12878 20 18 130 -71 -50 -5 12 -85 -58 70 46 18 57 -95 65 13 -13 73 -95 -44 -59 -96 9 64 176 -36 17
12904 17 -27 -41 102 55 -9 59 116 60 -19 205 -97 42 12 -6 13 1 -12 40 84 92 -68 5 114 46 8 27 86
12931 86 -82 29 -34 108 50 30 53 125 -66 50 -168 -13 -28 105 -37 -65 39 21 -44 31 74 39 -80 -63
12955 -63 20 -122 -16 -10 -53 58 28 61 -71 36 28 26 9 16 60 64 -39 49 34 13 54 -91 17 -21 49 15 30 -30
$$ packed form
12771G8j50N4l1R6N9j39N4r4O8p4J02r3J61j76R1JO7j36P0l2J22j37M7Q0n5J9
12797E2j2p7R2Pj13Q5O4o7n7J32k01R5n5J24m0P5k85J06J76j16j4J4J73r6LJ04
12823A69j07k0J9lo3p7J35n1o5j0N3J8m3n8J42q3P8j05J49k7Rl4J6k2n8R7j85
12850a26J09J4MQ5L3r0M0q0N0QL2o3j47J55O4j14L1J87j70Q3q9qLQ9o0j10P5J5
12878B0kJ12k01K1M5J7r7K7J28k4k8L9j52J60n2k6Q6j68N1j5l7J05N5J12k12N3
12904A7m4j4J43m7o4O8N7n6p9K24l02J39l0j8J9j2j3N2M4Qj60P3J09o8l8J9N9
12931H6j68J11o3J42n8k0K3P2j91J16k18J55j5J33j42k8J04j8o5P5M3l5j19J7
12955f3Q3j42J06Om3J11l0L3j32J07qkj7PM4Mj03Q8j5k1M1j45J08l8P0l4J5o0
$$ plain form
12983 -30 33 -26 69 96 -2 80 -42 20 -46 -49 81 70 -46 30 -90 50 5 0 -12 32 -35 8 -8 -77 -1 65 -127 15
13011 15 -73 62 27 27 -17 111 2 -30 0 -134 -61 -64 -54 -67 52 48 61 -38 16 -5 15 131 52 22 96 154 43 41
13039 41 14 44 -70 -62 43 -12 56 58 -51 37 44 162 109 26 -73 -49 69 -22 -53 -4 -98 -45 -20 98 -50 -8 22 50
13067 50 -50 -76 108 27 -64 20 -113 -12 -26 -4 -4 -125 58 14 89 -38 -18 39 -8 -41 186 77 -62 -24 -24 -102
13093 -102 132 18 52 19 -61 -36 -114 7 -75 2 7 -30 -17 -89 110 49 -1 60 -70 38 2 -5 20 81 6 -29 42
13120 42 26 50 20 5 97 -1 82 90 47 35 86 52 -68 -123 53 -79 90 21 40 -116 84 12 -6 25 18 49 65 90
13148 90 63 -34 52 74 -95 -71 -22 -56 -67 53 73 -30 -64 25 -45 -30 -43 0 -72 -32 58 -2 121 67 -86 102 -19
13175 -19 -8 -101 106 -77 -65 91 104 35 51 77 -69 50 1 14 9 16 -40 41 13 -65 4 64 96 -12 7 -88 -87 8
$$ packed form
12983c0O3n9R5K7r8Q2j22O2o6lJ30j1j16P6j20J40m5nj2M4o7M3j6o9P6O6j92J42
13011A5q8J35l5%m4J28j09l2L0j34P3lJ0j3J19mJ3r9N4k1K0J16p9l0P4N8j11k
13039D1k7L0j14QJ05n5O8Kj09Q8PJ18n3q3r9K4J18r1l1M9r4N3K5J18j48M2L0K8
13067E0j00k6J84q1r1Q4j33J01j4K2%j21J83m4P5j27K0N7m7l3K27j09j39L8%p8
13093a02K34j14L4l3q0K5p8J21q2P7Nl7J3p2J99o1n0O1j30J08l6pK5O1p5l5P1
13120D2j6K4l0j5R2r8Q3Qm3j2N1l4j20n5J76j32J69o9J9j56K00p2j8L1pL1J6K5
13148I0k7r7Q6K2j69K4M9l4j1J20K0j03l4Q9p0J5j3M3p2M0R0o0J23n4j53J88j21
13175a9J1r3K07j83J2J56J3o9J6K6j46J19m9J3nPn6Q1k8p8O9O0L2j08J9r5JR5
$$ plain form
13203 8 -8 -38 61 91 28 51 -25 107 33 141 28 16 26 -24 17 -18 115 -33 -51 39 12 74 14 82 -29 139 19
13230 19 10 13 128 122 44 57 14 83 44 -131 -12 -49 82 -110 -72 -72 26 41 -102 15 -41 -22 67 130 -82 54 -49
13257 -49 59 5 -53 -59 37 4 -65 122 -13 44 -60 61 0 45 -10 35 21 33 30 133 33 -66 -41 21 -102 -84 69
13284 69 85 56 97 -30 84 98 -55 52 77 45 -118 42 3 -31 -37 27 -79 99 61 49 -52 37 4 23 65 140
13310 140 -24 -20 125 82 -14 -3 -105 62 0 30 27 -89 52 82 -18 -71 -40 46 80 45 111 -6 -86 -16 -42 13
13336 13 38 -45 -12 25 115 -60 19 65 -93 0 24 -102 78 10 35 3 -146 -141 51 9 12 37 -83 53 -63 66
13362 66 -25 62 37 -33 46 -29 -30 63 127 -31 12 144 -90 -33 -14 -3 -43 67 110 -73 -24 88 35 -44 -10 -3 -97 -19
13390 -19 79 -76 -1 72 -39 -16 18 51 -24 50 -71 64 38 -133 -90 112 44 88 -3 67 -25 -10 33 -39 52 -29 41
$$ packed form
13203Hj6l0R9L0o3K3p6J32p4J08j13j2J0n0M1l5J33j48j8R0k7O2o0O8j11J68j20
13230A9rLJ15op8J3m3O9l9j75J19l7J31j92L8%R8J5j43J17n6J9Q9O3k12J36j03
13257d9J08n4n8oR6l3o9J87j35N7j04J21o1M5n5M5j4J2lJ03j00r9K5O2j23J8J53
13284F9J6k9M1j27J14J4j53J07K5l2j63J60l9l4oO4j06J78l8j2j01Q9l3J9M2P5
13310A40j64MJ45m3r6J1j02J67o2L0lj16J41L0j00n3L1Q6L4l5O6j17q0P0k6N5
13336A3K5q3L3L7R0j75P9M6j58R3K4j26J80o8K5l2j49NJ92m2LK5j20J36j16J29
13362F6r1Q7k5p0P9p5jR3O4j58M3J32k34N7J9J1m0J10M3j83M9J12n3p9L4Pr4P8
13390a9R8j55P5P3j11K3L4L3p5P4j21J35k6j71M3K02o8M4r1P0r2J5M3p2R1q1P0
$$ plain form
13417 41 33 6 29 -75 14 107 18 62 106 -2 32 62 -35 35 -2 27 89 40 -50 -17 26 -124 44 -10 -112 51 47 6
13445 6 33 99 41 44 17 -56 -100 34 -37 65 26 21 -17 -14 -22 111 38 14 83 -14 -106 -27 -23 12 223 44 21 -114 -23 -6
13475 -6 54 -7 5 -29 -83 -13 66 32 -46 -4 -47 -7 -26 25 -14 -97 68 1 50 -13 -65 -41 16 118 66 -5 72 6 32
13504 32 -45 -25 -64 -1 -22 14 76 -50 70 50 -29 49 4 -81 -11 23 14 52 -8 -4 97 -68 -12 96 -44 -39 -3 -82
13532 -82 -10 9 -40 29 -5 49 -45 -73 8 74 -17 -89 -147 -43 -60 16 47 -12 95 19 12 -96 17 116 32 119 24 124
13560 124 -97 -27 -61 108 -26 -46 31 -19 -63 -6 12 -51 106 -29 117 -154 8 -66 -8 7 60 -17 71 78 187
13585 187 83 -66 -23 -30 60 101 78 17 4 -25 -17 69 2 12 -24 83 1 56 30 88 10 83 -41 -70 -34 -49 -59 41
13613 41 -78 -16 60 -66 4 -71 -5 -76 16 -27 30 104 -23 -38 59 32 91 -109 76 -26 91 65 -18 -55 -44 127
$$ packed form
13417D1qk7K3j04Q9R3q9M4M4j08L4L0r7P0l7K9O2m9r0L3M3j50J68n4j02J63mm1
13445FK7O6n8Lk7p3m4J34p1J02l9nl8LqJ33p3k4O9r7r2P9ML5K11j79k3j35R1J7
13475fO0o1J2l4n4P0P9l4p8M2m3M0j9N1l9q3J65o7M9o3n2K4N7J02n2p1P7o6K6
13504C2p7K0l9O3k1L6O2j26J20k0p9P8m5q5P0L4rL8o0MJ01j65N6J08j40NL6p9
13532h2P2J9m9O9l4N4r4k8Q1O6r1p2n8J04j7P6L1n9J07p6pj08J13R9q4Q7r5J00
13560A24k21P0l4J69j34k0P7n0m4N7J8o3J57j35J46k71J62p4N8J5N3p7Q8PJ09
13585A87j04j49M3pR0M1k3o1j3k9QQ6o7J0l6J07q2N5k6N8p8P3j24k9L6j5j0J00
13613D1j19O2P6j26P0p5O6p1R2m3N7P4j27j5R7k7N9k00J85j02J17k6q3l7J1J71
$$ plain form
13639 127 14 -22 -127 115 -43 -134 -106 -5 77 52 -43 -1 29 134 -79 -106 35 63 -79 43 19 14 -58 108
13663 108 -17 -45 3 1 4 17 94 -42 14 -72 -15 -5 21 26 -9 -53 33 120 -12 52 49 -16 17 74 121 30 -36 -24 25 67
13693 67 -72 -3 30 -36 55 -17 44 46 -193 133 113 -53 100 266 118 10 -73 60 90 -71 -30 89 -16 -126
13717 -126 32 158 74 72 -20 12 94 49 -168 54 67 -43 63 2 42 -104 -43 -25 89 72 -117 -5 29 24 -115
13742 -115 -52 -74 -44 -2 37 43 -11 89 19 108 -82 131 40 68 -22 156 30 73 53 49 -49 10 48 -20 60 63 -31 72
13770 72 1 89 61 -7 2 64 -34 8 -59 39 -57 98 17 43 27 -102 93 -19 94 -19 141 4 -86 41 -63
13795 -63 -103 -169 21 4 6 127 29 -6 62 -13 30 67 80 101 -25 29 123 -122 35 -22 80 -29 -109 -3 64 -4
13821 -4 -46 30 29 2 -3 103 -3 -55 8 30 4 -12 97 50 113 51 -25 76 104 28 25 59 87 41 121 130 34 64 -121 32
$$ packed form
13639A27j13l6j05K42j58r1K8J01Q2k5r5M2L0J05k13k7J41K8j42J22k4np2J66
13663A08j25k8M8kLJ3P7j36N6q6N7J0K6Nl5m4Q6Q7j32O4lo5L3N7M7r1o6J2M9M2
13693F7j39O9L3o6R1p2O1Kk39L26k0j66J53J66j48j08q3J33L0j61M1J19j05j10
13717a26J58J26q4kr2L2Q2m5k17K22J3j10J06o1M0j46O1J8J14j7j89J12L4nj39
13742a15O3k2L0M2L9On4J00p0Q9j90K13r1K8r0J78j26M3k0mr8N9L8o8Q0Lr4J03
13770G2p1Q8k8o8RO2r8M2o7R8r6J55q1K6j6j29J95j12J13j13J60j37r0J27j04
13795f3m0o6J90j7KJ21r8l5O8p5M3L7J3K1j26N4R4k45J57n7J02j09q0J06O7o8
13821dm2P6jk7nJ06j06n2O3K2k6j6J09m7O3o2p6J01K8p6lL4K8m6Q0Rr6L0j85J53
$$ plain form
13851 32 -9 -77 6 -47 9 -25 -51 -22 -21 -2 89 57 125 -89 1 22 -107 -28 -25 156 -78 -76 126 83 3 6 169 -9
13879 -9 9 -79 -21 -12 -19 63 22 108 28 -54 -9 -32 92 13 67 20 -2 -41 32 1 -15 34 -29 52 17 -96 -28 -71 37 7
13909 7 44 31 -41 -124 -83 106 73 34 -96 -63 -20 -22 -11 88 18 4 87 32 -70 86 -35 -33 30 25 -123 67 -40 108
13937 108 43 2 -63 5 20 10 41 50 64 126 -68 32 27 12 69 53 -22 -110 1 41 51 94 -8 -49 -108 16 -59 47
13965 47 -88 -110 39 -3 -24 -122 -27 -11 72 47 51 -46 110 162 -3 -6 -47 -95 -41 -34 2 -45 213 35 113 -24 36 12
13993 12 40 104 64 22 37 -46 -22 -47 45 30 15 11 1 25 27 39 105 -17 10 -29 -14 -181 59 -5 -15 -80 -25 -8 26
14022 26 79 104 3 -68 -4 86 22 -103 -67 -6 124 108 10 92 49 -78 -45 5 -29 -72 11 89 -97 29 0 22 43
14049 43 11 39 -77 -41 -28 31 43 20 -13 6 -56 -56 38 60 22 49 51 90 84 -128 -89 -67 -55 -34 132 -57 -30 -44 -130
$$ packed form
13851C2m1o8Q3n3N6l4k6K9JJ9R1l2O8k14R0K1j29P9LJ81k34KK02m3q0LJ63j78
13879iJ8q8N8RpQ2m1Q6q0q2M5k3J24p9N4m7k2l9P3l1j6M9o3Q1l5j13O8m3J08l0
13909GL7j3p2q3M1J89l3l9j30L3M3kJ1R9p0j4Q3n5j02J56j21KO3nj48J90j07J48
13937A08o5m1o5O8J5j0L1RJ4O2j94J00nj5N7j6p5q8J11M0J0M3j02m1n9J24p5J06
13965D7j35k2J49m2k1r8R5J6Q3k5Mr7J56N2j65lm1m8N4PL6m7K58j78P8j37O0k4
13993A2K8O4m0m2J5q3K4k5R2j5j5mj0K4KJ2O6j22K7l9J5j67K40o4j0o5N5J7L4
14022B6N3K5j01p1O4R0o4j25L6O1J30j6r8Q2m3j27L3N0l4m3Q3P8j86J26k9K2K1
14049D3l2K8j16L6J3N9J2k3l3J9o2%R4K2l8K7KL9ok12L9K2J2K1J66j89K7j4q6
$$ plain form
14078 -130 15 46 11 27 97 24 -47 -110 51 23 -9 -5 136 15 -49 0 2 -19 -43 20 132 58 -34 -151 -111 30 -8
14105 -8 -7 -41 64 26 90 40 45 -113 18 -29 46 82 -11 9 21 -17 4 -1 -77 -84 56 25 -116 -37 21 39 -42 -112 133
14134 133 134 -8 39 50 110 140 6 -49 3 3 119 -66 159 -12 -34 99 -58 -133 -121 -61 6 -30 82 -49 -11
14159 -11 7 52 -68 58 -16 -143 -22 -56 64 48 46 14 16 29 20 41 -39 -2 -30 58 -21 -39 64 -6 -56 -27 8 -139
14187 -139 -12 -68 -76 9 -72 41 -35 -46 21 -82 26 2 44 -71 27 79 -64 -94 50 42 -40 27 -32 57 -104 -40
14213 -40 -79 -13 4 -68 -26 52 -8 4 -120 -29 140 77 -49 108 1 -85 -58 76 60 77 26 -69 -96 27 -84 81
14239 81 23 20 4 -18 -20 -32 -42 -19 -12 -142 -84 -29 97 42 -34 2 57 -41 -35 -64 -58 12 142 29 129 -45 88 -10 -6
14268 -6 -8 42 26 21 69 112 -43 33 103 -70 1 -160 -9 146 -21 25 80 72 83 -63 102 -56 -26 22 -6 -8 75 -7
$$ packed form
14078a30J45L1l5J6P0p3p1o3J61k8l2MJ41j21o4M9Kk1k4O3J12p4r2j17M0J41l8
14105hJl4J05l8O4n0Nj58J31m7P5L6r3K0J2l8K1np6pJ40l1j41P9N8J8q1p0K45
14134A33Jj42M7J1O0L0j34n5N2%J16j85K25j71k2J33j57p5J2O0O7l6J12j31L8
14159a1J8M5j20J26p4j27J21l4J20j6kl2KJ3rK1q0L7k8Q8p9j8J03p0n0K9L5j47
14187a39J27n6qQ5q1J13p6j1O7j03J08k4M2j15R8N2j43l0J44qq2O7n9Q9j61O4
14213d0l9O6J7p2M2P8o0J2j24R1J69o3j26J57j07q6K7J34j6J7n1r5k7J23j11J65
14239H1n8lj6k2kj2j0K3Pj30N8N5J26n5p6L6N5r8Ok9OP0J30j13J00j74J33r8M
14268fkN0j6nM8M3j55P6P0j73P1j61J51J55j67M6N5qJ1j46J65j58L0M8k8kQ3q2
$$ plain form
14296 -7 -9 -5 23 21 17 23 -6 134 83 5 62 44 -33 43 118 87 -40 74 -19 139 -26 63 81 38 96 -19 70 -67 87
14325 87 85 -90 28 -108 69 97 20 -118 1 17 -1 36 -70 -86 -3 -30 -3 48 99 104 -175 -104 7 -34 59 33
14351 33 30 59 -80 -65 -36 127 67 14 27 62 -70 -36 17 5 1 148 62 -46 -100 16 -22 120 110 27 22 125 78
14378 78 -9 -36 23 -55 36 89 -20 67 -11 -97 -163 -95 2 9 48 30 11 -84 -42 -39 -90 86 35 4 127 124 59 87 -123
14407 -123 55 6 -47 -6 -40 39 116 86 -50 -48 14 14 13 60 91 -96 47 -46 -68 74 65 -99 -13 -80 24 -118 -36
14434 -36 73 36 -53 31 53 56 53 -42 56 -5 -52 -2 35 65 20 -107 -72 74 44 -22 84 14 -42 113 54 54 107 3
14462 3 -49 13 -8 -2 160 -91 58 14 -54 51 -15 -21 10 37 113 -90 11 -66 53 17 -5 47 9 -47 -34 -79 -142 17
14490 17 -26 36 -9 -71 76 17 61 -15 30 41 34 78 65 -103 -2 180 64 -32 -187 95 34 6 -44 3 -38 -106 20
$$ packed form
14296gkMK8kmOk9J40n1p8N7j8p7P6P5l1j27J14r3J58j65Q9J8m3N8j15Q9j37J54
14325H7kj75J18j36J77K8p7j38J19J6j8L7j06j6Q3k7K7N1N1Nk79P1J11m1R3k6
14351C3lK9j39J5K9J63o0n3J3L5j32L4N3j2mJ47q6j08n4J16l8J42j0q3nJ03m7
14378G8q7k7N9p8R1N3j09Q7p8q6o6O8R7PL9j8j9r5M2Ln1J76n1l1J23lo5K8k10
14407a23J78m9n3M1l4P9P7l0j36KO2%jM7L1j87J43r3k2J42rj64Q6o7J04j42Q2
14434c6J09l7q9Q4K2Llr5R8o1m7N0L7L0m5j27L5J46l0o6J06p0n6J55n9%N3j04
14462Cn2O2k1OJ62k51J49m4o8J05o6oL1K7P6k03J01p7J19l6k2N2l8n6J3m5o3J59
14490A7m3O2m5o2J47n9M4p6M5J1pM4j3j68J01J82j16r6j55K82o1k8n0M7m1o8J26
$$ plain form
14517 20 26 0 -10 -34 127 42 172 -64 -18 24 -54 -27 2 -33 53 -6 -53 -35 -57 -39 -36 -23 -16 -1 -30 5 -34 -23 -17 -126
14547 -126 22 21 -3 17 -11 -6 62 16 -24 -99 -63 96 5 -25 -76 43 -133 58 100 80 126 38 -3 -81 -3 -18 -17 35
14575 35 -73 47 105 -174 -58 -85 51 18 137 103 -45 93 23 64 3 -57 -28 -55 61 -17 54 -45 20 51 57 -33
14601 -33 7 28 -4 33 42 17 51 8 -127 31 -53 -26 -61 -38 -62 -92 -115 30 53 15 -25 -27 -138 140 1 2 -109 28
14629 28 -5 -11 69 68 -26 -51 -40 179 -61 -13 84 78 54 77 65 -1 26 23 37 -45 94 -8 9 11 -68 106 28 -47 8 -72
14659 -72 -29 69 -32 -2 117 -37 77 0 28 131 73 -51 11 21 -50 -67 100 -12 -41 -57 -3 27 9 -17 -30 18
14685 18 -56 18 85 77 0 -75 29 -46 187 -51 -64 38 44 59 -27 65 35 46 -138 12 24 -24 65 -42 -88 -64 84
14712 84 19 38 -143 -83 -72 71 -143 53 82 101 -14 49 75 -25 -20 81 48 8 65 -123 151 67 -32 -3 -46 -20
$$ packed form
14517B0Ok6j0k4J61q5J30k36M6M2p8K7K9l5Q6n9m7J8k2J8LJ3PJ5k9L5l9J1Oj09
14547a26J48jk4K0k8NO8m6m0p5L6J59r1l0n1J19j76J91M2k0M6q8m1p8P8j5JN2
14575C5j08J20N8k79J16k7J36l3J19l4j48J38p0M1o1o0K9k7J16p8P1r9O5L1Or0
14601c3M0K1l2L7Rk5L4m3j35J58q4K7l5K3k4l0k3J45K3l8m0kj11K78j39Jj11J37
14629B8l3oQ0jr4k5J1K19k40M8R7ok4K3j2o6K7lJ4q2J39j02J7Kp9J74p8p5N5q0
14659g2M3R8j01L0J19j54J14p7K8J03n8j24O2J0p1j7J67j12k9j6N4L0j8k6j3M8
14685A8p4P4O7qp7p5J04p5K33k38j3J02OJ5q6R2l0J1j84J50J2m8Q9j07m6K4J48
14712H4o5J9j81O0J1J43k14J96K9J9j15O3K6j00NJ01l3m0N7j88K74q4r9K9m3K6
$$ plain form
14738 -20 173 -64 -27 10 0 86 27 -20 78 45 34 -30 -42 12 30 34 -139 -9 32 30 -38 12 -8 61 -32 -13 37 52 -44
14767 -44 -9 -24 71 61 58 -20 -15 143 91 25 89 -35 47 61 54 -97 70 29 -5 28 22 58 117 -39 -18 -46 165 44
14795 44 -38 38 18 -34 55 32 -42 -64 44 33 -45 -45 70 24 0 -57 -84 -1 -51 133 -19 -123 -2 63 54 -95 -86 8
14823 8 2 74 72 -64 -71 -56 16 88 37 46 4 50 84 51 95 8 85 -104 -122 -6 7 73 51 31 114 -57 107 20 -86
14852 -86 -83 38 -4 86 -28 69 28 13 6 -71 -30 15 42 63 -48 -7 71 -77 113 -42 125 -35 51 -45 19 -38 -44
14879 -44 97 93 -33 50 19 -33 -40 -28 -15 -1 -2 38 -39 -56 -31 7 76 6 -57 3 35 28 21 -127 61 51 -68 -144 44
14908 44 113 -29 16 -45 13 118 -101 -102 24 77 -20 -85 165 48 -25 -71 88 64 38 -65 -13 40 -71 111 -8
14933 -8 37 32 100 47 -64 80 -219 66 -19 -55 -44 42 -36 -73 117 -88 -20 14 -15 -24 -186 14 8 34 75 -46 -63
$$ packed form
14738b0J93k37L7L7j0Q6n9m7R8l3j1o4j2N4J8Mj73J30M1ko8N0k0O9r3J9N0J5r6
14767d4L5j5R5j0lp8NJ58n2o6O4j24Q2J4pj51J67m1l4L3oL6N9j56K1k8K11j21
14795D4q2P6k0n2Q9k3p4k2J08j1p8%J15m6k4n7k7Q3n0J84j52j04J21O5rj49RR4
14823HoP2kj36pJ5P2P2n1Rm2M6L4l3M4q7P7j89j8J16J3O6k2k0Q3j71J64q7j06
14852h6LJ21m2R0j14R7m1j5pp7M1M5K7K1j11M1P8j48J90j55J67j60Q6r6O4n7o
14879d4J41mj26Q3l1n2pJ2J3J4jM0p7j7K5L8O9p0o3O0L2ppj48J88j0j19p6J88
14908D4O9j42M5o1N8J05k19jJ26N3r7o5K50j17p3m6J59k4k6j03N2N3j11J82j19
14933hM5nO8n3j11J44k99K85q5l6J1Q6p8l7J90k05O8L4k9rj62K00oK6M1j21j7
$$ plain form
14960 -63 24 -18 30 -83 34 -50 53 79 18 43 57 78 -22 17 -30 57 6 -50 -18 -109 183 83 -23 -16 16 -4 85
14987 85 28 -55 -73 54 -55 133 -49 -26 10 -49 -1 -16 118 -67 -106 67 -31 -15 -88 -4 56 -58 9 26 65 27
15013 27 -7 -31 -81 -107 -20 25 52 47 -72 -5 52 32 70 -8 -89 36 79 10 156 110 55 117 29 35 63 -18 56 24 37
15042 37 -34 -37 4 -125 -9 -60 66 12 -64 111 28 -35 89 -25 100 -58 -15 -19 45 96 -74 -25 -7 33 191 11
15068 11 -24 82 -120 62 -27 -14 43 -82 31 2 -89 -2 -16 -44 2 -42 24 107 122 55 41 -66 -67 -57 37 104 -9
15095 -9 47 -42 -22 -41 75 -56 15 -93 69 8 -30 42 -24 -73 -58 97 90 4 -15 -62 14 -39 11 -29 -14 -6 91 -6 -92
15124 -92 -38 -128 -15 -57 99 77 -5 -52 -127 -32 -4 -89 -1 -19 -90 1 91 119 -28 -52 -22 34 9 -83 87 103 32 131
15152 131 81 5 21 -86 11 141 105 36 43 -12 67 -57 32 73 21 84 80 -21 -85 22 19 -57 17 -20 2 21 -29 -19
$$ packed form
14960f3Q7m2M8j13J17q4J03K6o1K5J4K1j00L9m7Q7n1n6L2r1K92j00j06PL2k0Q9
14987H5n7q3j8J27j09J88j82K3L6n9M8j5J34j85l9J73r8J6p3Q4O0j14O7J7L9l8
15013B7l4k4n0k6Q7M5K7nj19O7N7k0L8p8q1J25M3o9J46m6n5O2q8OK8q1P4l2J3
15042C7p1lM1j29J16n1J26n4p6J75q3o3J24j14J25j58M3mO4N1j70M9J8M0J58j80
15068A1l5J06k02J82q9J3N7j25J13k9r1Q7j4k8M6m4O6Q3J5o7j4j07jJ0R4O7j13
15095iN6q9K0j9J16j31P1j08J62o1l8P2o6m9J5J55pq6j9m7P6n3N0m0J5QR7r7q6
15124i2N4r0J13m2J56k2q2m7p5R5K8q5Q8j8p1R1R0K8j47k4L0N6k5r2J70J6p1R9
15152A31n0p6J6j07R7J30l6o9Pn5P9j24Q9M1n2O3mj01o4J07lp6P4l7K2J9n0J0
$$ plain form
15180 -19 -5 -108 -123 -72 36 66 -16 63 -39 23 60 -102 71 11 152 34 27 31 0 -4 42 -15 21 -36 85 34 -81
15207 -81 22 61 -53 12 -9 -20 11 -72 -39 52 -7 -186 86 5 -30 -77 39 67 -59 -33 64 -20 -66 -7 -15 -67 -123
15234 -123 -53 36 -59 -69 -10 0 37 42 73 -20 17 82 83 -6 -46 119 4 93 -37 28 33 149 98 108 110 -59 -56 92 49
15263 49 -124 -55 60 -19 -15 27 46 -54 104 12 -15 32 108 53 -117 60 31 -84 16 -118 81 -93 -136 146
15287 146 -112 -36 -55 99 35 -39 42 92 10 -20 -75 -171 -34 20 6 -45 13 -11 70 15 -66 81 65 -41 -13 70 42
15314 42 -3 -44 22 -40 43 49 -94 -26 95 -66 -5 14 -81 -89 -26 5 98 16 126 19 14 -30 -81 19 3 90 0 56
15342 56 -29 -24 -40 40 68 89 23 -60 94 17 47 108 71 -21 -93 21 111 79 42 28 -35 -63 -32 61 38 10 -67 59 -46
15371 -46 -2 -71 -14 6 11 28 -151 21 54 101 -22 4 59 -81 -77 36 -17 41 67 3 129 18 53 -11 -14 46 59 -52
$$ packed form
15180a9J4j03j5N1J08L0q2P9j02O2L7j62J73o0J41j18pMl1mM6n7L6n7J21n1j15
15207h1J03L9j14O5k1j1L1q3L3R1n9j79K72q1l5m7J16K8j26K6R7q4m6N9qn2n6
15234a23P0Q9r5j0N9J0L7NL1r3L7O5Jq9m0J65j15Q9j30O5NJ16n1J0Kj69LJ48m3
15263D9j73O9J15p9MM2J9j00J58r2k7M7P6n5j70J77k9j15J00j34J99j74m3K82
15287A46k58P6j9J54o4p4Q1N0q2l0n5r6J37N4j4n1N8k4Q1n5q1J47j6j06K8Q3k8
15314D2m5m1O6o2Q3Oj43O8J21j61O1J9r5qO3L1R3q2J10j07nm4n1J00j6Q7r0N6
15342E6q5Nj6Q0K8K1o6q3J54p7L0O1l7r2p2J14R0l2l7j4o3k8L1R3k3k8p7J26j05
15371d6M4o9N7K0NJ7j79J72L3M7j23K6N5j40MJ13n3N8K6o4J26j11L5o4lO0J3j11
$$ plain form
15399 -52 -78 -9 58 9 89 -52 -9 56 18 35 -24 28 34 53 80 6 59 9 -65 2 -53 70 58 25 4 54 -1 14 -101
15428 -101 -64 7 -58 49 50 65 -33 -17 61 -91 -119 99 36 -104 70 61 -11 7 -28 42 -3 -52 2 111 -63 -16 -33
15455 -33 8 105 -14 35 31 25 -107 -39 -11 -88 39 -104 -35 49 14 101 -34 -20 78 -46 25 -106 -59 21 102 7 20
15482 20 12 37 25 64 23 -31 33 -39 -173 58 -17 -50 157 65 20 6 105 102 67 55 134 34 27 68 23 -54 94 -135
15510 -135 65 13 145 -145 41 6 -115 65 -49 37 -104 -7 36 -12 81 68 -76 47 32 -39 140 154 44
15533 44 -117 49 27 29 74 -89 -9 -3 94 -71 3 59 -94 51 136 -70 -39 -66 -20 -98 -54 -99 -103 -72 49 10 -71
15560 -71 -58 61 -13 -23 -21 -78 -111 -140 20 -49 -85 48 64 -41 31 23 93 91 -7 87 9 88 -105 63 6 -79 60 117
15588 117 12 0 29 -78 16 71 -26 -19 33 73 -131 -111 -67 -96 3 2 -54 -13 29 54 59 105 27 30 42 93 -46 -45 -86 -46
$$ packed form
15399e2k6O9O7m9Q0j41M3O5l8J7n9N2OJ9K7p4N3n0p4O7n5J23j2l3k1N0n5J5j15
15428a01L7P1o5J07JJ5r8J6P8j52k8K18o3j40J74rp2J8l5P0m5m9N4J09j74M7j7
15455c3M1R7j19M9moj32O8K8p7J27j43O9Q4l5Q7j35J4R8j24P1j31M7Q0Q1r5J3
15482B0qK5j2L9m1n4O4p2j34K31p5l3K07r2m5j4R9ll5j2P9j00pM1m5p7J48k29
15510a35K00n2J32k90J86l5j21J80j14Q6j41R7M3m8R3j3j44J23j5p1J79J4j10
15533D4j61J66k2KM5j63Q0OR7j65P4N6j53J45Q5k06L1k7M6p8M4m5mL1J21l9q1
15560g1J3J19p4j0Kn7l3k9J60o9l6J33J6j05P2qP0kr8R4p8P9j93J68n7q5J39N7
15588A17j05j2K9j07R4N5r7PN2M0k04K0M4k9R9jn6M1M2K5NM6p8LJ2N1j39Jm1M0
$$ plain form
15618 -46 47 -82 -15 83 -19 103 33 118 8 47 3 121 81 -98 -58 10 96 100 -27 -166 0 73 47 -68 121
15643 121 55 4 66 -5 72 0 -55 10 36 -12 -14 -93 1 -43 -14 12 105 -60 -10 24 -78 -17 60 31 80 17 -157 -66
15671 -66 -53 -9 23 29 -95 -51 119 101 2 50 -88 18 12 -39 -13 32 -36 -80 21 3 10 77 3 -73 6 21 -68 -100 -25
15700 -25 -22 40 -34 -13 -11 -15 -10 -4 2 27 67 36 7 109 77 27 -58 -90 -25 -123 -26 -43 -50 74 66 28 -103 24 34 -8 -53 11
15732 11 -80 33 -41 51 36 -66 -45 79 -65 -48 8 -26 89 -17 58 60 -37 -77 -10 -3 54 -11 -2 -35 -13 -27 15 5
15760 5 -1 81 -19 -95 69 -16 35 -83 81 86 37 -55 63 68 34 -60 -27 55 38 95 -50 117 66 4 -28 -1 -3 -132
15788 -132 103 89 -100 -24 -10 -79 -3 -114 -114 40 96 -24 -113 104 -108 21 -40 67 -54 5 -43 -83 55 53 -47
15813 -47 -104 -80 144 -67 -30 47 -81 126 -15 38 -34 -16 22 51 -7 41 95 6 112 -61 -8 134 56 41 -8 -62
$$ packed form
15618d6R3j29O7R8j02J22p0Q5j10L9m4J18m0j79M0O8Q6Mj27j39J66P3k6j15J89
15643A21o6n1O2p1P7p2n5O5K6m8kp9R4m4K9K6R3j65N0L4j02O1P7k9M9o3j74R1
15671f6J3M4L2Oj24M4J70j8r9M8j38J06on1K6M5o8m4J01j8PO7p4p6P9J5q9l2P5
15700b5LO2p4K1KmNOOK5M0l1k9J02l2n0q5l2O5r8R7j7pJ24ql8j31J27J0m2m5O4
15732A1r1J13p4R2j5j02K1J24j44J7N6l4J15j06P5Kr7m0O7PN7o5Rl3K2j4M2j0
15760EoQ2j00p6J64q5N1j18J64Nm9r2J18Nl4r4L3Q2j7N7j45J67n1o2l2K7kj29
15788a32K35j4j89P6J4o9P6j11%J54N6j20q9K17k12J29o1J07j21N9m8m0J38kj00
15813d7n7K4K24k11L7P7j28K07j41N3p2J8L8K9n8M8N4q9J06j73N3J42p8j5m9n4
$$ plain form
15839 -62 38 14 46 66 70 -78 87 50 49 -33 -26 -60 -94 118 16 22 24 15 38 6 54 36 14 88 87 54 39 49 -76 -11
15869 -11 99 -60 128 47 -28 -102 26 -18 93 32 -89 -22 63 -1 6 -34 -53 -84 114 -70 -68 -6 -4 61 15 -10 -58
15896 -58 87 50 -11 -120 -23 -42 -39 44 81 23 -47 -71 26 -79 -68 5 10 60 -4 26 38 -52 54 -44 14 -74 -89 160
15924 160 -32 -43 6 14 -20 31 111 -3 -6 -111 61 -29 25 -13 -36 129 99 -22 62 91 -80 22 80 106 -43 -57
15950 -57 -5 -99 36 -34 163 -34 76 75 40 96 5 25 -114 6 -66 -70 18 32 -38 61 1 -47 -18 85 -36 49 -7
15977 -7 -18 -160 -59 4 36 129 -113 74 -185 33 23 2 71 45 -103 -8 26 -73 78 98 22 -42 -38 74 6 7 6
16004 6 7 15 43 50 -79 -43 -6 58 67 52 97 -136 12 73 39 -30 5 61 14 -50 36 -34 -47 -21 111 -19 -47 -10 -33 39
16034 39 -21 21 -32 10 -17 -86 -22 -60 -28 -28 105 31 -38 -2 40 2 -4 145 67 16 -64 64 31 15 51 -137 10 -13
$$ packed form
15839f2J00k4L2K0Mj48J65l7jq2Pl4l4K12j02OKrK3l2M8j8k2P4jl3j5J0j25O5
15869a1J10j59J88q1p5p4J28m4J11o1j21O7Q5o4Pm0j9l1J98j84KO2KO5m6k5m8
15896e8J45l7o1j09R7j9LQ3L7n8p0k4R7j05J1P3NN0o4L0J2r0J06r8N8q8j5K49
15924A60j92j1M9Ql4N1Q0j14lj05J72r0N4l8k3J65l0j21Q4K9j71J02N8K6j49j4
15950e7N2r4J35p0J97j97J10jl5N6r1K0j39J20p2mQ8J4p0R9o0m8K9J03j21Q5n6
15977gj1j42J01O3L2R3k42J87k59K18j0k1O9k6j48R5L4r9J51K0p6o4MJ12o8Jj
16004FJQK8Pj29L6L7O4Rj5M5k33J48O1l4o9L5N6m7o4Q6p0j3K6J32j30k8L7k3P2
16034C9o0M2n3M2k7o9O4l8L2%J33p4o9L6M2l8oJ49p8n1q0J28l3j6L6j88J47k3
$$ plain form
16062 -13 -33 78 5 -92 31 -1 165 -109 13 38 31 33 -42 71 27 41 -56 17 16 -3 60 -13 -28 19 44 -75 13 -48
16090 -48 -59 113 -63 22 -23 20 -42 -2 38 22 -20 46 0 66 -59 95 8 65 -15 138 13 -62 -12 127 110 148
16116 148 -72 7 162 64 -7 -71 33 -42 14 88 -9 -76 73 21 -43 -107 -5 -29 123 -8 -25 -6 39 120 21 -5
16142 -5 95 7 32 34 -3 60 -55 0 87 21 18 -42 57 124 117 -32 44 19 -96 101 113 56 30 9 14 44 23 24 -45 34
16172 34 -46 9 11 4 -23 -55 34 24 -19 -8 17 31 63 -43 56 -16 50 -42 46 -24 63 -22 71 77 -22 -6 -28 121 -115 45
16202 45 50 -112 -49 28 -83 104 -65 -59 1 -22 -3 -43 -14 -17 -28 32 -7 -18 -64 -48 56 -30 -8 -80 66 0 90 -35
16230 -35 15 90 88 108 63 7 14 37 -40 -24 1 103 147 -30 -25 -87 74 59 73 -29 32 -23 -53 -4 139 99 35 66 2
16259 2 35 124 -6 -58 -79 18 -43 20 -78 -33 69 16 77 -27 -49 -7 -18 -7 -35 94 -15 17 45 -12 -8 -50 13 -88
$$ packed form
16062a3k0J11p3r7J23l2J66k74J22K5pKp5J13m4J4r7P3jj9O3p3j5M7K5j19Q8o1
16090d8j1J72j76Q5m5M3o2M0M0j6m2O6m6O6j25J54q7N7q0J53j25p5N0J39j7L8
16116A48k20P9J55r8p1o4J04p5N6P4r7o7J49n2o4o4J02k4J52j31j7J9M5Q1r9k6
16142eJ00q8K5Kl7O3j15N5Q7o6lo0R9O7pj49P6k5j15J97J2n7k6k1NL0k1Jo9P9
16172C4q0N5Kpk7l2Q9j0m3J1K5J4L2j06R9p2O6r2Q8p0Q7q5R3Or9J6k2J49k36J60
16202D5Nj62O3P7j11J87j69OO0k3J9m0K9lj1O0l9j1m6J6J04q6K2p2J46o6R0j25
16230c5N0P5kK0m5n6PK3p7J6K5J02M4j77No2J61j5J4j02O1n5l0M9J43m0o4L1o4
16259BL3Q9j30n2k1R7o1O3r8M5J02n3O1j04k2M2j1J1k8J29j09L2K8n7Mm2O3j01
$$ plain form
16287 -88 11 1 -34 60 128 -11 69 -10 45 -49 21 65 34 -1 5 -12 -11 -4 83 -125 -30 -27 -13 -8 63 -1 -15 -5 9 57 -29
16318 -29 -23 -74 -47 37 90 15 43 -80 -27 -6 -4 27 -75 -18 37 61 51 -5 112 -7 -11 -7 -29 -84 -3 21 41 18 -11 -16
16348 -16 -16 71 53 -138 9 -116 26 -109 -73 -15 69 -57 30 -28 18 40 17 19 70 87 -21 80 8 103 11 89 -12
16375 -12 -44 -7 -1 -38 -118 10 -21 -44
$$ packed form
16287h8R9j0l5R4O8j39Q0p9N5r4P0M4l1l5Oj7JPQ7k08R5LJ4NP1o4j4J0J4M8q6
16318b9On1K7Q4N3p5K8j23N3K1KL1j02N7N5K4j0n6J17j19mMk2n5Q1K4K0k3k9n
16348a6%Q7j8j91J47j25J42j35L6N8Q4j26Q7n8M6K2k3KN1J7j08J01p2R5r2P8j01
16375a2l2L7Ol7q0J28l1k3
16383d4
$$ Imaginary data points
##PAGE= N=2
##DATA TABLE= (X++(I..I)), XYDATA
$$ plain form
0 0 0 0 0 0 0 0 0 0 0 0 0 0 -32 32 -32 32 -32 64 -64 64 -96 96 -128 160 -192 193 -231 288 -320 354 -417 480
32 480 -544 609 -703 771 -869 992 -1090 1218 -1367 1511 -1683 1858 -2056 2274 -2509 2770
48 2770 -3048 3360 -3701 4079 -4498 4960 -5483 6069 -6741 7509 -8406 9465 -10735 12296
62 12296 -14270 16852 -20398 25586 -33929 49581 -89231 411350 528080 -511214 -699412
73 -699412 -206901 457634 439490 34554 -297542 -220971 -98851 -41463 33467 247577 253420
84 253420 -68573 -426982 -310479 205694 575859 325149 -246075 -493707 -178114 232229
94 232229 301653 58124 -156936 -189810 -103150 -18743 73295 163755 141089 -60129 -226769
105 -226769 -124721 151341 264227 96251 -133288 -165459 -24017 61757 -4464 -56984 24100
$$ packed form
0@%%%%%%%%%%%%l2O4o4O4o4R6j28J28j60J92k24K88l52L85m24N19o08O74p71Q97
32D80j024J153j312J474j640J861k082K308k585K878l194L541l914M330m783N279
48B770n818O408p061P780q577R458j0443J1552j2810J4250j5915J7871k0200K3031
62A2296k6566L1122l7250M5984n9515Q3510j38812N00581J16730j039294j88198
73f99412M92511O64535j8144m04936l32096P6571J22120N7388P4930K14110N843
84B53420l21993l58409J16503N16173L70165k50710n71224k47632L15593M10343
94B32229O9424k43529k15060l2874Q6660Q4407R2038R0460k2666k01218j66640
105b26769J02048K76062J12886j67976k29539l2171J41442Q5774o6221n2520Q1084
$$ plain form
116 24100 91637 -15939 -167196 -117796 115494 249006 98284 -163027 -205775 17003 199491
127 199491 115442 -81244 -123390 -11193 45938 -35579 -101416 -2610 149710 115016 -102329
138 -102329 -207744 -32929 210095 213326 -22736 -209987 -139163 74063 158454 42109 -87500
149 -87500 -82234 -12442 3427 -15955 10437 70519 68456 -27473 -105862 -45868 93489 130055
161 130055 12418 -110105 -99224 6290 71451 36513 -31009 -42156 -6762 3959 -10726
172 -10726 7694 51836 47634 -15560 -57744 -20523 49959 56266 -19728 -77350 -33872 44479
184 44479 41712 -31761 -62179 -3408 65564 52532 -25286 -61359 -4580 62936 46054 -22247
196 -22247 -44954 -8698 16777 -5652 -33221 -11177 38484 36131 -32391 -71089 -9460 81557
$$ packed form
116B4100O7537j07576j51257M9400K33290J33512j50722k61311m2748K22778J82488
127A99491q4049j96686m2146J12197N7131q1517o5837R8806J52320l4694k17345
138a02329j05415J74815K43024L231k36062j87251P0824K13226Q4391j16345j29609
149h7500N266O9792J5869j9382K6392O0082k063r5929p8389N9994J39357L6566
161A30055j17637j22523J0881J05514O5161l4938o7522j1147L5394J0721j4685
172a0726J8420M4142m202o3194m2184L7221P0482O307p5994n7622M3478P8351
184D4479k767p3473l0418N8771O8972j3032p7818l6073N6779O7516j6882o8301
196b2247k2707L6256K5475k2429k7569K2044M9661k353o8522l8698O1629R1017
$$ plain form
208 81557 83684 -7297 -82434 -57251 31873 74796 26218 -42334 -52250 -18576 3929 8189 17006
221 17006 25898 10831 -26378 -43463 -3140 61805 67616 -4431 -70791 -56339 12488 53994
233 53994 29278 -25204 -46423 -20446 9511 15179 16026 23365 14460 -16513 -32821 -7247 37006
246 37006 46494 -112 -55133 -50735 6430 41558 18128 -21496 -27344 -2054 18674 13481 706
259 706 6962 20224 7443 -21594 -23218 6370 24843 6284 -27406 -35400 -6069 24359 17003
272 17003 -10719 -12271 12337 22234 5276 -10654 -2922 17062 17611 -10916 -33892 -17855 13866
285 13866 15350 -9529 -21836 -7965 12011 15732 4362 -399 12022 17697 -1075 -18129 -5987
298 -5987 15783 13170 -13400 -33478 -22347 9899 24177 3187 -19123 -9993 13420 20678 11253
$$ packed form
208H1557K127r0981p5137K5183Q9124M2923m8578o8552r916L3674K2505M260Q817
221A7006Q892j5067l7209j7085M0323O4945N811p2047o6360J4452O8827M1506
233E3994k4716n4482k1219K5977K9957N668Q47P339q905l0973j6308K5574M4253
246C7006R488m6606n5021M398N7165L5128k3430l9624n848K5290K0728n193j2775
259G06O256J3262j2781k9037j624K9588J8473j8559l3690p994K9331L0428p356
272A7003k7722j552K4608R897j6958j5930P732J9984N49k8527k2976J6037L1721
285A3866J484k4879j2307J3871J9976L721j1370m761J2421N675j8772j7054J2142
298e987K1770k613k6570k0078J1131L2246J4278k0990k2310R130K3413P258r425
$$ plain form
311 11253 2654 2454 4677 -1807 -13160 -9648 7555 7985 -15659 -30082 -12854 15585 24205 6625
325 6625 -14652 -10339 15277 26683 11078 -6560 -7370 -2692 -3776 -7120 -7154 -2847 -521 -8951 -17322
340 -17322 -5001 18776 22805 4306 -10400 -4559 12812 21262 7785 -13545 -16441 -3683 828
353 828 -6550 -9096 -4478 -1100 -1863 -2735 1680 13009 18101 5943 -7646 -2938 10162 10602 -2010
368 -2010 -13692 -14960 -5394 2593 -2382 -9671 -4659 5180 6147 3447 4722 8078 9576 5954 -2295
383 -2295 -5707 915 4058 -5642 -14224 -10496 -1893 2026 103 -3491 -1699 7210 11518 5534 1275
398 1275 4852 6403 1168 -4130 -6141 -4948 -2123 -3229 -8947 -8645 -105 4906 2772 1890 4266 6402
414 6402 7194 5049 291 -198 3208 152 -8615 -10850 -5384 -609 300 -2263 -5431 -2762 5567 9341
$$ packed form
311A1253q599k00K223o484j1353L512J7203M30k3644j4423J7228K8439Q620j7580
325F625k1277M313K5616J1406j5605j7638q10M678j084l344l4M307K326q430q371
340a7322J2321K3777M029j8499j4706N841J7371Q450j3477k1330k896J2758M511
353H28p378k546M618L378p63q72M415J1329N092j2158j3589M708J3100M40j2612
368b010j1682j268R566P987m975p289N012R839R67k700J275L356J498l622q249
383b295l412O622L143r700q582L728Q603L919j923l594J792Q909M308n984m259
398A275L577J551n235n298k011J193K825j106n718L02Q540N011k134q82K376K136
414F402P92k145m758m89L406l056q767k235N466M775R09k563l168K669Q329L774
$$ plain form
430 9341 6487 4869 4113 597 -1641 302 1280 -689 -3827 -8689 -11442 -5329 3604 5203 1631 -582
446 -582 -1279 1638 8231 10911 6143 -224 -4868 -7565 -4386 2923 3354 -4669 -10794 -9466 -1951 7254
462 7254 10409 3658 -2384 -198 3957 4562 4807 3748 -895 -5674 -7857 -7837 -2851 4599 4116 -4583
478 -4583 -8974 -3298 6441 12696 10252 -160 -6850 -2036 4945 4319 -588 -4817 -6865 -5364 -2452
493 -2452 -2144 -1191 3541 5447 1249 -2346 -137 4949 8756 7356 -1425 -9928 -7513 767 4055 521
509 521 -5710 -9026 -4288 4572 7000 2334 111 2790 4266 2920 -91 -2501 -314 3683 762
524 762 -8612 -11641 -3719 5646 7290 210 -7784 -5504 7058 13773 6336 -4143 -5328 618 4935
539 4935 1355 -6532 -8593 -1108 4010 -1498 -7821 -4418 5313 10781 6534 -3832 -6716 3029 12169
$$ packed form
430I341k854j618p56l516k238J943R78j969l138m862k753O113Q933J599l572k213
446e82o97K917O593K680m768o367m644k697L179P309M31q023o125J328P515R205
462G254L155o751o042K186M155O05K45j059m643m779k183K0M986P450m83q699
478d583m391N676R739O255k444j0412o690M814O981o26m907m229k048J501K912
493b452L08R53M732J906m198l595K209N086L807j400q781q503K415Q280L288l534
509E21o231l316M738Q860K428m666k223K679J476j346l011k410K187L997k921
524G62r374l029P922R365J644p080p994K280J2562O715p437j0479j185N946M317
539D935l580p887k061P485N118n508o323L403R731N468m247j0366k884R745R140
$$ plain form
554 12169 6855 -5871 -11313 -5712 3188 4639 -3426 -10312 -5088 5577 7593 1603 -2990 -386
568 -386 6228 9081 2983 -6118 -6475 950 4190 -614 -7486 -9125 -2778 5320 5096 -2484 -4975 2638
584 2638 9761 7873 -546 -6228 -2315 6957 7537 -4825 -14410 -9226 3505 9054 1717 -9367 -9581
599 -9581 3712 14305 8915 -2896 -5679 1952 7601 3753 -5698 -8681 -1015 5041 -1366 -10786
613 -10786 -8593 3468 11453 6658 -5114 -9038 2352 14568 11484 -3123 -11196 -6128 3670 6349
627 6349 -1608 -10585 -8493 1159 5368 1165 -2542 -448 4759 7579 4019 -2193 -2882 2874 5165
642 5165 -315 -6857 -8432 -3555 3020 3274 -3521 -7047 -683 7496 8247 2088 -3323 -1660 5992 8484
658 8484 17 -9773 -8263 907 5579 577 -8334 -9843 -351 9456 7245 -1659 -3943 2006 7358
$$ packed form
554A2169n314j2726n442N601Q900J451q065o886N224J0665K016n990m593K604
568c86O614K853o098r101l57P425L240m804o872j639O347Q098k24p580k491P613
584B638P123j888q419n682L913R272N80j2362r585N184J2731N549p337j1084k14
599i581J3293J0593n390j1811k783P631N649l848r451k983P666O056o407r420
613a0786K193J2061P985m795j1772l924J1390J2216l084j4607q073N068R798K679
627F349p957q977K092R652M209m203l707K094N207K820l560o212o89N756K291
642E165n480o542j575M877O575K54o795l526O364Q179P51o159n411J663P652K492
658H484q467r790J510R170M672n002q911j509R492R807k211q904k284N949N352
$$ plain form
673 7358 5514 -1150 -4603 -566 3405 -1268 -8574 -7398 944 5937 2201 -5235 -6738 1688 11164
688 11164 9700 -263 -5941 -2551 3245 5029 685 -5725 -6680 -2412 58 -1267 -1484 306 1819
703 1819 2247 1679 329 1177 4580 4844 638 -3471 -4727 -2914 574 1989 -1817 -5717 -4087 603
719 603 3651 3594 1888 193 1334 3379 1561 -1238 -378 1643 327 -3361 -6101 -4992 542 5149
735 5149 2551 -3850 -4658 873 6260 6935 2706 -2290 -3126 -290 1242 -116 -930 -1284 -3115 -4546
751 -4546 -2829 759 3987 4599 722 -3475 -1815 3586 6177 3887 -1041 -5242 -5046 -481 2405 977
767 977 -1976 -3857 -3638 -560 3721 4861 2440 32 -1024 -571 2052 3349 982 -2635 -3695 -3186
783 -3186 -1782 455 1488 -491 -1660 -891 720 2729 4221 2558 -768 -1511 -2 813 329 -1004
$$ packed form
673G358j844o664l453M037L971m673p306J176Q342M993l736p436j503Q426R476
688A1164j464r963n678L390N796J784m344o410r55M268K470j325k17J790J513
703A819M28n68j350Q48L403K64m206m109j256J813L488J415l806l900J630M690
719F03L048n7j706j695J141K045j818k799Q60K021j316l688k740J109N534M607
735E149k598o401q08N531N387O75m229m996q36K836J532j358q14l54j831j431
751d546J717L588L228O12l877m197J660N401K591k290m928m201J96M565K886j428
767I77k953j881K19L078M281J140k421k408j056M53K623J297k367l617j060N09
783c186J404K237J033j979j169P69J611K009J492j663l326p43J509Q15m84j333
$$ plain form
799 -1004 -2908 -3252 -1342 442 -111 49 812 786 1099 2102 2119 1130 767 -152 -1353 -1225 -375 -1198 -2394
818 -2394 -1790 -957 -373 757 1122 514 1004 2073 1726 988 868 183 -988 -1011 -975 -1566 -1785 -1131 -1075 -807
838 -807 389 1054 1030 1393 1748 1352 946 1009 217 -1038 -841 -995 -1758 -1872 -1365 -1183 -424 753 1070 616
858 616 1032 1580 1493 1539 1476 146 -1335 -1403 -981 -1133 -1048 -1145 -1730 -1477 265 1387 1606 1905 1444 505 814
879 814 1728 1079 -247 -877 -2092 -2539 -1335 -380 -619 -775 -482 -212 864 2499 2504 1346 802 537 74
898 74 57 147 -1016 -2403 -2142 -1771 -1252 -128 531 74 256 1189 1923 1903 2134 1294 -266 -561 -143 -767
918 -767 -1500 -1701 -2004 -1807 -651 229 274 759 1332 1304 1303 1909 1736 561 -255 -800 -1185 -1152 -869 -1657 -2053
939 -2053 -1317 -399 191 1056 1466 1205 1154 1601 1242 773 846 -10 -1448 -1969 -1475 -1183 -1098 -801 -1049 -776 633
$$ packed form
799a004j904l44J910J784n53J60P63k6L13J003J7r89l63r19j201J28Q50q23j196
818b394O04Q33N84J130L65o08M90J069l47p38j20o85j171k3L6n91k19O54N6K68
838h07J196O65k4L63L55l96m06O3p92j255J97j54p63j14N07J82P59J177L17m54
858F16M16N48q7M6o3j330j481o8M22j52Q5r7n85K53J742J122K19K99m61r39L09
879H14R14o49j326o30j215m47J204R55k39j56K93K70J076J635Nj158n44k65m63
898G4j7R0j163j387K61L71N19J124O59m57J82R33P34k0K31q40j560k95M18o24
918g67p33k01l03J97J156Q80M5M85N73k8jO06j73j175q16n45l85L3K83p88l96
939b053P36R18N90Q65M10k61n1M47l59m69P3q56j438n21M94K92Q5K97k48K73J409
$$ plain form
960 633 1589 1454 1568 1897 1461 487 8 -222 -362 -420 -1128 -2339 -2257 -903 116 111 474 658 617 1388 1814
981 1814 1434 1320 1295 -185 -1753 -1524 -694 -491 -800 -1514 -2157 -1059 911 1489 1094 1407 1554 671 234
1000 234 817 1137 768 -256 -2458 -3346 -1340 910 414 -855 -1317 -657 1192 2441 1950 962 1025 991
1018 991 -474 -1236 -286 472 -60 -1515 -3241 -2763 271 2342 1410 -550 -521 423 1585 2359 1499 130
1036 130 -560 -1000 -1516 -1225 0 49 -1012 -1436 -1298 -437 1371 2404 1895 583 -147 -502 43 1474
1054 1474 1886 -399 -3033 -3168 -1244 1065 1754 -130 -1982 -799 1414 1867 1062 845 1037 833 -495
1071 -495 -2143 -1785 980 2135 -546 -3966 -3498 136 3411 3140 -343 -2516 -571 2528 2429 208
1087 208 -972 -682 -213 -697 -1771 -1635 490 1778 -61 -2391 -1553 1210 3369 2772 278 -1904 -1362
$$ packed form
960F33R56j35J14L29m36r74m79k30j40n8p08j211Q2J354J019nL63J84m1P71M26
981A814l80j14k5j480j568K29Q30K03l09p14o43J098J970N78l95L13J47q83m37
1000B34N83L20l69j024k202q88K006K250m96j269m62O60J849J249m91r88O3l4
1018I91j465p62R50P58n32j455j726M78L034K071r32j960K9R44J162P74q60j369
1036A30o90m40n16K91J225M9j061m24J38Q61J808J033n09j312p30l55N45J431
1054A474M12k285k634j35J924K309O89j884j852J183K213M53q05k17J92k04j328
1071d95j648L58K765J155k681l420M68L634L275k71l483k173J945L099r9k221
1087B08j180K90M69m84j074J36K125J288j839k330Q38K763K159n97k494k182N42
$$ plain form
1104 -1362 1001 1675 421 -1046 -2023 -1954 -660 615 613 271 285 389 301 596 880 933 1310 833 -1233 -2794
1124 -2794 -1801 623 1831 266 -2358 -3391 -350 3394 3201 159 -1699 -481 1767 1971 -142 -1870
1140 -1870 -683 1061 -318 -3129 -2623 728 3137 1802 -1852 -3154 138 4458 3969 -388 -2909
1155 -2909 -1525 1080 1565 -321 -2398 -1728 181 75 -1241 -852 1319 2435 1404 -490 -1313 222
1171 222 2362 2065 -604 -2453 -2179 -903 259 746 -472 -1573 -1355 209 1453 2196 1153 -59
1187 -59 -208 859 730 -452 -958 -472 10 -612 -1994 -2365 -96 2680 2125 -1086 -2075 289 3349 3296
1205 3296 262 -2573 -1718 1173 1298 -1334 -2596 -1214 720 539 -1281 -1775 717 3381 2403 -974
1221 -974 -1914 471 2723 1974 -1004 -2812 -1814 422 551 -1335 -1582 -130 868 387 28 455 1546
$$ packed form
1104a362K363O74j254j467r77O9J294J275kl42J4J04q8K95K84N3L77m77k066j561
1124b794R93K424J208j565k624j033L041L744j93l042j858J218K248K04k113j728
1140a870J187J744j379k811N06L351K409j335l654j302L292M320m89m357k521
1155b909J384K605M85j886k077O70J909j06j316L89K171J116j031j894q23J535
1171B22K140k97k669j849K74J276J162M87j218j101K18J564J244P43j043j212
1187e9j49J067j29j182n06M86M82o22j382l71K269K776n55l211r89K364L060n3
1205C296l034k835Q55K891J25k632j262J382J934j81j820m94K492K664r78l377
1221i74r40K385K252p49k978j808R98K236J29j886k47J452R98m81l59M27J091
$$ plain form
1238 1546 1949 800 -979 -786 493 522 -545 -1246 -1204 -1061 -591 -88 385 849 608 -54 -97 1271 1990
1257 1990 851 -607 -1146 -388 352 -180 -1653 -1594 118 626 -546 -1062 236 1838 1842 405 -951 -174
1275 -174 1580 1546 -812 -2201 -1199 444 240 -939 -1650 -434 1277 1219 -294 -469 1166 2043 782
1292 782 -871 -1044 -12 858 -68 -1685 -1625 10 621 -205 -689 79 1092 1267 310 -495 275 1261 702
1311 702 -952 -1358 -345 131 -147 -1003 -1070 -4 880 356 -407 310 1333 1126 -30 -471 -119 522 418
1330 418 -977 -1608 -656 433 -97 -785 -474 628 1108 708 58 -121 979 1181 -299 -1242 -431 401
1348 401 185 -919 -1520 -578 690 880 -331 -543 780 1520 668 -203 -366 393 810 -89 -1424 -1216
1366 -1216 181 397 -654 -1019 -289 977 1280 407 -412 110 1303 941 -576 -1033 -41 325 -345 -1130
$$ packed form
1238A546M03j149j779J93J279K9j067p01M2J43M70N03M73M64k41o62m3J368P19
1257A990j139j458n39P58P40n32j473N9J712N08j172n16J298J602Mj437j356P77
1275a74J754l4k358j389J002J643k04j179p11J216J711n8j513j75J635Q77j261
1292G82j653j73J032Q70r26j617O0J635O11q26m84P68J013J75r57q05P70R86n59
1311G02j654m06J013M76k78q56o7J066Q84n24p63P17J023k07j156m41L52O41j04
1330D18j395o31R52J089n30o88L11J102M80m00o50j79J100K02j480r43Q11Q32
1348D01k16j104o01R42J268J90j211k12J323P40q52q71j63P59M17q99j335K08
1366a216J397K16j051l65P30J266L03q73q19N22J193l62j517m57R92L66o70p85
$$ plain form
1384 -1130 -1128 -110 853 299 -508 -54 1170 1285 356 -150 -82 573 435 -427 -1097 -563 178 -218 -857 -713
1404 -713 333 923 640 -61 -5 842 1291 313 -726 -209 436 -78 -845 -1184 -700 266 286 -519 -629 470
1424 470 1266 673 -40 110 568 697 177 -898 -1010 -78 125 -791 -1000 -308 427 571 195 45 397 1136
1444 1136 976 -44 -448 161 307 -256 -868 -1002 -425 142 -118 -619 -177 766 869 140 68 445 602 558
1464 558 -145 -775 -487 138 -268 -913 -797 -162 -18 228 109 114 583 999 683 33 309 493 37 -426 -749
1485 -749 -644 -280 -251 -409 -601 89 509 410 232 396 667 648 308 -181 -273 -59 9 -635 -790 -519 10 26
1507 26 -214 -86 187 567 723 260 43 498 330 58 -406 -509 -347 -325 -267 -522 -498 206 383 242 158 426
1529 426 487 578 341 67 -236 53 -185 -612 -548 -344 -267 -241 10 -22 64 453 622 313 266 593 240 -158 -197
$$ packed form
1384a130KJ018R63n54q07M54J224J15r29n06O8O55j38q62o70N34P41l96o39J44
1404g13J046N90k83p01N6Q47M49r78j039N17O45n14p67l39M84R66K0q05j10J099
1424D70P96n93p13J50M58J29n20j075j12R32K03r16k09O92P35J44l76j50L52P39
1444A136j60j020m04O09J46n63o12j34N77N67k60n01M42R43J03p29p2L77J57m4
1464E58p03o30K88O25m06o45J16O35J44K46j19NM69M16l16o50K76J84m56m63l23
1485g49J05L64K9j58j92O90M20r9j78J64K71j9l40m89r2K14O8o44j55K71N29J6
1507B6k40J28K73L80J56m63k17M55j68k72m64j03J62K2N8k55K4P04J77j41q4K68
1529D26O1R1k37k74l03K89k38m27O4K04P7K6K51l2Q6L89J69l09m7L27l53l98l9
$$ plain form
1552 -197 -216 -393 -415 -531 -661 -260 -12 39 -29 256 621 479 498 215 24 -26 -27 -177 -630 -556 -339 -212 -272
1575 -272 -154 -25 128 576 543 347 340 366 245 242 137 -223 -446 -270 -310 -454 -277 -133 -143 269 463 252 231
1598 231 407 524 245 145 -112 -473 -217 -150 -431 -656 -371 -142 56 194 164 68 277 595 508 192 -89
1619 -89 82 1 -71 -420 -642 -513 -91 121 -54 -27 93 302 624 515 85 -69 310 307 -148 -495 -524 -455 -71
1642 -71 -134 -363 -453 -29 656 346 146 -69 105 559 527 -211 -686 -325 112 189 -341 -655 -408 128 593 245
1664 245 -226 73 603 619 397 -216 -153 21 375 -144 -584 -637 -102 166 171 -19 -286 219 703 586 201 -7
1686 -7 89 72 111 -224 -645 -604 -15 128 -205 -311 -89 219 665 671 1 -356 278 646 268 -382 -646 -335 119
1709 119 138 -452 -719 -131 490 517 31 -86 225 667 680 -57 -598 -407 289 95 -429 -802 -666 -57 385
$$ packed form
1552a97j9j77k2j16j30M01K48N1o8K85L65j42J9k83j91n0jj50m53P4K17J27o0
1575b72J18J29J53M48l3j96pK6j21lj05l60k23J76m0j44J77J44j0M12J94k11k1
1598B31J76J17k79j00k57l61K56O7k81k25K85K29J98J38l0r6K09L18q7l16k81
1619h9J71q1p2l49k22J29M22K12j75K7J20K09L22j09m30j54L79lm55l47k9O9L84
1642g1o3k29r0M24O85l10k00k15J74M54l2p38m75L61M37P7n30l14K47N36M65l48
1664B45m71K99N30J6k22o13O3J74L54n19m40n3N35K68Nj90k67N05M84j17l85k08
1686gR6j7L9l35m21M1N89J43l33j06K22L08M46Oo70l57O34L68l78o50k64L11M54
1709A19J9n90k67N88O21K7m86j17L11M42J3p37n41J91O96j94n24l73J36O09M42
$$ plain form
1730 385 259 -299 39 542 741 289 -101 -86 -5 339 -175 -625 -602 -206 46 -178 -386 -232 -58 514 592
1751 592 151 15 318 415 194 2 -222 -543 -390 -160 -291 -527 -353 38 317 397 198 37 183 676 481
1772 481 27 -305 -204 19 66 -213 -703 -491 81 326 -9 -77 14 512 664 301 -143 -61 271 278 -308 -794
1794 -794 -564 -200 -45 -225 -464 -172 476 616 222 255 230 446 342 56 -251 -427 -99 -142 -450 -374 -337 -167
1816 -167 17 160 49 421 380 358 227 211 145 -125 -269 -103 -241 -222 -373 -459 -217 219 198 -136 49 483
1838 483 533 199 -38 2 -38 198 -181 -566 -449 -13 -75 -366 -247 36 307 498 274 44 184 523 380
1859 380 -184 -214 -90 -75 -117 -357 -489 -266 205 253 -190 -4 274 530 275 162 -185 31 121 -110 -376 -283
1881 -283 -164 -181 -192 -200 -79 198 364 182 36 265 340 157 -169 32 -96 -162 -198 -313 -370 -21 -7 -204 -76
$$ packed form
1730C85j26n58L38N03J99m52l90J5Q1L44n14m50K3L96K52k24k08J54J74N72P8
1751E92m41j36L03R7k21j92k24l21J53K30j31k36J74L91K79Q0j99j61J46M93j95
1772D81m54l32J01K23M7k79m90K12N72K45l35o8R1M98J52l63m44Q2L32Pn86m86
1794g94K30L64J55j80k39K92O48J40l94L3k5K16j04k86l07j76L28m3l08P6L7J70
1816a67J84J43j11L72m1k2j31j6o6k70j44J66j38J9j51q6K42M36k1l34J85M34
1838D83N0l34k37M0m0K36l79l85J17M36o2k91J19K83K71J91k24k30J40L39j43
1859C80n64l0J24J5m2k40j32K23M71M8m43J86K78K56k55j13l47K16R0k31k66R3
1881b83J19j7j1qJ21K77J66j82j46K29P5j83l26K01j28o6l6j15n7L49J4j97J28
$$ plain form
1904 -76 199 343 243 57 24 163 340 -8 -331 -375 -72 62 -232 -186 -98 139 152 110 -81 99 496 300
1926 300 -118 -122 45 183 -84 -257 -425 -247 -18 -69 -298 -131 250 306 162 124 71 203 247 -23 -260 -155
1948 -155 18 16 -317 -231 -77 -37 171 62 -24 238 363 255 65 81 184 96 -83 -309 -342 -39 -37 -194 -196 62
1972 62 340 103 -55 85 161 283 140 -280 -372 -39 -49 -142 -331 -325 -47 76 16 -42 71 398 273 53 159
1995 159 112 135 -7 -144 -373 -225 4 -163 -230 -178 165 256 122 108 183 265 321 76 -76 -48 62 -74 -288
2018 -288 -213 -180 -51 105 -86 -133 128 347 220 117 109 261 138 -96 -217 -232 -141 -130 -222 -207 -67 125 27 20
2042 20 77 191 275 265 14 -75 -16 -42 -131 -299 -331 -179 -151 -36 -144 -80 125 215 121 8 265 188 147 -152 -68
2067 -68 -161 -159 -49 -323 -389 -18 33 -178 -98 235 278 284 274 -15 110 271 113 -93 -212 -227 3 16 -179 -274 8
$$ packed form
1904g6K75J44j00j86l3J39J77l48l23m4L03J34k94M6Q8K37J3m2j91J80L97j96
1926C00m18mJ67J38k67j73j68J78K29n1k29J67L81N6j44l8n3J32M4k70k37J05
1948a55J73kl33Q6J54M0K08j09q6K62J25j08j90J6J03q8j79k26l3L03Kj57kK58
1972F2K78k37j58J40P6J22j43m20r2L33j0r3j89OK78J23o0n8J13L27j25k20J06
1995A59m7K3j42j37k29J48K29j67o7N2L43R1j34j4P5Q2N6k45j52K8J10j36k14
2018b88P5L3J29J56j91m7K61K19j27j03qJ52j23k34j21j5R1J1r2J5J40J92r8p
2042B0N7J14Q4j0k51q9N9k6q9j68l2J52K8J15j08O4K05R0r4j13K57p7m1k99Q4
2067f8r3KJ10k74o6L71N1k11Q0L33M3Oj0k89J25J61j58k06j19j5K30J3j95r5K82
$$ plain form
2092 8 338 200 -9 124 297 276 195 -37 -116 -111 28 -46 -211 -262 -76 -33 2 -1 -47 358 248 217 44 117 66 -106
2118 -106 -157 -67 -212 -241 -250 -392 -163 -29 87 -29 10 182 273 163 75 -63 153 39 -108 -273 -330 -97 37
2141 37 -162 -155 -121 225 308 180 49 54 294 247 72 -47 -150 -121 -118 -165 -172 -172 -68 65 15 58 92 272 181 197 185
2168 185 125 -49 -107 -95 -234 -109 -158 -311 -123 151 31 100 66 137 253 350 111 -69 -16 104 21 -215 -301 -175
2192 -175 -71 31 -89 -161 64 371 128 -115 98 104 152 185 -223 -343 -120 -25 -135 -64 -173 -105 47 205 62
2215 62 -54 96 225 165 139 -5 -15 -9 81 -62 -392 -141 63 -17 92 128 36 78 193 302 22 57 36 82 -111
2240 -111 -85 -273 -275 -101 -74 -92 -75 42 127 280 283 68 -39 51 172 70 -158 -151 -224 -151 -14 -185 -197 -39 170
2265 170 165 30 85 204 232 217 52 -210 -145 -38 -115 -315 -351 -281 -24 148 233 -15 -59 204 224 451 232 -110
$$ packed form
2092HL30j38k09J33J73k1q1k32p9NJ39p4j65n1J86M3L5lm6M05j10l1j73P3n1j72
2118a06n1R0j45k9rj42K29J34J16j16L9J72R1j10q8j38K16j14j47j65n7K33J34
2141C7j99PL4L46Q3j28j31NK40m7j75j19j03K9Lm7p%J04J33n0M3L4J80r1J6j2
2168A85o0j74n8J2j39J25m9j53J88K74j20O9l4P1J16R7k39j80N3J20q3k36q6J26
2192a75J04J02j20p2K25L07k43k43K13OM8L3m08j20K23R5j10P1j09O8J52J58j43
2215F2j16J50J29o0k6j44j0OR0j43l30K51K04q0J09L6r2M2J15J09k80L5k1M6j93
2240a11K6j88kJ74K7j8J7J17Q5J53Lk15j07R0J21j02k28Pp3P3J37j71j2J58K09
2265A70nj35N5J19K8j5j65k62O5J07p7k00l6P0K57J72Q5k48m4K63K0K27k19l42
$$ plain form
2289 -110 -26 63 55 -288 -335 -72 53 15 -46 -124 26 423 373 84 38 64 280 132 -131 -292 -359 -1 -93 -253
2313 -253 -361 -91 182 123 142 258 184 368 292 117 34 -59 -2 -100 -154 -295 -203 -51 -18 0 66 181 143 181 386
2338 386 300 -54 -7 34 -50 -168 -291 -425 -300 -45 -139 -125 -108 183 338 225 143 73 -44 335 144 -183 -312
2361 -312 -214 -38 -170 -274 -276 -124 209 191 0 42 363 436 254 -4 -142 60 150 -116 -425 -338 -194 -94 -141
2384 -141 22 34 149 194 226 171 236 336 154 -1 -165 -53 -269 -334 -232 -186 -114 -131 0 -20 185 255 173 133
2408 133 134 111 137 7 -129 -107 -107 6 -280 -274 -64 108 115 45 33 174 342 343 58 -179 22 162 -82 -306 -271
2433 -271 -181 -30 74 -205 -124 132 309 180 90 49 24 79 -60 -176 -180 -108 -108 -164 -250 -73 25 120 20 105 66 200
2459 200 250 96 101 113 45 -44 -223 -58 -99 39 -122 -31 -39 276 172 19 66 152 153 84 -51 -68 20 39 -249 -260
$$ packed form
2289a10Q4Q9ql43m7K63J25l8o1p8J50L97n0k89m6K6K16j48k63j61o7L58r2j60
2313b53j08K70K73n9J9J16p4J84p6j75q3r3N7r8n4j41R2J52L3J8O6J15l8L8K05
2338C86q6l54M7M1q4j18j23j34J25K55r4J4J7K91J55j13q2p0j17L79j91l27j29
2361c12R8J76j32j04kJ52L33j8j91M2L21P3j82k58j38K02R0k66l09Q7J44J00m7
2384a41J63J2J15M5L2n5O5J00j82j55j64J12k16o5J02M6P2j7J31k0K05P0q2m0
2408A33Jk3K6j30j36K2%J13k86OK10J72Pp0j2J41J68Jk85k37K01J40k44k24L5
2433b71R0J51J04k79Q1K56J77j29r0m1k5N5j39j16mP2%n6q6J77R8R5j00Q5l9J34
2459B00N0j54NJ2o8q9j79J65m1J38j61R1qL15j04j53M7Q6Jo9j35j7Q8J9k88j1
$$ plain form
2485 -260 -179 -59 167 149 -39 -47 225 161 78 -172 20 97 128 -44 -202 -194 -132 78 -156 -149 33 98 38 21 60 35
2511 35 267 110 -61 -131 -40 -53 -172 -42 -182 -60 -4 -27 89 115 179 157 -65 -6 106 45 -140 -79 -198 -170
2535 -170 -91 -31 -114 -68 27 130 -29 18 312 221 156 -26 -108 -165 -16 -63 -244 -165 7 98 -167 92 20 121 258
2560 258 143 -40 5 131 28 -79 -276 -207 -70 -81 -255 -230 -40 87 164 29 39 173 114 167 -100 -122 31
2583 31 43 -193 -276 -196 75 -11 -19 -64 121 43 218 57 -70 213 262 19 -125 -124 -39 -111 -79 -301 -105 91 103
2608 103 162 11 226 218 291 97 -176 17 75 -70 -224 -310 -79 40 -215 -64 -44 50 219 228 80 149 213 164
2632 164 -177 -96 15 -8 -67 -279 -258 -29 9 -57 -77 179 246 195 350 115 74 17 92 -108 -204 -96 -1 -50 -103
2657 -103 -161 -35 6 160 154 115 142 308 314 84 5 -57 -47 -186 -202 -268 -168 -70 -202 -99 192 226 127 200 185 69
$$ packed form
2485b60Q1J20K26j8j88qK72o4q3k50J92P7L1j72j58QO2K10k34PJ82O5o0j7L9k5
2511C5K32j57j71p0R1j3j19J30j40J22N6k3J16K6O4k2k22N9J12o1j85O1j19K8
2535a70P9O0q3M6R5J03j59M7K94r1o5j82q2n7J49m7j81P9J72R1k65K59p2J01J37
2560B58j15j83M5J26j03j07j97O9J37j1j74K5J90J27P7j35J0J34n9N3k67k2J53
2583C1J2k36q3Q0K71q6qm5J85p8J75j61j27K83M9k43j44JQ5p2L2k22J96J96J2
2608A03N9j51K15qP3j94k73J93N8j45j54q6K31J19k55J51K0R4J69Rj48O9O4m9
2632A64l41Q1J11k3n9k12K1K29L8o6k0K56O7n1J55k35m1n7P5k00r6J08R5m9n3
2657a03n8J26M1J54ol9K7J66Ok30p9o2J0j39j6o6J00R8j32J03K91L4r9P3j5j16
$$ plain form
2683 69 111 -33 -112 -155 -23 -128 -301 -180 -104 43 50 7 71 257 370 288 147 -51 95 -7 -13 -104 -187 -49 -44
2708 -44 -121 -172 -220 197 213 -2 167 123 293 305 118 -185 -99 -71 -123 -250 -211 -179 -212 -86 -54 -25 74 202 209 189
2734 189 167 278 -94 1 85 -87 -143 -261 -96 -158 59 -89 -131 102 87 247 171 114 23 88 53 -26 -76 -252 -48
2759 -48 -31 -212 -99 -193 34 159 221 115 -11 198 265 191 -40 -64 -7 63 -159 -203 -209 -12 -31 0 69 -60 111
2784 111 129 127 2 96 3 62 91 -108 -155 -30 -70 -36 -117 -104 76 204 145 267 251 103 178 110 3 -76 -148 -92
2810 -92 -76 28 -147 -148 -97 91 148 -55 18 82 143 191 23 -172 -98 -92 27 -147 -23 -191 -70 39 93 79 -2
2835 -2 131 185 77 42 -81 107 -53 -27 -150 -231 -2 165 88 46 14 61 65 221 73 50 28 -73 -94 53 -102
2860 -102 -137 -84 48 32 -103 -76 15 -17 208 125 -118 41 91 26 -210 -51 -42 -146 -45 -281 -101 -125 172 14
$$ packed form
2683F9M2j44p9m3J32j05j73J21P6J47Pm3O4J86J13q2j41j98J46j02or1q3J38N
2708d4p7n1m8M17J6k15J69m4J70J2j87l03Q6K8n2j27L9L2l3J26L2K9R9J28Pk0
2734A89k2J11l72R5Q4j72n6j18J65o2K17j48m2K33j5J60p6n7r1O5l5p9n0j76K04
2759d8J7j81J13r4K27J25O2j06j26K09O7p4k31k4N7P0k22m4oJ97j9L1O9j29J71
2784A11J8kj25R4r3N9K9j99m7J25m0L4q1J3J80J28n9J22j6j48P5o8j07p9p2N6
2810i2J6J04j75jN1J88N7k03P3O4O1M8j68j95P4OJ19j74J24j68J21J09N4j4q1
2835bJ33N4j08l5j23J88j60K6j23q1K29J67p7m2l2M7MJ56j48k3k2j01k1J47j55
2860a02l5N3J32j6j35K7R1l2K25q3k43J59N0o5k36J59Rj04J01k36J80k4K97j58
$$ plain form
2884 14 -3 83 80 133 168 120 67 2 -69 77 -207 -58 -155 -108 43 78 29 43 147 15 18 29 -45 30 -84 -54 -114 -80
2912 -80 -124 -58 -26 35 -84 -77 60 208 284 146 -16 85 0 56 50 -132 -202 33 -191 -125 -23 -26 140 133 190 -9
2938 -9 110 229 263 44 -132 -153 -8 -152 -41 -152 -117 81 -6 -19 -8 124 165 193 126 177 -22 108 -64 -117
2962 -117 -132 -181 -130 -167 -13 60 -146 203 130 143 219 173 52 68 19 49 -20 -48 -88 -105 17 44 -48 -152 129 66
2988 66 11 63 133 51 178 94 -154 -158 -35 13 -72 -221 -145 -185 -27 68 79 -56 225 215 104 118 142 161 -4 91
3014 91 -221 -67 -93 -33 -86 -118 74 8 -43 99 188 142 165 172 68 18 45 -12 -54 -82 -40 -100 -11 -109 0 81 236
3041 236 168 60 95 184 63 83 -47 -97 -118 -95 -256 -145 68 -1 -51 47 46 -21 327 54 -14 -94 17 11 -82 -196
3067 -196 -184 -40 11 -44 -119 77 56 46 37 -39 178 74 17 142 -87 -121 -116 -66 -178 2 -67 -40 -24 115 27 142
$$ packed form
2884A4j7Q6lN3L5m8n3o5p1J46k84J49r7M7J51L5m9J4J04j32LJ1p4P5j14L0o0L4
2912h0m4O6L2O1j19PJ37J48P6j38j62J01q5N6oj82p0K35k24O6J02lJ66pN7j99
2938iJ19J19L4k19j76k1J45j44J11j11L5J98q7j3J1J32M1K8o7N1j99J30j72n3
2962a17j5m9N1l7J54P3k06L49p3J3P6m6j21J6m9L0o9k8m0j7J22K7r2j04K81o3
2988F6n5N2P0q2J27q4k48mJ23M8q5j49P6m0J58R5J1j35K81j0j11J4K4J9j65R5
3014I1l12J54k6O0n3l2J92o6n1J42Q9m6K3Pj04n0K7n7m2k8M2o0Q9r8J09Q1J55
3041B36o8j08L5Q9j21K0j30n0k1K3j61J11K13o9n0R8jo7L48k73o8q0J11or3j14
3067a96J2J44N1n5p5J96k1j0rp6K17j04n7J25k29l4NN0j12J80o9K7J6J39q8J15
$$ plain form
3093 142 105 212 26 82 189 -33 -67 -88 -56 -74 -142 -45 -35 -135 136 17 -107 138 79 198 92 3 23 -14
3117 -14 117 74 -214 -27 94 -12 -9 -58 85 150 123 46 18 -9 18 -141 -175 -160 -48 -6 -223 -135 -130 15 113 -106
3143 -106 39 243 310 -66 18 19 19 7 -58 -294 -62 9 4 -106 -104 -9 16 110 32 -27 165 122 58 14 -189 -97 -151 48
3171 48 -55 -42 -26 10 -89 -67 55 216 177 112 47 -64 -11 146 -74 -27 -60 92 -69 -17 -12 163 10 114 158
3196 158 74 50 135 76 -113 39 -100 -3 59 -117 -5 32 76 -12 73 148 136 110 107 34 95 44 -78 -138 -92 -103 95
3223 95 118 -25 23 -101 24 8 65 51 188 214 -66 -104 -178 -90 -71 -179 -211 -125 -66 -124 -24 10 71 9 31 -53 108
3250 108 209 26 17 -34 17 -111 -9 -75 -88 -110 -49 49 75 35 167 223 93 -79 -67 130 -54 -100 -117 -27 -58 34
3276 34 -158 -127 52 227 48 93 118 99 53 161 -107 -96 -54 -89 -128 -238 -76 -47 77 53 -79 61 153 148 157 0
$$ packed form
3093A42l7J07j86N6J07k22l4k1L2j8o8R7J0j00K71j19j24K45n9J19j06q9K0l7
3117a4J31m3k88J87J21j06Lm9J43O5k7p7k8k7K7j59l4J5J12M2k17Q8NJ45R8k19
3143a06J45K04O7l76Q4J%j2o5k36K32P1nj10KR5K5R4p8n9J92m3o4m4k03R2n4J99
3171D8j03J3J6L6r9K2J22J61l9o5o5j11N3J57k20M7l3J52j61N2NJ75j53J04M4
3196A58q4k4Q5n9j89J52j39R7O2j76J12L7M4q8Q5P5j2k6lp3O1n1j22o0M6j1J98
3223I5K3j43M8j24J25j6N7j4J37K6k80l8p4Q8J9j08l2Q6N9n8J00L4O1o2K2q4J61
3250A08J01j83rn1N1j28J02o6j3k2O1R8K6m0J32N6j30j72J2J97j84m6j7R0l1R2
3276C4j92L1J79J75j79M5K5j9m6J08k68J1M2l5l9j10J62K9J24k4j32J40R2nRj57
$$ plain form
3302 0 9 174 -15 33 -162 -118 10 -11 -81 -175 66 88 -85 86 88 127 72 -16 4 41 -36 -21 -88 21 -72 28 -60
3329 -60 21 -38 37 167 35 109 136 176 78 -14 -111 22 14 -65 -151 -100 -168 130 -4 -134 73 28 181 14 95 40
3355 40 -35 65 -53 -182 -41 -36 -43 -20 -7 -23 33 156 -29 52 154 -13 39 -50 82 -38 -43 20 -229 -112 29
3380 29 -49 -37 101 205 105 214 6 -5 -68 13 27 -153 -10 8 62 -135 -61 -102 14 91 31 45 59 262 -5
3405 -5 -35 69 -47 -6 -199 -3 -246 34 -58 -134 -43 -83 112 50 157 90 -84 -10 131 -67 -30 -46 -79 -154 -144
3430 -144 -72 29 6 91 19 85 92 104 55 33 135 21 -22 -77 6 -45 27 -67 -61 43 109 82 14 142 -44 147 44
3457 44 40 23 -83 19 -125 -83 -162 -59 -78 -48 4 -11 35 132 97 7 42 113 11 -14 -5 -88 -134 -100 -82 2 -158 -85
3485 -85 158 111 114 87 81 77 23 12 145 -47 -115 -106 106 -85 -62 11 39 63 -45 51 -28 186 166 23 -52 -129 53 53
$$ packed form
3302@RJ65j89M8j95M4J28k1p0r4K41K2j73J71KL9n5q8K0L7p7J5o7J09r3J00q8
3329f0Q1n9P5J30j32P4K7M0r8r2r7J33qp9q6N1o8K98j34j30K07m5J53j67Q1n5
3355D0p5J00j18j29J41NpK3J3j6N6J23j85Q1J02j67N2q9J32j20nO3k49J17J41
3380B9p8J2J38J04j00J09k08j1o3Q1J4j80J43J8N4j97P4m1J16P7o0J4J4K03k67
3405el0J04j16M1j93J96k43K80r2p6R1m0J95o2J07o7j74P4J41j98L7j6l3p5J0
3430a44P2J01k3Q5p2O6PJ2m9k2J02j14m3n5Q3n1P2r4OJ04O6k7o8J28j86J91j03
3457D4mj7j06J02j44M2p9J03j9L0N2j5M6R7l5r0L5P1j02k5Rq3m6L4J8Q4j60P3
3485h5K43m7Lk7omn4j1J33j92o8RK12j91K3P3K8K4j08R6p9K14k0j43p5p7J82%
$$ plain form
3513 53 -35 -109 -238 -100 -91 54 -22 106 -10 9 30 65 60 -2 34 53 -6 -177 -65 4 -6 -32 -159 -202 64 45 118
3540 118 150 37 81 98 98 51 28 15 41 36 46 31 9 -55 -9 113 18 13 89 59 13 52 25 43 54 -76 20 -89 -100
3569 -100 7 -44 -89 8 -20 63 31 -38 29 -57 -18 -146 -118 -52 -19 94 -61 17 -88 90 30 32 103 130 -11 96
3595 96 114 -23 15 -8 -60 16 48 16 -145 -34 124 -11 57 57 44 99 104 35 -27 -126 -36 14 123 94 -118 2 76
3622 76 -110 117 -39 48 -21 34 78 -56 32 61 185 -87 -113 -10 -83 -41 -19 -19 101 7 67 158 29 5 97 8
3648 8 -20 47 -32 91 42 50 5 12 -28 -49 93 25 37 101 -1 -30 -1 -9 -57 -35 -3 48 8 -120 49 40 68 6 -24 99
3678 99 75 75 7 22 37 -41 -41 90 -154 -129 59 146 185 120 26 32 53 129 80 -51 21 1 4 -8 -44 -107 -16 -42 -97 -82
3708 -82 -45 -54 66 130 93 23 54 46 87 -112 101 60 -187 -189 14 77 -63 29 48 33 142 117 118 52 48 -2 57 11 -6
$$ packed form
3513E3q8p4j29J38RJ45p6J28j16J9K1L5no2L6J9n9j71J12O9j0k6j27m3K66j9P3
3540A18L2j13M4J7%m7k3j3K6nJ0j5k2o4M6J22r5nP6l0m6L9k7J8J1j30R6j09j1
3569a00J07n1m5R7k8Q3l2o9O7q6L9j28K8O6L3J13j55P8j05J78o0KP1K7j41J07
3595I6J8j37L8k3n2P6L2l2j61J11J58j35O8%j3N5No9o2r9R0N0J09k9k12J20P4
3622G6j86K27j56Q7o9N5M4j34Q8K9J24k72k6J03p3M2K2%J20r4O0R1j29k4R2q9
3648Hk8O7p9J23m9Qm5Pm0k1J42o8J2O4j02k9K9qm8K2L2N1m0j28J69rK8o2l0J23
3678I9k4%o8J5J5p8%J31k44K5J88Q7L9o5r4OK1P6m9j31P2k0Lj2l6o3R1k6n5J5
3708h2L7rJ20O4l7p0L1qM1j99K13m1k47kK03O3j40R2J9j5J09k5Jo6mn0N9m6j7
$$ plain form
3737 -6 3 -45 -94 4 50 93 176 -69 43 189 46 111 37 2 -47 -45 69 -243 81 29 -154 -35 59 123 133 103 45
3764 45 77 -93 61 -108 -103 -65 -102 -167 -61 0 -96 5 -44 25 -106 38 87 55 185 99 60 -62 -58 111 26 -61
3790 -61 52 -70 21 -74 -37 -66 60 -19 62 60 27 -78 14 -46 -41 -87 6 -70 -25 -103 -144 -108 -110 29 53 -50 68 -21
3818 -21 7 20 -46 -48 -1 -182 25 45 19 17 52 -1 -64 27 78 92 -19 160 -56 -8 -136 -12 -2 95 -96 -31 -44
3845 -44 -29 -16 -8 43 43 54 69 82 -7 -37 57 -90 1 -47 -154 -58 23 47 -72 3 -1 116 13 18 81 -10 96 -65 40
3874 40 89 -104 -34 -39 -65 -131 -24 9 -28 139 62 120 31 140 83 -48 -119 -59 -4 -70 -76 -95 -86 -45 12 40 -19 -24 -47 43
3904 43 93 -92 5 -107 -34 0 103 -48 -100 26 -42 -85 -17 159 -51 64 46 133 46 -67 -46 -52 -18 -11 12 42 26
3931 26 48 124 43 -11 16 71 57 -13 -21 -46 -14 -59 -1 -29 -68 17 -109 22 70 131 -6 -105 94 83 -28 19 97 34
$$ packed form
3737fRm8m9R8M6M3Q3k45J12J46j43O5p4l5m9KJ14l12L24n2j83J19R4O4J0l0n8
3764D5L2j70J54j69NL8l7o5J06O1r6J01m9O9j31J44M9l2J30q6l9j22MJ69q5q7
3790f1J13j22R1r5L7k9J26p9Q1kl3j05R2o0Nm6R3p6M5p8m1L6kJ39K4j03J18q9
3818b1K8J3o6kM7j81K07K0k6kL5n3o3R1N1J4j11J79k16M8j28J24J0R7j91O5j3
3845d4J5J3QN1%J1J5J3q9l0R4j47R1m8j07R6Q1K4j19P5mJ17j03NO3r1J06j61J05
3874D0M9j93P0nk6o6J07L3l7J67p7N8q9J09n7j31p1O0N5o6oj9RM1N7K8n9nk3R0
3904D3N0j85R7j12P3L4J03j51n2J26o8m3O8J76k10J15j8Q7q7j13K1oL4PK3L0j6
3931B6K2P6q1n4K7N5j4p0qk5L2m5N8k8l9Q5j26J31M8O1j37r9J99j1j11M7P8o3
$$ plain form
3959 34 -103 -63 48 -53 -40 27 111 -87 67 -22 -24 122 60 122 22 35 -10 56 22 36 -193 -60 -75 -2 90 -107
3985 -107 -50 105 -44 48 -94 66 33 -18 -18 -56 -9 40 43 -80 26 73 -46 50 -31 54 71 8 -15 -92 -1 -2 -130
4012 -130 5 61 32 44 62 66 156 96 35 117 -51 58 20 98 1 -100 70 -7 28 -67 10 -2 66 75 -25 -23 -6 149
4040 149 -64 -95 -69 -30 -37 -112 -117 -15 -84 -6 -23 -39 59 42 70 41 -55 189 -11 124 32 -72 -56 -80 1 -7 71 -47
4068 -47 84 22 80 34 139 4 34 35 121 -31 -31 98 -111 51 -47 -66 -40 -12 40 30 85 -31 20 22 45 -177 84
4095 84 -3 27 -89 -77 43 -98 -17 35 67 65 -86 51 104 -27 84 25 68 101 28 46 -75 37 -27 -33 -70 -135 -122
4122 -122 -75 -38 57 -44 72 -44 -32 35 -40 2 -46 -57 -105 21 -37 -22 -35 -2 -22 234 -8 1 -6 61 -2 2 -80 -42
4150 -42 -24 26 -42 3 -51 -90 39 41 57 73 -3 -12 55 -128 52 7 60 19 -32 20 10 37 57 10 -16 -1 -46 -5 29 33
$$ packed form
3959C4j37M0J11j01J3O7Q4j98J54q9kJ46o2O2j00J3m5O6l4J4k29J33j5P3R2j97
3985a07N7J55j49R2j42J60l3n1%l8M7M9Lj23J06M7j19R6q1Q5J7o3k3p7R1jj28
4012a30J35N6k9J2J8MR0o0o1Q2j68J09l8P8r7j01J70p7L5r5P7j2O8Rj00KJ7J55
4040A49k13l1K6L9pp5nJ02o9P8j7j6R8j7K8k9r6K44k00J35r2j04J6k4Q1qP8j18
4068d7J31o2N8m6J05j35L0JQ6j52%J29k09J62r8j9K6K8N2j0N5j16N1KK3k22K61
4095H4q7L0j16J2J20j41Q1N2L2kj51J37N3j31J11n9M3L3p3J8j21J12o4ol7o5J3
4122a22M7L7R5j01J16j16J2O7p5M2m8j1m8J26n8J5j3L3k0K56k42RpO7o3Mq2L8
4150d2J8N0o8M5n4l9J29KJ6J6p6rO7j83J80m5N3m1n1N2j0K7K0m7k6J5m5M1L4M
$$ plain form
4180 33 -36 -81 -48 -32 -12 -21 74 3 -117 72 87 16 46 -36 -2 -95 -35 -21 28 -39 -52 143 9 -29 -53 10 -34 73
4208 73 100 86 40 -38 2 -2 16 25 54 39 -40 -70 13 18 48 23 142 -26 -73 -28 4 -12 -63 85 68 52 -9 -151 -109 -94
4238 -94 -53 -100 -47 47 -119 95 -7 197 -182 -96 46 -46 108 62 101 -21 158 34 35 -17 -27 -15 -29 11 28 22
4264 22 -25 41 33 31 -157 -35 -22 -15 -21 -54 26 38 26 -5 32 88 61 6 -41 45 -24 -76 -78 -67 -47 -15 -17 26 -56 56 59 98
4296 98 57 -40 21 69 -67 70 -36 142 -29 -7 -35 67 0 -35 -80 -60 32 9 73 -43 -97 -56 -40 -25 48 -14 30
4323 30 85 -49 4 22 -38 -12 48 44 52 6 -13 5 -22 -108 70 57 -117 -91 -24 116 80 51 52 90 -25 -39 -29 78 -16
4352 -16 -81 118 -17 13 -70 -56 15 -30 53 -10 -67 -77 -1 36 7 53 -42 38 40 -142 -7 -151 -11 64 -120 -27 -22 -44
4380 -44 -80 -9 36 -86 50 -24 56 101 -3 18 -10 -79 -89 -88 78 -79 -68 73 -11 47 44 112 201 -15 -27 38 -20 -117
$$ packed form
4180C3o9m5L3J6K0rR5p1j20J89J5p1L0q2L4r3O0J4M9o7j3J95j34l8k4O3m4J07
4208G3K7j4m6p8M0mJ8RK9j5p9l0Q3NL0k5J19j68m7M5L2j6n1J48j7j6o1j42M2J5
4238i4M1m7N3R4j66K14j02K04l79Q6J42r2J54m6L9j22J79j24Jn2j0J2j4M0J7o
4264B2m7O6qkj88J22J3Pol3Q0J2j2l1L7N6k7n5m7Q6o9n2kJ1K0L2kM3q2J12LL9
4296I8m1r7O1M8j36J37j06J78j71K2k8J02o7l5m5K0R2k3O4j16n4M1J6J5P3o2M4
4323C0N5j34N3J8o0K6O0mQm6j9J8k7q6J78j3j74K6O7J40l6k9JL8j15j4J0J07r4
4352a6o5J99j35L0q3J4P1m5Q3o3n7j0P6L7k9M6r5Q0Kj82J35j44J40P5j84R3Nk2
4380d4l6P1M5j22J36p4Q0M5j04K1k8o9j0JJ66j57J1J41q4N8lO8Q9k16j2O5n8r7
$$ plain form
4408 -117 1 -75 -115 2 -1 -56 -26 -66 -24 -24 -133 -177 -36 5 -50 -46 -54 -43 -78 -35 -128 -125 -85 90 3 -44 100 63 -53
4437 -53 50 59 15 75 109 -94 -24 112 -69 -21 145 -33 -1 -64 74 88 56 47 67 9 101 40 -41 48 37 -1 -66 30
4465 30 -52 -31 -19 -20 46 36 -41 28 -58 132 -86 56 -35 92 18 12 48 43 43 48 -63 0 -74 49 45 -109 63 57 -42 23
4495 23 188 3 -1 -76 -31 -38 -40 -87 -36 95 56 6 67 56 -12 -76 -41 -7 -77 -79 -88 -82 -1 40 166 -52 39 45 107 -8 36
4526 36 -77 36 75 138 -9 102 -18 92 -68 -40 74 -77 -12 -97 53 46 30 -61 39 39 78 -47 -42 18 45 -84
4552 -84 -3 4 90 11 -30 -44 13 50 4 104 -24 -13 -5 -52 30 -9 50 78 -136 -66 101 63 120 -13 53 -71 50 -95
4580 -95 -11 32 -27 27 147 -10 42 -11 -42 42 146 32 -42 -2 73 40 -77 -5 39 81 17 -19 36 -51 28 -110 35
4607 35 42 88 109 -168 15 -7 110 -82 21 -11 147 41 15 -35 -34 -19 -61 -12 0 97 -47 25 2 -8 -25 41 66
$$ packed form
4408a17J18p6m0J17ln5L0m0M2%j09m4J41M1n5MqJ1l5M3r3LM0J75q7m7J44l7j16
4437e3J03Rm4O0L4k03P0J36j81M8J66j78L2o3J38J4l2rK0n8R2o1q1Q9j1l8o5R6
4465C0q2K1J2jO6j0p7O9q6J90k18J42r1J27p4oL6n%Nj11O3p4J23mj54J72or9O5
4495B3J65j85mp5M5pkm7N1J31l9n0O1j1o8o4L5L4p0krOQ1M1J26k18R1OO2j15M4
4526C6j13J13L9O3j47J11j20J10j60K8J14j51O5q5J50pj6r1J00%L9j25NO0K7j29
4552h4Q1PQ6p9m1j4N7L7m6J00j28J1Qm7Q2l9N9K8k14P0J67l8N7j33O6j24J21j45
4580i5Q4M3n9N4J20j57N2n3l1Q4J04j14p4M0P5l3j17P2M4M2o4l6N5q7P9j38J45
4607C5PM6K1k77J83k2J17j92J03l2J58j06k6n0JJ5m2M9J2R7j44P2k3j0j7O6K5
$$ plain form
4634 66 20 -38 -9 69 -121 46 14 -91 110 38 -75 -219 -11 -146 47 -67 -35 -70 9 109 -105 17 -79 -27
4658 -27 15 -4 69 66 29 -5 -52 -99 36 -88 25 -40 12 -16 -93 23 18 83 -121 159 82 23 42 35 31 78 -36 -134 -92
4687 -92 -81 101 14 40 95 18 5 70 -24 -38 118 0 -16 -58 -12 70 57 72 -113 23 -62 25 46 -39 -5 77 -5 39
4715 39 49 135 23 82 -2 -6 92 28 -27 56 27 -1 78 32 9 -44 55 -33 59 71 -74 18 57 -94 -1 -14 117 -9
4743 -9 -116 31 24 -4 -74 -48 133 42 -82 42 -130 -52 -44 24 4 -80 -73 -65 13 14 22 30 -15 91 47 -72 27 63 29 7
4773 7 -106 49 142 -61 18 -26 123 -20 71 -59 -81 6 -20 21 -2 -88 -51 -18 -34 0 43 -112 20 53 -106 -17
4799 -17 22 -37 -5 4 -33 -121 47 -33 4 -15 38 -53 -13 46 -35 41 17 -27 -16 99 34 -43 52 104 68 -42 -23 -56 51
4828 51 14 45 21 -40 -122 -63 106 -35 23 -119 -21 -81 -41 12 36 51 21 -46 2 66 14 33 47 -11 -93 16 28 64
$$ packed form
4634F6m6n8K9P8j90J67l2j05K01p2j13j44K08j35J93j14L2l5P9J00k14J22r6N2
4658b7M2j9P3ll7l4m7m7J35j24J13o5N2k8p7J16nO5k04K80p7n9J9pmM7j14r8M2
4687i2J1J82q7K6N5p7j3O5r4j4J56j18j6m2M6Q2j3J5j85J36q5Q7K1q5L4Q2q2M4
4715C9J0Q6j12N9q4mR8o4n5Q3k9k8P9m6k3n3R9q8R2J2j45R2L9j51R3j3J31j26
4743ij07J47pk8p0K6J81r1j24J24j72P8QO8k0q4PQP8JQQm5J06m4j19R9L6l4k2
4773Gj13J55R3k03P9m4J49j43R1j30k2Q7k6M1k3q6L7L3j6L4M3j55J32L3j59Q9
4799a7L9n9L2Rl7q8J68q0L7j9N3r1M0N9q1P6k4m4J1J15o5p7R5N2l6j10J9l3J07
4828E1l7L1k4o1q2N9J69j41N8j42R8o0M0N3K4J5l0o7M8O4n2J9J4n8q2J09J2L6
$$ plain form
4856 64 84 -62 -83 71 -45 72 -48 8 5 -15 -39 -12 86 -42 44 52 -116 -56 -132 -8 54 34 91 -6 -43 16 100
4883 100 5 14 -94 44 -56 -18 29 -2 42 -30 -126 -60 -12 -6 6 -15 17 9 -7 168 -14 -47 14 64 18 98 67 -39
4911 -39 44 -62 35 -50 95 83 33 100 0 55 64 5 51 -3 47 -66 -42 -81 -31 11 32 -49 -14 62 8 51 32 56 7
4940 7 -32 -150 -44 60 -31 -82 -61 38 126 -85 9 -6 -71 44 65 85 87 -9 -83 -106 -7 -50 48 45 75 -32 31 -30 20
4969 20 -63 -52 84 -14 -32 -6 -17 -30 81 9 16 38 180 -27 -51 -4 109 -14 28 -83 10 65 23 24 103 -39 -43 -30
4997 -30 104 -56 3 9 -33 61 105 76 7 -126 104 44 -8 -3 3 -126 -18 25 51 32 55 31 -58 -28 -1 -87 -22 -76 -27
5026 -27 -63 -179 -9 62 55 26 -16 109 -74 15 82 77 -2 -24 74 -132 18 -17 40 93 34 7 -105 53 13 49 31
5053 31 -89 88 -9 35 56 -46 -30 3 -16 -4 -14 -16 -88 79 -63 40 104 -112 29 -3 -23 -66 17 -106 -48 -87
$$ packed form
4856F4K0j46k1J54j16J17j20N6lk0k4K7R8j28Q6Qj68O0p6J24O2k0N7r7l7N9Q4
4883A00r5Rj08J38j00L8M7l1M4p2r6O6M8OJ2k1L2qj6J75j82l3O1N0m6Q0l1j06
4911c9Q3j06R7q5J45j2n0O7j00N5Rn9M6n4N0j13K4l9N0M2K1q1L5P6n4M3j9K4m9
4940Gl9j18J06J04r1n1K1R9Q8k11R4j5o5J15K1K0Kr6p4k3R9m3R8lL0j07O3o1N0
4969B0q3J1J36r8j8K6j1j3J11p2PK2J42k07k4M7J13j23M2j11R3N5m2JP9j42mJ3
4997c0J34j60N9Om2R4M4k9o9j33K30o0n2NOj29J08M3K6j9K3k4q9L0K7q6O5n4M9
5026b7l6j16J70P1pk9m2J25j83Q9O7np9k2R8k06J50l5N7N3n9k7j12J58m0L6j8
5053C1j20J77r7M4K1j02J6L3j9J2j0kp2J67j42J03O4k16J41l2k0m3Q3j23N8l9
$$ plain form
5079 -87 -125 3 -80 -55 -11 -66 -58 30 43 24 -61 42 46 36 124 -16 39 -71 -22 45 23 21 -99 53 147 -6 -115 7
5107 7 45 94 -16 43 20 -11 -97 -18 -36 33 52 19 55 0 -56 -134 -83 -2 30 5 -31 -52 5 -68 59 -40 54 86 -65
5136 -65 -32 -58 55 75 -1 4 -82 20 17 -69 154 -14 76 63 -83 198 46 -59 -13 -41 -51 20 -16 0 -167 -98 -32
5163 -32 -6 18 37 -2 -30 35 -31 19 -26 25 60 39 -37 -107 -53 83 -19 -52 37 -11 -3 -48 8 12 -23 -66 69 141 71 -16
5193 -16 69 7 -104 -79 119 74 -37 29 -83 132 118 -68 103 173 -29 -54 39 -38 -85 -5 74 71 36 95 -62 -117
5219 -117 18 -14 11 -3 35 43 -56 13 -106 -79 -27 10 -39 -5 -25 26 169 105 31 93 43 -63 37 18 -79 -26 -17 -160
5247 -160 57 0 57 -54 -23 11 119 -87 -104 -42 -121 -32 166 -58 14 -18 -46 -25 125 -45 -8 -12 94 26 31 7
5273 7 83 -66 65 29 46 -37 87 83 -19 53 25 35 -9 -27 21 89 -21 21 -54 -85 -106 -59 38 -91 63 148 -30
$$ packed form
5079h7l8J28q3K5M4n5QQ8J3j9q5J03Mj0Q8j40N5j10M9O7k2kj20J52R4j53j09J22
5107GL8M9j10N9k3l1q6P9j8O9J9l3L6n5n6p8N1Q1L2k5l6k1N7p3J27r9R4L2j51
5136f5L3k6J13K0p6Nq6J02lq6K23j68R0j3j46K81j52j05M6k8j0P1l6J6j67O9O6
5163c2K6K4J9l9k8O5o6N0m5N1L5k1p6p0N4J36j02l3Q9m8Qm5N6Ml5m3J35P2p0q7
5193a6Q5o2j11K5J98m5j11O6j12K15j4j86J71P0k02k5R3p7m7Q0P9ll5N9j57n5
5219a17J35l2K5j4L8Qr9O9j19K7N2L7m9L4k0N1J43o4p4O2n0j06J00j9r7N3Rj43
5247a60K17n7N7j11L1L4J08k06j7O2p9Q9J98k24P2l2k8K1J50j70L7mJ06o8Nk4
5273GP6j49J31l6J7q3J24mj02P2k8J0m4j8M8O8j10M2p5l1k1M7R7j29J54Q5j78
$$ plain form
5300 -30 10 34 -92 -67 -70 22 -4 47 -76 -27 6 25 -84 -35 -116 -76 -89 0 -28 6 84 -85 24 141 51 41 -11 168
5328 168 -8 26 -29 -54 -35 176 14 45 60 99 -22 -129 21 -38 86 -48 7 52 50 -126 -18 -14 -33 -31 -45 -65
5354 -65 77 -34 -9 40 -51 -16 -134 -84 15 -101 36 9 -82 0 -17 -23 1 7 17 -6 -115 -43 183 107 -16 102 73
5381 73 45 -97 -46 -45 -120 61 -4 36 125 36 -1 50 61 5 -9 73 -84 -134 -92 33 4 -7 -32 -22 75 -57 92 -120
5409 -120 -62 64 -17 43 10 47 -29 -10 -71 -42 -20 -6 24 -100 -32 19 81 77 43 34 51 16 94 126 -2 57 -30 33 66
5438 66 26 -18 -42 -53 34 -22 -36 16 -22 44 55 110 -21 55 -1 -10 63 23 20 -21 27 46 95 -29 -53 12 116 6 -5
5467 -5 95 -41 -65 53 -19 -49 72 41 71 153 97 -79 104 -82 -43 111 -71 -42 -13 -35 -27 0 -61 -1 19 37 12
5494 12 58 39 18 20 -46 -53 -75 67 -123 -121 2 64 -44 -35 3 -177 31 -139 38 63 -61 38 -8 -9 67 -73 149
$$ packed form
5300c0M0K4j26K5lR2k6N1j23M9L3J9j09M9q1M0j3Q9k8L4P8j69J09J17r0j0n2J79
5328A68j76L4n5k5J9K11j62L1J5L9j21j07J50n9J24j34N5M5kj76J08Mj9Kj4k0
5354f5J42j11K5M9r1L5j18N0R9j16J37k7r1Q2j7oK4OJ0k3j09P2K26p6j23J18k9
5381G3k8j42N1Jp5J81o5M0Q9q9l7N1J1n6j4Q2j57n0M2J25k9j1k5J0R7j32J49k12
5409a20N8J26q1O0l3L7p6J9o1K9K2J4L0j24O8N1O2ml4rJ7l5P8L2j28N9q7O3L3
5438F6m0m4k4j1Q7n6j4N2l8O6J1N5j31P6n6rP3m0lm1M8J9M9j24k4O5J04j10j1
5467eJ00j36k4J18p2l0J21l1L0Q2n6j76J83j86L9J54j82K9K9k2QK7o1O0K0J8k5
5494A2M6j9k1Ko6pk2J42j90KJ23O2j08RL8j80K08j70J77K5j24R9m6jP6j40K22
$$ plain form
5521 149 58 -28 -84 -37 11 -21 91 43 73 54 121 11 101 123 -49 -82 -39 14 -50 -30 40 -7 2 91 13 -74 20 29 52
5550 52 -10 -62 55 21 -100 3 -80 -47 -98 -38 131 -140 -4 -30 174 60 38 23 -22 -21 -110 -42 4 -75 -17 -4 -80
5577 -80 36 -64 66 -1 55 5 -127 12 -5 -11 92 -77 40 -51 1 74 -72 -48 16 -12 1 -74 -31 58 -39 -53
5603 -53 20 -26 -53 -59 65 33 -9 -217 22 20 -71 117 67 88 -27 21 74 120 103 2 6 -50 162 5 -148 -39 60
5630 60 -15 3 11 -52 88 -50 55 37 -45 -10 56 36 -89 85 -22 49 -9 51 -49 106 146 8 51 125 93 143
5656 143 10 -37 24 52 -41 -7 97 118 132 84 -31 9 25 -73 -18 -11 -43 34 55 29 -1 -27 -21 9 1 -107 -17 48 -23
5685 -23 185 114 -11 -36 -77 -36 12 -19 36 -89 -138 -64 -44 30 -46 77 14 -34 64 54 84 -10 1 -90 -29 24 -6 3 0
5714 0 -52 76 -116 -6 36 -15 -8 7 -8 -54 -35 0 -39 -46 43 -105 -102 2 31 -77 -84 33 24 58 -16 40 39 13 -5 -22
$$ packed form
5521A49r1q6n6M7M8l2J12m8L0j9O7j10R0K2j72l3M3N3o4K0P0m7RQ9p8q7R4RK3
5550E2o2n2J17l4j21J03q3L3n1O0J69k71J36k6K04j14k2j5m5Jq9O8M6p9N8J3p6
5577h0J16j00J30o7N6n0j32J39j7oJ03j69J17r1N2P3j46K4O4k8J3p5M3Q9r7j4
5603e3P3m6k7oJ24l2m2k08K39kr1J88n0K1j15M8N3M6j7j01Mn6K12j57j53J09R9
5630F0p5J8Qo3J40j38J05j8q2L5O6k0j25J74j07P1n8O0j00J55M0j38M3P4l2N0
5656A43j33m7O1K8r3L4J04K1J4m8j15M0J6r8N5Pl2P7K1k6l0k6OL0qj08R0O5p1
5685b3K08p1j25k5m1M1M8l1N5j25m9P4K0P4p6J23o3m8R8j0L0r4J1r1O1N3l0Rl
5714@n2J28j92J10M2n1PJ5j5m6J9L5l9pQ9j48LJ04K9j08pJ17rL4p4N6jk6j8j7
$$ plain form
5744 -22 -15 -79 -56 7 -31 2 17 18 -79 2 -37 39 115 37 8 -72 6 27 23 -125 45 -56 -111 -2 -97 16 9 -6 53 -57
5774 -57 -6 -8 -22 -73 22 78 -86 5 6 -47 -2 -44 -19 -68 17 106 44 60 4 -1 13 14 3 -20 16 5 60 -109 10 17 -12
5805 -12 120 64 -134 24 -49 -24 -17 -112 -110 61 -12 -12 41 -138 -67 -23 -32 -67 46 -11 29 -36 -45 58 94 25 -89 -18 -70
5834 -70 -77 -78 11 -73 61 42 -4 41 3 27 -8 -14 43 79 -62 -72 -52 13 -77 -26 -49 1 -8 -83 31 7 99 54 9 -45 8
5865 8 -93 -119 -37 -12 -65 60 -17 -36 -113 -122 -76 81 -20 11 -25 -34 52 -21 21 -28 110 17 72 -85 -12 -10 -68 34 81
5894 81 -29 11 31 -28 11 65 -140 6 25 18 -15 -7 74 -22 66 37 22 -57 83 86 8 23 -23 -65 -27 -22 59 2 -51 63
5924 63 13 -16 -26 -33 114 -15 -68 -54 18 19 -9 -119 -29 -3 -15 -26 52 103 22 10 51 69 -1 70 103 49 89 77 54 -53
5954 -53 14 11 -17 -3 51 1 -19 -60 -71 50 31 30 -33 -125 -7 15 -73 75 -9 -25 44 -92 2 -16 4 -99 -115 139
$$ packed form
5744b2Po4K3O3l8L3J5Jr7Q1l9P6P6p8k9q0P8K1mj48J70j01n5J09r5J13pj5N9j10
5774e7N1kj4n1R5N6j64R1Jn3M5m2K5m9Q5Q9o2J6n6nJ4Jj1k3L6j1N5j69J19Pk9
5805a2J32n6j98J58p3K5Pr5KJ71p3%N3j79P1M4rl5J13n7M0o5rJ03L6o9j14P1n2
5834g0pjQ9q4J34j9m6M5l8K4l5oN7L6j41j0K0O5r0N1k3N0rp5J14k4R2m5m5n4N3
5865Hj01k6Q2K5n3J25p7j9p7rM6J57j01L1l6rQ6p3M2m9J38r3N5j57P3Kn8J02M7
5894H1j10M0K0n9L9N4k05J46J9pl3QQ1r6Q8k9j5p9J40Lp8J5m6m2L8NQ1n7n3J14
5924F3n0k9j0pJ47j29n3J4P2Jk8j10R0K6j2j1P8N1q1j2M1J8p0P1L3n4M0j2k3j07
5954e3O7lk8J4N4n0k0m1j1J21j9jo3r2J18K2q8J48q4j6O9j36R4j8K0j03j6K54
$$ plain form
5982 139 -35 -41 71 -20 32 -28 -88 -1 52 12 85 6 69 103 25 24 78 -1 87 37 -56 44 -44 12 -32 29 -33 11 -36
6011 -36 -16 -41 -86 -3 38 29 -34 27 -55 -41 -68 -37 94 -52 -41 41 51 50 -13 13 -13 -39 -71 -91 17 -1 65 1 -47 31
6041 31 93 76 98 87 67 17 -16 84 28 13 -71 -32 62 11 45 -48 34 -52 -118 -77 28 31 23 -16 -88 -56 37 25 -11 -42
6071 -42 -112 -37 -24 29 37 6 6 -19 60 24 -5 109 39 -130 45 39 10 -76 -71 29 11 -62 87 -3 84 1 6 39 1 58
6101 58 78 68 -64 -56 30 -103 -78 -49 64 8 71 19 113 20 6 -34 170 -11 -1 41 -32 -87 -12 -84 -79 5 11 -92 -31
6130 -31 26 45 -9 10 -47 78 -62 16 -104 40 67 -117 -69 -102 15 18 1 31 55 -140 -15 39 -85 -25 -81 -109
6156 -109 -26 -41 -42 -9 40 4 -63 3 -53 94 52 -77 -104 106 7 82 29 -136 -51 -1 -65 -79 -31 80 -51 96 29
6183 29 28 8 15 21 103 94 -43 12 -7 -50 15 -3 -123 -29 143 -10 106 0 -125 60 -60 25 -27 36 41 -69 -76 -91
$$ packed form
5982A39j74oJ12r1N2o0o0Q7N3m0P3p9O3L4p8jN4p9Q8n0r3J00q8N6m4O1o2M4m7
6011c6K0k5m5Q3M1ro3O1q2J4k7L1J31j46J1Q2J0jo3K6k6k6l2k0J08j8O6o4m8P8
6041C1O2j7K2j1k0n0l3J00n6j5q4L9R4n1L4r3Q2q6o6M1J05Lql9p2L2R3j2l6l1
6071d2p0P5J3N3Ql1%k5P9l6k9J14p0j69J75ok9q6NJ00j8p3J49r0Q7q3NL3l8N7
6101E8K0j0j32QQ6j33K5K9J13n6O3n2R4r3j4m0K04j81J0M2p3n5P5p2NQ4Oj03O1
6130c1N7J9n4J9n7J25j40P8j20J44K7j84M8l3J17Lj7L0K4j95J25N4j24O0n6k8
6156a09Q3j5jL3M9l6o7O6n6J47m2j29k7K10r9P5n3j65Q5N0o4j4M8J11j31J47o7
6183B9jk0POQ2rj37N5j9m3O5j8j20R4J72j53J16j06j25J85j20Q5n2O3Nj10pj5
$$ plain form
6211 -91 -63 43 94 -30 -33 52 -28 7 148 -97 -41 10 10 143 31 60 -17 2 -25 71 102 -64 9 133 -8 -13 209
6238 209 67 52 149 25 -78 -7 75 100 35 -77 57 59 -44 6 85 -3 106 18 -1 209 -117 -146 11 46 -22
6263 -22 -2 -33 -158 100 -47 122 50 24 98 8 -16 -53 40 11 -121 -73 17 172 -3 -31 132 -103 29 49 -45
6288 -45 22 83 98 -10 -61 -87 -127 -29 82 -109 -11 -3 -26 -106 -64 17 12 -40 -73 -1 75 -41 -54 94 -148 57 12 -2
6316 -2 91 87 13 5 85 95 91 1 76 15 -31 127 57 -74 -79 102 -110 -113 6 34 115 -10 8 -97 -42 -57 14 -30 -9 -30
6346 -30 -21 -156 16 -120 3 -122 -6 24 24 -94 -49 -28 89 34 -43 71 21 -43 33 -41 67 59 -41 40 -54 116
6372 116 131 24 -12 22 132 165 -90 -138 -48 -29 -83 106 31 -3 -9 -48 56 -15 26 -96 -30 90 12 45 -102 -49
6398 -49 31 -41 -32 -124 104 -14 -28 105 -41 86 -9 221 13 48 -44 -14 -78 -73 -20 15 121 -32 -19 75 120 -22
$$ packed form
6211i1K8J06N1j24lQ5q0L5J41k45N6N1%J33j12K9p7J9k7R6L1j66P3J24j41nK22
6238B09j42j5R7j24j03P1Q2K5o5j12J34Kj03N0P9q8J09q8j9K10l26k9J57L5o8
6263b2K0l1j25K58j47J69p2k6P4r0k4l7R3k9j32M8R0J55j75k8J63k35J32K0r4
6288d5O7O1J5j08n1k6m0R8J11j91R8Qk3q0M2Q1nn2l3P2P6j16j3J48k42K05m5j4
6316bR3mp4qQ0J0mr0P5o1m6J58p0j31nJ81k12lJ19K8Q1j25J8j05N5j5P1m4K1k1
6346c0Rj35J72j36J23j25J16L0%j18M5K1J17n5p7J14n0o4P6p4J08qj00Q1r4J70
6372A16J5j07l6L4J10L3k55m8R0J9n4J89p5l4ol9J04p1M1j22O6J20p8L3j47N3
6398d9Q0p2Rr2K28j18j4J33j46J27r5K30k08L5r2L0o4NN3L5J06j53J3R4M5j42
$$ plain form
6424 -22 119 63 -91 31 -4 -62 -3 -118 -21 -40 -99 12 65 -69 -127 -47 21 -17 -14 -78 68 57 -79 99 -94 -9
6450 -9 -78 4 19 130 32 -25 38 13 69 13 -7 -59 29 59 -54 -24 -33 -9 31 -94 42 72 -19 -72 60 145 18 -75
$$ packed form
6424b2J41n6j54J22l5n8N9j15R7j9n9J11N3j34n8Q0O8l8Lo4J46j1j36J78j93Q5
6450io9Q2J5J11r8n7O3k5N6n6k0n2Q8L0j13L0rK4M0j25J36L0r1n3J32Q5j27r3
$$ [...]
16383B1
##END NTUPLES=NMR FID
##END=
