##TITLE=abcd
##JCAMPDX= 6.0         $$ Bruker NMR JCAMP-DX V2.0
##DATA TYPE= NMR SPECTRUM
##DATA CLASS= NTUPLES
##ORIGIN= UXNMR, Bruker Analytische Messtechnik GmbH
##OWNER= root
$$ XWIN-NMR		Version 3.5
$$ Fri Aug  8 18:40:37 2025 Russian Standard Time (UT+4h)  servis@DPX200
##.OBSERVE FREQUENCY= 200.131235884673
##.OBSERVE NUCLEUS= ^1H
##.ACQUISITION MODE= SIMULTANEOUS
##.ACQUISITION SCHEME= undefined
##.AVERAGES= 32
##.DIGITISER RES= 18
##SPECTROMETER/DATA SYSTEM= spect
##.PULSE SEQUENCE= zg
##.SOLVENT NAME= CDCl3
##.SHIFT REFERENCE= (INTERNAL, CDCl3, 0, 16.4885)
##AUDIT TRAIL= $$ (NUMBER, WHEN, WHO, WHERE, WHAT)
$$ ##TITLE= Audit trail, XWIN-NMR		Version 3.5
$$ ##JCAMPDX= 5.01
$$ ##ORIGIN= Bruker BioSpin GmbH
$$ ##OWNER= servis
$$ F:\spectra/data/av/nmr/H1/1/pdata/1/auditp.txt
$$ ##AUDIT TRAIL=  $$ (NUMBER, WHEN, WHO, WHERE, WHAT)
(   1,<2025-08-08 18:35:52.85 +0400>,<servis>,<DPX200>,
      <created by zg, POWCHK disabled, PULCHK disabled
       configuration hash MD5:
       00 E9 B6 7A A2 85 ED C7 34 08 36 98 17 FE 4E 26
       data hash MD5: 32K
       54 8F 2A F9 24 5E 93 70 57 D8 FE 7D 19 DA DD 19>)
(   2,<2025-08-08 18:36:59.40 +0400>,<servis>,<DPX200>,
      <Start of raw data processing
       efp BC_mod = 2 LB = 0.05 FT_mod = 6 PKNL = 1 PHC0 = -274.4391 PHC1 = 4.101552 SI = 16K 
       data hash MD5: 16K
       7B 41 B2 58 D1 46 61 43 35 78 6A 50 DB AF 1A 84>)
(   3,<2025-08-08 18:37:12.68 +0400>,<servis>,<DPX200>,
      <pk PHC0 = -1.4 PHC1 = 0 
       data hash MD5: 16K
       FE 7F A0 02 54 A0 D2 E7 A7 9D 20 81 63 54 6B 0A>)
(   4,<2025-08-08 18:37:18.09 +0400>,<servis>,<DPX200>,
      <abs ABSG = 5 
       data hash MD5: 16K
       A5 99 16 61 F0 C2 F1 BD E6 CB BD 53 CB 27 73 82>)
(   5,<2025-08-08 18:38:18.84 +0400>,<servis>,<DPX200>,
      <pk PHC0 = 3.356856 PHC1 = -3.000002 
       data hash MD5: 16K
       EA F4 B1 F7 E2 DE 53 F5 99 D6 41 E9 8D 9E 8E EC>)
(   6,<2025-08-08 18:38:22.12 +0400>,<servis>,<DPX200>,
      <abs ABSG = 5 
       data hash MD5: 16K
       89 B0 4D 11 7E 4B F5 A8 5E A2 45 D2 FF C7 AE 5C>)
(   7,<2025-08-08 18:38:40.87 +0400>,<servis>,<DPX200>,
      <pk PHC0 = 3.130957 PHC1 = -4.8 
       data hash MD5: 16K
       9E 40 C8 B0 56 D2 DD 8D 3A 59 FC 2C B6 39 FB F3>)
$$ ##END=
$$ 
$$ hash MD5
$$ 8D D9 4D 02 0E C3 5C 62 0C 45 4B 65 D4 33 75 59
##$RELAX= 
##$RELAX= 
##$RELAX= 
##$RELAX= 
##$RELAX= 
##$RELAX= 
##$RELAX= 
##$RELAX= 
$$ Bruker specific parameters
$$ --------------------------
##$DU= <F:\spectra>
##$EXPNO= 1
##$NAME= <H1>
##$PROCNO= 1
##$TYPE= <nmr>
##$USER= <av>
##$AMP= (0..31)
100 100 100 100 100 100 100 100 100 100 100 100 100 100 100 100 100 100 
100 100 100 100 100 100 100 100 100 100 100 100 100 100 
##$AQSEQ= 0
##$AQ_mod= 1
##$AUNM= <au_zg>
##$AUTOPOS= <>
##$BF1= 200.13
##$BF2= 200.13
##$BF3= 200.13
##$BF4= 200.13
##$BF5= 500.13
##$BF6= 500.13
##$BF7= 500.13
##$BF8= 500.13
##$BYTORDA= 1
##$CFDGTYP= 0
##$CFRGTYP= 5
##$CHEMSTR= <none>
##$CNST= (0..31)
$$ [...]
##$SUBNAM5= <"">
##$SUBNAM6= <"">
##$SUBNAM7= <"">
##$SUBNAM8= <"">
##$SUBNAM9= <"">
##$SW= 20.6817932712277
##$SWIBOX= (0..15)
0 0 3 0 0 0 0 0 0 0 0 0 0 0 0 0 
##$SW_h= 4139.07284768212
##$TD= 32768
##$TD0= 1
##$TE= 0
##$TE2= 300
##$TE3= 300
##$TEG= 300
##$TL= (0..7)
0 120 120 120 120 120 120 120 
##$TP= (0..7)
150 150 150 150 150 150 150 150 
##$TP07= 0
##$TPNAME0= <>
##$TPNAME1= <>
##$TPNAME2= <>
##$TPNAME3= <>
##$TPNAME4= <>
##$TPNAME5= <>
##$TPNAME6= <>
##$TPNAME7= <>
##$TPOAL= (0..7)
0.5 0.5 0.5 0.5 0.5 0.5 0.5 0.5 
##$TPOFFS= (0..7)
0 0 0 0 0 0 0 0 
##$TUNHIN= 0
##$TUNHOUT= 0
##$TUNXOUT= 0
##$USERA1= <user>
##$USERA2= <user>
##$USERA3= <user>
##$USERA4= <user>
##$USERA5= <user>
##$V9= 5
##$VALIST= <valist>
##$VCLIST= <CCCCCCCCCCCCCCC>
##$VD= 0
##$VDLIST= <DDDDDDDDDDDDDDD>
##$VPLIST= <PPPPPPPPPPPPPPP>
##$VTLIST= <TTTTTTTTTTTTTTT>
##$WBST= 1024
##$WBSW= 30
##$XGAIN= (0..3)
0 0 0 0 
##$XL= 0
##$YL= 0
##$YMAX_a= 739384
##$YMIN_a= -699412
##$ZGOPTNS= <>
##$ZL1= 120
##$ZL2= 120
##$ZL3= 120
##$ZL4= 120
##$ABSF1= 16.48848
##$ABSF2= -4.193441
##$ABSG= 5
##$ABSL= 3
##$ALPHA= 0
##$AQORDER= 0
##$ASSFAC= 0
##$ASSFACI= 0
##$ASSFACX= 0
##$ASSWID= 0
##$AUNMP= <proc_1d>
##$AZFE= 0.1
##$AZFW= 0.1
##$BCFW= 0
##$BC_mod= 2
##$BYTORDP= 0
##$COROFFS= 0
##$CY= 18.4799938201904
##$DATMOD= 1
##$DC= 0
##$DFILT= <>
##$DTYPP= 0
##$F1P= 9.9274215381318
##$F2P= -0.165520771350173
##$FCOR= 1
##$FTSIZE= 16384
##$FT_mod= 6
##$GAMMA= 0
##$GB= 0
##$INTBC= 1
##$INTSCL= 4.127829e-11
##$ISEN= 128
##$LB= 0.05
##$LEV0= 0
##$LPBIN= 0
##$MAXI= 10000
##$MC2= 0
##$MEAN= 0
##$ME_mod= 0
##$MI= 50
##$NCOEF= 0
##$NC_proc= -6
##$NLEV= 6
##$NOISF1= 3.799351
##$NOISF2= 2.8
##$NSP= 0
##$NTH_PI= 0
##$NZP= 0
##$OFFSET= 16.48848
##$PC= 4
##$PHC0= -269.3513
##$PHC1= -3.69845
##$PH_mod= 1
##$PKNL= yes
##$PPARMOD= 0
##$PSCAL= 4
##$PSIGN= 0
##$REVERSE= no
##$SF= 200.130005582386
##$SI= 16384
##$SIGF1= 3
##$SIGF2= 2
##$SINO= 400
##$SIOLD= 16384
##$SREGLST= <1H.CDCl3>
##$SSB= 0
##$STSI= 16384
##$STSR= 0
##$SW_p= 4139.07284768211
##$SYMM= 0
##$S_DEV= 0
##$TDeff= 32768
##$TDoff= 0
##$TI= <>
##$TILT= no
##$TM1= 0
##$TM2= 0
##$TOPLEV= 0
##$USERP1= <user>
##$USERP2= <user>
##$USERP3= <user>
##$USERP4= <user>
##$USERP5= <user>
##$WDW= 1
##$XDIM= 16384
##$YMAX_p= 327364586
##$YMIN_p= -832899
$$ End of Bruker specific parameters
$$ ---------------------------------
##NTUPLES= NMR SPECTRUM
##VAR_NAME=  FREQUENCY,     SPECTRUM/REAL,   SPECTRUM/IMAG
##SYMBOL=    X,             R,               I
##VAR_TYPE=  INDEPENDENT,   DEPENDENT,       DEPENDENT
##VAR_FORM=  AFFN,          ASDF,            ASDF
##VAR_DIM=   16384,         16384,           16384
##UNITS=     HZ,            ARBITRARY UNITS, ARBITRARY UNITS
##FACTOR=    0.252644378177508, 1,           1
##FIRST=     3299.83951724647, 0,            0
##LAST=      -839.233330435636, 0,           0
##MIN=       -839.233330435636, -832899,     0
##MAX=       3299.83951724647, 327364586,    0
$$ Real data points
##PAGE= N=1
##DATA TABLE= (X++(R..R)), XYDATA
$$ [...]
7611f1362M7071j89756k7693k795J30645O7384j42396J01139k42813j698N4807
7600b67467J29368N4249Q1760q8740J14937q7319o0662K3028J6712M0304m7822
7589i1652L6863J7985m1083j01894L73024j57498j02524K9705l7954P2223M9934
7578D7129l5633j46071Q1412J14415j69543m7885J07401P29O2932m5398o5902
7567i6414J982q4758J03041n2970k3038j47902K39735J06905j19294M9173O2712
7556C9172l30244J58360P6765n5814J60047j20563K44720j40343j1518j38829
7546a18247k7211K0256l8292R4186N8301N9866j66165K4170j79070K60381p8845
7535i0670N8950j30606M8541j08255J61705k7059R357J6174P4108L0613m7356
$$ y = [-61362, -14291, -204047, -231740, -234535, -103890, -36506, -178902, -77763, -320576, -322274, -267467, -138099, -83850, -2090, -90830, 24107, -63212, -123874, -100846, -84134, -43830, -91652, -54789, -36804, -77887, -179781, 193243, 35745, -66779, -37074, -75028, -2805, 47129, 11496, -134575, -53163, 61252, -108291, -156176, -48775, -48046, 14886, -30512, -96414, -94432, -179190, -76149, -129119, -152157, -300059, -60324, 46581, -72713, -23540, 39172, -291072, -132712, -55947, -111761, 48286, -72277, 172443, 32100, 20582, -118247, -145458, -125202, -163494, -69308, -11007, 48859, -117306, -93136, -272206, -11825, -90670, -31720, -162326, -113785, -222040, -60335, -87394, -78037, -61863, 12245, 42858, -4498]
7524d498k41060L30595n7790j52191N6417K4996N7463k3354j73328Q726J25596
7513d8428R8567j04381j71925J97862R2283j70986J20389j66754O9552J6357r8503
7502a65967O7734k6522j26073J86516j32182j19082M8578J15549J55908k10448
7492b05989J24569j62542K52440j87897K0183r7171Q7304n8931L07348j67944
7482h8630j30786l694k0493Q0193N1871L3259j47058L2365J03799O0605j33310
7471a61879J65670j78850o990q3894J22520k8608q7559P4958O7768p6116j9421
7460b12401K71826k01249k40715K78221p0546l463k3808O7793j79466K1331K83277
7449i200j40527j20002N4254L286J88605j90657O4549n0273m4156r8072j9231
$$ y = [-4498, -245558, 85037, 27247, -124944, -68527, -43531, 13932, -9422, -182750, -174024, -48428, 50139, -54242, -226167, -28305, 63978, -107008, 13381, -153373, -83821, -67464, -165967, -98233, -124755, -250828, -64312, -196494, -315576, -266998, -151449, 4459, -205989, -81420, -243962, 8478, -179419, -159236, -256407, -169103, -228034, 79314, -88630, -219416, -223110, -243603, -163410, -111539, -78280, -225338, -192973, -89174, -28569, -161879, 3791, -175059, -182049, -265943, -143423, -172031, -259590, -184632, -116864, -192980, -212401, 59425, -141824, -382539, -104318, -174864, -178327, -202135, -134342, -313808, -292477, -9200, -149727, -269729, -215475, -212189, -23584, -214241, -149692, -199965, -244121, -342193, -361424]
7438c61424P8966K80799j05943j38237l5558j1857J18998N9826p2139J47624q5351
7427a24296j17463J5244J32871O1064K345j67655j18927J97831L5869k60693L04913
7416c8897n243k13282K52920j38162K06891k37797L7026M733K207J76367M0354
7405H7117j95310Q7373o5111o6980K4201l6477l1979L086j18259K55429k4448
7394h1358q6087j06042J03464r6433J08212J15762k84581J74745l720k6281k02314
7383c84633J85668n1128J17058J92485r3256j71793N8769K794J12853j45890P9733
7372i7340j36914n034O0476j37789J44594L5433j0352N8819J19277j34180q1104
7361a84114J10489o3479l9964j65179K14874r3051j1529K05048j35800R2309j64784
$$ y = [-361424, -282458, -1659, -107602, -245839, -281397, -293254, -174256, -114430, -186569, -38945, -124296, -241759, -226515, -93644, -32580, -30235, -197890, -316817, -118986, -83117, -343810, -38897, -44140, -257422, -4502, -142664, 64227, -173570, -136544, -131811, -129604, 46763, 87117, -108193, -20820, -85931, -152911, -128710, -165187, -197166, -194080, -312339, -56910, -81358, -167445, -273487, -170023, -266456, -158244, -42482, -327063, -152318, -156038, -182319, -384633, -198965, -250093, -133035, 59450, -33806, -205599, -146830, -144036, -31183, -177073, -97340, -234254, -239288, -178812, -316601, -172007, -136574, -146926, -88107, 31170, -103010, -184114, -73625, -137104, -177068, -342247, -127373, -220424, -231953, -26905, -162705, -70396, -235180]
7350b35180q8444J41525m5438j25571K62804l6235J44760j71590r0049K79643
7340C6225k13408M883l5969O9112j6532m531J9249O6594q5568J17590l50135J08932
7328b83558J16546j05166j7789J12803J51662j69393J92663k39728m8415j4925
7318c05300L21521J589k08543J62460j58749p222j89663L45321k53155J29167
7308a62574N5193J5142m1199J41872j34998M9942q1278K0980N129o0149j77661
7297c69601J03026J02487O2765j63020L4779J06763p0114o8913J65126m7677K4835
7286a19544p4678j01654J60800L603M2709p3535p1579N4814m2415n3050M1280
7275b33249l0608J30743J0387r1285m529K4443J57965j52612J1787k14887K62754
$$ y = [-235180, -323624, -182099, -227537, -353108, -90304, -126539, 18221, -153369, -243418, 36225, -177183, -172300, -208269, -139157, -155689, -160220, -140971, -74377, -159945, -42355, -392490, -283558, -167012, -272178, -289967, -177164, -25502, -194895, -2232, -241960, -290375, -305300, 16221, 17810, -190733, -28273, -187022, -194244, -383907, -38586, -291741, -162574, -107381, -92239, -133438, 8434, -126564, -76622, -157900, -136920, -131791, -191940, -369601, -266575, -164088, -101323, -264343, -229564, -122801, -192915, -261828, -96702, -144379, -119544, -194222, -295876, -135076, -131473, -88764, -162299, -233878, -179064, -221479, -274529, -233249, -263857, -133114, -122727, -214012, -218541, -194098, -36133, -188745, -176958, -391845, -129091]
7264a29091j08427J8616J76014j50159K6901j01172m6963M1046P0295K3612L1883
7253a47445k7480j68697J35740L5072o8315K09852m7943n6360k6984k4162n3621
7242b40343L3142J96739k64394J81690j58989J31128m2757j12834M7526K29012
7232h0l12573K38743k15130J15372J22662k22004J02559R54O1874J50490j79372
7221a36505k5370k6457k5213r3194K30595j20949K6904m526j87261L14844j89141
7210b36273O8758Q3522j78292M9888L8138j3667Q800N3841K93192m26325J02126
7199a56292r648K7423j2138Q2722p1034K816q7114J70415j23597M2243O0300j07840
7187a81744n9624J37514j3730j23232M0634O4483M7306l5539J69801j72197l1001
$$ y = [-129091, -237518, -218902, -42888, -193047, -166146, -267318, -314281, -273235, -202940, -179328, -147445, -174925, -343622, -207882, -172810, -241125, -31273, -79216, -135576, -162560, -186722, -240343, -207201, -10462, -274856, -93166, -252155, -121027, -163784, -276618, -229092, -80, -312653, -73910, -289040, -173668, -51006, -273010, -170451, -169497, -107623, 42867, -136505, -161875, -188332, -213545, -306739, -76144, -197093, -170189, -174715, -361976, -47132, -236273, -167515, -83993, -262285, -212397, -174259, -187926, -179126, -125285, 167907, -258418, -156292, -165940, -138517, -150655, -67933, -138967, -136151, -223265, -52850, -176447, -134204, -73904, -181744, -241368, -103854, -117584, -240816, -200182, -135699, -88393, -123932, 45869, -126328, -157329]
7176a57329N8718J01255p9229M1636j50363J10545N44J04858j16718o0335R6716
7165d9702j31939O3537k3015J39565k13995Q0962l61P8617J4623j63032J2465
7154a92275J95555j44661M7278R9356j34243j6537K7903r5461O3383P9205P7791
7143G294j25600k3181L6735j51138K71487l57921K47438r257o5897j32562R214
7132b93388J57026k082O5525n1523o7596J36337k8758j36018P031M8479Q336l3130
7120a89761k3556L6673K03496j90863l0414n066J30197q839j37193K27140r9577
7109h7763m831M6638o8500J49188j48045o2601k75737L13975K02001k12711J20408
7098b7978p3265j3338j62179M29320l02409O1808j88185J71144L77O2558j32552
$$ y = [-157329, -98611, 2644, -76585, -34949, -185312, -74767, -74223, 30635, -86083, -146418, -49702, -181641, -118104, -141119, -1554, -215549, -134587, -134948, -56331, -41708, -204740, -192275, 3280, -141381, -94103, 5253, -128990, -145527, -117624, -213085, -149702, -70497, 7294, -118306, -141487, -104752, -255890, 15597, -342324, -94886, -104143, -170040, -302602, -293388, -136362, -138444, -72919, -124442, -192038, -55701, -84459, -220477, -213446, -164967, -156631, -189761, -213317, -176644, 26852, -164011, -194425, -199491, -69294, -78133, -215326, 11814, -87763, -92594, -45956, -114456, 34732, -113313, -175914, -451651, -137676, 64325, -148386, -27978, -101243, -114581, -276760, 152560, -149849, -88041, -276226, -105082, -104705, -42147, -174699]
7087a74699n2339J44402p6934K53556k14985J82774k12740J7601J01942p855l8268
7076g7545L5473j49526J48000k68376K91171j75708Q7730J06923l0071J77226
7066A45297k37841J13726m7931j23896L3818K23719j00454q5406J9110J20528
7056F0670r1488j1663j662l3238k5229P1573J95389j53771j55994K33678j31157
7045d2892r8726K21759j57026J36417k6323P1570j76342J04778J94528m39336
7035b11593J23727K53088k24693J07448j97277K66255k8152J03709l03797K38105
7025A26820k99613J99261J8991N6243k40165K26149p3711o6219O6395k93005J69720
7014a09134O7176J58349o4053Q2994j13384p0733J33567r1588K14085k87321P0198
$$ y = [-174699, -227038, -82636, -159570, 93986, -120999, 61775, -150965, -133364, -31422, -39277, -77545, -42072, -191598, -43598, -311974, -20803, -196511, -108781, -1858, -31929, 145297, -92544, 21182, -26749, -150645, -116827, 106892, 6438, -78968, -59858, 60670, -30818, -42481, -44143, -77381, -102610, -31037, 164352, 10581, -145413, 88265, -42892, -141618, 80141, -76885, 59532, 33209, 104779, -71563, 33215, 227743, -211593, -87866, 165222, -59471, 47977, -149300, 116955, 88803, 192512, -111285, 126820, -172793, 26468, 45459, 101702, -138463, 87686, 13975, -52244, 14151, -278854, -109134, -41958, 116391, 52338, 135332, 21948, -48785, 84782, -6806, 207279, -80042, -9844]
7003i844Q66M4108j00347J30361j52628m2174J53823q7795J11571P5059m3971
6992G9029M4043j91011J16611j47001J54070O7049q9099P7191m2049P1974p9829
6981F0978J42694k48019J05715r7664J19630K6525k19599K15697J27327j28916
6971A04368j59485K31454j24501m5230J28662r1436N2807P3183J09931j01176
6961A78577J9726n802j61941R6058p4176J33605Q5769j06025j28006O6540j75443
6950g1118L87560k66199N9586k8226j02864J33525K6529O0258k27358M24647l02491
6939I3849m2150j7311J3272P3321q1733n8988J53571j51223L95122j05602j26174
6928A45954L1468j6181n7090Q5404p9666M8075m7272q0332J34364j67946N7911
$$ y = [-9844, -8978, 35130, -65217, 65144, -87484, -129658, 24165, -63630, 47941, 123000, 79029, 123072, -67939, 48672, -98329, 55741, 122790, 33691, 110882, 68833, 140807, 60978, 203672, -44347, 61368, -36296, 83334, 109859, -109740, 105957, 233284, 104368, -55117, 176337, 51836, 6606, 135268, 43832, 96639, 169822, 279753, 178577, 198303, 192501, 30560, 126618, 52442, 186047, 271816, 165791, 37785, 104325, -71118, 316442, 50243, 109829, 81603, -21261, 112264, 138793, 199051, -28307, 396340, 93849, 51699, 34388, 47660, 120981, 39248, -19740, 133831, -17392, 377730, 272128, 145954, 177422, 161241, 104151, 189555, 109889, 157964, 110692, 30360, 164724, -3222, 54689]
6917E4689o3552J19109N7433r1656J40031k5916m9199n5417J35318j32082P0755
6906A59513r9556r3493J86197l1918M526P0467J7138j50322K09451N9495j17585
6895B13913r5835M967q046P1591n8729N9028q3523J77132p0285n5080K5394Q5467
6883B65994k69292K5406J46556m1527p8463J17171o7179q6401N5723J06897m0331
6872A34554R4024M5300k6262j03508k8832J14950Q2027j04461O7776j85224R2155
6861A82499N0903m6140N5217o2233N0901o3707K3468j41554K91616k51758J74774
6850B63986J00386k65414L20075k28160j26778K17938J08588j07405R2282k14626
6840A60872R6815j78197L00352j79136l1665O2051n9288J65647L1302J53139j57372
$$ y = [54689, -8863, 110246, 167679, 76023, 216054, 190138, 140939, 85522, 220840, 88758, 159513, 59957, -33536, 152661, 120743, 125269, 195736, 212874, 62552, 272003, 331498, 213913, 118078, 123045, 114999, 186590, 127861, 186889, 103366, 280498, 210213, 155133, 180527, 265994, -3298, 22108, 168664, 127137, 48674, 165845, 98666, 12265, 67988, 174885, 134554, 228578, 273878, 247616, 144108, 115276, 230226, 312253, 207792, 275568, 90344, 182499, 233402, 187262, 242479, 180246, 231147, 167440, 190908, 49354, 340970, 89212, 263986, 364372, 98958, 419033, 190873, 64095, 282033, 390621, 283216, 375498, 160872, 257687, 79490, 379842, 200706, 169041, 231092, 171804, 337451, 368753, 521892, 364520]
6829C64520j8636k20132J07740L3196n8560q5087J69318j525J33740j96745P6346
6818C04175k133o4107r6430L31382k49305K01318k44865K28470j76348K01475
6808D33632J67k21287P6081J7412m478J57329o1229l451L1538j9001J9142Q1326
6796E07181o6565j11134J80622k17922J86771O0469k13668m9869K21447l29762
6786A67570K56047O5951q4240p1629N6325P6235m1508P3286k40886J53941j27125
6775B83967J64479O6605J30048j43171K5000j18447j40421J53205J19336j6130
6765E24471k04916R6937L11853j96311q5921j5021l3886J71211m3828l7558J74206
6754F61237j54430P3172P96M2575j75654J0123J23504j73494J93360n62K1291
$$ y = [364520, 345884, 125752, 233492, 266688, 208128, 123041, 292359, 290834, 424574, 227829, 304175, 302042, 237935, 141505, 472887, 223582, 424900, 180035, 408505, 232157, 433632, 433799, 212512, 288593, 306005, 301527, 458856, 397627, 394176, 425714, 406713, 425855, 507181, 440616, 329482, 510104, 292182, 478953, 539422, 325754, 275885, 497332, 167570, 423617, 489568, 405328, 333699, 390024, 466259, 424751, 498037, 257151, 411092, 283967, 448446, 515051, 645099, 501928, 526928, 408481, 268060, 421265, 540601, 524471, 319555, 416492, 728345, 532034, 446113, 431092, 397206, 568417, 524589, 487031, 661237, 506807, 579979, 580775, 623350, 447696, 457819, 581323, 407829, 601189, 600627, 621918]
6743F21918j8311j93772K36202q8684p5026m3652K05766o7831J64065j11864L2013
6732F60824N9903Q2097o6539Q5941j00330J32510j73616N6616n8924O0121o4821
6721F73782K40844j51113J48338j06268p1038J94250Q531j62688L332J17626O4417
6710I60013J66801k14908o7644j07037J38725L7784P4633j02825J29550K5760
6700A040852k15117O8467K0507J00144l3694n9131J05450o0139n1066J2627P1040
6689I99940J36605k89180J15433K97154j30204M0542J3331n8834m5865Q774j3833
6678A073863J1808J50967n8870M3470j17602J70133k3872n2267j2661L19683r0231
6667A414421J8293l07285Q7712K16653j58915Q2279R166Q761L4359j5329j7690
$$ y = [621918, 603607, 409835, 646037, 557353, 482327, 438675, 644441, 576610, 740675, 628811, 660824, 720727, 802824, 736285, 822226, 721896, 854406, 680790, 737406, 678482, 738603, 673782, 914626, 763513, 911851, 805583, 734545, 928795, 937326, 774638, 777970, 895596, 960013, 1126814, 911906, 844262, 737225, 875950, 913734, 988367, 885542, 1015092, 1040852, 825735, 894202, 914709, 1014853, 981159, 922028, 1027478, 967339, 916273, 928900, 999940, 1136545, 847365, 962798, 1259952, 1129748, 1170290, 1183621, 1124787, 1078922, 1087696, 1073863, 1085671, 1236638, 1177768, 1221238, 1103636, 1273769, 1249897, 1197630, 1184969, 1504652, 1414421, 1432714, 1125429, 1213141, 1429794, 1270879, 1353158, 1362324, 1371085, 1405444, 1390115, 1372425]
6656A372425J50752j27786r442K5950Q1069J24797j39660P5868L5970P3363k05086
6645A458220J05230l45J12862j02384R1503j09707J00336P3685j82040L07476
6635A854836m1393j40166M4308J20241K17955r6485o0885j35810J01281K23374
6625B087256j32694Q4483j7785R6030Q7184k55717L84139k71802J34260j01094
6615B094260J79069o0491J45712j29973l5188K02871j25708Q5984P7595L776j1095
6604B426812o4329R6465K89442j41286j19315J15522J36529o512k0217Q2177j2959
6593B782329R0276m8411K33220M2848J2205r3807L7741O1955J32154j45815N6333
6582C161028L12421P8884k70507K00553K7517N4760K5084K4922J63847J8037p686
$$ y = [1372425, 1523177, 1395391, 1385949, 1411899, 1492968, 1617765, 1478105, 1553973, 1589943, 1663306, 1458220, 1563450, 1563105, 1675967, 1573583, 1665086, 1555379, 1655715, 1729400, 1547360, 1854836, 1813443, 1673277, 1717585, 1837826, 2055781, 1959296, 1898411, 1762601, 1863882, 2087256, 1954562, 2039045, 2021260, 2117290, 2204474, 1948757, 2332896, 2061094, 2195354, 2094260, 2273329, 2212838, 2358550, 2228577, 2193389, 2396260, 2270552, 2356536, 2434131, 2437907, 2426812, 2362483, 2458948, 2748390, 2607104, 2487789, 2603311, 2739840, 2733328, 2713111, 2795288, 2782329, 2872605, 2824194, 3057414, 3100262, 3112467, 3018660, 3056401, 3118356, 3250510, 3104695, 3161028, 3473449, 3552333, 3281826, 3482379, 3509896, 3564656, 3589740, 3614662, 3778509, 3796546, 3788860]
6571C788860K21388L7913r4209L2994K39934j49597J69969J83144m6416J59869
6561D543849J09536K5246r062J51312r8323J29426K28559p4477J71458o0986J26328
6550E242866J12878M1789P1820K66307j0665J64883j78626L11271J27228O2158
6540F211909M79549l76449K73196O5064J75759Q3862j931K24095J26014Q0800
6530G341868J65547J51445p7482J50380J32424K64176j27574J46854Q9921J30356
6520H367915L02136K72148k59118J78603J75526j44178L48713j1193J19885J84267
6510I534704q3517L34386L7755K2525J02130J93933J15710l9322K40303o8558
6500A0390049Q0970K26960n7501J8967O0348R5310M9643J92737n7700J32611p2801
$$ y = [3788860, 4010248, 4048161, 3953952, 3986946, 4226880, 4077283, 4247252, 4430396, 4383980, 4543849, 4653385, 4678631, 4669569, 4820881, 4722558, 4851984, 5080543, 5006066, 5177524, 5116538, 5242866, 5355744, 5397533, 5469353, 5735660, 5724995, 5889878, 5711252, 6022523, 6149751, 6211909, 6691458, 6315009, 6588205, 6653269, 6829028, 6912890, 6910959, 7135054, 7261068, 7341868, 7507415, 7658860, 7581378, 7731758, 7864182, 8128358, 8000784, 8147638, 8237559, 8367915, 8670051, 8942199, 8683081, 8861684, 9037210, 8893032, 9241745, 9230552, 9350437, 9534704, 9451187, 9785573, 9823328, 9845853, 9947983, 10141916, 10257626, 10218304, 10458607, 10390049, 10471019, 10697979, 10640478, 10659445, 10719793, 10815103, 10864746, 11057483, 10999783, 11132394, 11059593]
6489A1059593J72362l4469Q3274j31716L3260r9833J5304K19095j04689m0458
6479A1171723P9212j24348J05273r8448N127j30530J16036n6063K9728l16340
6469A0781370K40163L5913j18101j9969k11134j6206P3212m8516o1744k7533j96063
6458A0431392J7907O2069j60752j79755j06870K1144K8677r1293O5247k7340l42194
6447I718232J54306q1717k6367j21589k155k02618j75553O1800j83397L7927l06065
6436H872804J1762J19431p8658l93304L04480j56338j36967k35388J15646K1345
6426H444813j38451k10645J2833q0102J37171k26389j38251q6801m7718j05937
6416G560523q2713j90571J26467L1629p330k03482j34498J64144m03190o5253
$$ y = [11059593, 11231955, 11197486, 11280760, 11149044, 11182304, 11082471, 11097775, 11316870, 11212181, 11171723, 11250935, 11126587, 11231860, 11133412, 11138539, 11008009, 11124045, 11067982, 11097710, 10781370, 11021533, 11057446, 10939345, 10919376, 10708242, 10692036, 10765248, 10716732, 10654988, 10627455, 10431392, 10449299, 10511368, 10350616, 10170861, 10063991, 10085135, 10113812, 10022519, 10087766, 10060426, 9718232, 9872538, 9790821, 9764454, 9642865, 9640710, 9438092, 9262539, 9324339, 9140942, 9178869, 8872804, 8884566, 9003997, 8925339, 8532035, 8836515, 8680177, 8543210, 8307822, 8423468, 8444813, 8306362, 8095717, 8108550, 8028448, 8165619, 7939230, 7800979, 7714178, 7666460, 7560523, 7477810, 7287239, 7413706, 7445335, 7438005, 7234523, 7100025, 7264169, 6860979, 6795726]
6406F795726K3961j33848L7350j69920o944J18636l02853R2406q4922r823p5755
6395F284014k3655k49414J45091k96740J16974n2390n1016k37213l9573p9337
6385E516741O3089n2433j37822M0498j9711o5398j03141L2373J34985m54719l795
6374D950667J81047l79070K59516j60707k2223o6180j11242L2474j21198L7559
6364D600643K5231n4643r6387j70699o2265K10754j21527l38574J87088n8891
6354D120730P5199j65613Q545l0541p0286O5666J0930k0265k29709j02754M9159
6343C711061n3067q8046J97272n3195j18376P728k02109P4869p2777m3339R3379
6332C453400n7109k78197J00598j03916J68274j01388j63136p3617m1770j07086
$$ y = [6795726, 6819687, 6685839, 6723189, 6553269, 6546325, 6664961, 6362108, 6454514, 6369592, 6359769, 6284014, 6260359, 6010945, 6156036, 5859296, 5976270, 5923880, 5872864, 5635651, 5596078, 5516741, 5579830, 5527397, 5389575, 5430073, 5410362, 5344964, 5241823, 5274196, 5409181, 4954462, 4950667, 5131714, 4752644, 5012160, 4851453, 4829230, 4763050, 4651808, 4684282, 4563084, 4600643, 4625874, 4571231, 4474844, 4304145, 4241880, 4452634, 4331107, 3992533, 4179621, 4120730, 4195929, 4030316, 4038861, 4008320, 3938034, 4003700, 4014630, 3994365, 3764656, 3661902, 3711061, 3657994, 3569948, 3767220, 3714025, 3595649, 3603377, 3401268, 3476137, 3403360, 3360021, 3453400, 3396291, 3118094, 3218692, 3114776, 3283050, 3181662, 3018526, 2944909, 2903139, 2796053]
6322B796053L31441n4801q5405k3783q0186J15759M03k29992k89896J45176q1992
6311B542777L19543j95773K8952L648j81468O2100r2910J32455o3557M893r268
6300B551392k43596P3131k4291j22468J44298j5042k6568q9838m5251J90637q7558
6289B304846l8094j11701M5838N6464l387j10633j49490J08496Q3322n1555j13226
6278B020880J34708j07024n3892m9219J50156k86200K37109k46272R8109L7376
6268A935731j9562M9082m9181j19028K19400j80484l04639K27902L7127J8054
6258A814402o2136O3482K4186j77945J26966L5071k06062J27380k60255L7263
6248A522352L9310J20171j18997j3962L8800K7001l767J96099l35601N0312J52739
$$ y = [2796053, 3127494, 3072693, 2987288, 2963505, 2883319, 2999078, 2999481, 2769489, 2479593, 2624769, 2542777, 2862320, 2666547, 2695499, 2699147, 2517679, 2579779, 2486869, 2619324, 2555767, 2560660, 2551392, 2307796, 2380927, 2356636, 2234168, 2378466, 2363424, 2336856, 2247018, 2201767, 2392404, 2304846, 2266752, 2155051, 2200889, 2257353, 2253966, 2143333, 1993843, 2102339, 2185661, 2134106, 2020880, 2155588, 2048564, 1994672, 1945453, 2095609, 1809409, 2046518, 1800246, 1898355, 1935731, 1916169, 1965251, 1916070, 1797042, 2016442, 1835958, 1531319, 1759221, 1796348, 1814402, 1752266, 1815748, 1839934, 1661989, 1788955, 1824026, 1617964, 1745344, 1485089, 1522352, 1561662, 1681833, 1562836, 1548874, 1587674, 1614675, 1610908, 1807007, 1471406, 1521718, 1674457]
6237A674457r4653o2729j39649J75707J08675J05563m5091j5276j76158O0145
6227A590991m8496k161N7687o2426j78197n0368K55255k91000K00352K9966j14803
6216A386800J96364l05161J96271j07744J59762j3845o9757N8231n7285j26249
6206A317387J16141k4968l085J6924j7774j1717L9805j75496m266J21225L8758
6195A412934K2208p0254J7648P996n1000j1201k2851j37369j85256K45947k5352
6184A203450P1136j75167K65447j71026J76372j15538j735l353l3678r7262Q5373
6173A204019K49383l23878O3279J7223M4896J67481j68335J16267l50966K34218
6163A253587q7071J8216L5941J05818k56974P3677q519j0837K63070j43783K13191
$$ y = [1674457, 1579804, 1517075, 1377426, 1553133, 1661808, 1767371, 1722280, 1707004, 1530846, 1590991, 1542495, 1540334, 1598021, 1535595, 1357398, 1307030, 1562285, 1271285, 1471637, 1501603, 1386800, 1583164, 1278003, 1474274, 1366530, 1526292, 1512447, 1442690, 1500921, 1443636, 1317387, 1433528, 1408560, 1405475, 1422399, 1404625, 1392908, 1432713, 1257217, 1252951, 1374176, 1412934, 1435142, 1364888, 1382536, 1390532, 1339532, 1328331, 1305480, 1168111, 982855, 1228802, 1203450, 1274586, 1099419, 1364866, 1193840, 1370212, 1254674, 1252939, 1249586, 1215908, 1118646, 1204019, 1453402, 1129524, 1192803, 1210026, 1254922, 1422403, 1254068, 1370335, 1019369, 1253587, 1166516, 1184732, 1220673, 1326491, 1069517, 1143194, 1134675, 1123838, 1386908, 1243125, 1456316]
6152A456316k34511J6737K27028k75677k33951K05980J4064J37209j94088j15994
6142A003113L6884K41179k44347J04943J5252k598o5435k584J58375j68488L5850
6131A112144N1085O9725j25651R496j25732J34750n1948J21552j31796j8676J4330
6120A059279k1912J65577j90986j04755J97149o7636k72M5058r6035n4684P2118
6109A002901J53862k50206K32359O3416j49342o1195k1498p5641K60329j48513
6099A006472L75485k43322j57270J47573l5866J28646j23308J4083r1064L9217
6089A060646J2968O5710j95199J87746n3957Q6978o461j71494Q2401l7949J37798
6078A169187j94952L3232N3030k00478M9573N6445l0290r1391J80150l0764J43507
$$ y = [1456316, 1221805, 1238542, 1465570, 1189893, 955942, 1161922, 1175986, 1313195, 1119107, 1003113, 1039997, 1281176, 1036829, 1141772, 1157024, 1154426, 1088991, 1086407, 1244782, 1076294, 1112144, 1163229, 1232954, 1107303, 1116799, 991067, 1125817, 1073869, 1195421, 1063625, 1044949, 1059279, 1037367, 1202944, 1011958, 907203, 1104352, 1036716, 1036444, 1081502, 985467, 930783, 1002901, 1156763, 906557, 1138916, 1202332, 1052990, 991795, 970297, 894656, 1154985, 1006472, 1381957, 1138635, 981365, 1128938, 1093072, 1221718, 1098410, 1112493, 1021429, 1060646, 1073614, 1139324, 944125, 1131871, 1077914, 1164892, 1158431, 986937, 1069338, 1031389, 1169187, 974235, 1007467, 1060497, 860019, 909592, 966037, 935747, 844356, 1024506, 993742, 1137249]
6067A137249k08848J17995Q9126J02686k50935P6527o7299j51723K30619l3895
6057A041502J30845j72500P0679K0350j35278R6977m0505r767O9248n0459l6812
6046I84280K35157k96141J25355J59842j04348O2385M4314K5998k18916j02589
6036I15337K00763j15622m9915Q2254j0265K5163n4096l5740M3244k0184K24791
6025A205730J014l4457k40014J39900Q6178J68968j05424j43137K1112J07542
6015A207412l20544K48419o2344J68743J29049j16926R9824k13143J14604N9588
6005A314682j98585J2539K29535o8161J00518k19351J76577J49187k99707K00872
5995A398106J99360j60330j64651L25747j33332O68J22023L9234Q544K48579K2127
$$ y = [1137249, 928401, 1046396, 1135522, 1238208, 987273, 1063800, 996501, 844778, 1075397, 1041502, 1172347, 999847, 1070526, 1090876, 955598, 1052575, 1012070, 1002303, 1071551, 1021092, 984280, 1219437, 923296, 1048651, 1208493, 1104145, 1166530, 1210844, 1236842, 1017926, 915337, 1116100, 1000478, 950563, 1032817, 1022552, 1047715, 993619, 957879, 1001123, 980939, 1205730, 1206744, 1172287, 932273, 1072173, 1158351, 1327319, 1221895, 1078758, 1099870, 1207412, 886868, 1135287, 1072943, 1241686, 1370735, 1253809, 1353633, 1140490, 1255094, 1314682, 1116097, 1128636, 1358171, 1290010, 1390528, 1171177, 1347754, 1496941, 1197234, 1398106, 1597466, 1437136, 1272485, 1598232, 1464900, 1465568, 1587591, 1626825, 1635369, 1883948, 1906075]
5984A906075k32608J53780q1371k665J53746J08414j13476p9363L37294r8567
5974B051259R4127K0381J72872k66324K79704j40244K05280l17258K96095j40380
5964B255512K2456K41223J16866k14649L30645j35491Q3865q5577K31173O4929
5954B910952J3163l8805L0796M6293J92J87927j68096M7011L7013j08174P2098
5943C030370L08273j50392j05034R6753K3076R7757Q4628r0520l00611J62247
5933C156547J01270q1864r6600K03087k44113K25250N9155j84211J33221o0386
5923C211356J3679k2048J47599O2659j04101k67987K28850J60592n266j40011
5913C285322l1835K325K11131j17450K10177n9319j7483j95058L07778l70721
$$ y = [1906075, 1673467, 1827247, 1745876, 1743211, 1896957, 2005371, 1891895, 1812532, 2149826, 2051259, 2145386, 2165767, 2338639, 2072315, 2352019, 2211775, 2417055, 2099797, 2395892, 2255512, 2277968, 2519191, 2636057, 2421408, 2752053, 2616562, 2700427, 2614850, 2846023, 2910952, 2924115, 2885310, 2916106, 2962399, 2962591, 3150518, 2982422, 3029433, 3066446, 2958272, 3030370, 3338643, 3188251, 3083217, 3179970, 3203046, 3300803, 3385431, 3294911, 2994300, 3156547, 3257817, 3175953, 3079353, 3282440, 3038327, 3263577, 3322732, 3138521, 3271742, 3211356, 3225035, 3202987, 3350586, 3413245, 3309144, 3041157, 3270007, 3430599, 3425333, 3285322, 3253487, 3255812, 3466943, 3349493, 3559670, 3500351, 3482868, 3287810, 3595588, 3224867]
5903C224867K31741k86634M1799M9679o5392P0408k11691J97999j32415K5532
5893C145893J77492m0543k4478J04567k1926R1666J012N5097q8837Q1921O971
5882C488835l0778L12347p1514j53799J27048K4923J60898m5603j40935O2402
5872C733824l4043J06148j04559J55809J14825n0771r1570J10644K52494j06992
5862D085809k1093k9715M9679Q3015K1796J25198j51866n9181P3960J93399k12081
5851D158920K65975m0418j0111o7181K2575j9673L9054J50364O8481j55725J89862
5840D602123L1637k84927K10533N9517q1849m8896K40920p9434J08845m5266J219
5829D714422P7729K02484o3397p938p6152P6956K17177q2080j07182K10732J0399
$$ y = [3224867, 3456608, 3169974, 3211773, 3261452, 3196060, 3266468, 3054777, 3252776, 3120361, 3145893, 3323385, 3282842, 3258364, 3362931, 3341005, 3432671, 3433683, 3488780, 3399943, 3481864, 3488835, 3458057, 3770404, 3698890, 3545091, 3672139, 3697062, 3857960, 3812357, 3671422, 3733824, 3699781, 3805929, 3701370, 3857179, 3972004, 3921233, 3829663, 3940307, 4192801, 4085809, 4064716, 4035001, 4084680, 4167695, 4189491, 4314689, 4162823, 4103642, 4177602, 4371001, 4158920, 4424895, 4384477, 4374366, 4307185, 4329760, 4310087, 4349141, 4499505, 4567986, 4412261, 4602123, 4633760, 4348833, 4559366, 4618883, 4537034, 4488138, 4729058, 4649624, 4758469, 4713203, 4714422, 4792151, 4994635, 4931238, 4923300, 4847148, 4924104, 5141281, 5059201, 4952019, 5162751, 5173150]
5818E173150l6146K33054q2857J44748N7522o411K5595K14018l4317J72863J65660
5807F026879j3578j15771J23184J74096K86975O8871j56927O5139K22941k9337
5797F652472P0150K62967n9673J61423J20485J30502J12259M0089L14146j42702
5787G662118N32277M2044M3267K28204j0214K09351J00326K12581K34976J89979
5777I444909K23044J98753K1190K78361K74841L69483L2362K17985L60461L50664
5767A1772053K98713K94781J97795M36198K66388J66667N61021M92578K55347
5758A4741541L07046N59245O30969O55233N10137M21162R70169P37122N76699
5749B0109323J172837J331908J163986J114862J503651J770387J623576K089721
$$ y = [5173150, 5137004, 5370058, 5287201, 5431949, 5489471, 5483060, 5508655, 5722673, 5688356, 5861219, 6026879, 6013301, 5897530, 6020714, 6194810, 6481785, 6550656, 6393729, 6458868, 6681809, 6652472, 6722622, 6985589, 6925916, 7087339, 7207824, 7338326, 7450585, 7490674, 7804820, 7662118, 8194395, 8236439, 8279706, 8507910, 8497696, 8707047, 8807373, 9019954, 9254930, 9444909, 9667953, 9866706, 9887896, 10166257, 10441098, 10810581, 10842943, 11060928, 11421389, 11772053, 12070766, 12365547, 12563342, 12999540, 13265928, 13432595, 13993616, 14486194, 14741541, 15048587, 15607832, 16238801, 16894034, 17404171, 17825333, 18795502, 19532624, 20109323, 21282160, 22614068, 23778054, 24892916, 26396567, 28166954, 29790530, 31880251]
5741C1880251K229623K446688K997133L401301L432994M054217M585986N022993
5733F0051186N361660O024749O019687N848144N655067N564925M546560M005721
5725A03077699L068568K565390J837445J774961J327563J326878J786509K405534
5717A19170547L101953L593698M377444M677805N079331N496693N441579N349460
5709A56288510N376071N093422M827956N261120N426175O358422O508314O855303
5701B01995293P716816P803512P861515P381767O775930N405226M682091L048126
5693B52670276K122933R47413M05242O10711O08952J209278J619404K588261L000072
5684B65782542L463509L705761L622583K727449K390447P76360o2925q46137j752010
$$ y = [31880251, 34109874, 36556562, 39553695, 42954996, 46387990, 50442207, 55028193, 60051186, 65412846, 71437595, 77457282, 83305426, 88960493, 94525418, 99071978, 103077699, 106146267, 108711657, 110549102, 112324063, 113651626, 114978504, 116765013, 119170547, 122272500, 125866198, 130243642, 134921447, 140000778, 145497471, 150939050, 156288510, 161664581, 166758003, 171585959, 176847079, 182273254, 188631676, 195139990, 201995293, 209712109, 217515621, 225377136, 232758903, 239534833, 244940059, 249622150, 252670276, 254793209, 255740622, 256145864, 256756575, 257365527, 258574805, 260194209, 262782470, 265782542, 269246051, 272951812, 276574395, 279301844, 281692291, 282468651, 282405726, 281559589, 279807579]
5675B79807579k277925k283319k513551k012844j568234r38764l69726k01583
5667B67641633M7185k42161j70884r79128j193241j475861j608656j743153j228366
5658B59047368j153335m68535o52378K98949J0064K04759J69311k54382o66159
5649B56535662j747199k458370l194443l330408l902675m170571m228819l905073
5641B29598104l611837l233167k519436k118773j428326p95007l95569O5937O24283
5632B16186209J045176J259851J491775J826181J270242J629735J407568J338415
5624B27455152J391281J317534J293807J039337J432749J662643J700723K169384
5616B39462610K221636K504344L022748K829345K692217K879308K744924K010610
$$ y = [279807579, 277529654, 275246335, 272732784, 270719940, 269151706, 268212942, 267843216, 267641633, 267688818, 267446657, 267275773, 266296645, 265103404, 263627543, 262018887, 260275734, 259047368, 257894033, 257425498, 256773120, 257072069, 257082133, 257286892, 257456203, 257201821, 256535662, 254788463, 252330093, 249135650, 245805242, 241902567, 237731996, 233503177, 229598104, 225986267, 222753100, 220233664, 218114891, 216686565, 215891558, 215495989, 215561926, 216186209, 217231385, 218491236, 219983011, 221809192, 223079434, 224709169, 226116737, 227455152, 228846433, 230163967, 231457774, 232497111, 233929860, 235592503, 237293226, 239462610, 241684246, 244188590, 247211338, 250040683, 252732900, 255612208, 258357132, 260367742]
5608B60367742K237809J432914Q34760K87005l82061j239627j749707k163937
5600B59624898k850325l227856l372098l637327l947779l891080l666146m007526
5592B31024761l475120l339630k923318k653779k848999j913734k201959j894284
5584B09773938j968016j600163k090048k252110k193883k560725k897149l234625
5576A90977219l439437l719846l582055l819922l750012l686844l169507l364863
5568A62444733l404360k757391k951132k534317k516862k420470k128962k131204
5560A41600035j860721k142881j960718j480979j849725j460333j924186j601438
5552A27319054j387381j429600j385788j438314j338274j112535j325599j468972
$$ y = [260367742, 262605551, 264038465, 264873225, 265160230, 264778169, 263538542, 261788835, 259624898, 256774573, 253546717, 250174619, 246537292, 242589513, 238698433, 235032287, 231024761, 227549641, 224210011, 221286693, 218632914, 215783915, 213870181, 211668222, 209773938, 207805922, 206205759, 204115711, 201863601, 199669718, 197108993, 194211844, 190977219, 187537782, 183817936, 180235881, 176415959, 172665947, 168979103, 165809596, 162444733, 159040373, 156282982, 153331850, 150797533, 148280671, 145860201, 143731239, 141600035, 139739314, 137596433, 135635715, 134154736, 132305011, 130844678, 128920492, 127319054, 125931673, 124502073, 123116285, 121677971, 120339697, 119227162, 117901563, 116432591]
5544A16432591j082588j082673j222140j054666q39411q84026p05158r86313n80042
5535A07995574o44423o79946k01007l08921l42486q6425n3465L6509K86763M41885
5525A06444058L00035R62124P86763J343040J406871J680163J895797J936873
5517A16755724K231231K163460K375080K215176K269562J973478J842959J691617
5509A33518287J665560J416807J413922J263233J489846J616466J804541K122484
5501A46311146K378199K710361K906847L230588L754784L881796M220384M459070
5493A73853175M336120M246375M138819L998529L679278L078232K165200J725733
5485B01221461Q92243N1634j60078j043335j296575j511472k124485j890988k178635
$$ y = [116432591, 115350003, 114267330, 113045190, 111990524, 111151113, 110267087, 109561929, 108575616, 107995574, 107351151, 106671205, 106470198, 106161277, 105818791, 105732366, 105678901, 105715410, 106002173, 106444058, 106744093, 107706217, 108492980, 109836020, 111242891, 112923054, 114818851, 116755724, 118986955, 121150415, 123525495, 125740671, 128010233, 129983711, 131826670, 133518287, 135183847, 136600654, 138014576, 139277809, 140767655, 142384121, 144188662, 146311146, 148689345, 151399706, 154306553, 157537141, 161291925, 165173721, 169394105, 173853175, 178189295, 182435670, 186574489, 190573018, 194252296, 197330528, 199495728, 201221461, 202113704, 202165338, 202005260, 200961925, 199665350, 198153878, 196029393, 194138405, 191959770]
5476A91959770j895450k200459j752986j670865j703301j662560j495692j381313
5468A78197144k045831j723098k055370k584096k403540k751266l138385l141668
5460A58353890l559687l296863l546781l605358l546152l401670l432628l016233
5452A30948518k758221l058794k447617k195565k293761k243880j742649j659992
5444A12548039j606790j771809j330542j436961j567679j201170j237022j311777
5436A01084289j170734j517829j448473j200054j381179j389279j293920j254469
5428I0428352j305234j385965j173982j235346j340496j131094j300972r99552
5420H0555711j030140j356515j085088j099780j326036j258931j200962j184304
$$ y = [191959770, 190064320, 187863861, 186110875, 184440010, 182736709, 181074149, 179578457, 178197144, 176151313, 174428215, 172372845, 169788749, 167385209, 164633943, 161495558, 158353890, 154794203, 151497340, 147950559, 144345201, 140799049, 137397379, 133964751, 130948518, 128190297, 125131503, 122683886, 120488321, 118194560, 115950680, 114208031, 112548039, 110941249, 109169440, 107838898, 106401937, 104834258, 103633088, 102396066, 101084289, 99913555, 98395726, 96947253, 95747199, 94366020, 92976741, 91682821, 90428352, 89123118, 87737153, 86563171, 85327825, 83987329, 82856235, 81555263, 80555711, 79525571, 78169056, 77083968, 75984188, 74658152, 73399221, 72198259, 71013955]
5412G1013955j126866j415342j296303r90532j256804j484944r30365j281078
5404F1231721r08146j202691j200397j063371r91116r71458r97478r72658r26212
5395E1998194q87732j104795o33095j050794q29241q01347q50840r54239p10107
5386D4176004o84521q19291n83517p21145n93390q98889n41553o09680n98031
5377C8125987o18705m17121p12819n15360n31588l01717n02411o83481k65221
5368C3577564m15275l45618o02757l62896l24295m92248m38221l24485l32548
5359B9939221l84919l03894k97915m05039j68918l08808m19578m83475p5367l63820
5349B6727488n38423j86025l12987l61411m41638l47965l95317l31664k47088
$$ y = [71013955, 69887089, 68471747, 67175444, 66184912, 64928108, 63443164, 62512799, 61231721, 60323575, 59120884, 57920487, 56857116, 55866000, 54894542, 53897064, 52924406, 51998194, 51110462, 50005667, 49372572, 48321778, 47492537, 46691190, 45840350, 44886111, 44176004, 43491483, 42672192, 42088675, 41367530, 40774140, 39875251, 39333698, 38724018, 38125987, 37507282, 37090161, 36377342, 35861982, 35330394, 35028677, 34526266, 33842785, 33577564, 33162289, 32816671, 32213914, 31851018, 31526723, 31034475, 30596254, 30271769, 29939221, 29554302, 29250408, 28952493, 28547454, 28378536, 28069728, 27650150, 27166675, 27091308, 26727488, 26189065, 26003040, 25690053, 25328642, 24887004, 24539039, 24143722, 23812058, 23564970]
5340B3564970m96443l53188k98374n00557j39187l38742l77058k21072l28611
5331B0511738l47422l66143k12241l65661k15977k98884k75169l00106m20508
5322A7709627j43916m73297k18232q2674o51656j12647j84846j99903l99487k51635
5312A4991334j96737k04481k53875k30428j09376j15073l77796r8410Q766m63955
5302A2949969k05117n6142k92817l47710o7910k24144l08842r3737j08130l30000
5292A0915420m0206l07019p4336l30948k0854j77691j74916J35402n67982J67187
5282I524057j85990L8790k36246k3780m4469j79895N1892j73870m0918k11246
5272H518325O7167k73454J55122k83802J0689m06037K25852j43138R0100k43718
$$ y = [23564970, 23068527, 22715339, 22416965, 21916408, 21777221, 21438479, 21061421, 20840349, 20511738, 20164316, 19798173, 19585932, 19220271, 19004294, 18705410, 18430241, 18130135, 17709627, 17565711, 17092414, 16874182, 16791508, 16139852, 16027205, 15842359, 15642456, 15242969, 14991334, 14794597, 14590116, 14336241, 14105813, 13996437, 13881364, 13503568, 13405158, 13413924, 12949969, 12744852, 12688710, 12395893, 12048183, 11980273, 11756129, 11447287, 11353550, 11245420, 10915420, 10875214, 10568195, 10493859, 10162911, 10142057, 9964366, 9789450, 9924852, 9356870, 9524057, 9338067, 9376857, 9140611, 9116831, 9072362, 8892467, 8944359, 8770489, 8729571, 8518325, 8585492, 8312038, 8467160, 8183358, 8194047, 7788010, 8013862, 7870724, 7960824, 7717106]
5262G717106j15812j44064J1131j10018j56433k3711L8308j87231k18011J52549
5252F963814o4528K71465r7927q2970j93288K6095J85815k59307r5880R0500j33861
5241F609928P8582k5036j32691Q2183j37246r5136m375j00792j6385O6058N649
5230F330739j79570L4592r1207Q0445k65522r7019o5627J36147L2396o9918k9848
5219E815608j2103k86145J32775k55844J13656r4063L1734k14454r8795R1740
5209E224109j3728k11674J02141l98154K52067r9484j7636L553o9519k19108R1247
5198D643814Q1478r5970o2611J2448K2493l1960m1297l32762K40281q0777j67169
5187D187968K25683l48790J08092J48990k07572J50480j16160Q3232l7153j57241
$$ y = [7717106, 7601294, 7457230, 7468361, 7358343, 7201910, 7178199, 7216507, 7029276, 6811265, 6963814, 6899286, 7170751, 7072824, 6989854, 6796566, 6822661, 7008476, 6749169, 6653289, 6743789, 6609928, 6688510, 6663474, 6530783, 6612966, 6475720, 6380584, 6376209, 6275417, 6259032, 6325090, 6330739, 6151169, 6185761, 6094554, 6174999, 5909477, 5812458, 5746831, 5882978, 5915374, 5845456, 5815608, 5803505, 5517360, 5650135, 5394291, 5507947, 5413884, 5445618, 5231164, 5132369, 5224109, 5210381, 4998707, 5100848, 4702694, 4954761, 4855277, 4837641, 4841194, 4771675, 4552567, 4643814, 4725292, 4629322, 4566711, 4579159, 4601652, 4569692, 4528395, 4195633, 4435914, 4355137, 4187968, 4413651, 4064861, 4172953, 4321943, 4114371, 4264851, 4148691, 4231923, 4194770, 4037529]
5177D037529J88696j1925j57450j68365J78843m3747p838j1316L7570j46573J70063
5166D065487K9800j00478j31375J37353l1926J32965j97418O1606n153J341K39045
5155D201247j61828o8632r6681Q7519P1928J5552M044K195j9108M3240m271p6293
5143C998912Q6571o3143j4195m6903J87437L1835N2208j0806o0130J29291J79483
5132D470560j36762K89605R631j05789O9822O1703n4026K5102K21582J71709K3702
5121E046839J63268j21112J04848j08729P8941K92446j55029J82126K3519L08277
5111E815394J15739m1485K26982m2174K30406n9818M6635L81136K14769M421K55421
5100G147426M23308J28651L02092L59244K82914J97451N99764K12519O01813N09700
$$ y = [4037529, 4226225, 4214300, 4056850, 3888485, 4067328, 4023581, 4015743, 4004427, 4041997, 3895424, 4065487, 4095287, 3994809, 3863434, 4000787, 3968861, 4101826, 3904408, 3966014, 3960861, 3962202, 4201247, 4039419, 3970787, 3874106, 3961625, 4033553, 4049105, 4053149, 4055344, 4036236, 4079476, 4075205, 3998912, 4085483, 4022340, 4008145, 3961242, 4148679, 4180514, 4232722, 4221916, 4161786, 4291077, 4470560, 4333798, 4623403, 4633034, 4527245, 4597067, 4658770, 4604744, 4629846, 4851428, 5023137, 5046839, 5210107, 5088995, 5193843, 5085114, 5164055, 5456501, 5301472, 5483598, 5507117, 5815394, 5931133, 5889648, 6116630, 6074456, 6304862, 6245044, 6291679, 6672815, 6887584, 6892005, 7147426, 7570734, 7699385, 8001477, 8360721, 8643635, 8841086, 9440850, 9653369, 10255182, 10764882]
5090A0764882N27270P31666Q59451N80687P84994J267924J096874J279706J305105
5081A9198559J663391J931734K238844K321766K327139K362801K186030J280248
5073C5510512P96769j23639o34609n70856p11164n77120k80236R9667j97819N11921
5063C3823426L34445P23223P40039J200495J028559J470451K103640K199183K724035
5054D6347496L158131L865452M131573M915895N669995O486933O819518O308846
5046H7703839N821878N064565L918532K398657K58286k223358l969304l943049
5038I5030046l334832l187307k471200k336721j987314j302263j043985p21599
5030G8644825k34601M12954Q91574J609699K152652K718732L320053L880316M860192
$$ y = [10764882, 11292152, 12023818, 12883269, 13463956, 14248950, 15516874, 16613748, 17893454, 19198559, 20861950, 22793684, 25032528, 27354294, 29681433, 32044234, 34230264, 35510512, 36307281, 36183642, 35549033, 34978177, 34267013, 33689893, 33409657, 33509324, 33311505, 33823426, 34157871, 34881094, 35621133, 36821628, 37850187, 39320638, 41424278, 43623461, 46347496, 49505627, 53371079, 57502652, 62418547, 68088542, 74575475, 81394993, 87703839, 93525717, 98590282, 102508814, 104907471, 105165757, 102942399, 98973095, 95030046, 91695214, 88507907, 86036707, 83699986, 81712672, 80410409, 79366424, 78644825, 78410224, 78823178, 79714752, 81324451, 83477103, 86195835, 89515888, 93396204, 98256396]
5021I8256396N826837O857410P326244P503551P449469P125865O362512M803877
5013A51512161J811376j495489l832053n541979o162769n597091n281921m828781
5005A20583454m305792m108734l534011k979149j931145j703186r90059p52935
4997A00278443k95132k530O04558O08101J222347J972352K260148L306031L842625
4988A13796943M299285M216875M039551L084675J371179n53312k126811l701701
4980A24426684m510270m494486m117648l979309l626551l169864l078946k948790
4972I4500820k432965k071906j832008j301144j474427j349973j172123r51770
4964H1914504p52882o08960o27438k97213k94522p40k13171J38075k06553k97305
$$ y = [98256396, 104083233, 110940643, 118266887, 125770438, 133219907, 140345772, 146708284, 151512161, 153323537, 151828048, 147995995, 142454016, 136291247, 130694156, 125412235, 120583454, 116277662, 112168928, 108634917, 105655768, 103724623, 102021437, 101031378, 100278443, 99983311, 99980781, 100585339, 101193440, 102415787, 104388139, 106648287, 109954318, 113796943, 118096228, 122313103, 126352654, 129437329, 130808508, 130255196, 128128385, 124426684, 119916414, 115421928, 111304280, 107324971, 103698420, 100528556, 97449610, 94500820, 92067855, 89995949, 88163941, 86862797, 85388370, 84038397, 82866274, 81914504, 81161622, 80552662, 79925224, 79628011, 79333489, 79332749, 79119578, 79257653, 79051100, 78753795]
4954G8753795n15974r38560j650814j648151j874753j615402j535852j232905
4946F7741384j590183j275661j272382j212467j155829j171601r08566j103643
4938E8051052r10573r47868j026034r37271p68847n59042r28027p86060p21190
4929E0466140j081723n98950q11215j104619p86038j072015q92150p10936o95719
4920D2712775q66927m97246n13002m97625m21639l60915k77819n07600m74948
4911C8295054l84776o69597o65080n94727l43822m20829l63067m75189m67356
4902C3910611m13626j34696o08629k91854m81164n64102k70035m03138m61097
4893C0282270p54103k66587n40093k87651k09091m05480l81699k8183m40069k15575
$$ y = [78753795, 78237821, 77299261, 75648447, 74000296, 72125543, 70510141, 68974289, 67741384, 66151201, 64875540, 63603158, 62390691, 61234862, 60063261, 59154695, 58051052, 57140479, 56192611, 55166577, 54229306, 53460459, 52901417, 51973390, 51187330, 50466140, 49384417, 48785467, 47974252, 46869633, 46083595, 45011580, 44119430, 43408494, 42712775, 41845848, 41348602, 40835600, 40337975, 39916336, 39555421, 39277602, 38770002, 38295054, 37910278, 37240681, 36575601, 35980874, 35637052, 35216223, 34853156, 34377967, 33910611, 33496985, 33362289, 32753660, 32461806, 31980642, 31416540, 31146505, 30743367, 30282270, 29528167, 29261580, 28721487, 28433836, 28224745, 27819265, 27437566, 27409383, 26969314, 26753739]
4883B6753739j02514l44275p2857k49735j87472k93672m44347o7399j06552j70565
4873B4714351k07515k05430j60699k00216p5457r2423j20996n9442K2327k83725
4863B3330775j33050M0021J31967p7184N3419j28061L29441l30443J50388K70045
4853B3637318L76918l19540N68322J23159M72263O7688P23263K33934O76357L79669
4843B6939351N10557Q63836K65555O76729Q85382N79811J066035O45387P26971
4834C3159614R42063Q72791J036104J034459J153107R67976Q60193J201800R48304
4825D2176411J153924J258067J124468J135881J448044J058709J291369J300471
4817E1947344J421024J679681J753523J870270K275993K588414K827515L103016
$$ y = [26753739, 26651225, 26306950, 26234093, 25984358, 25796886, 25503214, 25058867, 24991468, 24884916, 24714351, 24506836, 24301406, 24140707, 23940491, 23865034, 23772611, 23651615, 23592173, 23614500, 23330775, 23197725, 23237746, 23369713, 23292529, 23345948, 23217887, 23547328, 23216885, 23367273, 23637318, 24014236, 23694696, 24263018, 24386177, 24858440, 24926128, 25649391, 25883325, 26559682, 26939351, 27449908, 28313744, 28579299, 29256028, 30141410, 30721221, 31787256, 32432643, 33159614, 34101677, 34974468, 36010572, 37045031, 38198138, 39166114, 40026307, 41228107, 42176411, 43330335, 44588402, 45712870, 46848751, 48296795, 49355504, 50646873, 51947344, 53368368, 55048049, 56801572, 58671842, 60947835, 63536249, 66363764, 69466780]
4809F9466780L473615L909324M515398M451637N162632N441253N656546O212405
4801A08289590O537956O670821O879131O689374O393457N770313N835185N349535
4793A58415362N700707N885448O505354P367157Q061073Q549105R285467R661521
4785B19431194R674567R391081P257479M887692M314432M014083N438917O829553
4777B71238998P346598Q138089Q332724Q326584P631183O657812N054221L339889
4769C26066098J298488m96226k096110l409523l870782l637071k761920k617496
4761C08475458j819637j326227q66547r31331j976506m233122o019086o868376
4753B84434626o219227m903327m538450m168867m219225l534071l483741l355987
$$ y = [69466780, 72940395, 76849719, 81365117, 85816754, 90979386, 96420639, 102077185, 108289590, 114827546, 121498367, 128377498, 135066872, 141460329, 147230642, 153065827, 158415362, 164116069, 170001517, 176506871, 183874028, 191935101, 200484206, 209769673, 219431194, 229105761, 238496842, 245754321, 250642013, 254956445, 258970528, 264409445, 271238998, 278585596, 286723685, 295056409, 303382993, 311014176, 317671988, 322726209, 326066098, 327364586, 326868360, 324772250, 321362727, 317491945, 313854874, 311092954, 308475458, 306655821, 305329594, 304463047, 303531716, 301555210, 297322088, 291303002, 284434626, 278215399, 273312072, 268773622, 264604755, 260385530, 256851459, 253367718, 250011731]
4745B50011731l637119l597106m394941m067939m733957m876889m634414m494452
4737B15574914m480723m280290m108930l667277l610088l377403l595149l291494
4729A85163560k854966k668790k191547k231774k028621j943068j578852j416275
4721A68249667j314897j690676j762496k108731k118236j989629k103722k171289
4713A52989991j726026k184998k549562k348846k446313k143489k290350k117485
4705A35182922k173597k105259j948390k300461k168513k032898k031613j987430
4697A18434761k503843k172255k278348k285320k173686j972948k035079j951396
4689A01061886k000204j650398j774247j831742j731394j715291j562883k175505
$$ y = [250011731, 246374612, 242777506, 238382565, 234314626, 229580669, 224703780, 220069366, 215574914, 211094191, 206813901, 202704971, 199037694, 195427606, 192050203, 188455054, 185163560, 182308594, 179639804, 177448257, 175216483, 173187862, 171244794, 169665942, 168249667, 166934770, 165244094, 163481598, 161372867, 159254631, 157265002, 155161280, 152989991, 151263965, 149078967, 146529405, 144180559, 141734246, 139590757, 137300407, 135182922, 133009325, 130904066, 128955676, 126655215, 124486702, 122453804, 120422191, 118434761, 115930918, 113758663, 111480315, 109194995, 107021309, 105048361, 103013282, 101061886, 99061682, 97411284, 95637037, 93805295, 92073901, 90358610, 88795727, 86620222]
4681H6620222j730657j662679j579387j669862j467452j498026j101449j438315
4673G4472395j173244j047064j318097j185370j503316j019817j202803j015965
4665F5006719j153504j042759p94190j196812q31637o97234j042149j202757n73568
4656E6472109o90046p84772q49495q26695n66891q25741p56587p28804o76053
4647D9767025q15218n00217n06898p89825o46814o49233o20547p74182n65247
4638D3898844n68242o39154n56024p69797l25273p83125o96334m82048o32925
4629C8445922p53972o63609n34436o14022o20422n67665n23311p12083n16260
4620C2940142o45926m93400n31924n53380n72657m59741n86581m20553o13621
$$ y = [86620222, 84889565, 83226886, 81647499, 79977637, 78510185, 77012159, 75910710, 74472395, 73299151, 72252087, 70933990, 69748620, 68245304, 67225487, 66022684, 65006719, 63853215, 62810456, 62016266, 60819454, 59987817, 59290583, 58248434, 57045677, 56472109, 55782063, 54997291, 54147796, 53321101, 52754210, 51928469, 51171882, 50443078, 49767025, 48951807, 48451590, 47944692, 47154867, 46508053, 45858820, 45238273, 44464091, 43898844, 43330602, 42691448, 42135424, 41365627, 41040354, 40257229, 39560895, 39078847, 38445922, 37691950, 37028341, 36493905, 35879883, 35259461, 34691796, 34168485, 33456402, 32940142, 32294216, 31800816, 31268892, 30715512, 30142855, 29683114, 29096533, 28675980, 28062359]
4611B8062359p36371k87334o94774l36269m61248o46000l02765m30767n81279
4602B3585552j32249o77292o08029k97311m92378l28650l23761m03891m33659
4593A9888332n95861p1482l88119m62303k21802n13509j73821l59371m21148m38760
4583A6242156k23192k72417j95030n73182k14548k10083n83264O1822m00944p0422
4573A3560896m83592k65000k84735q1522l36368k65420k64132j48001r2075k29960
4563A1110091l52186m9076k05748k17460j98761l99237J27429k91224j19022j49916
4553I254890j22955k77760J48516n8011l45126j66517P3383k37294j06729p3521
4543H088876r5058j99273o387j34746k26542j79300N6710j22061j03110j18300
$$ y = [28062359, 27325988, 27038654, 26343880, 26007611, 25546363, 24900363, 24597598, 24166831, 23585552, 23453303, 22776011, 22167982, 21870671, 21378293, 21049643, 20725882, 20321991, 19888332, 19292471, 19220989, 18832870, 18370567, 18148765, 17635256, 17461435, 17102064, 16680916, 16242156, 16018964, 15746547, 15551517, 14978335, 14763787, 14553704, 13970440, 14032262, 13631318, 13560896, 13077304, 12812304, 12527569, 12446047, 12109679, 11844259, 11580127, 11432126, 11340051, 11110091, 10757905, 10708829, 10503081, 10285621, 10086860, 9687623, 9815052, 9523828, 9404806, 9254890, 9131935, 8854175, 9002691, 8944680, 8599554, 8433037, 8506420, 8269126, 8162397, 8088876, 7993818, 7794545, 7788158, 7653412, 7426870, 7247570, 7304280, 7182219, 7079109, 6960809]
4533F960809J86159m12747J8720r7463j39445J18881O2664m771l37500M2189j7442
4522F380054l4674o8104j42392k69759J67288k23950q736j8290m3110j81255p1902
4511E485170j6414q4735j33378J96718k82581K46969j18089k2387j15133o2819
4501E093321k23964Q4877L9080J5532l95725R7898l4046j0702k61716n2387N3486
4490D405654l49517J85481o8815n5076K4139N3052j67906k07822K01928R8257
4480D119375j7423j05472R4079l08132j06659j65642K66187o4583k44652k9251
4470C437827j30926R0070j88678K2647j52867l2712K8026r2514M4667j13860J41096
4459C052776k97830J22286j47323R8697j58833o836K20815l37595J83941j30054
$$ y = [6960809, 7146968, 6734221, 6752941, 6655478, 6516033, 6634914, 6697578, 6692807, 6355307, 6397496, 6380054, 6345380, 6277276, 6134884, 5865125, 6032413, 5808463, 5799727, 5781437, 5738327, 5557072, 5485170, 5468756, 5384021, 5250643, 5447361, 5164780, 5411749, 5293660, 5271273, 5156140, 5093321, 4869357, 4954234, 4993314, 5008846, 4613121, 4711019, 4676973, 4666271, 4404555, 4352168, 4405654, 4056137, 4241618, 4172803, 4117727, 4141866, 4194918, 4027012, 3819190, 4021118, 4119375, 4101952, 3996480, 4090559, 3782427, 3675768, 3510126, 3776313, 3711730, 3467078, 3437827, 3306901, 3396971, 3208293, 3230940, 3078073, 3045361, 3073387, 2980873, 3025540, 2911680, 3052776, 2754946, 2877232, 2729909, 2828606, 2669773, 2662937, 2883752, 2546157, 2730098, 2600044]
4449B600044m0968m5678l13578K09133J3437j21704r6620k2737J2074j6676n1362
4438B125365n3297M601P2926l6382k40234J27506J88636j51622n6215M7395K1127
4427B049806j71845j79528P5334J6276k0010J48499k73448K96323k46470n1335
4417A643602L13679k43434J60437j85376J10844j4903p4320L4168j69764O6445
4407A641378m6791K9673q283K9718R7492o6515k6361j42350N6727m6144j8974
4396A499570q4267O1323J98241p1928J27016j60971j1412j69570Q2289K56965
4386A727256p9015k73804K77567j38892M3887o7726N03K26440j58456k64860J02535
4375A395435L3375P3772N5575m4421l3820k4221K07680k67136J03316p3301K4727
$$ y = [2600044, 2559076, 2513398, 2199820, 2408953, 2422390, 2300686, 2204066, 2181329, 2193403, 2176727, 2125365, 2072068, 2076669, 2149595, 2113213, 1872979, 2000485, 2189121, 2037499, 1981284, 2028679, 2049806, 1877961, 1698433, 1773767, 1790043, 1770033, 1918532, 1645084, 1941407, 1694937, 1643602, 1957281, 1713847, 1874284, 1688908, 1799752, 1784849, 1710529, 1744697, 1574933, 1641378, 1594587, 1624260, 1615977, 1645695, 1743187, 1676672, 1650311, 1507961, 1564688, 1518544, 1499570, 1415303, 1476626, 1674867, 1602939, 1729955, 1568984, 1557572, 1388002, 1470291, 1727256, 1648241, 1374437, 1652004, 1513112, 1556999, 1489273, 1489776, 1716216, 1557760, 1292900, 1395435, 1428810, 1502582, 1558157, 1513736, 1479916, 1455695, 1663375, 1396239, 1499555, 1426254, 1450981]
4364A450981j54933J84858K9882O1150j22045J46596J65357j04085o1671l6029
4354A560061n1729m30K58252j94548j9112q7651J22938l7134J05837k2732l5558
4343A598194R8947q1356o9346j53427K02579j6146M0526j29539K67518J22915
4333A880865m0506m2748j01383J63874K1518M9715O4593J7349K7663R2853K92966
4322B426759m8149L5232k7318L12603J24675J50545Q9425k1458M47423J27656
4312C617393R1977J5191J13619J81050l9990r3680k03298L2674l42261l1249l58690
4301B982736k5219j10441j48685k75446j82754K21217j07609k93019J17955j8721
4291B160014m8775k13896m8192J82621j44830j86357J28816k89074K91666k20048
$$ y = [1450981, 1296048, 1480906, 1510788, 1571938, 1449893, 1596489, 1761846, 1657761, 1596090, 1560061, 1508332, 1507902, 1766154, 1571606, 1552494, 1464843, 1587781, 1550647, 1656484, 1633752, 1598194, 1697141, 1615785, 1546439, 1393012, 1595591, 1579445, 1619971, 1490432, 1757950, 1880865, 1840359, 1797611, 1696228, 1860102, 1881620, 1931335, 1995928, 2013277, 2040940, 2133793, 2426759, 2378610, 2413842, 2386524, 2699127, 2823802, 2974347, 3063772, 3042314, 3489737, 3617393, 3709370, 3724561, 3838180, 4019230, 3979240, 3885560, 3682262, 3714936, 3372675, 3341426, 2982736, 2957517, 2847076, 2698391, 2422945, 2240191, 2461408, 2353799, 2060780, 2178735, 2160014, 2111239, 1897343, 1849151, 2031772, 1886942, 1700585, 1829401, 1540327, 1831993, 1611945]
4281A611945m736j94379J79234J02306j55282P4438k4365j86006L35764k75294
4271A463625J20971k47938R3269j79536L868R9023n0018K05616j96389o6398K32724
4260A478817k66218q84R816J70798l3004k86524N6207M842j00336j1853P1528
4249A093189J45330k12777j45458R4199j89604o228J54245r1167J87796q9101
4239I40424j53288l2256P9201j03998P4452N956j62026L2697K15436m43239J64538
4228F17897Q6259p1540p0941M4351k77610L69527j66245O0410o7020l2461j7632
4217D74995R336J63066l80106P8370l8641P7029L5865l1584J6243M1322n6586
4206C89309J40661j02924j34823j6318N5945l9342q9301J25814o9320J13670j51820
$$ y = [1611945, 1607209, 1412830, 1592064, 1694370, 1539088, 1613526, 1589161, 1403155, 1738919, 1463625, 1584596, 1336658, 1429927, 1250391, 1254259, 1353282, 1303264, 1508880, 1312491, 1246093, 1478817, 1212599, 1211715, 1221531, 1392329, 1359325, 1072801, 1129008, 1133850, 1033514, 1021661, 1093189, 1238519, 1025742, 880284, 974483, 784879, 778651, 932896, 841729, 1029525, 940424, 787136, 754880, 834081, 730083, 804535, 810491, 648465, 681162, 896598, 453359, 617897, 704156, 632616, 561675, 606026, 328416, 697943, 531698, 592108, 525088, 492627, 474995, 484331, 647397, 267291, 345661, 307020, 384049, 419914, 388330, 404573, 445895, 389309, 529970, 427046, 292223, 275905, 331850, 292508, 203207, 329021, 259701, 373371, 221551]
4195B21551J21375k13893L34429o7646j63393J097m107q7000Q1146M1991j01688
4184A63862K02550j0553o1368m1152j54799N5879j9570J21199p6114k18117K98252
4173B60069P0662j59346j94148R5971L2418j31382R5156P1841l5625k2315J02764
4162A86065p9441p410j72742J54037r8548P7038P716o9505J13091k65445J99464
4151D4320r4388Q7362k11868M49540k92945J01275k45772J28147j9488J10228
4141E6411m6621j55676Q2615M6840j21478j30025K80913k15682J86203k17576
4131b34076J95521l15173K70483j773q7646O4073O0540j1252n7959q5732M3712
4120a59282K6761j39897J63897r7179Q4025j01401K06960j00936Q0374j80308
$$ y = [221551, 342926, 129033, 463462, 395816, 232423, 233520, 229413, 142413, 223559, 265550, 163862, 366412, 355859, 294491, 253339, 98540, 154419, 134849, 256048, 179934, -38183, 260069, 330731, 171385, -22763, 73208, 105626, -25756, 69400, 141241, 105616, 83301, 186065, 106624, 99214, -73528, 80509, -18039, 58999, 66715, -2790, 110301, -155144, 44320, -50068, 37294, -174574, 274966, -17979, 83296, -162476, -34329, -53817, 56411, 9790, -145886, -63271, -16431, -137909, -267934, 12979, -202703, -16500, -234076, -38555, -353728, -83245, -85018, -172664, -108591, -48051, -59303, -117262, -202994, -159282, -132521, -272418, -108521, -205700, -121675, -223076, -16116, -117052, -36678, -216986]
4110b16986J16022p6841n457J65265j87552j9357K0613j31861J11095j36202K31122
4099a30139o876q9483J79092n2032R5696k33223L804J04490j5764Q6561l5337
4088i3211k04981J23721J1824q5929J2385K07558j25238o3540L6370r9186N8290
4077b21937N9915j28189O4579J61642n5284j21674J73474j12868O3681j14081
4067b30742R0341n9549j13218J87008j02290J04932j7538K1750R9550n4225l37862
4056d11843J22705J13243M0854P9402k6748j58256J21784m8671K21608k56173
4046b02095K55473j59154k268q0236J72958Q0051j08148R3011n5221K0012m2406
4035b8023l7421p4823L7081K85291k00159n4077K58236j96794j20215L96464l88359
$$ y = [-216986, -100964, -177805, -183262, -17997, -205549, -224906, -204293, -336154, -225059, -361261, -130139, -137015, -226498, -47406, -99438, -3742, -236965, -233161, -128671, -144435, -57874, -93211, -298192, -174471, -162647, -248576, -236191, -28633, -153871, -217411, -181041, -280227, -221937, -162022, -290211, -225632, -63990, -119274, -240948, -67474, -180342, -116661, -230742, -140401, -199950, -313168, -126160, -228450, -123518, -141056, -119306, -19756, -73981, -411843, -289138, -175895, -135041, -55639, -82387, -240643, -118859, -167530, 54078, -202095, 53378, -105776, -108044, -188280, -15322, 64729, -43419, 49592, -5629, 14383, -28023, -65444, -140267, -103186, 182105, -18054, -72131, 186105, -10689, -130904, 265560, -122799]
4024a22799K02708j02160l8578J76658J25985j18343l8852J62790k86826K81877
4014B42460j19000O2839p4957O4908o0578K0404J6728j50931M5385J76114J09011
4003C32383k83909j11589M37522k01163k31837O6107J36899k10131J32285N6819
3993A23386j87725O3441Q2244J06574k32114K53625R1933k37948J59061j99687
3983B2790j8752J36727N0926j87307J97811k86878J53197M0161j6646K6749M1133
3972A59911j62765j409J77669j67362j27643Q7190J14824j25561o90K84978j76907
3961F2235k5107r3664J55499k2918m4026J9975m3177q6424R8386j01928m1052
3950a22201J43170k19365Q3046J1978O7388r3563j5128o6459n26N0122J5579J37662
$$ y = [-122799, 79909, -22251, -60829, 115829, 241814, 123471, 84619, 247409, -39417, 242460, 123460, 186299, 111342, 176250, 115672, 136076, 152804, 1873, 47258, 223372, 332383, 48474, -63115, 374407, 173244, -58593, 7514, 144413, -65718, 66567, 123386, -64339, -898, 81346, 187920, -44194, 209431, 301364, 63416, 222477, 22790, 4038, 140765, 191691, 4384, 202195, -84683, 68514, 108675, 92029, 118778, 159911, -2854, -4263, 173406, 6044, -121599, -34409, 80415, -45146, -45836, 239142, 62235, 37128, -56536, 98963, 76045, 32019, 51994, 8817, -77607, 20779, -81149, -122201, 20969, -198396, -115350, -103372, -35984, -129547, -144675, -211134, -211660, -161538, -145959, -8297]
3938h297p9093j70655J2338j39926L22414q085j03305J10293j15005p5522N3123
3927b01720n761m6422m1119L9804J3664O99o8577L0634M8590N2358n4519P1091
3915a61278j46438J69850o7644J424j98682K65926j50931J50342r2689N473Q9560
3904a35087L076j60580K43611j84086r2164j32504J07311J50142n7580r1391K36573
3893a12679k62137K24583k32825O3668j34556K60760j08452m5811k1245K46712
3883a21982j28134K13208l11361J2665R6138j39833J06070J3445j45471J59804
3873b45451j33373j07557J73444q3827K82970k60356J44359l9722j2575p9549
3863c61637J76017j08334j55011R8286K0123j06040J07014O2768j7295p4917N4147
$$ y = [-8297, -87390, -258045, -245707, -385633, -63219, -71304, -174609, -64316, -179321, -254843, -201720, -207481, -253903, -295022, -255218, -241554, -240855, -309432, -278798, -230208, -177850, -232369, -161278, -307716, -137866, -205510, -204086, -402768, -136842, -287773, -137431, -230120, -224647, -135087, -132011, -292591, -48980, -233066, -325230, -457734, -350423, -200281, -257861, -349252, -112679, -374816, -150233, -383058, -319390, -453946, -193186, -301638, -347449, -368694, -121982, -250116, -36908, -348269, -335604, -239466, -379299, -273229, -259784, -405255, -245451, -378824, -486381, -312937, -396764, -113794, -374150, -229791, -269513, -282088, -361637, -185620, -293954, -448965, -350679, -330556, -436596, -329582, -266814, -284109, -359026, -304879]
3852c04879o6533J51384L7916k69466m181P9477p666o2091J59812J54334k01615
3841c33508N4791j05296k4317J08184Q4271K0089l30225J04315L84408m42743
3831d80031J54377j63803L07290k1672j81832j2634M580J99223r7400p1448O4713
3820b98637R5643o9600q4156R660p2269l533M1002k603K10952j19044Q761j89700
3808d73524J16911k59316J02733J53082j96579J10432J7038J83339k06797J65698
3798b86983k89783L18182k92882J73783j0867O2265q8014J09646j76692j5006
3788d96351M8109Q7882j2441l6067P1006j84263L3178Q6357j72158J34314J35902
3777c04532o5361k81688J84540P8506m9731K1194j10752J69307M760R476Q1276
$$ y = [-304879, -371412, -220028, -182112, -451578, -455759, -376282, -383948, -446039, -286227, -131893, -333508, -278717, -384013, -408330, -300146, -215875, -195786, -526011, -421696, -37288, -480031, -325654, -489457, -182167, -203839, -385671, -398305, -393725, -194502, -291902, -363350, -298637, -202994, -272594, -356750, -347090, -419359, -422892, -381890, -384493, -173541, -292585, -283824, -473524, -356613, -615929, -513196, -360114, -556693, -446261, -429223, -245884, -452681, -286983, -576766, -258584, -551466, -377683, -388550, -326285, -414299, -304653, -481345, -496351, -448242, -360360, -372801, -408868, -337862, -522125, -488947, -402590, -574748, -440434, -304532, -369893, -651581, -467041, -388535, -438266, -417072, -527824, -358517, -353757, -344281, -263005]
3766b63005j79899L9762r8479P5041L5011j1478O3713j42330R1864J51760m17662
3755f55702L47827k12379J92663o0491K1760j15237O1159m9138l8801J22414k14243
3744f00168K7715L35622j81013j5838M5210j11065l5610J00191j0672j535K9301
3733d17862l4148l9951P9544R283K2496L915P2458q5291j01862l1125M5694K52115
3721b24734j45377j15773r7568P9722J18166Q5891p4502j40816J79321p9063k04854
3710f19587P4703j03757K80769J0473j6697k9715J5440N5258L5909k51977P8420
3699d70761J44474j22012R5447j06509M6375k56262J42128P4191j5341J05797
3689c62473J00972k33106L7779K7482K15534j90953l4465j11881L6445R2637J88461
$$ y = [-263005, -442904, -403142, -501621, -426580, -391569, -403047, -339334, -481664, -389800, -238040, -655702, -307875, -520254, -327591, -388082, -366322, -481559, -420400, -469538, -508339, -385925, -600168, -572453, -236831, -417844, -433682, -388472, -499537, -535147, -434956, -445628, -447163, -417862, -452010, -491961, -412417, -403134, -380638, -376723, -304265, -389556, -491418, -522543, -476849, -224734, -370111, -485884, -583452, -503730, -385564, -299673, -374175, -514991, -335670, -414733, -619587, -544884, -648641, -367872, -357399, -374096, -403811, -388371, -333113, -297204, -549181, -470761, -326287, -448299, -352852, -459361, -412986, -669248, -527120, -452929, -468270, -362473, -261501, -494607, -456828, -429346, -213812, -404765, -439230, -551111, -514666, -422029, -233568]
3678b33568k89930k0196Q1346o4485J0898L2338r7321J06570K17092j62796J1564
3667d08488R160m9693p701j95465J15332J36262M34j8745P770J9343l9675q146
3655d39612j10103K47275o8786r1303L17l0665P9601J8661J09313k26796m8958
3644e61056R3176P5534q8090J50567o525o153j96028J24682J51427l51956k3671
3633f38093L17490n5511J2697n4893M0303p0582J37343k97087k0061K26906j19938
3622e21426J45959j00903K16924k95874J78913K1004j18201J00116j16441j8330
3612e08259N8308j26598J97078r7058R5353K01496l03921J55229j9050J28900
3602b18522k17404K7534k11496n2304K99556p3099K3482j54969R0983J95861j63904
$$ y = [-233568, -523498, -543694, -462348, -526833, -515935, -483597, -580918, -474348, -257256, -420052, -408488, -399328, -449021, -456722, -652187, -536855, -400593, -400159, -418904, -411134, -391791, -431466, -439612, -549715, -302440, -371226, -462529, -462212, -492877, -413276, -394615, -285302, -512098, -561056, -467880, -392346, -480436, -329869, -336394, -342547, -538575, -413893, -262466, -614422, -638093, -320603, -376114, -363417, -418310, -378007, -448589, -311246, -608333, -628394, -401488, -521426, -375467, -476370, -259446, -555320, -376407, -355403, -473604, -373488, -489929, -508259, -449951, -576549, -379471, -476529, -381176, -179680, -483601, -328372, -347422, -218522, -435926, -408392, -619888, -672192, -372636, -445735, -422253, -577222, -486239, -290378, -454282]
3591d54282o4101O6867Q4073J259j5174J71991n6080j31744l2956j54343J13818
3580d70672M2524j37912p2516L39539k65887K61050J11040j86558P766J5271M3847
3569c12508K35l3402o1743O1131j30258J15712Q8833j10556j6552J93409l21268
3558e26967L09701j16863n2349m3600j8310p3390K46181j16267J10421j22158
3548d03601K13747j87408J18043L2460j3844N595j33557J6671J55451j28603o1342
3537c86388K4520J2165J22759k17531Q9109L8792m0346O0084O8105l4804n9941
3526c23476K8243j24736Q9360k6001K6926Q1596n6960N1010J3568j83483K66000
3515a57953j83602M8323N2664k13057K24724l49921K59406O0573j37231J28192
$$ y = [-454282, -518383, -451516, -367443, -366184, -381358, -209367, -265447, -397191, -430147, -584490, -470672, -428148, -566060, -638576, -299037, -564924, -303874, -192834, -379392, -371626, -356355, -312508, -312273, -345675, -407418, -346287, -476545, -360833, -272000, -382556, -399108, -205699, -526967, -217266, -334129, -386478, -430078, -448388, -521778, -275597, -391864, -281443, -403601, -189854, -377262, -259219, -226759, -240603, -235008, -368565, -351894, -196443, -325046, -386388, -361868, -349703, -226944, -444475, -355366, -316574, -356920, -296836, -228731, -263535, -323476, -295233, -419969, -330609, -356610, -329684, -248088, -305048, -254038, -240470, -423953, -157953, -341555, -293232, -240568, -453625, -228901, -578822, -319416, -258843, -396074, -267882]
3505b67882J9815q624K3158p8128l2376j3974O5031L1198q5581K28758j45837
3494b64442k6779J06130j90609J25096j37996j33257K27334k04999J56635J72086
3484a70801j90826j46157J06002o001J46655j60290J73080p7247O9917L9906K9690
3473a86072j50622M5184j42670J8026J28079j6419j98061N6440K02381J60225
3463h3509k89038O0663j0480n9378Q5383k63117L97631j24510N5850j46718J32561
3452b44662o2184O5926j41168P5184J40475k53618M3637J40134K8425o4804o5466
3441c38121o0606J35944k00133R2636R0451R278J06466k86185K5566J18602J300
3430c04802n1730K28280q1477k15528m4722K49253j4195j56336J86444j26377
$$ y = [-267882, -248067, -256691, -233533, -311661, -344037, -358011, -292980, -261782, -347363, -118605, -264442, -291221, -185091, -375700, -250604, -388600, -521857, -294523, -499522, -342887, -170801, -361627, -507784, -401782, -407783, -261128, -421418, -248338, -325585, -255668, -215762, -186072, -336694, -291510, -434180, -416154, -288075, -304494, -502555, -446115, -243734, -83509, -372547, -311884, -322364, -381742, -296359, -559476, -161845, -286355, -230505, -377223, -244662, -306846, -240920, -382088, -306904, -166429, -420047, -376410, -236276, -207851, -272655, -338121, -398727, -262783, -462916, -370280, -279829, -270551, -164085, -450270, -424704, -306102, -304802, -356532, -128252, -209729, -425257, -469979, -220726, -234921, -391257, -204813, -331190]
3420c31190L8164m2238J56244J1675L5816j14573r5113p5205J17509m5034J78415
3409a65530O0837o6897k16910K05549j14321P6497m9957Q7016n9205j9649K28054
3398c4516l8400M1718q9951j32321N8147J81360j19396J99115k62979J92706Q5472
3387H0955j65192J45838j0022N7928K1311L363M7135L0207j6982q6484J28379
3376B36436p5792J57812p5602m6365q2163j22196L35536q570Q3390n2480M1039
3365C91045M4811j93336O3814N9183n1390q4741J51280l5560J5923L3117l820
3354C90326j0118o3814K04539R4391o0564r6092K23981o0345J78737K7160j1786
3343H16415K50612J52443o2120K66508J37827K36463J41207M72676L9873L48876
$$ y = [-331190, -293026, -335264, -179020, -167345, -131529, -246102, -341215, -416420, -298911, -343945, -165530, -104693, -171590, -388500, -182951, -297272, -220775, -270732, -183716, -242921, -262570, -34516, -72916, -31198, -121149, -253470, -195323, -13963, -133359, 65756, -197223, -4517, 80955, -84237, 61601, 51579, 109507, 130818, 134181, 181316, 211523, 194541, 108057, 236436, 160644, 318456, 242854, 196489, 114326, -7870, 327666, 319096, 402486, 350006, 391045, 435856, 242520, 306334, 365517, 314127, 229386, 380666, 345106, 361029, 394146, 390326, 380208, 316394, 520933, 615324, 554760, 458668, 682649, 622304, 801041, 828201, 816415, 1067027, 1219470, 1157350, 1423858, 1561685, 1798148, 1939355, 2412031, 2451904, 2800780]
3333B800780K49314O19144L73388L64368N44592P25857M94025N98617R77831J275182
3323I023098J511967J752140J668774J741602J777838J744808Q30472j044445
3315A9006254j687666j740473j084443j204361q41535r68243q91559q38885o08894
3306I140195q03987l78591p55574l37360j51478n43354l29563k05493l97159k03184
3296E034452j55459p6855k3215k33712j60070j08403J56056j68177j36005L3200
3286D161812n6671k07736R9985J66029j09066k6574J28413J7922r4070p5072K9053
3275D034025n1276J13353Q5307O3874j24819j56847n4558L60167J11643l62028
3265D018841J43106k64501r0421m1604r7623l66471O2599j69020K0284j97696
$$ y = [2800780, 3050094, 3669238, 4042626, 4406994, 4951586, 5677443, 6171468, 6770085, 7747916, 9023098, 10535065, 12287205, 13955979, 15697581, 17475419, 19220227, 20050699, 19006254, 17318588, 15578115, 14493672, 13289311, 12447776, 11479533, 10587974, 9749089, 9140195, 8336208, 7957617, 7202043, 6864683, 6713205, 6169851, 5840288, 5634795, 5237636, 5034452, 4878993, 4802138, 4778923, 4545211, 4385141, 4276738, 4432794, 4264617, 4128612, 4161812, 4105141, 3897405, 3997390, 4163419, 4054353, 4027779, 4156192, 4174114, 4080044, 4004972, 4034025, 3982749, 4096102, 4181409, 4245283, 4120464, 3963617, 3909059, 4269226, 4380869, 4018841, 4161947, 3897446, 3807025, 3765421, 3667798, 3301327, 3363926, 3194906, 3215190, 3017494]
3255C017494m9317K6391k06422J11548j27054j14262P8608L9307r5433r4451J81040
3244B767449k20987j0015j81318J05800j92581o0011j09393k6828l0408k890j37855
3233A900963o1006K46047k07192j54869m7791k9833j98343J4569M0616j31934
3223A371227N563M6666j35414j67955K6791J4808J34737l9031j43449J5774q1006
3212A048711L3137q9685K7889L8039j92019J12314j12798J41549P2086k0308p9449
3201I79466J00813j17397j16006J88372o8767p8530J8604J99893l39340J15510
3191H82618j61579J8574J82505J27072j01008l1696O4569j57452n3368N2250o095
3180H16390r9560R7479L8896k74509j84698J37468k3421J48314p1504j07427o095
$$ y = [3017494, 2968177, 2994568, 2788146, 2899694, 2772640, 2658378, 2736986, 2776293, 2680860, 2586409, 2767449, 2546462, 2536447, 2355129, 2460929, 2268348, 2208337, 2098944, 2072116, 2041708, 2038818, 1900963, 1839957, 2086004, 1878812, 1723943, 1676152, 1646319, 1447976, 1462545, 1503161, 1371227, 1376790, 1423456, 1288042, 1120087, 1146878, 1161686, 1296423, 1257392, 1113943, 1129717, 1048711, 1081848, 992163, 1020052, 1058091, 866072, 978386, 865588, 1007137, 1079223, 1058915, 979466, 1080279, 962882, 846876, 1035248, 966481, 887951, 906555, 1106448, 767108, 882618, 721039, 739613, 922118, 1049190, 948182, 916486, 981055, 823603, 770235, 822485, 816390, 716830, 814309, 853205, 578696, 393998, 531466, 508045, 656359, 584855, 477428, 471333]
3169D71333N3714l37934P3895r3948K98733P2259j38190K3982r2733N9899M8672
3158D39682O0257j74269L2360M8915j10578L4151q8973k8372J52716k16707J07963
3147B57145j25656L5183R6609j16937M4570n394j53685L10850j62162j0694N2101
3136B21930j77468O0785r2508L8031r1736J13754j15760K2926K3642j06911Q5570
3125a7745r2525K30813j07045p8225n6978o9805R8124R7108P0682k17176n6663
3114a99435n4323J94733J15223q9905n4397j04353J92413m5240p8362j12398R4729
3103a41315J61395j6541q2534j85482J33406l1804K8016M0802l2015N2491o8812
3092a42393K67742k42755J26260k35988n504R332K9818J5987n3643J03760o0964
$$ y = [471333, 525047, 187113, 261008, 167060, 465793, 538052, 399862, 423844, 331111, 391010, 439682, 499939, 325670, 358030, 406945, 296367, 330518, 241545, 213173, 365889, 149182, 257145, 131489, 166672, 263281, 146344, 190914, 185520, 31835, 342685, 180523, 169829, 221930, 44462, 105247, 12739, 50770, -40966, 72788, -42972, -20046, 3596, -103315, -17745, -110270, 120543, 13498, -64727, -121705, -191510, -93386, 3722, 74404, -142772, -199435, -253758, -59025, 56198, -33707, -88104, -192457, -44, -45284, -123646, -236044, -141315, 20080, 3539, -78995, -264477, -131071, -162875, -134859, -94057, -126072, -73581, -142393, 125349, -117406, 8854, -227134, -232638, -223306, -193488, -177501, -231144, -127384, -188348]
3081a88348j247J6313O002M1777O834j04049q3223J68717J31390n1638m0650k15949
3069c14071J82864r9768M8242P1185j48892j03332K80907j76551N0652j0783J21190
3058i8357p8624l07501K59817m845j8988Q3994j23352N7711j5226j71828J57408
3047b59791J36672j70706q3580J68269m4504J7005Q2988m4362K1964j49958Q2283
3036b43720J17507p9681J1886l34034L46513j55594o4988L07423q9177j31308
3026c15173j3621N6445J89007j87670k4196j42289R3162J73555j24066L4561k9983
3015b90268J51657k02440K00242l2745j11920K34343k24383L8934J04300j87760
3005c20040M3141k14786Q1119K8606J4239r377K21459k05757J7567J22202P4077
$$ y = [-188348, -189595, -173282, -167280, -125503, -118669, -222718, -305941, -137224, -5834, -57472, -98122, -314071, -131207, -230975, -182733, -111548, -260440, -363772, -82865, -259416, -208764, -219547, -98357, -176981, -484482, -224665, -229510, -248498, -164504, -287856, -230145, -245371, -417199, -259791, -123119, -293825, -377405, -209136, -253640, -236635, -153647, -198009, -176045, -326003, -243720, -126213, -205894, -194008, -528042, -181529, -337123, -402111, -94688, -183865, -315173, -328794, -272349, -83342, -271012, -295208, -437497, -344335, -170780, -294846, -260285, -290268, -138611, -341051, -140809, -173554, -285474, -51131, -275514, -236580, -132280, -320040, -276899, -491685, -410566, -381960, -367721, -377098, -155639, -361396, -343829, -221627, -147550]
2994a47550n8176j07454L2158j3586l9369j53304M9320J19763r834q1355J94500
2983b14887r492q2129j6265j1747k1713J11193o4354q3552M9716O113Q5236n9954
2971c11835N0740j32650J88206j51590L5868J5280R1896j00531j16986j0846J66644
2960b75804j21842K02379j35743P369O1756o8571P2434J23643k03071N9967k0446
2949b97929O748J8270j76794J27211P5637O2931k72828O4253K3981K23030j25852
2938b71342j07988Q1255o0702N5433J68644l44003J39895m0741J51790q0544k0385
2927c28688J4266j73832K50824k87294K13455R3999l11520L49189k24454J6165
2917c87890J4681J07539q9022J24781r2518j37597m6636K39622J01414j32442
$$ y = [-147550, -205726, -313180, -281022, -294608, -333977, -487281, -437961, -318198, -328032, -409387, -214887, -224379, -306508, -322773, -334520, -356233, -245040, -309394, -392946, -343230, -337117, -251881, -311835, -261095, -393745, -205539, -357129, -321261, -305981, -214085, -314616, -431602, -442448, -275804, -397646, -195267, -331010, -323641, -261885, -330456, -258022, -134379, -337450, -277483, -297929, -291181, -272911, -449705, -322494, -246857, -183926, -456754, -392501, -368520, -145490, -271342, -379330, -298075, -358777, -303344, -134700, -478703, -338808, -379549, -227759, -308303, -328688, -314422, -488254, -237430, -524724, -311269, -217270, -528790, -179601, -404055, -387890, -373209, -265670, -354692, -229911, -322429, -460026, -506662, -267040, -165626, -298068]
2907b98068Q363k4501R682N8446m9885L1928j56081P8916O0357j16105K22716
2896a74232q5874J13644l07660K18606j9726j61699Q397m3259K05652j01324Q09
2885c46666k061N3033L0487J30441j44003L5740l14807K89268R1922L6518k34101
2874c74229J48451q124j9863J4506j76893K64459o2140j16203O2951k9990l3327
2863c30402J109n8304L4002P513R0433K9995j16977r2414Q5599K3959K04197j67137
2851b88427l927l8602m4949L716J07013r1507J29920Q8210l6258j73316l997o0874
2839d12998K28718q5360j66228M75O7693R7415l857j23594K12873j89786K7664
2828c46985P5617m5486J13064k74907J06954J75840k37664J42439m0106k478J03424
$$ y = [-298068, -289705, -314206, -304524, -246078, -295963, -264035, -420116, -341200, -280843, -396948, -174232, -260106, -146462, -454122, -235516, -255242, -416941, -408544, -451803, -246151, -347475, -346666, -348727, -295694, -265207, -134766, -278769, -243029, -557836, -268568, -176646, -140128, -374229, -225778, -233902, -253765, -239259, -416152, -151693, -213833, -330036, -267085, -297075, -330402, -329293, -387597, -353595, -346082, -255649, -225654, -342631, -435045, -349446, -325487, -121290, -288427, -292354, -330956, -375905, -372189, -265176, -356683, -226763, -138553, -174811, -348127, -352124, -412998, -184280, -269640, -435868, -435393, -367700, -270285, -274142, -397736, -184863, -374649, -346985, -271368, -316854, -203790, -478697, -371743, -195903, -433567, -291128, -331234, -333712, -230288]
2817b30288j41829K93853k24182n884Q7979K8308J00712k21996J35498j26705
2807c04534n288M7242j04442J29233j40006K6999J29490j76003O9272M8194K8971
2796b50872O6457j0989j29892Q1483q7481m5071k0274J01732M0138k1495m8364
2785c24628N2379p072J2343r7094P7438j75585K95510L8035j97059k5703M1246
2774c10190M9569O8903M818j58596N7216K09461p6945k64133J23754P7172k08359
2763d27330K36251j32660N8179q0865j15080J21508j33801K87815k51508K6754
2753d10737P8364L8066L446p9614J21174m0504n7490J09525J0865j19218m3512
2742c89635J33001j07986K27217k43761k9971J85276j23713Q2017Q216j02793
$$ y = [-230288, -372117, -78264, -302446, -308330, -220351, -192043, -91331, -313327, -177829, -304534, -309822, -262580, -367022, -237789, -377795, -350796, -221306, -397309, -328037, -279843, -250872, -184415, -195404, -325296, -243813, -331294, -376365, -396639, -294907, -254769, -276264, -324628, -272249, -279321, -266978, -364072, -286634, -462219, -166709, -128674, -325733, -351436, -310190, -260621, -191718, -186900, -345496, -288280, -78819, -155764, -419897, -296143, -218971, -427330, -191079, -323739, -265560, -346425, -461505, -339997, -473798, -185983, -437491, -410737, -332373, -294307, -290861, -370475, -249301, -289805, -347295, -237770, -226905, -346123, -389635, -256634, -364620, -137403, -381164, -411135, -225859, -349572, -267555, -259339, -362132]
2732c62132m8587K50345k06564J27227K9818j31472O4694N6737j73118J33275
2722b59777j3314J2461O0658m9279p4208J3157J41382k10394j1653M7142N4568
2711b89257J60764p8377p6414M4733q3469n0173K32575n3343k51895K93104j19438
2700b71190p4507L6086R449j4587R0427n8541n4207N5989P4696n7554J69301l29042
2688d23680K36689n3459J7177J29510q4512q0565k87305K09224N7882Q3808k39417
2677d34648Q2159O0946n7255J9801P3005L8443l1047k4710O1901j53777L06514
2666e8668l13573P3088L03636l82894P4090o9953J52618j22649J98321p8272j9253
2655b43509k7623K7210j24870J30071j55966Q0690o931O9008j03976J68088o2707
$$ y = [-362132, -410719, -160374, -366938, -239711, -209893, -341365, -276671, -219934, -393052, -259777, -273091, -260630, -199972, -249251, -323459, -310302, -168920, -379314, -390967, -343825, -289257, -128493, -206870, -283284, -238551, -322020, -372193, -139618, -192961, -444856, -151752, -271190, -345697, -309611, -300162, -314749, -224322, -282863, -337070, -281081, -206385, -263939, -94638, -423680, -186991, -240450, -223273, -93763, -178275, -258840, -546145, -336921, -279039, -195231, -434648, -352489, -291543, -348798, -328997, -255992, -217549, -248596, -273306, -211405, -365182, -58668, -372241, -299153, 4483, -378411, -304321, -374274, -221656, -344305, -145984, -224256, -243509, -271132, -243922, -368792, -238721, -394687, -313997, -320928, -251920, -355896, -187808, -250515]
2644b50515K0113l3580J18633k31968M2755M4000j5658P5244M1449j14108P9514
2633b24121k13729J93593j5163k48424K16750p3706J94283j74651J63015K7732
2623a54421j17609K0373K5764r1423K55936r0718o6391k71440P6325J06972j6288
2612c22920m1145J16374P5416k6268N002k40461M2765K51103q8873r3588j5734
2601c38329q0889K97666k3179j07410r7858L9143P3539Q1034k5775p5012j77953
2590d35023N4244Q194l9675J37760j2724n7357J60495k80239M16514l03600M4962
2579c06449J15153j75703R6322R0283j62828K25917j46153Q5944n9141l9934o8512
2568c45101k5515j7604J74690q704j42457J08515n8336J5753K6417o8887J46773
$$ y = [-250515, -230402, -263982, -145349, -377317, -334562, -290562, -306220, -230976, -189527, -303635, -224121, -437850, -244257, -259420, -507844, -291094, -364800, -170517, -345168, -182153, -154421, -272030, -251657, -225893, -317316, -61380, -152098, -218489, -489929, -413604, -306632, -322920, -364065, -247691, -172275, -198543, -193541, -434002, -391237, -140134, -229007, -322595, -338329, -419218, -121552, -144731, -252141, -349999, -310856, -237317, -156283, -182058, -257070, -435023, -380779, -372585, -412260, -274500, -287224, -344581, -184086, -464325, -47811, -351411, -306449, -191296, -366999, -270677, -180394, -343222, -117305, -263458, -177514, -236655, -276589, -345101, -370616, -388220, -213530, -222234, -364691, -256176, -314512, -298759, -272342, -341229, -194456]
2557a94456l3903o4175n5445o8253k5991J25726J9668j8477J9434k1708q5303
2546d02883J10290J52642o8137M2270k11494Q9772L6258l8648R5973l0399o1891
2535b86247K5503N2611j30796J56647r9465J20214j70402O36388o42380J99621
2525a38306o7477j90331K33575o1872m315O772j51081J44294M1263j31517n4561
2514c73556K4093J11174j42905K1708K05481j88710O7877J46077j34262k12781
2504d75804M01686j84658J09184P343j55385L1695j66714K12806j19266R5934
2494b43179J17366j11061k4346L0645j8405o6421k3294J38405K9982j72219P4472
2483b68055N0400r2795l6215J62335j991j40965J71476j59428J1827K10173r5950
$$ y = [-194456, -228359, -292534, -347979, -416232, -442223, -316497, -296829, -315306, -295872, -317580, -402883, -292593, -139951, -208088, -165818, -377312, -287540, -251282, -289930, -193957, -224356, -286247, -260744, -208133, -338929, -182282, -281747, -161533, -331935, 304453, -337927, -138306, -205783, -396114, -162539, -224411, -228726, -221954, -373035, -228741, -187478, -318995, -373556, -349463, -238289, -381194, -359486, -154005, -342715, -274838, -128761, -263023, -475804, -74118, -258776, -149592, -142249, -297634, -265939, -432653, -219847, -339113, -243179, -125813, -236874, -261220, -230575, -248980, -315401, -338695, -200290, -170308, -342527, -268055, -217655, -310450, -346665, -184330, -186321, -327286, -155810, -315238, -303411, -93238, -189188]
2472a89188m4388p8270P1056j29098K78058j69433K9202J22749q0290n5935l3019
2461b78556j80132J96781j13642J38402J50543k41074M0921P5517J1814l5093
2451b34519q5631M0686Q0062p4290J47644k3906k73449K01985m0489R929J26901
2440a25077k33547L0537n1875n2159J0974J564J80176P0431p0059L184N3772p4127
2428b56206P3080j50822m4847J76138K2782m6867J40141r0803q1563m8812o6393
2417c74172N1972Q6032m2541k1945K1561R525J1594L9664o7574J9784M4274R7356
2405a24470q885j2818j54049N6399m340j13452J09274J37090L2309j50962l494
2394b37398P7355n4891K4672Q4508k03243J45722j66087q9023J65871o953j29906
$$ y = [-189188, -233576, -311846, -240790, -369888, -91830, -261263, -232061, -109312, -189602, -245537, -278556, -458688, -261907, -375549, -237147, -86604, -327678, -286757, -211240, -199426, -234519, -320150, -279464, -199402, -273692, -126048, -149954, -423403, -221418, -261907, -251978, -125077, -358624, -328087, -379962, -432121, -421147, -419583, -239407, -168976, -239035, -235851, -182079, -256206, -183126, -333948, -378795, -202657, -179875, -226742, -86601, -177404, -258967, -307779, -374172, -322200, -236168, -278709, -300654, -279093, -269568, -257974, -218310, -285884, -266100, -221826, -124470, -133355, -146173, -300222, -243823, -248163, -361615, -252341, -115251, -82942, -233904, -237398, -160043, -214934, -190262, -105754, -308997, -163275, -329362, -418385, -252514, -259467, -389373]
2383c89373J32434J37525l01979J54924p7385J79025m6205n6213Q4269l2136r6801
2372c11915J13747l2371j15864Q2779n0783N9575j09833J67024r5074O6800j9687
2361b45602j52875J03453M8208K8225P0648j46447r4872K32577j25772j6931N6039
2350b43349j37590J91061k78507P4550J72127o3447l9227O8430J19264l5215j01210
2339b73113r384N5349k3795m1252j717k3716J9553J29074j17736R5678o2795O221
2327b47633K9454j22139N3102j72433K10733j89793K19145J41454j74467j15664
2317c68241J77408r217j13020Q0571K1686j47244K33250j69470n6911L5573m7203
2306c62818P4051M285O0232L6050J8726n8781j68921L992K87342l36845J90536
$$ y = [-389373, -256939, -119414, -421393, -266469, -343854, -164829, -211034, -267247, -182978, -215114, -311915, -198168, -230539, -346403, -263624, -314407, -254832, -364665, -197641, -292715, -225915, -245602, -398477, -295024, -246816, -218591, -147943, -294390, -389262, -156685, -282457, -299388, -243349, -380939, -189878, -468385, -393835, -221708, -285155, -324382, -255952, -136688, -171903, -273113, -282497, -227148, -250943, -292195, -293912, -317628, -298075, -169001, -286737, -191059, -253854, -247633, -218179, -340318, -287216, -459649, -248916, -438709, -219564, -78110, -252577, -368241, -190833, -200050, -313070, -232499, -210813, -358057, -124807, -294277, -351188, -315615, -362818, -288767, -284482, -224250, -188200, -169474, -228255, -397176, -393184, -105842, -442687, -252151]
2295b52151p0292J58068k3071k491J48089j74021J05963j33853J09015O7968k78559
2284c45335J97635P1992l41960J52905R7202r5453j16056o333K31528j12220p0847
2273c36942R5458J02186K7024m0706M18l6911p9725J71883j75137L413J8136J16910
2261a33993q0367j8875J59963k12040O9598J5620N826r0403J09583j53863K33167
2250i5784j93865J13467l13290K41923M5767J57351j75909n6197J82149k35730
2240c30118K23244k54988L06027o0158j44495J1690J09136j78125Q3101j13133
2230c47819J42860j29746K38886j57806k3532j20669O9401K00001k06890K67936
2220f7378j01930O4007o4658j75838N0500M8366m8274j2912K16684q1226k04916
$$ y = [-252151, -322443, -164375, -187446, -189937, -41848, -215869, -109906, -243759, -134744, -66776, -345335, -147700, -75708, -417668, -264763, -167561, -263014, -379070, -385403, -153875, -266095, -336942, -241484, -139298, -112274, -152980, -152562, -189473, -269198, -97315, -272452, -269039, -250903, -133993, -214360, -233235, -73272, -285312, -215714, -200094, -194268, -284671, -175088, -328951, -95784, -289649, -176182, -489472, -247549, -201782, -44431, -220340, -276537, -94388, -330118, -106874, -361862, -55835, -115993, -260488, -248798, -139662, -317787, -234686, -347819, -204959, -334705, -95819, -253625, -277157, -397826, -328425, -128424, -335314, -67378, -169308, -105301, -169959, -345797, -295297, -246931, -295205, -308117, -91433, -172659, -377575]
2209c77575L63773l32585J54268J70727m28977O1449J61210j92145J94272K8326
2199a97257j6618J46605j37128j79809K34324N8231j56272N2454r4261J72620
2189a17111q0197L2355m2310O8965k9941O9655o3860o5682n7552R9176j0868l4823
2177b32193p8654j3883L9752L8372l2451Q9082q6840P2297j02387P5736q1588
2166c12757L0702R5628j05183J38224j13714j04103k7767K12471O3660m5004j37116
2155c04959p3748K41133j47221R9103j08735k5274J26881J10958j20874j6037
2145b18773J3938J24829n8244J4853K8763j96562P3810M6935m5728Q846K41043
2134C3710o8701k08566p8007J45879K3579k16728J29442J12537o1087j1908j25152
$$ y = [-377575, -13802, -346387, -192119, -21392, -450369, -388920, -227710, -419855, -225583, -197257, -213875, -67270, -204398, -384207, -149883, -91652, -247924, -195470, -289731, -117111, -197308, -164953, -207263, -138298, -168239, -98584, -162444, -228126, -285678, -186502, -197370, -232193, -310847, -324730, -284978, -246606, -279057, -189975, -276815, -204518, -306905, -231169, -312757, -282055, -186427, -291610, -153386, -267100, -371203, -398970, -186499, -122839, -167843, -304959, -378707, -137574, -284795, -185692, -294427, -319701, -192820, -81862, -202736, -218773, -204835, -80006, -138250, -123397, -94634, -291196, -217386, -170451, -216179, -207333, 33710, -34991, -243557, -321564, -175685, -152106, -368834, -239392, -126855, -187942, -199850, -325002]
2123c25002R7917q7348J00446j08769N0527M6944j03986J30108O3245M4523L169
2112h8226j33773J39572j59733o5891O4577Q688Q3308j24460k8781K3054M4080
2101b37585m2490M7612J5728J46625j87087m6531m2782J6975K13851j58562K38729
2090c5517k04411J27058j28284K97662m85201K59432J53977k24369J3768l9547
2080b65432J72604j50988J2706M9015j529o7604O3102m2468Q1339L5942j2189
2069a25502k02881N2703N9032Q8964r2134j64988K49173j43261k6719K26130j58552
2058b38035o4352P6483J52304l1182J48155m67675L32546j59147j28337J5207
2048c64033J27422r4634R0456M5778p4911J37581p6791l123Q5333j61646P6379
$$ y = [-325002, -227085, -314433, -213987, -322756, -272229, -225285, -329271, -199163, -135918, -91395, -88226, -221999, -82427, -242160, -308051, -243474, -234786, -151478, -275938, -304719, -281665, -237585, -280075, -232463, -216735, -70110, -257197, -303728, -346510, -329535, -115684, -274246, -35517, -239928, -112870, -241154, 56508, -428693, -169261, -15284, -239653, -225885, -265432, -92828, -243816, -231110, -182095, -183624, -251228, -188126, -230594, -149255, -113313, -125502, -328383, -275680, -216648, -127684, -219818, -384806, -135633, -278894, -305613, -79483, -238035, -302387, -225904, -73600, -104782, 43373, -424302, -91756, -250903, -379240, -364033, -236611, -331245, -240789, -195011, -269922, -132341, -209132, -212255, -126922, -288568, -212189]
2037b12189o9969p2324K34601R1979k80899J77012j56845J65213j4915k55697
2027c94033J58035n4812J15904j26214K70310j92549N2521l4527L1092N9712j29114
2016b43675M1803j44725J67001J21728j97537o7933K85540j77673J67572j92453
2006b40352K95827j27436R129j88665K03823j06651j19878O4078r0203K02228
1996i8100k30896K42366r1032N5869J9034k0207j20949L4274J80118j96002O3632
1985a61893j38312J37972r88k96985K32694K48628o386k77968P3843o5614L1844
1974b23165l2826O9839j3782R6199j31936J8065q3242Q1047j23826K12685l9232
1963a70174M0881P5366k51630J07457k4769k3813J58534O6863j34804k35082J10556
$$ y = [-212189, -282158, -354482, -119881, -27902, -308801, -131789, -288634, -123421, -138336, -394033, -235998, -290810, -174906, -301120, -30810, -223359, -170838, -205365, -174273, -114561, -243675, -201872, -346597, -179596, -57868, -255405, -323338, -37798, -215471, -47899, -240352, 55475, -71961, -62832, -251497, -47674, -154325, -274203, -210125, -300328, -98100, -328996, -86630, -177662, -121793, -102759, -122966, -243915, -209641, -29523, -225525, -161893, -300205, -162233, -163221, -460206, -227512, 21116, 14730, -263238, -189395, -255009, -223165, -255991, -186152, -199934, -103735, -235671, -217606, -300848, -219801, -343627, -130942, -170174, -129293, -53927, -305557, -198100, -222869, -246682, -88148, -21285, -156089, -391171, -280615]
1952b80615N1551Q4546j6606m1831J41631n292j93126M928J43192j69407n7088
1941c38117K55859J4645j79668j00175J01626r1356J19901L8126j28733j00803
1931d08695J70799p2054J02997o5487J9197K7564o0089q9986K51469j38395K9093
1920b33587J57156O4106m7311j40866j68585Q9315o8476K23293R2339j90483n67
1909b23666J58077j92473j42998L02616r4514K6313N5693k08181Q1184P7458K9529
1898a30962J53424k97802N3207n1778J26686J44974k45141K40623j74775J28261
1888e3283j83299p9336L299J67620o6638K0147k5050K44098j10252q9280j18040
1877b90014K35247j16830k41598K64998J5169P666j67728p1923K57410j45740
$$ y = [-280615, -229064, -144518, -161124, -202955, -61324, -66616, -259742, -254814, -111622, -281029, -338117, -82258, -67613, -247281, -347456, -245830, -337186, -217285, -179159, -307892, -408695, -237896, -309950, -206953, -272440, -253243, -225679, -285768, -375754, -124285, -262680, -233587, -76431, -12325, -59636, -200502, -369087, -279772, -348248, -124955, -32616, -223099, -223666, -65589, -258062, -401060, -98444, -192958, -166645, -110952, -319133, -237949, -160491, -130962, 22462, -275340, -222133, -273911, -147225, -2251, -247392, -6769, -181544, -53283, -236582, -315918, -312619, -144999, -211637, -191490, -216540, 27558, -82694, -171974, -290014, -54767, -171597, -413195, -148197, -133028, -125362, -293090, -365013, -107603, -253343]
1867b53343R9406J91161k45634J52512K1317m8248R8960j01789k07097J18944
1857a73811m211p5874Q6130J47721j03729j27674R2233k286M1960k9123j27037
1846b75701j01847J37238N7422j5979J07394j58748j77896J01455K00021o6453
1836a93094o7771O1947j79469n8947K06488p1591p3053L90893k89000O8680j25582
1825c30499K30658j27414P3362j00141K69733j76591j55908N9567Q8596k2855
1815a91492o3874L1835m59n9615L2399j50095K69661R8053m40860L17146q644
1804a65945o8735J22137M2473j35877j89556K41265k7431n9563M9571j90716R9306
1793b83071n5154l0755J14954n7967K46294k17659J28215j93420J90267n1921
$$ y = [-253343, -153937, 37224, -208410, -55898, -34581, -82829, 16131, -85658, -292755, -173811, -178022, -253896, -167766, -20045, -123774, -251448, -159215, -161501, -119541, -148664, -275701, -377548, -240310, -182888, -198867, -91473, -250221, -428117, -326662, -126641, -193094, -260865, -198918, -378387, -437334, -230846, -302437, -375490, 15403, -273597, -204917, -330499, -99841, -227255, -153893, -254034, 15699, -160892, -316800, -257233, -168637, -191492, -255366, -223531, -223990, -283605, -251206, -401301, -131640, -33587, -474447, -157301, -165945, -234680, -112543, -70070, -205947, -395503, -154238, -181669, -241232, -191661, -382377, -283071, -338225, -368980, -254026, -311993, -65699, -283358, -155143, -348563, -158296, -210217]
1783b10217L544L7531J63661j35245j95736J62507j1332j1699j14738J01356j30945
1772c41313K21482j46951O5847M4978J52017j62686N9842k311M9628k67788J77076
1761a50179j61458k0577J27028J34747k02880l4762q5509J12414J48798l5389
$$ y = [-210217, -206673, -169142, -5481, -140726, -336462, -173955, -185287, -196986, -311724, -210368, -341313, -119831, -266782, -200935, -155957, -3940, -166626, -106784, -109095, -59467, -327255, -150179, -311637, -332214, -205186, -70439, -273319, -308081, -393590, -281176, -132378, -167767]
$$ [...]
##END NTUPLES=NMR SPECTRUM
##END=
