##TITLE=abcd
##JCAMPDX= 6.0         $$ Bruker NMR JCAMP-DX V2.0
##DATA TYPE= NMR SPECTRUM
##DATA CLASS= NTUPLES
##ORIGIN= UXNMR, Bruker Analytische Messtechnik GmbH
##OWNER= root
$$ XWIN-NMR		Version 3.5
$$ Mon Aug 25 18:50:45 2025 Russian Standard Time (UT+4h)  servis@DPX200
##.OBSERVE FREQUENCY= 200.131235884673
##.OBSERVE NUCLEUS= ^1H
##.ACQUISITION MODE= SIMULTANEOUS
##.ACQUISITION SCHEME= undefined
##.AVERAGES= 32
##.DIGITISER RES= 18
##SPECTROMETER/DATA SYSTEM= spect
##.PULSE SEQUENCE= zg
##.SOLVENT NAME= CDCl3
##.SHIFT REFERENCE= (INTERNAL, CDCl3, 0, 16.4885)
##AUDIT TRAIL= $$ (NUMBER, WHEN, WHO, WHERE, WHAT)
$$ ##TITLE= Audit trail, XWIN-NMR		Version 3.5
$$ ##JCAMPDX= 5.01
$$ ##ORIGIN= Bruker BioSpin GmbH
$$ ##OWNER= servis
$$ F:\spectra/data/av/nmr/H1/1/pdata/1/auditp.txt
$$ ##AUDIT TRAIL=  $$ (NUMBER, WHEN, WHO, WHERE, WHAT)
(   1,<2025-08-25 18:45:58.18 +0400>,<servis>,<DPX200>,
      <created by zg, POWCHK disabled, PULCHK disabled
       configuration hash MD5:
       00 E9 B6 7A A2 85 ED C7 34 08 36 98 17 FE 4E 26
       data hash MD5: 32K
       A2 66 1F 66 94 5A 09 5C 33 15 65 01 92 8C EA 23>)
(   2,<2025-08-25 18:49:53.76 +0400>,<servis>,<DPX200>,
      <Start of raw data processing
       efp BC_mod = 2 LB = 0.05 FT_mod = 6 PKNL = 1 PHC0 = -275.9419 PHC1 = 0.101552 SI = 16K 
       data hash MD5: 16K
       81 48 BC B3 83 FD 70 1C CF AE AF 04 90 18 63 87>)
$$ ##END=
$$ 
$$ hash MD5
$$ 62 85 87 3E 56 91 E0 5F 66 61 74 D3 55 47 E8 37
##$RELAX= 
##$RELAX= 
##$RELAX= 
##$RELAX= 
##$RELAX= 
##$RELAX= 
##$RELAX= 
##$RELAX= 
$$ Bruker specific parameters
$$ --------------------------
##$DU= <F:\spectra>
##$EXPNO= 1
##$NAME= <H1>
##$PROCNO= 1
##$TYPE= <nmr>
##$USER= <av>
##$AMP= (0..31)
100 100 100 100 100 100 100 100 100 100 100 100 100 100 100 100 100 100 
100 100 100 100 100 100 100 100 100 100 100 100 100 100 
##$AQSEQ= 0
##$AQ_mod= 1
##$AUNM= <au_zg>
##$AUTOPOS= <>
##$BF1= 200.13
##$BF2= 200.13
##$BF3= 200.13
##$BF4= 200.13
##$BF5= 500.13
##$BF6= 500.13
##$BF7= 500.13
##$BF8= 500.13
##$BYTORDA= 1
##$CFDGTYP= 0
##$CFRGTYP= 5
##$CHEMSTR= <none>
##$CNST= (0..31)
1 1 145 1 1 1 1 1 1 1 1 1 1 1 1 1 1 1 1 1 1 1 1 1 1 1 1 1 1 1 1 1 
##$CPDPRG= <>
##$CPDPRG1= <>
##$CPDPRG2= <>
##$CPDPRG3= <>
##$CPDPRG4= <mlev>
##$CPDPRG5= <mlev>
##$CPDPRG6= <mlev>
##$CPDPRG7= <mlev>
##$CPDPRG8= <mlev>
##$CPDPRGB= <>
##$CPDPRGT= <>
##$D= (0..31)
0 2 0 0 0 0 0 0 0 0.06 0 0 0 0 0 0 0.0002 0 0 0 0 0 0 0 0 0 0 0 0 0 0 
0 
##$DATE= 1756133157
##$DBL= (0..7)
120 120 120 120 120 120 120 120 
##$DBP= (0..7)
150 150 150 150 150 150 150 150 
##$DBP07= 0
##$DBPNAM0= <>
##$DBPNAM1= <>
##$DBPNAM2= <>
##$DBPNAM3= <>
##$DBPNAM4= <>
##$DBPNAM5= <>
##$DBPNAM6= <>
##$DBPNAM7= <>
##$DBPOAL= (0..7)
0.5 0.5 0.5 0.5 0.5 0.5 0.5 0.5 
##$DBPOFFS= (0..7)
0 0 0 0 0 0 0 0 
##$DE= 6
##$DECBNUC= <off>
##$DECIM= 32
##$DECNUC= <off>
##$DECSTAT= 4
##$DIGMOD= 1
##$DIGTYP= 9
##$DL= (0..7)
0 120 120 120 120 120 120 120 
##$DP= (0..7)
150 150 150 150 150 150 150 150 
##$DP07= 0
##$DPNAME0= <>
$$ [...]
##$SUBNAM4= <"">
##$SUBNAM5= <"">
##$SUBNAM6= <"">
##$SUBNAM7= <"">
##$SUBNAM8= <"">
##$SUBNAM9= <"">
##$SW= 20.6817932712277
##$SWIBOX= (0..15)
0 0 3 0 0 0 0 0 0 0 0 0 0 0 0 0 
##$SW_h= 4139.07284768212
##$TD= 32768
##$TD0= 1
##$TE= 0
##$TE2= 300
##$TE3= 300
##$TEG= 300
##$TL= (0..7)
0 120 120 120 120 120 120 120 
##$TP= (0..7)
150 150 150 150 150 150 150 150 
##$TP07= 0
##$TPNAME0= <>
##$TPNAME1= <>
##$TPNAME2= <>
##$TPNAME3= <>
##$TPNAME4= <>
##$TPNAME5= <>
##$TPNAME6= <>
##$TPNAME7= <>
##$TPOAL= (0..7)
0.5 0.5 0.5 0.5 0.5 0.5 0.5 0.5 
##$TPOFFS= (0..7)
0 0 0 0 0 0 0 0 
##$TUNHIN= 0
##$TUNHOUT= 0
##$TUNXOUT= 0
##$USERA1= <user>
##$USERA2= <user>
##$USERA3= <user>
##$USERA4= <user>
##$USERA5= <user>
##$V9= 5
##$VALIST= <valist>
##$VCLIST= <CCCCCCCCCCCCCCC>
##$VD= 0
##$VDLIST= <DDDDDDDDDDDDDDD>
##$VPLIST= <PPPPPPPPPPPPPPP>
##$VTLIST= <TTTTTTTTTTTTTTT>
##$WBST= 1024
##$WBSW= 30
##$XGAIN= (0..3)
0 0 0 0 
##$XL= 0
##$YL= 0
##$YMAX_a= 194033
##$YMIN_a= -180056
##$ZGOPTNS= <>
##$ZL1= 120
##$ZL2= 120
##$ZL3= 120
##$ZL4= 120
##$ABSF1= 0
##$ABSF2= 0
##$ABSG= 0
##$ABSL= 0
##$ALPHA= 0
##$AQORDER= 0
##$ASSFAC= 0
##$ASSFACI= 0
##$ASSFACX= 0
##$ASSWID= 0
##$AUNMP= <proc_1d>
##$AZFE= 0.1
##$AZFW= 0.1
##$BCFW= 0
##$BC_mod= 2
##$BYTORDP= 0
##$COROFFS= 0
##$CY= 18.4799938201904
##$DATMOD= 1
##$DC= 0
##$DFILT= <>
##$DTYPP= 0
##$F1P= 9.9274215381318
##$F2P= -0.165520771350173
##$FCOR= 1
##$FTSIZE= 16384
##$FT_mod= 6
##$GAMMA= 0
##$GB= 0
##$INTBC= 1
##$INTSCL= 4.127829e-11
##$ISEN= 128
##$LB= 0.05
##$LEV0= 0
##$LPBIN= 0
##$MAXI= 10000
##$MC2= 0
##$MEAN= 0
##$ME_mod= 0
##$MI= 50
##$NCOEF= 0
##$NC_proc= -9
##$NLEV= 6
##$NOISF1= 3.799351
##$NOISF2= 2.8
##$NSP= 0
##$NTH_PI= 0
##$NZP= 0
##$OFFSET= 16.48848
##$PC= 4
##$PHC0= -275.9419
##$PHC1= 0.101552
##$PH_mod= 1
##$PKNL= yes
##$PPARMOD= 0
##$PSCAL= 4
##$PSIGN= 0
##$REVERSE= no
##$SF= 200.130005582386
##$SI= 16384
##$SIGF1= 3
##$SIGF2= 2
##$SINO= 400
##$SIOLD= 16384
##$SREGLST= <1H.CDCl3>
##$SSB= 0
##$STSI= 16384
##$STSR= 0
##$SW_p= 4139.07284768211
##$SYMM= 0
##$S_DEV= 0
##$TDeff= 32768
##$TDoff= 0
##$TI= <>
##$TILT= no
##$TM1= 0
##$TM2= 0
##$TOPLEV= 0
##$USERP1= <user>
##$USERP2= <user>
##$USERP3= <user>
##$USERP4= <user>
##$USERP5= <user>
##$WDW= 1
##$XDIM= 16384
##$YMAX_p= 435130182
##$YMIN_p= -3795856
$$ End of Bruker specific parameters
$$ ---------------------------------
##NTUPLES= NMR SPECTRUM
##VAR_NAME=  FREQUENCY,     SPECTRUM/REAL,   SPECTRUM/IMAG
##SYMBOL=    X,             R,               I
##VAR_TYPE=  INDEPENDENT,   DEPENDENT,       DEPENDENT
##VAR_FORM=  AFFN,          ASDF,            ASDF
##VAR_DIM=   16384,         16384,           16384
##UNITS=     HZ,            ARBITRARY UNITS, ARBITRARY UNITS
##FACTOR=    0.252644378177508, 1,           1
##FIRST=     3299.83951724647, 0,            0
##LAST=      -839.233330435636, 0,           0
##MIN=       -839.233330435636, -3795856,    0
##MAX=       3299.83951724647, 435130182,    0
$$ Real data points
##PAGE= N=1
##DATA TABLE= (X++(R..R)), XYDATA
$$ [...]
7109E176723J028820p64232J308002p34176p41184J061837k376064Q40389k53698
7100D546417L95874k13435J338878q78257N54448P4667j291672N33046M73895
7091E533861j45283m43960o66914p2633j406489J425001M52346O83604j398421
7082C961112j86279Q26580q72819l82743O79456j02844M64683J01014n08382P82633
7072D762411q44861L02628K07057m17768j291318J415023M30497j250294J614958
7063D928333n56314j606164J918886j024983P85426o58237m18607M6264n65545
7054B849059R22872j821745J242313J612841r70221j007695K293215j397800p09238
7045C013601r68393Q90814j114707J029293P35402j085888O51081l5643j303238
$$ plain form
7109 5176723 6205543 5441311 6749313 6015137 5273953 6335790 3959726 4800115 4546417
7100 4546417 4942291 4728856 6067734 5189477 5743925 5818592 4526920 5059966 5533861
7091 5533861 5388578 4944618 4277704 4205071 2798582 4223583 4675929 5359533 3961112
7082 3961112 3774833 4601413 3728594 3345851 4025307 3922463 4387146 4488160 3979778 4762411
7072 4762411 3917550 4220178 4427235 4009467 2718149 4133172 4563669 3313375 4928333
7063 4928333 4372019 2765855 4684741 3659758 4445184 3786947 3368340 3414604 2849059
7054 2849059 3771931 1950186 3192499 4805340 3835119 2827424 5120639 3722839 3013601
7045 3013601 2045208 2936022 1821315 2850608 3586010 2500122 3151203 3115560 1812322
7036A812322N45650L09493M15783p25889r00034J703815J429309l220190K669403
7027D039662q64631k96299Q58921j166945j56405N97383j542069L89806K19954
7018B079377l80171R48334J627008j349211P38447j91077J54176j616526R19759
7009B930116K59709n71574O32959j010629o28651J291743p10438N7770l68995
7000A882010J567864l66348p07051k56770L51255J08090J7590N63396p87606J75182
6990B547612n59608J405817o71600k61954N99937P98700j178420L07250j316155
6981A671579j94654K189377p42511m2772P502J95553j025781J089790p10302J313671
6971C751452Q72012k037571j96893j494725J335793Q44888j326948J68192N79465
$$ plain form
7036 1812322 2357972 2667465 3083248 2357359 1457325 3161140 4590449 1370259 4039662
7027 4039662 3175031 2878732 3737653 2570708 2414303 3011686 1469617 1859423 2079377
7018 2079377 1699206 2647540 4274548 2925337 3663784 3472707 3626883 2010357 2930116
7009 2930116 3189825 2618251 3251210 2240581 1611930 2903673 2193235 2251005 1882010
7000 1882010 3449874 3083526 2376475 2119705 2470960 2579050 2596640 3160036 2372430 2547612
6990 2547612 1988004 3393821 2722221 2460267 3060204 3858904 2680484 2987734 1671579
6981 1671579 1476925 3666302 2923791 2881019 2888521 3084074 2058293 3148083 2437781 3751452
6971 3751452 4623464 2585893 2389000 894275 2230068 3074956 1748008 1916200 2495665
6962B495665M05023n344p54539o36983J523257L25418j498227J977462m71154
6953C360578k407378L054884k239905J273731N4488o43185J57465j021193J056519
6944B646004J403012j369166j118776j327421K285599m31330N80787K69019j668771
6935A268957N36696O97238m5447q04310J498555j620204m1915J101788o43508
6926A947850n98574R09955N40659m77687N48582k145670J329716L76579L52987
6917B784397j908276N75323N86892L36689R18784j107527q61998J765757j496980
6908A593061J372130J012118q79878o5242l33211j252228o44283J098715J268057
6899C169239r08708n91350M30794N46780L18262k183238K231758j800253J410392
$$ plain form
6962 2495665 2900688 2895344 2140805 1503822 3027079 3352497 1854270 3831732 3360578
6953 3360578 953200 4008084 1768179 3041910 3096398 2453213 2610678 1589485 2646004
6944 2646004 4049016 2679850 1561074 233653 2519252 2087922 2668709 2937728 1268957
6935 1268957 1805653 2502891 2457444 1653134 3151689 1531485 1489570 2591358 1947850
6926 1947850 1349276 2259231 2799890 2322203 2870785 725115 2054831 2431410 2784397
6917 2784397 876121 1451444 2038336 2375025 3293809 2186282 1324284 3090041 1593061
6908 1593061 2965191 3977309 3097431 3032189 2698978 1446750 802467 1901182 3169239
6899 3169239 2260531 1669181 2099975 2646755 2965017 781779 3013537 1213284 2623676
6890B623676r16244K80955M53035J50763O53629j885011L098953j439609L88619
6881C408766j359541p4805N0212m86403O67238n44678L08913J39366M72129J169420
6871C750617j412735k68597p7157J49477J758390j771679R88361k259163K773005
6862C630519j017425O13747j856636O18432l06368J246828r82284Q62031M53896
6853C262740j712578P61450q99258J926682n64094q58524O17997k59317Q3538
6844B358636k31621L62967l85320M13626K55015O93019j875278O37738l7994M97317
6834B688105k85551J258391j964218P51489J536561o02240R7540q02530J053673
6825C731220k10421r15817Q83224L24523j058837j04536P73419k92931r50040
$$ plain form
6890 2623676 1707432 1988387 2441422 2592185 3245814 1360803 4459756 3020147 3408766
6881 3408766 2049225 1974420 2024632 1538229 2205467 1660789 1969702 2109068 2581197 3750617
6871 3750617 2337882 2069285 1992128 2141605 3899995 2128316 3116677 857514 3630519
6862 3630519 2613094 3226841 1370205 1988637 1682269 2929097 1946813 2808844 3262740
6853 3262740 1550162 2311612 1412354 3339036 2774942 1916418 2534415 2275098 2358636
6844 2358636 2127015 2489982 2104662 2518288 2773303 3466322 1591044 2228782 2190788 2688105
6834 2688105 2402554 3660945 1696727 2448216 3984777 3382537 3480077 2677547 3731220
6825 3731220 3520799 2604982 3488206 3812729 2753892 2649356 3422775 3129844 2179804
6816B179804L67790m05407n77065r77185J191398L56600l15501M5683P05141K10280
6806B781538r20320J564635q89822L00979m86338p165K84343Q22578j04974j107967
6796B237487M19518l10385M45333L80497O68079r36296J84233j757544J662820
6787B993742P37374r17198n07956J629438j661745K17667R2227L83308P40095
6778C706952o02486r89755J221764L41514k003111K160648q64964R83372j001455
6769B952479L60146R42193J07331q34810o79978J25838l92748L15764K85686m81216
6759B700685N18917J367187j240838K36409j508656R80647N0265N55653j158369
6750B501900j637687K917302j483254N52678L00603j207175J117888j258901J300255
$$ plain form
6816 2179804 2547594 2142187 1565122 587937 1779335 2135935 1820434 1866117 2571258 2781538
6806 2781538 1861218 3425853 2536031 2837010 2350672 2343507 2627850 3450428 3345454 2237487
6796 2237487 2657005 2346620 2791953 3172450 3840529 2904233 3088466 1330922 2993742
6787 2993742 3731116 2813918 2305962 3935400 2273655 2491322 2583549 2966857 3706952
6778 3706952 3104466 2114711 3336475 3677989 1674878 3835526 2970562 3953934 2952479
6769 2952479 3312625 4254818 4362149 3527339 2847361 2973199 2580451 2896215 3181901 2700685
6759 2700685 3219602 4586789 3345951 3582360 2073704 3054351 3104616 3660269 2501900
6750 2501900 864213 3781515 2298261 2850939 3151542 1944367 3062255 1803354 3103609
6741C103609r81685M10616j411646R76676K48188k26271p16579O18318J1948N73124
6731B606298j018410j28310L80986M84679J996998j712292M38086L35048m67093
6722B915990j246796K337553o12453o38220n66592j8222J42856N57508o47210
6713B224414J38948M35117r94211q65102M94255N84633L10362j4719q84513K096876
6703C526060r09683o24199L40418L81993q64393J161629J03502k80838r6379M50029
6693C188139R95233j475860n72273N64609L80940j737921J926892J0024p00877
6684B578906r61321J080288j573175K648550o63600j74152O0398j063032J503492
6675C436354j491158J699365j54461o38695N30595q72663J206557j268296o03587
$$ plain form
6741 3103609 2121924 2532540 1120894 2097570 2345758 2119487 1402908 2021226 2033174 2606298
6731 2606298 1587888 1459578 1840564 2325243 4322241 2609949 3048035 3383083 2915990
6722 2915990 1669194 4006747 3394294 2756074 2189482 2171260 2314116 2871624 2224414
6713 2224414 2363362 2798479 1804268 939166 1433421 2018054 2328416 2313697 1429184 3526060
6703 3526060 2616377 1992178 2332596 2714589 1850196 3011825 3115327 2834489 2738110 3188139
6693 3188139 4183372 2707512 2135239 2699848 3080788 1342867 3269759 3279783 2578906
6684 2578906 1617585 2697873 1124698 3773248 3109648 2935496 2995894 1932862 3436354
6675 3436354 1945196 3644561 3490100 2851405 3382000 2509337 3715894 2447598 1844011
6666A844011R47246O42233j571043J440608j617658J004659l98053N07223N66666
6657C365892l6840m49310M43239j474149J389789j91534j262914P00209l18718
6648B165664j20202l24319R64571j354693J379625O69937j565970P75465L96184
6639B986262N53800j942205j217013J380120l96327p6954P33051J421375q10249
6630B631860l09465k44148J114064l59351q55760n94222R29339M51061n65131
6621B198247M46545P14035P5424j131103J76971L78137r32316K905L97757M44934
6611B771536J33644j519083R19319L55894o21585Q40859n1294n85094p57872N9183
6601A545507O98613q40755K413254k8490k244886P08005L91141N35473j035046
$$ plain form
6666 1844011 2791257 3433490 1862447 3303055 1685397 2690056 2292003 2799226 3365892
6657 3365892 3329052 2879742 3322981 1848832 3238621 3047087 1784173 2484382 2165664
6648 2165664 2045462 1721143 2685714 1331021 2710646 3380583 1814613 2590078 2986262
6639 2986262 3540062 1597857 380844 1760964 1364637 1287683 2020734 3442109 2631860
6630 2631860 2322395 2078247 3192311 2832960 1977200 1382978 2312317 2763378 2198247
6621 2198247 2644792 3358827 3434251 2303148 2480119 2858256 1925940 1928845 2326602 2771536
6611 2771536 2905180 1386097 2305416 2661310 2039725 2880584 2829290 2244196 1486324 1545507
6601 1545507 2244120 1403365 3816619 3788129 1543243 2251248 2642389 3177862 2142816
6592B142816j1390Q83085m47691K55785K34853j862807J662535Q03536j41337
6583C519385j151815Q23905J674148k11930j068104L62621j052129p54868m54531
6574A686682J538117j865786N01346J385994N73406j723138O19553O74610L53001
6565C743785k76013N02668j662272j704J128116L23576j255017M51581q64283
6556B090437R41293m8933p13502L52383J190066n64462P69766r68578p15101j239819
6546A093550J179030J590698r51440q35416J497061J40443k3144Q4826m21219
6537C354389J22515k890051M79932J723416o77102O67449N7945j15294j224048
6528A499151K86820M71281M77127K0840J21136j92970n10629L51520l3391N50864
$$ plain form
6592 2142816 2131426 3014511 2566820 2822605 3057458 1194651 2857186 3660722 3519385
6583 3519385 2367570 3191475 4865623 4653693 3585589 3948210 2896081 2141213 1686682
6574 1686682 3224799 1359013 1860359 3246353 3819759 2096621 2716174 3390784 3743785
6565 3743785 3467772 3970440 2308168 2306464 3434580 3758156 2503139 2954720 2090437
6556 2090437 3031730 2982797 2269295 2621678 3811744 3247282 4017048 3048470 2333369 1093550
6546 1093550 2272580 3863278 2911838 2076422 3573483 3713926 3690782 3775608 3354389
6537 3354389 3476904 586853 1066785 2790201 2113099 2780548 2838493 2723199 1499151
6528 1499151 1785971 2257252 2734379 2755219 2876355 2683385 2172756 2524276 2490885 3041749
6518C041749j029526Q45162J513319j349006k17233J085565N70413j181135l24258
6509B955050l19253J35943j334033J139632J95037M81564m93207M03856k60141
6500B904448m25904J159422p72061j156977q18871J685635M35240r23537L12266
6491B399661L20432N61778j014211J236740L35419n42323p86127q30482J426400
6482C107287m62561J096905o68438N10320j34650J09310J99835j63747r83614
6473B610647Q05681k67210j663422J873771k25418n27369M14385l44944M19560
6464C095681k95753P11079j595050p0735P02627J074162p33561J90200L87564
6455C466214l68018N75668p26443L18574L44076p69821L40051j51197P39201k171306
$$ plain form
6518 3041749 2012223 2857385 4370704 3021698 2804465 3890030 4460443 3279308 2955050
6509 2955050 2635797 2771740 1437707 2577339 2772376 3253940 2760733 3164589 2904448
6500 2904448 2478544 3637966 2865905 1708928 890057 2575692 3010932 2087395 2399661
6491 2399661 2720093 3281871 2267660 3504400 3839819 3297496 2511369 1680887 3107287
6482 3107287 2644726 3741631 3073193 3583513 3448863 3558173 3758008 3594261 2610647
6473 2610647 3416328 3149118 1485696 3359467 3134049 2606680 3021065 2676121 3095681
6464 3095681 2799928 3511007 1915957 1845222 2547849 3622011 2888450 3078650 3466214
6455 3466214 3098196 3673864 2947421 3265995 3610071 2840250 3180301 3029104 3768305 1596999
6445A596999q34621J961394Q95285r25798J550136k781799J615869L45429q75807
6436B547087J285717j402060j009467J440676L17200j547566J701854j398905
6428A934536N36105Q23105P67905j227753P05289J7072l11455J21784N26285q02489
6418C090384N01845m70351q20861P9162K81853K37039J461012j324396N58357
6409C594044k176689J181328L52423n87674j25929M64199L02741r34632L85643
6400B455454p65624L62117J23158j237232L327959j118456J025360j119788M11856
6391C464804k050873J191753j68891P10679P63340k039947L05526N90871J157539
6382C924801J71712K64249k667091K510260m11379n68537l9003K7341o76278J524228
$$ plain form
6445 1596999 762378 2723772 3619057 2693259 4243395 1461596 3077465 3422894 2547087
6436 2547087 3832804 2430744 1421277 2861953 3179153 1631587 3333441 1934536
6428 1934536 2470641 3293746 4061651 2833898 3539187 3556259 3244804 3366588 3892873 3090384
6418 3090384 3592229 3121878 2301017 2380179 2662032 2899071 4360083 3035687 3594044
6409 3594044 1417355 2598683 2951106 2363432 2237503 2701702 3004443 2069811 2455454
6400 2455454 1689830 2051947 2175105 937873 4265832 3147376 4172736 3052948 3464804
6391 3464804 1413931 2605684 2436793 3147472 3910812 1870865 2176391 2767262 3924801
6382 3924801 4096513 4360762 1693671 4203931 3792552 3224015 3185012 3212353 2536075 4060303
6372D060303k086970M96828k26308J642078j91660j400023l60967O25998R09688
6363C468967m15558L34479o46946N85124R2798n06421l33437N73441J301473J07178
6353D561098k21921j679028j006876K023712j332729J529552j565941R08175O46049
6344C862091j957716J470701r31365M48970l17052R21260j119714J914267k160151
6335B131291J667180p65092p83031L0002M78203m7214J027693k314665P11915
6326B136282J445506r654l5553J64761j068180J805425k136448j58185J142909
6317C286863J003107j876800Q10733j130296P79280q4673J016344m90101j9536
6308C294921n16295J250516j712402Q20965J106588j253109J894686k585770K27640
$$ plain form
6372 4060303 1973333 2470161 2243853 3885931 3694271 2294248 1933281 2559279 3468967
6363 3468967 3053409 3387888 2740942 3326066 3418864 2912443 2579006 3152447 4453920 4561098
6353 4561098 4339177 2660149 1653273 3676985 2344256 3873808 2307867 3216042 3862091
6344 3862091 1904375 3375076 2443711 2892681 2575629 3496889 2377175 4291442 2131291
6335 2131291 3798471 3033379 2250348 2280350 2758553 2711339 3739032 1424367 2136282
6326 2136282 3581788 3572134 3536581 3701342 2633162 4438587 2302139 2143954 3286863
6317 3286863 4289970 2413170 3223903 2093607 2872887 2788214 3804558 3314457 3294921
6308 3294921 2778626 4029142 2316740 3137705 4244293 2991184 4885870 2300100 2527740
6299B527740J051236L90632j838596J895215q16198L7808o95255M82050M84331
6290C518963k19124Q58969j208398K33550j84574R26899n92589j126757J779559
6281C986498r17838j33552K95536j02259J017337j658394Q72739m47769J223570
6272D135868n66735l99716k83948L35372k64153l26351J104771n58908j61278
6263C014922J461603j588323L6188P9642q809M97737J368887j487907J1235k25102
6253C160073r07594R6847J084501k60034j75800J630545j225752R53480n30489
6244C825777p280o75659n85278M020594k194885r20299J052069k008928J031820
6235C537931p79839J215345M49l33211k82588J265580j054847j562490N23878
$$ plain form
6299 2527740 3578976 3969608 2131012 4026227 3210029 3247837 2552582 3034632 3518963
6290 3518963 3299839 4158808 2950410 3183960 2999386 3926285 3333696 2206939 3986498
6281 3986498 3068660 2935108 3230644 3128385 4145722 2487328 3360067 2912298 4135868
6272 4135868 3569133 3169417 2885469 3220841 2956688 2630337 3735108 3176200 3014922
6263 3014922 4476525 2888202 2924390 3004032 2995223 3492960 4861847 3373940 3385175 3160073
6253 3160073 2252479 2349326 3433827 3173793 2997993 4628538 3402786 4356266 3825777
6244 3825777 3818497 3142838 2557560 6578154 4383269 3462970 4515039 2506111 3537931
6235 3537931 2758092 3973437 3973886 3640675 3358087 4623667 3568820 2006330 2530208
6226B530208J565006k12451j110171l69670p42011K54743J660179r10521K01923
6217B867235J289080k303063K795625j200946l29104q6788J223164r00198q37426
6208B517579L99674O56903O00035l665k569019J593072j929376K081483Q53792
6199D200478k077158N52358Q03779J53196m30124P68826j975477J081631m4529
6190C032980J074938l09503l99778N39756r1488k025075O376J395546K51266J22031
6180C597049p9495p45924P27915j126221l70171J813892P45925j528314Q52467
6171C887123O91261J1418k876078K497484j610211R60091k06485N0663p42422
6162B662844K02729O24461r08626K66382j309594J495171j28609O72477o04534
$$ plain form
6226 2530208 4095214 3882763 2772592 2402922 1660911 1915654 3575833 2665312 2867235
6217 2867235 4156315 1853252 4648877 3447931 3118827 3032039 4255203 3355005 2517579
6208 2517579 2917253 3574156 4174191 4170526 1601507 3194579 1265203 3346686 4200478
6199 4200478 2123320 2675678 3479457 3632653 3202529 3971355 1995878 3077509 3032980
6190 3032980 4107918 3798415 3398637 3938393 3846905 1821830 1828206 3223752 3475018 3597049
6180 3597049 3517554 2771630 3499545 2373324 2003153 3817045 4562970 3034656 3887123
6171 3887123 4578384 4589802 1713724 4211208 2600997 3561088 3354603 3405266 2662844
6162 2662844 2865573 3490034 2581408 2847790 1538196 3033367 2904758 3577235 2972701
6153B972701q95465J276350j29885j249818J735509K6388j28509M59584n88613
6144C478242R18275l64312m14121o64013j02077O65439Q31416j560442j43542
6135B644865K95192O58468n70319J06730J478297o38453o67489O35559k058447
6126A884403L009497j194810J263290j71854l46661n69746J01910r47109O42615
6117C671535j501457J629592R26924k91725q05146R66205j211878P57932R1586
6108D233568k35541j069091p0903J40496K08252j130687L090018k719114J879742
6099D326740j251131O67046j042540J710619k25300L42273j303447J432291r22999
6090C733552J161588M00843k490909K58313l59022Q47909J465115j302152Q74725
$$ plain form
6153 2972701 2077236 3353586 3223701 1973883 3709392 3735780 3607271 4066855 3478242
6144 3478242 4396517 4032205 3618084 2954071 2851994 3517433 4348849 2788407 2644865
6135 2644865 2940057 3598525 3028206 3134936 4613233 3974780 3307291 3942850 1884403
6126 1884403 4893900 3699090 4962380 4790526 4443865 3874119 3976029 3028920 3671535
6117 3671535 2170078 3799670 4726594 4434869 3629723 4595928 3384050 4141982 4233568
6108 4233568 3998027 2928936 2858033 2998529 3206781 2076094 5166112 2446998 4326740
6099 4326740 3075609 3742655 2700115 4410734 4185434 4527707 3224260 4656551 3733552
6090 3733552 4895140 5295983 2805074 3063387 2704365 3552274 5017389 3715237 4589962
6081D589962k110212J22658N81384M3415j1230J339552j277599J575728R6639
6072D950297j778895L72922o3941M91766K43429J82183k775314L969299j040877
6063D550869n79110o30681M22851J07811l13555Q11827N3930N62877j576398j62868
6053C247553M09202j291811M40069J355192m32583j706383J981290o93915l31144
6044B977470J69774J512634j728464J616718p49740o96953K071536j309546J91506
6035D054935k80746l15928J442688k577308Q12615o6864J711503k041700J845165
6026D584360k40568j076112N56104J14843O28028k405510J255100J646631q01714
6017D261162K67406n95978p51488j511377J574377J722870k043424P82232J43987
$$ plain form
6081 4589962 2479750 2602408 3183792 3227207 3215977 4555529 3277930 4853658 4950297
6072 4950297 3171402 3544324 3480383 3972149 4215578 4397761 1622447 5591746 4550869
6063 4550869 3971759 3341078 3763929 3871740 3558185 4370012 4423942 4986819 3410421 3247553
6053 3247553 3656755 2364944 2805013 4160205 3727622 2021239 4002529 3308614 2977470
6044 2977470 3147244 4659878 2931414 4548132 3798392 3101439 5172975 3863429 4054935
6035 4054935 3774189 3458261 4900949 2323641 3136256 3069392 4780895 2739195 4584360
6026 4584360 4343792 3267680 3823784 3938627 4566655 2161145 3416245 5062876 4261162
6017 4261162 4528568 3932590 3181102 1669725 3244102 4966972 2923548 3705780 3849767
6008C849767J188156l94980R37427n92778o33131P58628M73841k368342P11823
5999C930411k72990J176201j480638J431481j593667L99113J20178j71627Q91715
5990D430177p18677r86484P31826n68746J160831n86579Q34203q51649M64533
5981C909435o23264m710O60804n20331P81843j750604J562179J233151k779734
5972B468769J083444M43036n47296m20136J51283J695754k102812J027179l68862
5963C430359K98377l57836j101538J326786J286993m95767J56784m83995O48273
5954D708436j803082J570597r12717J079210j897955K229659j542327j4582M26775
5945C844014N57126j493692J776291j127078P75788Q4478j002769l82216J201582
$$ plain form
6008 3849767 5037923 4642943 5580370 4987592 4354461 5113089 5586930 3218588 3930411
5999 3930411 3657421 4833622 3352984 4784465 3190798 3589911 3710089 3538462 4430177
5990 4430177 3711500 2725016 3456842 2888096 4048927 3462348 4296551 3444902 3909435
5981 3909435 3286171 3281461 3942265 3421934 4203777 2453173 4015352 5248503 2468769
5972 2468769 3552213 3995249 3447953 3027817 3179100 4874854 2772042 3799221 3430359
5963 3430359 3728736 3370900 2269362 3596148 4883141 4387374 4544158 4060163 4708436
5954 4708436 2905354 4475951 3563234 4642444 2744489 4974148 3431821 3417239 3844014
5945 3844014 4401140 2907448 4683739 3556661 4332449 4416927 3414158 3031942 4233524
5936D233524R17986k328476k11229o11141J013067j48544M28697J9460M97798
5927C811142j513232J189781J017685j260101J102910j200676P70621J412609
5919E330739j004862l57865O37485L97952j484137J500641r05035j27678J071516
5910E058756j115821o29501K652896k600129K236012Q3485j261783J156345j619033
5901C961227Q75425j077644l89834J354101Q84894k687362J467828n70016J079674
5892D898293r48959p28024L85466r421R37861q01153J250633m52262J187239l74306
5882E345367j075815j65894m25913J270605n893o56238j208453J504596L39911
5873D922273p14057J120787r06575o21249K503565k419251R88696N767l21663
$$ plain form
5936 4233524 5151510 2823034 2611805 2000664 3013731 2865187 3293884 3313344 3811142
5927 3811142 2297910 3487691 4505376 3245275 4348185 3147509 3918130 5330739
5919 5330739 4325877 3968012 4605497 5003449 3519312 5019953 4114918 3987240 5058756
5910 5058756 3942935 3313434 5966330 3366201 5602213 5685698 4423915 5580260 3961227
5901 3961227 4836652 3759008 3369174 4723275 5608169 2920807 4388635 3818619 4898293
5892 4898293 3949334 3221310 3606776 3597355 4535216 3734063 4984696 4532434 5719673 5345367
5882 5345367 4269552 4103658 3677745 4948350 4942457 4286219 3077766 4582362 4922273
5873 4922273 4208216 5329003 4422428 3801179 6304744 3885493 4874189 4879956 4558293
5864D558293j218588Q32042M72091n82987N92370j60715k047827J186241K017208
5855E648128k519536M80777J050739k74720J021221m7720j682805N70056l61959
5846C884181j39901J612649n87085r04723j26701o70084J991023L91116p42328
5837D708147m78889J87200O76157r02009k4961l34585J506891j762829Q06595
5828D381717m85840J033662j037624j070999P28879J91651P35003o98255p97533
5819B980661L90972Q42548q49609N12454n71169p37827K471798l29083J046986
5810E757731j942577l33535R65821o32279m1199J744932j516648L33913K7821
5801D363980o98555J95765J338426j180430J67483j74877J95141L25247Q35171
$$ plain form
5864 4558293 3339705 4171747 4643838 4060851 4653221 4492506 2444679 3630920 5648128
5855 5648128 3128592 3609369 4660108 4385388 5406609 5358889 3676084 4246140 3884181
5846 3884181 3744280 5356929 4769844 3865121 3738420 3068336 5059359 5450475 4708147
5837 4708147 4229258 4416458 5092615 4190606 4165645 3831060 5337951 3575122 4381717
5828 4381717 3895877 4929539 3891915 2820916 3549795 3741446 4476449 3778194 2980661
5819 2980661 3371633 4214181 3364572 3877026 3305857 2568030 5039828 4710745 5757731
5810 5757731 3815154 3481619 4447440 3815161 3773962 5518894 4002246 4336159 4363980
5801 4363980 3665425 3861190 5199616 4019186 4186669 4011792 4206933 4532180 5367351
5792E367351O4888k69380p10227O43486m01144O30973n53094r48806j162207L038464
5782E700304j068366M18307r6640p95020L92250q97869J926640j433577J517521
5773E663550j516548R26671q59009K10304j89194P17938P28832n06950n07224
5764D668370P99601l97733j062636J71243O76496j64592Q08158j952365K45863
5755C792405o1781J297249o51435r4659r95182J952063k74687r46342M58063j393638
5745C082056J274297K24490k27509l78726r3789o46620K696557j141550J43989
5736D933195M42521n98182R90439j093216q32409J665697r33569R89427k315087
5727C248816K165514r25362L02354j18460O72577k86164q69496K946098n13628
$$ plain form
5792 5367351 5432239 5162859 4452632 5096118 4694974 5325947 4772853 3824047 2661840 5700304
5782 5700304 4631938 5050245 4953605 4158585 4550835 3652966 5579606 4146029 5663550
5773 5663550 4147002 5073673 4214664 4424968 4235774 4953712 5682544 5175594 4668370
5764 4668370 5467971 5070238 4007602 4178845 4855341 4690749 5498907 3546542 3792405
5755 3792405 3730624 5027873 4376438 4281779 3286597 5238660 4963973 4017631 4475694 3082056
5745 3082056 4356353 4580843 4353334 3974608 3880819 3234199 5930756 4789206 4933195
5736 4933195 5375716 4777534 5767973 4674757 3842348 5508045 4574476 5563903 3248816
5727 3248816 5414330 4488968 4791322 4672862 5345439 5059275 4189779 7135877 6622249
5718F622249j258135q36056N01330q23339k73913J126868J121813p61213J269796
5709F689400j460585j39617m36130R6115J319183n08887p92900O11699l1094p60771
5699D586413n3050q18549K80568Q31807J766827Q906j064240M01008j80094J68545
5689E928141k407771J801751j111201k16182J740558j576254J253867M38961K48436
5680F100306k253733K234363L14169p16482k50896j279379J454237j026557K359457
5671F935485j553006K05885M45388n23813O84210r30141N27757N20579p88457
5662E523887J87357M89260k011420K335539r25533J77835M37937p0511m31540
5653E712811o33260J030252K14191L22193n17223Q89363q29169j157814L54018
$$ plain form
5718 6622249 5364114 4528058 5029388 4206049 3932136 5059004 6180817 5419604 6689400
5709 6689400 5228815 5089198 4653068 4749183 6068366 5559479 4766579 5378278 5347184 4586413
5699 4586413 4533363 3714814 3995382 4827189 6594016 6602922 5538682 5939690 5759596 5928141
5689 5928141 3520370 5322121 4210920 3994738 5735296 4159042 5412909 5851870 6100306
5680 6100306 3846573 6080936 6395105 5678623 5427727 4148348 5602585 4576028 6935485
5671 6935485 5382479 5588364 6033752 5509939 6194149 5264008 5791765 6312344 5523887
5662 5523887 5711244 6200504 4189084 6524623 5599090 5776925 6214862 6144351 5712811
5653 5712811 5079551 6109803 6323994 6646187 6128964 7018327 6189158 5031344 5385362
5644E385362J327296l2317N92691J45119O29652k808618J30079P18083j7326J316914
5634G386935j975979L93443J355955j100385N05871k35012q25912J795002q50058
5625F449860J07293J096603L30368o45402l90011R53620j074163O71775J500378
5616I000321n05568M41979j526713J658828j434956j345345J7370r09474R39018
5607F335460p48114k67725j26685P5248K79275L28844M28473O08720p98688P99413
5597F914221j203142N09989j002559J56991k872j32308L98909N19657k11370p53436
5587E194080P27007q42660P29127J9266J036576j218530J61611n71403n71791
5578D663283J679654k162650J782315n95500j012552J606560K56643j98282L95434
$$ plain form
5644 5385362 6712658 6680341 7273032 7418151 8047803 5239185 5369264 6087347 6070021 7386935
5634 7386935 5410956 5804399 7160354 6059969 6565840 6330828 5504916 7299918 6449860
5625 6449860 6557153 7653756 7984124 7338722 6948711 7902331 6828168 7499943 9000321
5616 9000321 8494753 8936732 7410019 9068847 7633891 6288546 6305916 5396442 6335460
5607 6335460 5587346 5319621 5192936 5268184 5547459 5876303 6304776 6913496 6114808 6914221
5597 6914221 5711079 6221068 5218509 5375500 5372628 5240320 5639229 6158886 5947516 5194080
5587 5194080 5921087 5078427 5807554 5826820 6863396 5644866 5806477 5235074 4663283
5578 4663283 6342937 4180287 5962602 5367102 4354550 5961110 6217753 6019471 6414905
5569F414905l51446J165825j584521j04478O22101l03738Q35552o9376j6952J0932
5559F618804M6762k595072K189144o93236J77886j71695M42362O29847n33470
5550F111332R71587n54429j235354o38868K306779q68057l50404o42821M28206
5541E527971M58703j696353P22696l34689J595071k87695m79849N19922j246268
5532D779509L017047j606009N54566J134797J25661j491651M60391l91744j42391
5523F440176o27160J380312m10508Q41326j315760n18303K914033j506725J059960
5514H257351n7172k153043K741937k729619Q68825M88737n23157M2303J588111
5505H524273j178490n8980P71047L1424j255565J304633j833966J670909K23839
$$ plain form
5569 6414905 6063459 7229284 5644763 5540285 6162386 5858648 6694200 6624824 6607872 6618804
5559 6618804 6665566 4070494 6259638 5566402 5744288 5572593 6014955 6644802 6111332
5550 6111332 7082919 6528490 5293136 4654268 6961047 6092990 5742586 5099765 5527971
5541 5527971 5986674 4290321 5013017 4678328 6273399 5985704 5505855 6025777 4779509
5532 4779509 7796556 6190547 6745113 7879910 8005571 6513920 6974311 6582567 6440176
5523 6440176 5813016 7193328 6782820 7624146 6308386 5790083 8704116 7197391 8257351
5514 8257351 8200179 6047136 8789073 6059454 6928279 7417016 6893859 6936162 8524273
5505 8524273 7345783 7286803 8057850 8089274 6833709 8138342 6304376 7975285 8199124
5496H199124j225707k25878J314222j032222m38601J356688M4346j80401o79454
5487G132117Q75039P92951n06146k77445R86212N6343j234201M38114q28253J863717
5477I298448j908834J509347r64074n71094J023107J34425K63924o98139n38590
5468G548520P82117j861698K105713K97655J23702j047733J88690p6647Q36079
5459H896398j182649M15204l05643l87176K152469p98861l47360m7844l88512
5450H006026K71962j202459J878121Q1325j565498R62025q29938K030392j389287
5441H242669N9410q3805j046355J750198L91005q14036r25474J423730j210183
5432G787159J119552N78136j687169J608034q06507j168994J843489n37234l73723
$$ plain form
5496 8199124 6973417 6747539 8061761 7029539 6590938 7947626 7991972 7811571 7132117
5487 7132117 8007156 8800107 8293961 8016516 9002728 9059071 7824870 8262984 7434731 9298448
5477 9298448 7389614 8898961 7934887 7363793 8386900 8521325 8785249 8087110 7548520
5468 7548520 8330637 6468939 8574652 8872307 8996009 7948276 8136966 8060319 8896398
5459 8896398 7713749 8128953 7823310 7436134 9588603 8789742 8442382 8394538 8006026
5450 8006026 8277988 7075529 8953650 9034975 7469477 8431502 7601564 9631956 8242669
5441 8242669 8302079 8218274 7171919 8922117 9313122 8499086 7573612 8997342 7787159
5432 7787159 8906711 9484847 7797678 9405712 8599205 7430211 9273700 8736466 8362743
5423H362743M73168j757769Q12929K34498n73136J993359L29639j707869R87568
5414I155130l5668M09693m13227J288841q81405L26195j29540j153780J4194Q64548
5404I444981j245447N71608k24960l9407K64362m16412p04060L43110J826585
5395I820360r26284k358311L226171j105420J699505q47801L73252j311333J4028
5386H584167N63302J107962r67984o60938J330756q67572P09838k29198n80694
5377H989639j28368m13170N26403j94944l35653L05792J884578j499501Q50883
5368I985659R12367r16447J384144j94542n94459n61834J068527j061311L13877
5359A0335981M10217j650k16947m30917m25801j217094M08905Q85515J170666
$$ plain form
5423 8362743 8835911 7078142 7891071 8125569 7552433 9545792 9875431 8167562 9155130
5414 9155130 9119462 9529155 9115928 10404769 9523364 9849559 9720019 8566239 8580433 9444981
5404 9444981 8199534 8771142 8546182 8506775 8771137 8354725 7650665 7993775 9820360
5395 9820360 8894076 6535765 9761936 8656516 10356021 9508220 9881472 8570139 8584167
5386 8584167 9147469 10255431 9287447 8626509 9957265 9089693 9799531 9570333 8989639
5377 8989639 8861271 8448101 8974504 8779560 8443907 8749699 10634277 9134776 9985659
5368 9985659 10898026 9981579 11365723 11171181 10576722 10014888 11083415 10022104 10335981
5359 10335981 10746198 10744548 10527601 10096684 9670883 8453789 8862694 9748209 10918875
5350A0918875j702729l9339j36441N07422J08574R19493o21207K54526J206443
5341A1415617q82888j028056k92430R10874O92153r37049K18378N20288Q07860
5332A1424747j149349J151376l72286J005669k96731j276496N29176K11040J64071
5323A1391217M15411j306634L90270K61248P8905O86742l115841K534995J55649
5314A1491962J076735r72627k49957O2515M60167L51960m92141p1820M33285j56628
5304A1933451o44579J778393j590482J736043j589664N57958J737926O1083j17136
5295A3862993o6013j25029K89039j335636J158118J170715m57550K43099j517678
5286A3222058N96926k56939K83409O01236J077902k092705J858671k72797N90519
$$ plain form
5350 10918875 9216146 9176807 9040366 9547788 9656362 10575855 9954648 10209174 11415617
5341 11415617 10532729 9504673 9212243 10123117 10815270 9878221 10096599 10616887 11424747
5332 11424747 10275398 11426774 11054488 12060157 11763426 10486930 11016106 11227146 11391217
5323 11391217 11806628 10499994 10890264 11151512 11230417 11917159 8801318 11336313 11491962
5314 11491962 12568697 11596070 11346113 11408628 11868795 12220755 11728614 11656794 12090079 11933451
5304 11933451 11288872 13067265 11476783 13212826 11623162 12181120 13919046 13980129 13862993
5295 13862993 13796980 13671951 13960990 12625354 13783472 14954187 14496637 14739736 13222058
5286 13222058 13818984 13562045 13845454 14446690 15524592 13431887 15290558 15017761 15608280
5277A5608280p66993J145972K05755k90610j242467J559046Q45754K72635o94164
5268A6643208J263293j007679j81660K534260r28565Q4549M24069P50595j165634
5259A8416436J477509J70404k62721J474285J010797M66222j193120O11832J491283
5250B3662927n27789Q82566J839520K545182j749603J157309K436159K68245K223539
5241C2738055O28664R61076J808723j32800J405091J490041p19730K006046O85797
5232D0870963J478078J110969K598556Q68542L369739n5950L418031K527532N331172
5223F1517632J123837N911636J912057L485173K176022K542021O55817K041219
5215H1365414j70160J639018l2588L738686Q9364M013001M521278M473993P461699
$$ plain form
5277 15608280 14841287 15987259 16193014 15902404 14659937 16218983 17064737 17337372 16643208
5268 16643208 17906501 16898822 16717162 19251422 18322857 18407406 18831475 19582070 18416436
5259 18416436 19893945 20064349 19801628 21275913 22286710 22752932 21559812 22171644 23662927
5250 23662927 23135138 24017704 25857224 28402406 26652803 27810112 30246271 30514516 32738055
5241 32738055 33366719 34327795 36136518 36003718 37408809 38898850 38179120 40185166 40870963
5232 40870963 42349041 43460010 46058566 46927108 50296847 50240897 53658928 56186460 61517632
5223 61517632 62641469 68553105 70465162 73950335 76126357 78668378 79324195 81365414
5215 81365414 81195254 82834272 82801684 86540370 86629734 90642735 95164013 99638006 107099705
5206A07099705N336899J0524988Q556246J2248022J2176234J4930640J4502667
5199A85375401J1890502N733738K410784L09765q52920j826760o077505o829173
5191A90133832m310877m934774p12442r61418J294094N583302N883260J3505332
5183B05480309J4630936J5675763J6670044J2727361J1185049L693838Q65799
5176B80929099l475874q122563j4526512j3977958j4178463j4488731j2258299
5169A99900699j2223122r915522o291201n531739o90989J268174J203295O706780
5161A74426375N566024N219755J829758k012880n545271p044711r932598p811200
5153A54695252j2400940j3775390j2778874r935796r312429p614789n904933o802427
$$ plain form
5206 107099705 112436604 122961592 131517838 143765860 155942094 170872734 185375401
5199 185375401 197265903 202999641 205410425 205720190 204867270 203040510 196963005 190133832
5191 190133832 185822955 180888181 180175739 179214321 180508415 186091717 191974977 205480309
5183 205480309 220111245 235787008 252457052 265184413 276369462 280063300 280929099
5176 280929099 277453225 269330662 254804150 240826192 226647729 212158998 199900699
5169 199900699 187677577 177762055 171470854 165939115 165248126 166516300 167719595 174426375
5161 174426375 179992399 185212154 187041912 185029032 179483761 172439050 162506452 154695252
5153 154695252 142294312 128518922 115740048 105804252 96491823 88877034 82972101 76169674
5145G6169674o635627k801306m469838l525023k207131l206408j731343l042037
5137D8550961k549464j067995l476648j980629N62989j995117k212039p98046
5129C5034012n99525m36315k65441k250031M81119k465756N19786j59454j252238
5120B8606157K69318j291506J41173L18810j893697R37501o22432j169079l54311
5111B4941934m3238p61734R28061k17966O65337j711069Q15659p23366O84890
5102B4578508j546752j67406Q40026J287378j163720L39847n59297m75172q07524
5093B2325888R62880r4649j590249K145622k91448n67478o35736P59192j553824
5084B1460198l60328J049489J99904J95959j174812l37712M76376M78073Q13944
$$ plain form
5145 76169674 69534047 66732741 62262903 58737880 56530749 53324341 51592998 48550961
5137 48550961 46001497 44933502 41456854 39476225 40039214 38044097 35832058 35034012
5129 35034012 34434487 33998172 33732731 31482700 31963819 29498063 30017849 29858395 28606157
5120 28606157 28875475 27583969 27725142 28043952 26150255 27087756 26465324 25296245 24941934
5111 24941934 24898696 24136962 25065023 24847057 25512394 23801325 24616984 23893618 24578508
5102 24578508 23031756 22864350 23704376 24991754 23828034 24167881 23608584 23133412 22325888
5093 22325888 23288768 23194119 21603870 23749492 23458044 22890566 22254830 23014022 21460198
5084 21460198 21099870 22149359 22349263 22545222 21370410 21032698 21509074 21987147 22801091
5075B2801091j533273j47727K53032L12149Q43663L8524j458278K154695k230636
5066B1033240k41236j441602J772697j181582q95542J204207L24M12124j010561
5057A9652069j90046L16113R11747Q53852j274066p25069r9364j082147J80220
5048A8543309l67132P1652Q57517j137508R27371j286904k38428J52662k117591
5039A5404948K767761j470651p19479Q56141j332981J948022r56465q24346J72880
5030A5845830n17257k28251O4301M05838P29577O78067p95820j722448J128738
5021A5588575m51707j49509q0828p38081j222432J353280M38729L05690k068618
5012A2975099K273061j578118K79401O42994N84082j740166O44784J436441j491127
$$ plain form
5075 22801091 21267818 21120091 21373123 21685272 22528935 22567459 21109181 23263876 21033240
5066 21033240 20792004 19350402 21123099 19941517 19045975 20250182 20250506 20662630 19652069
5057 19652069 19462023 19778136 20689883 21543735 20269669 19544600 19445236 18363089 18543309
5048 18543309 18176177 18247829 19105346 17967838 18895209 17608305 17369877 17522539 15404948
5039 15404948 18172709 16702058 15982579 16838720 15505739 17453761 16497296 15672950 15845830
5030 15845830 15328573 15100322 15164623 15570461 16300038 16978105 16182285 14459837 15588575
5021 15588575 15136868 14987359 14906531 14168450 12946018 14299298 14738027 15043717 12975099
5012 12975099 15248160 13670042 13949443 14592437 15176519 13436353 14081137 15517578 14026451
5003A4026451O92305r28826N12762Q54760n66176o57432L79943l40844j095670
4994A2877273K44682J707897j579960M60551j960478J281931L40908N27823j969086
4985A1931541J147854M64506j148206K084572j646452K162822j428232j159367
4977A2409038J019215j130991M8244j96892O79010M4767l97737k97785J767773
4968A3944642j388941Q51087p56442J033345N1524q36373J392541j148174J286191
4959A4429400n97780j368963l21695K476623j44615j719002m2439J528811n81778
4950A3658562J191364J36360j593363J450607l002265K301921m73578J11023j909783
4941A1870848J154126L14300J729936k159329O72553P70660j766976J672625N11772
$$ plain form
5003 14026451 14718756 13789930 14302692 15157452 14591276 13933844 14313787 13972943 12877273
4994 12877273 13121955 14829852 13249892 13710443 11749965 13031896 13372804 13900627 11931541
4985 11931541 13079395 13543901 12395695 14480267 12833815 14996637 13568405 12409038
4977 12409038 13428253 12297262 12345506 12148614 12827624 12872391 12474654 12176869 13944642
4968 13944642 12555701 13406788 12650346 13683691 13735215 12898842 14291383 13143209 14429400
4959 14429400 13831620 12462657 12140962 14617585 14472970 12753968 12711529 14240340 13658562
4950 13658562 14849926 14986286 13392923 14843530 11841265 14143186 13669608 13780631 11870848
4941 11870848 13024974 13339274 15069210 12909881 13582434 14353094 12586118 14258743 14770515
4932A4770515j240921M50064L74662O05226r32775J110884n09567j577420J974231
4923A5024899p91887m79475r4402J821976j606410R29294m25945j519233J406418
4914A4265235n37972J370067n33662j29183L94922K84015L77794j178832J33650
4905A4446034q04753K133597j011414J217429j733295K43833O60844K274789k372744
4896A5054320L94759q0883n35526K172249j355199R01741j046228o3906P01309
4887A6142636r70024m26612K277543o47575j348550J604221j054496O86747R9492
4878A6363382r92843J329975O79031q50372K07940o97167J000330j21028m29171
4869A6490077j274908O66122K67074J98003K66607n79824p36670K105075J143538
$$ plain form
4932 14770515 13529594 13979658 14354320 14959546 14026771 15137655 14628088 13050668 15024899
4923 15024899 14233012 13753537 13659135 15481111 13874701 14803995 14378050 12858817 14265235
4914 14265235 13727263 15097330 14563668 14434485 14829407 15113422 15491216 14312384 14446034
4905 14446034 13641281 15774878 14763464 15980893 14247598 14491431 15152275 17427064 15054320
4896 15054320 15449079 15368196 14832670 17004919 15649720 16551461 15505233 15441327 16142636
4887 16142636 15172612 14746000 17023543 16375968 15027418 16631639 15577143 16263890 16363382
4878 16363382 15370539 16700514 17379545 16529173 16737113 16039946 17040276 16919248 16490077
4869 16490077 15215169 15881291 16148365 16346368 16612975 16033151 15296481 17401556 18545094
4860A8545094o33805N88963j564023j648410J296149o9753K373769l104492J175158
4851A6958650j399994Q75846q39293q12674K035804J0292m09784J25140j20432
4842A6423555J2598M61685j914190J295188j070531L20494O78837M8656J599890
4833A7856182j790222R93382k645011J242003K65244o08214M43087R6222q75312
4824A4977361M4317K414001R10886j00314p28649j49432j318457q3666q33099
4815A5132948K131031M3127N28516q69983j067332K050367l94990J60907M82940
4806A8197531q31952R6792K09640J939057p78741O90286j975101J509196j858218
4797A7198490j52852J249374M68032m12444Q86050n94692K33087j16549Q40438
$$ plain form
4860 18545094 17911289 18500252 16936229 15287819 16583968 16514215 18887984 15783492 16958650
4851 16958650 15558656 16434502 15595209 14782535 16818339 16828631 16418847 16543987 16423555
4842 16423555 16436153 16897838 14983648 16278836 15208305 15528799 16207636 16256292 17856182
4833 17856182 16065960 17059342 14414331 15656334 15921578 15313364 15756451 15852673 14977361
4824 14977361 15021678 17435679 18346565 18246251 17517602 17368170 16049713 15966047 15132948
4815 15132948 17263979 17307106 17835622 16965639 15898307 17948674 17553684 17714591 18197531
4806 18197531 17365579 17462371 17672011 19611068 18832327 19522613 17547512 19056708 17198490
4797 17198490 17045638 18295012 18763044 18350600 19236650 18641958 18875045 18758496 19598934
4788A9598934O40643r15667J44191K27494j42525J670268m40719M29785j94726
4779B1017678j154580M63387K104908j536635J20524j42583J751443L13851o34263
4770B2303730k812257K374622L16482J92164K26824R80608l381682K289824n7385
4761B2432930j750968J884915M7243p96747p33036J412878k20995K048664j6681
4752B4308203M16559j86664j477013p9344K81580J019798p30147o53724o08821
4743B2290427l83046M21615K024481k098705L64623L98337N89672k027627K094534
4734B3674311j186511O12081k04465m51022j569741J989822l59509j125057Q35338
4725B2215247r82110Q71552l01265K17622j259821N749R87145j346212J295937
$$ plain form
4788 19598934 20239577 19323910 19468101 19695595 19553070 21223338 20782619 21212404 21017678
4779 21017678 19863098 20326485 22431393 20894758 21015282 20872699 22624142 22937993 22303730
4770 22303730 19491473 21866095 22182577 22374741 22601565 23582173 20200491 22490315 22432930
4761 22432930 20681962 22566877 22614120 21817373 21084337 22497215 22276220 24324884 24308203
4752 24308203 24724762 24538098 23061085 22981741 23263321 24283119 23552972 22899248 22290427
4743 22290427 21907381 22328996 24353477 22254772 22619395 23017732 23607404 21579777 23674311
4734 23674311 22487800 23099881 22895416 22444394 20874653 22864475 22504966 21379909 22215247
4725 22215247 21233137 22104689 21803424 22021046 20761225 20766974 21754119 20407907 21703844
4716B1703844l93680P25069j245895k24228J650456j807390m27167j188746J759250
4707B0551513p64259J29613O79636o13410J793j422782j86925N15177j28808L98570
4697A9160118r379n1377k73494J73145O62640J48994l167709K018370q23669J552369
4687A9390008j272788J929011J31326j705552p88431Q45847m7786J9807o56924
4678A7844518m48775J599979l60244m94798L89191j253267r7685K17846J52145
4669A7548910j150823Q00480K51465N81432P1070N7561L02335j61599j18513l06532
4659A7875786j240338N94037J949239j433789J574993p15766Q56380l69062j309382
4650A7782098J818145k420569K29513J394702Q6865j207827J709753R19739j589599
$$ plain form
4716 21703844 21310164 22035233 20789338 20565110 22215566 20408176 19981009 18792263 20551513
4707 20551513 19787254 19916867 20596503 19983093 19984886 18562104 18375179 18890356 18761548 19160118
4697 19160118 19150739 19099362 18825868 18999013 19661653 19810647 16642938 18661308 17837639 19390008
4687 19390008 18117220 20046231 20177557 18472005 17683574 18529421 18481635 18501442 17844518
4678 17844518 17395743 18995722 18635478 18140680 18529871 17276604 17178919 17396765 17548910
4669 17548910 16398087 17198567 17450032 18031464 18102534 18160095 18462430 18300831 18182318 17875786
4659 17875786 16635448 17229485 19178724 17744935 19319928 18604162 19460542 19091480 17782098
4650 17782098 19600243 17179674 17409187 18803889 18890754 17682927 19392680 20312419 18722820
4641A8722820M49670j238170J244165p18409j02265K0750Q39459j19117J596144
4632B0695047k473356J072338P43288J111267r19106J229408k389576J400229
4624B0469539o3047p42031K106947r15047J68365J661670j7981r22587j164447
4615B0581381J400414p53845J028376N05717j254484R55478J076881o53402K395165
4606B5281681M55286l122491J613263J91752j462153K194868m9050k72937r5207
4597B4735012L151427j305245q88816J192570k34543J584689j620858R71068M69464
4588B8054768J556219j469215L28006O63634J231066l24080J179429k01770N02011
4579C1520068l85409K249692q28843J5829J621482L55907J494297P98144m96912
$$ plain form
4641 18722820 19172490 17934320 19178485 18460076 18357811 18378561 19218020 19098903 20695047
4632 20695047 18221691 19294029 20037317 21148584 20229478 21458886 19069310 20469539
4624 20469539 20406492 19664461 21771408 20856361 21024726 22686396 22668415 21745828 20581381
4615 20581381 21981795 21227950 22256326 22762043 21507559 22463037 23539918 22886516 25281681
4606 25281681 25736967 22614476 24227739 24419491 22957338 25152206 25103156 24830219 24735012
4597 24735012 27886439 26581194 25692378 26884948 26650405 28235094 26614236 27585304 28054768
4588 28054768 29610987 28141772 28469778 29133412 30364478 30040398 31219827 31018057 31520068
4579 31520068 31134659 33384351 32555508 32571337 34192819 34548726 36043023 36841167 36344255
4570C6344255K287204n86246K286574J325234j659560K734841R00526P81100K826240
4561D7240168J617514O76849L432980k62517K293068J594568r43613J717784N78996
4552E7945797L385297J90204L704077J717269J559402M142509K524860K120656
4544G7290071N337876L206938N040263K254988N140901M685255L245874L969567
4536A10171733J988684K020585L844297M81675P90613K773453L422029K734741
4528A28227810O004771N043512P791442P887225Q035933J1594955J2463245J3796527
4520B00845420J4588011J7864420J7188910J2880772J1142312O382691M028247
4513B84920783J448720k807172j358190n716882k635811k984933n67917K361727
$$ plain form
4570 36344255 38631459 38045213 40331787 41657021 39997461 42732302 43632828 44413928 47240168
4561 47240168 48857682 49534531 52967511 52704994 54998062 56592630 55649017 57366801 57945797
4552 57945797 61331094 61521298 65225375 66942644 68502046 72644555 75169415 77290071
4544 77290071 82627947 85834885 90875148 93130136 98271037 102956292 106202166 110171733
4536 110171733 112160417 114181002 118025299 118506974 119297587 122071040 125493069 128227810
4528 128227810 134232581 139276093 147067535 154954760 162990693 174585648 187048893 200845420
4520 200845420 215433431 233297851 250486761 263367533 274509845 280892536 284920783
4513 284920783 286369503 283562331 282204141 276487259 273851448 270866515 270298598 272660325
4505B72660325Q038989J0913335J8682849J9398104K3368644K4837488J8398778
4498C96298512J5402763J1525140Q300770L602997l596897j1106914j2503582
4491D07922789j8777696j7520512j8143686j9535834j6645116j2320605j1222265
4484B93757075n673403j130127n08188L405067Q946670J0552002J2703815J7986932
4476C40039843J6048475J8077501J8531615J7038013J2740023Q47859j1875568
4469D11447761j7842376j9182042j7800057k1064615k3439145k6115108k6733592
4462B59270826k0022067j8207367j5644713j3180653j4442488r175486o211684
4455A62386368o106456k627246l877979n44334J23775J512212L412350P129122
$$ plain form
4505 272660325 280699314 291612649 310295498 329693602 353062246 377899734 396298512
4498 396298512 411701275 423226415 431527185 435130182 431533285 420426371 407922789
4491 407922789 389145093 371624581 353480895 333945061 317299945 304979340 293757075
4484 293757075 288083672 286953545 286445357 289850424 298797094 309349096 322052911 340039843
4476 340039843 356088318 374165819 392697434 409735447 422475470 423323329 411447761
4469 411447761 393605385 374423343 356623286 335558671 312119526 286004418 259270826
4462 259270826 239248759 221041392 205396679 192216026 177773538 168598052 162386368
4455 162386368 156279912 153652666 149774687 149230353 149354128 150866340 154278690 161407812
4447A61407812P960440J1144911J1269887M701672N68463n044663p566899n579730
4439A78861893q545456j2327401j3103108j1668481j4354814q964950r433042
4432A00464641p097551o032859m829267o074288m386977l242214k828078l747522
4424F2225885j942788k949188k005697k530355k285985j513020j615285j509839
4416D5873728p77891j927484p77586r63765k17089j927654q98574N52932j813778
4407C7122839J071653l048892O82243j786442M47912k444809K36080p4729j443229
4398C0762626J248816j078964j596113m83293p99592J275380o3866q36411j043388
4389B7385195J335664m06654q65845j19726m188p99260M44152j916128R44921
$$ plain form
4447 161407812 169368252 180513163 191783050 196484722 197053185 192008522 184441623 178861893
4439 178861893 170316437 157989036 144885928 133217447 118862633 109897683 100464641
4432 100464641 93367090 87334231 82504964 76430676 72043699 68801485 65973407 62225885
4424 62225885 60283097 57333909 55328212 52797857 50511872 48998852 47383567 45873728
4416 45873728 45095837 43168353 42390767 41427002 41209913 39282259 38383685 38936617 37122839
4407 37122839 38194492 35145600 35827843 34041401 34489313 32044504 32280584 32205855 30762626
4398 30762626 32011442 30932478 29336365 28853072 28053480 29328860 29264994 28428583 27385195
4389 27385195 28720859 28314205 27448360 27328634 27324446 26525186 26969338 25053210 25998131
4380B5998131J327836q46984j187161O43365j379971N19827k66438n89598K82226
4371B4501233r5702j031857M6689J118332p82609L98496n23178O84794o21349
4362B3694849n87637J65201j513907K351687p02644p95864K476477j814306J976170
4353B5250026j789482J228997k033434J174110j879676M71927l85931K454673
4345B4491210j632377k029560Q79933p87553O81752J114902j949977o78735N81824
4336B0671419J461199j458915N70528j32409n62707M52751k36555M49519K45688
4327B1460518q20890L22236k20869J155087M49853n20686k153321J134591J20405
4318B0926924p91692K086516p53962j286521J347986k536684K427982k865001
$$ plain form
4380 25998131 27325967 26478983 25291822 25935187 24555216 25075043 24808605 24219007 24501233
4371 24501233 24405531 23373674 23420363 24538695 23756086 24154582 23631404 24316198 23694849
4362 23694849 23107212 23272413 21758506 24110193 23407549 22611685 25088162 23273856 25250026
4353 25250026 23460544 24689541 22656107 23830217 21950541 22422468 22036537 24491210
4345 24491210 22858833 20829273 21709206 20921653 21603405 22718307 20768330 20089595 20671419
4336 20671419 22132618 20673703 21244231 21111822 20549115 21001866 20765311 21214830 21460518
4327 21460518 20639628 20961864 20740995 21896082 22345935 21825249 19671928 20806519 20926924
4318 20926924 20135232 22221748 21467786 20181265 21529251 18992567 21420549 18555548
4310A8555548K163459m93425m13518J360057l87496r93250J05727l2012l1905
4301A9833185O40042j523558J065196n84471K41735K273034k411822q4689m70234
4292A8978418J766014l46137J56467m73225K28261O19995J0846j133383J353160
4283B1160416j020766P15099p13389L30999n25565J807654j537514L72758k96719
4274B0292973J000672q68724J162462q98735r61624P90989L78956J49102o82450
4265B0363621J06533J070421K56538l18729j629492j62121j19838L049031n96051
4256B2019913R08092J139772k939996N47144l35596N71831R51805j099418R95776
4247B2759323p45885O84736j32629P06866r96236J4418m0708J341613K73739j044524
$$ plain form
4310 18555548 20719007 20225582 19812064 21172121 20784625 19791375 19897102 19865090 19833185
4301 19833185 20473227 18949669 20014865 19430394 19672129 21945163 19533341 19448652 18978418
4292 18978418 20744432 20398295 20554762 20081537 20309798 20929793 20940639 19807256 21160416
4283 21160416 20139650 20854749 20141360 20472359 19946794 21754448 20216934 20589692 20292973
4274 20292973 21293645 20424921 21587383 20688648 19727024 20518013 20896969 21046071 20363621
4265 20363621 20470154 21540575 21797113 21478384 19848892 19686771 19566933 22615964 22019913
4256 22019913 22928005 24067777 21127781 21674925 21339329 21911160 22862965 21763547 22759323
4247 22759323 22013438 22698174 22565545 23272411 22276175 22290593 22249885 23591498 23865237 22820713
4237B2820713M74119N39270J456925j686307J416951o29002l09641N26061L97946
4228B5007035q28252q74498J154208J021371k79544l27185J188711j016443J587635
4219B6633038O16950N25978j648646N54026N8553J300963K84824j09421r49067
4210B7267198r16051R93623L52351R0574N47461j4297L51523n34359j3828m05886
4200B7718309K53547J54049n4087J015225k64602J39313J421494j05891k26253
4191C0051104L21239r97529K874372k239242N93679J144811J073134p37420K37715
4182C2321863J713719l27885j046512o0754N57029j199945J556269P87028p97750
4173C3503062p35239J77928Q59464P57067J068682j191876J870456L30193J060318
$$ plain form
4237 22820713 23294832 23834102 25291027 23604720 25021671 24392669 24083028 24609089 25007035
4228 25007035 24178783 23304285 24458493 25479864 25200320 24873135 26061846 25045403 26633038
4219 26633038 27249988 27775966 26127320 26681346 26739899 28040862 28325686 28216265 27267198
4210 27267198 26351147 27344770 27697121 27787695 28335156 28320859 28672382 28138023 28124195 27718309
4200 27718309 27971856 28125905 28071818 29087043 28822441 28961754 30383248 30277357 30051104
4191 30051104 30372343 29374814 32249186 30009944 30603623 31748434 32821568 32084148 32321863
4182 32321863 34035582 33707697 32661185 32600431 33157460 31957515 33513784 34300812 33503062
4173 33503062 32767823 32945751 33805215 34562282 35630964 34439088 36309544 36639737 37700055
4164C7700055o99111P35676L033082J20147k96134J250890K196816J782382j558630
4155D4265173J470868L83528K442190k00836R72494J480639k87676j8179J066812
4146E1575013K401584j238508L737480j8257J649556J330180J276899M271029
4138F4984976J91840L007875J485774L893104r81123J607800M522440L400382
4130H2113068J856689L355978M64866K770834L516944L008454M853613Q83662
4122A02824108N597205M251920M723481O404833N164534P055632P706266J0053435
4114A53781414P420602Q729636P614190N976693N230155J804996J345559K55803
4106A92159048R369j553725q78905k355654j685902j368561r31379o23116J136587
$$ plain form
4164 37700055 37000944 37736620 40769702 40889849 40593715 41844605 44041421 45823803 44265173
4155 44265173 45736041 46119569 48561759 48360923 49333417 50814056 50526380 50508201 51575013
4146 51575013 53976597 52738089 56475569 56457312 58106868 59437048 60713947 64984976
4138 64984976 65176816 68184691 69670465 73563569 72582446 74190246 78712686 82113068
4130 82113068 83969757 87325735 87790601 90561435 94078379 97086833 101940446 102824108
4122 102824108 108421313 112673233 117396714 123801547 128966081 136021713 143727979 153781414
4114 153781414 161202016 169931652 177545842 183522535 188752690 190557686 191903245 192159048
4106 192159048 192168417 190614692 189735787 187380133 185694231 184325670 183394291 182771175 183907762
4097A83907762K39302N50463K839545K601324M875005M358890O592690J0200521
4089B16165502R249919J0798624J1999995J1455459J4463654J3224422J3004830
4082C00362405J0797424R281059Q835374L526908K654952j300738n49702k199313
4074C31408369o94599R27862M771031N349714N189024J459572k180813n912262
4066C40317898q521474n518419p783192o885951p628067j0038030r145825q551283
4058B76245657p282234l383856q23689R19675K976859M371078N791532N293928
4050B84108950N347620N408535P563129P418725R781786J3123222J7884406J8496083
4042C69132456J7113532J781470o979833j1466299j0359735j5061552j7658062
$$ plain form
4097 183907762 184147064 184697527 187537072 190138396 195013401 199372291 205964981 216165502
4089 216165502 225415421 236214045 248214040 259669499 274133153 287357575 300362405
4082 300362405 311159829 320440888 329276262 332803170 335458122 334157384 333607682 331408369
4074 331408369 330713770 331641632 336412663 341762377 346951401 348410973 346230160 340317898
4066 340317898 331796424 326278005 318494813 311608862 303980795 293942765 284796940 276245657
4058 276245657 268963423 265579567 264755878 265675553 268652412 273023490 278815022 284108950
4050 284108950 289456570 294865105 302428234 309846959 319628745 332751967 350636373 369132456
4042 369132456 386245988 388027458 381047625 369581326 359221591 344160039 326501977
4035C26501977k1107780k4980964k1675073j8753653j9193727j4049974j3294061
4028A93446745j0480896j1417003m572455m880104l251319m815763l17873J0879
4020A53722211Q77336L051676L104334O771322P687646J1262824N681143L918798
4012A96077290j75598l035231o207297m264718o569522q383443r078458p394892
4004A50968131p444615o445378l312723m666075l322020j041405j415550k32093
3996A23088272m45025j661654L7141K696510L9840R75858L01892K263322J341169
3987A28637325J615736M486650L502465L306185L662427N150366N513899N367343
3979A61242396N567127M452698N528145N240349L698595R48788M921389L722453
$$ plain form
4035 326501977 305394197 280413233 258738160 239984507 220790780 206740806 193446745
4028 193446745 182965849 171548846 166976391 162096287 158844968 154029205 153711332 153722211
4020 153722211 154599547 157651223 160755557 167526879 175214525 186477349 192158492 196077290
4012 196077290 195901692 192866461 186659164 182394446 175824924 167441481 158363023 150968131
4004 150968131 143523516 137078138 133765415 129099340 125777320 124735915 123320365 123088272
3996 123088272 122643247 120981593 121018734 123715244 123755084 124730942 125032834 127296156 128637325
3987 128637325 130253061 134739711 138242176 141548361 145210788 150361154 155875053 161242396
3979 161242396 166809523 171262221 176790366 182030715 185729310 186678098 191599487 195321940
3971A95321940M24561O03357l86581M073867j127016J368267J819041J460884
3963B03558320J505090M917003L181314J170136P344554K514895N975661N604816
3955B35771789K109905K088292M829736M96360j240850k5153n750943l499521
3947B34779615p516580o048628p755992p007896p478364p551794o769397p565104
3939A77085860m493978n259929l963074j321230k765048k102422k758164j425596
3931A52996419m22968k999359j631854j064302l547319l724561n350582m258633
3923A29996841m418362o820620m212045m423425o036651p351557k923235o415593
3915H7395353m659879m419565k298059n340051k572522k969334k496684j565388
$$ plain form
3971 195321940 195746501 196349858 195963277 200037144 198910128 200278395 202097436 203558320
3963 203558320 205063410 209980413 213161727 214331863 221676417 224191312 230166973 235771789
3955 235771789 237881694 239969986 244799722 245296082 244055232 244030079 238279136 234779615
3947 234779615 227263035 221214407 213458415 206450519 198972155 191420361 184650964 177085860
3939 177085860 172591882 167331953 163368879 162047649 159282601 157180179 154422015 152996419
3931 152996419 152573451 149574092 147942238 146877936 143330617 139606056 134255474 129996841
3923 129996841 125578479 118757859 114545814 110122389 104085738 96734181 93810946 87395353
3915 87395353 82735474 78315909 76017850 70677799 68105277 65135943 62639259 61073871
3907F1073871l363731j909881l149693j452027j422217j787281n08417L31789
3899D7812413j983005k604821K29502k17162j802939J0237k210330j243155J10691
3890C8101431R52597k467270N40510j908059p30436m46589J361776m90316j206333
3881C3707311R47581k543205L25613J169008l96049k311975K810441j639395o74999
3872C1394331J816083q39732K1031J53150k03418k225074J306463Q33489j691451
3863C0564872R23799K55786K03455k64958O48807l73395K77015k0685K77767m47393
3853C2045070Q57907N3355O12903j058506J997720j043215Q39435j345775J943719
3844C4902613J40546j15584J809112l80777j092734J002371J029727j405585J45651
$$ plain form
3907 61073871 57710140 55800259 52650566 51198539 49776322 47989041 47480624 47812413
3899 47812413 45829408 43224587 43454089 43236927 41433988 41444225 39233895 37990740 38101431
3890 38101431 39054028 36586758 37127268 35219209 34488773 34042184 35403960 34913644 33707311
3881 33707311 34654892 32111687 32437300 33606308 33210259 30898284 33708725 32069330 31394331
3872 31394331 33210414 32370682 32391713 32544863 32341445 30116371 31422834 32256323 30564872
3863 30564872 31488671 31744457 31947912 31682954 32331761 31958366 32235381 32214696 32492463 32045070
3853 32045070 32902977 32956332 33569235 32510729 34508449 33465234 34304669 32958894 34902613
3844 34902613 35043159 34927575 36736687 36355910 35263176 36265547 37295274 35889689 36035340
3835C6035340o72040J333887j527600J942171j932123K929935j682187l2446j587637
3826C4807300J376966j482967P07998J89672m44528J072205N56374K53776n33880
3817C6502916M71462R68198Q47464P44218J410843M98529R39833n41762j593827
3808D0247874J084087r03444L18646j505049Q62688r07993j175230R95239j565386
3799C7451432R35248j772922j586556P63734p0313m29808m89405P92954p20172
3790C4874192J113949l38809J107422j914404R2798K034920O35174M27801j918983
3781C6114060J327562m78995K014205k036660R49676K63450J550575k023451N45329
3772C8225751P6741j304421r3959j305235P19306L67234j263324j72039P66334
$$ plain form
3835 36035340 35363300 36697187 35169587 37111758 35179635 38109570 36427383 36394937 34807300
3826 34807300 36184266 34701299 35409297 35598969 35154441 36226646 36783020 37036796 36502916
3817 36502916 36974378 37942576 38790040 39534258 40945101 41443630 42383463 41841701 40247874
3808 40247874 41331961 40428517 40747163 39242114 40104802 39196809 38021579 39016818 37451432
3799 37451432 38386680 36613758 35027202 35790936 35720623 35290815 34801410 35594364 34874192
3790 34874192 35988141 35649332 36756754 34842350 34935148 36970068 37605242 38033043 36114060
3781 36114060 37441622 36962627 38976832 36940172 37889848 38153298 39703873 37680422 38225751
3772 38225751 38302492 36998071 36904112 35598877 36318183 36685417 35422093 35250054 36016388
3763C6016388L72882k15503n9258j094074L78290R47341J172592j719179J216563
3754C7016042o9075p84616R94865p8836J692495j928874O9170j91257J778216
3745C8498130o91172j832358N65394j88687j002005j710312J109483l94034j012772
3736C3341667M3160O13814j014263J042451j382634L05456J009183j171590O9169
3727C2856413P17393K115286j271889j605578n14191K903592O77204j373596L82534
3718C4887168J24021K87172Q99332k121361N31644o88157P90158Q97158J36430
3709C5743565K92389J31792J521393j2270O52191J774631J489682k271603K242606
3700D1564376J642758R77700o52730j77941L304578o84720J276485n98679K351022
$$ plain form
3763 36016388 36389270 36173767 36114509 35020435 35398725 36346066 37518658 35799479 37016042
3754 37016042 36946967 36162351 37157216 37078380 38770875 36842001 36911171 36719914 38498130
3745 38498130 37806958 35974600 36539994 36351307 35349302 33638990 34748473 34354439 33341667
3736 33341667 33384827 33998641 32984378 34026829 32644195 32949651 33958834 32787244 32856413
3727 32856413 33573806 35689092 34417203 32811625 32297434 35201026 35878230 34504634 34887168
3718 34887168 35011189 35298361 36197693 34076332 34607976 33919819 34709977 35607135 35743565
3709 35743565 36035954 36167746 37689139 37676869 38329060 40103691 41593373 39321770 41564376
3700 41564376 43207134 44184834 43532104 43354163 46658741 45974021 47250506 46651827 49002849
3691D9002849J519032Q02397P36645J753676K356721K419228J470589j62151J322807
3682F1221793L308578L024448K470500K411076J010903K413252K310937K102214
3674H0273701J612928K879561J662156L225209M340950L892687L197183M458724
3666A05543099N325917M670038O529886P143533M217563P417878N830421N085591
3658A51763926K134208K169311L055716L76374r00330O93048Q7809j909570l383211
3649A54087281j057028j849545j154122k40126N63691j80376J179337L39060L175213
3640A54863385L622447N241910N162189O874822P148737R001921R316822R614048
3632B10846281P529835O403788O966217L075385J445105r53740l645109l816151
$$ plain form
3691 49002849 50521881 51324278 52060923 53814599 56171320 58590548 60061137 59898986 61221793
3682 61221793 64530371 67554819 70025319 72436395 73447298 75860550 78171487 80273701
3674 80273701 81886629 84766190 86428346 89653555 93994505 97887192 101084375 105543099
3666 105543099 110869016 115539054 122068940 129212473 133430036 140847914 146678335 151763926
3658 151763926 153898134 156067445 159123161 159499535 158599205 159292253 159380062 157470492 154087281
3649 154087281 153030253 151180708 150026586 149786460 150350151 150169775 151349112 151688172 154863385
3640 154863385 158485832 163727742 168889931 175764753 182913490 191915411 201232233 210846281
3632 210846281 218376116 224779904 231746121 234821506 236266611 235312871 231667762 227851611
3624B27851611o800237p385171p753279j0090090p146979q690962r561774q180305
3616A62242814n953621m848980n069895l835518l900164l242272p07171J890166
3608A36575359Q36543J053331K364331K326694L034083L030307K199120L668620
3600A55088388J16158j966302j713814j595573n921565m294983p720506n850782
3592A26141021p148867j0459796m009384p986242n712697o937991m084238l690264
3584G6111542n069776l670710k798778l604002k243242j465886m138351k485690
3576E0635107R9317k767119j647671o4860m82595q42887k777428j31617j248970
3567D0771277p32699n26483m71875l44181j922589J303072j046956o76282p49410
$$ plain form
3624 227851611 221051374 213666203 205912924 195822834 188675855 179984893 170423119 162242814
3616 162242814 156289193 151440213 146370318 142534800 138634636 135392364 134685193 136575359
3608 136575359 137411902 138465233 140829564 143156258 146190341 149220648 151419768 155088388
3600 155088388 155204546 153238244 151524430 149928857 144007292 139712309 131991803 126141021
3592 126141021 118992154 108532358 104522974 96536732 90824035 83886044 79801806 76111542
3584 76111542 71041766 67371056 64572278 60968276 58725034 57259148 53120797 50635107
3576 50635107 50734424 47967305 46319634 46254774 45772179 44929292 42151864 42020247 40771277
3567 40771277 40038578 39512095 39040220 38696039 36773450 38076522 37029566 36353284 35603874
3558C5603874l55945j758227J238803j573936K5747J089359j594897j88726J15383
3549C2601435n39048q94422n66574P50526J230794j465181j756788R03292P67310
3540C1031344k071297r0697J366474k73404j409002J9777p44415Q26934j070113
3531B7585601n12657P0332J110105k87953l71207K563J214540r88149k65439l52685
3521B7205051R6721j14483n74225j814604O29395J300454m41548j30798K77172
3512B6433135J063527l03987o69037J157050o72546j011604L53080J036935j61781
3503B7224772j171434J747169j94822p94637J737297n99375P08491j009514Q79689
3494B8527636l30642j263665J694088J76739q90488J500310j127845K234935K6822
$$ plain form
3558 35603874 35247929 33489702 34728505 33154569 33180316 34269675 32674778 32486052 32601435
3549 32601435 32062387 31167965 30601391 31351917 32582711 31117530 29360742 30264034 31031344
3540 31031344 28960047 28869350 30235824 29962420 28553418 28573195 27828780 28655714 27585601
3531 27585601 27072944 27143276 28253381 27965428 27594221 27596784 28811324 27823175 27557736 27205051
3521 27205051 27301772 27187289 26613064 24798460 25427855 26728309 26286761 26155963 26433135
3512 26433135 27496662 27192675 26523638 27680688 27008142 25996538 26349618 27386553 27224772
3503 27224772 26053338 27800507 27605685 26811048 28548345 27948970 28657461 27647947 28527636
3494 28527636 28196994 26933329 28627417 28804156 27913668 29413978 28286133 30521068 30547890
3485C0547890j435841O08209J040562o47107K040536R56812j396505J465437l6392
3476C3143601n24956J794109J58656n55013J772872J072033l0871J123994J079559
3467C9033984j555161K919982L48309K023119J819323j223610J296623J774659
3459D6437228q96771K470477J134767K206273r04890J868697L110533R57321J734013
3450E8117648J616078J406499J755887K479377K722551L471982n52144K634804
3442G3652682L124935K019936M138481K80580K038710L981195J414803M725005
3434I5376327M391748J552766M106955M268768M002088N383886M837091P501557
3426A31421186N082903M668308O001982M639775N669272L345933N011719K258950
$$ plain form
3485 30547890 29112049 29720258 30760820 30113713 32154249 33111061 31714556 33179993 33143601
3476 33143601 32618645 34412754 34571410 34016397 35789269 36861302 36830431 37954425 39033984
3467 39033984 37478823 40398805 40747114 42770233 44589556 43365946 44662569 46437228
3459 46437228 45540457 48010934 49145701 51351974 50447084 52315781 55426314 56383635 58117648
3450 58117648 59733726 61140225 62896112 65375489 68098040 71570022 71017878 73652682
3442 73652682 76777617 78797553 82936034 83216614 85255324 89236519 90651322 95376327
3434 95376327 99768075 101320841 105427796 109696564 113698652 119082538 123919629 131421186
3426 131421186 136504089 141172397 147174379 151814154 157483426 160829359 165841078 168100028
3418A68100028L906627K13265M9408J291909l57361m51072K535408j48725J553988
3409A76693475K522996K294074M404517L655297P601122M480061P775811O360676
3401B15788029M670147O410434M101320N028010K146504J874031l801627j139447
3393B35077401k418299m841846n326412o950695o448827n667140n235720p447240
3385A90741222l723222o432848j746875l855859l711141k484216k207157l071947
3377A63507957j386460m255272p01938m305050l875597o362014m844404m234555
3369A33542667o578626o668995n651420m292656o483987o877976n856646l525344
3361H7607017o039922l977397k578836n322919j973306l956371l365899o46936
$$ plain form
3418 168100028 172006655 172219920 172269328 173561237 173203876 172752804 175288212 175139487 176693475
3409 176693475 179216471 181510545 185915062 189570359 197171481 201651542 209427353 215788029
3401 215788029 220458176 226868610 230969930 235997940 238144444 240018475 236216848 235077401
3393 235077401 232659102 227817256 222490844 215540149 209091322 203424182 198188462 190741222
3385 190741222 187018000 180585152 178838277 174982418 171271277 168787061 166579904 163507957
3377 163507957 162121497 157866225 157164287 152859237 148983640 142621626 137777222 133542667
3369 133542667 126964041 120295046 114643626 110350970 103866983 96989007 91132361 87607017
3361 87607017 81567095 77589698 75010862 69687943 67714637 63758266 60392367 59745431
3353E9745431k074267l494370l79937k974383j932221n56810j473335l092799
3345D3767309P76807n77557j287325j83624k091946J16916q45220j448388m96874
3336C7730098j803864m39082J499276m80425l290076Q92872k24924j656081k169365
3327C0058429J539022Q06812q39578p86513j688782J01200k82933j649356K050456
3318B9308757j057549R3371p98319J212866k184781Q51126O95206j203626o36365
3309B6280686p6784p15368R32118j073346J830806p16335j724763P73284k249040
3300B3261258K134822j17114J8146k73892m77029O50047p6081M86147q76504r11413
3290B3818387J301524m69255j308943O29935R2562M67372N77223j634409R79473
$$ plain form
3353 59745431 57671164 54176794 53796857 50822474 48890253 48333443 46860108 43767309
3345 43767309 44544116 43966559 42679234 42495610 40403664 40520580 39675360 38226972 37730098
3336 37730098 35926234 35487152 36986428 36506003 33215927 34108799 33883875 32227794 30058429
3327 30058429 31597451 32404263 31564685 30778172 29089390 29190590 28907657 27258301 29308757
3318 29308757 28251208 28344579 27546260 28759126 26574345 27425471 28120677 26917051 26280686
3309 26280686 26203902 25488534 26420652 25347306 27178112 26461777 24737014 25510298 23261258
3300 23261258 25396080 25278966 25297112 25023220 24546191 25196238 25120157 25606304 24729800 23818387
3290 23818387 25119911 24650656 23341713 23971648 24064210 24531582 25108805 23474396 24453869
3281B4453869L62840Q38662k85195L54349r38942O22924j047850N57548Q52149
3272B5770354j458854J313265J113152j054506j216004P24894o71624R32443O53747
3263B6106867m44061Q00393j5667J073697J11279p09033J155948k1597k92390
3254B7765436J507212J740527j998391J459600Q04958q50547J462048j493385
3246C0397458K191594j667089J083822J438126J062621N12456M54509p19058J134524
3237C5888963J041101K082177L31370j011237J42124K904001Q21649J722875J113356
3228D5036379J872218J722089j575791K822525j39679K983590Q09882J566788
3220E5098001j240593M629610R75472K169448K945406J203343M387350L947161
$$ plain form
3281 24453869 24816709 25655371 25370176 25724525 24785583 25408507 24360657 24918205 25770354
3272 25770354 24311500 25624765 26737917 25683411 24467407 25192301 24520677 25453120 26106867
3263 26106867 25662806 26463199 26447532 27521229 27632508 26923475 28079423 28057826 27765436
3254 27765436 29272648 31013175 29014784 30474384 31279342 30428795 31890843 30397458
3246 30397458 32589052 30921963 32005785 33443911 34506532 35018988 35473497 34754439 35888963
3237 35888963 36930064 39012241 39343611 38332374 38474498 41378499 42200148 43923023 45036379
3228 45036379 46908597 48630686 47054895 49877420 49737741 52721331 53531213 55098001
3220 55098001 53857408 58487018 59462490 61631938 64577344 65780687 70168037 74115198
3212G4115198L267356K450697K504872K374229L886350N89477J368262N40085
3204I1096526J016982r0807K48007Q42231K26131J218173l39370K192585j951489
3195I4458969J989270L219660L62376J646975K641322M174478K085107M509208
3187A15087365N236445O595822P171860R081771Q065552O348103Q831997N250861
3179A71669776M919714J989810N47126k826438p72176l553422l795540n062146
3171A63116704l493842m892271m212771k348972l164733l682704q50575k88286
3163A40182550j440772k78270K835466K483872J980414M357431N054343O105793
3155A61280827P248721R429057R056528O865569O389762P167632L631923J266136
$$ plain form
3212 74115198 77382554 79833251 82338123 84712352 88598702 89188179 90556441 91096526
3204 91096526 92113508 92022701 92270708 93112939 93339070 94557243 94217873 96410458 94458969
3195 94458969 96448239 99667899 100030275 101677250 104318572 108493050 110578157 115087365
3187 115087365 120323810 126919632 134091492 143173263 151238815 157586918 166418915 171669776
3179 171669776 176589490 178579300 179126426 176299988 175527812 171974390 168178850 163116704
3171 163116704 159622862 154730591 150517820 148168848 145004115 141321411 140470836 140182550
3163 140182550 138741778 138463508 141298974 143782846 145763260 150120691 155175034 161280827
3155 161280827 168529548 177958605 187015133 193880702 200270464 207438096 211070019 212336155
3147B12336155l516158p306193m288246o130695q113737j0166769p161841p653854
3139A57998662o914279o554657m968216p059070m211117l328934k574851j826710
3131A20560828p59076j613354n36917J70279K591984L218435K537364L872211
3123A30041754L860847N777163K516214J230231J36130j772387k866740n579847
3115A33343365n254075n375268o730598p079107o359605o789063m073086k658022
3107H9024541n408610m001279k446568k651980l922116j662499m64950j629407
3099F6837132m02751j253421J913j61429L86846K69540j09028j370346J556595
3090F5755051r0475k167147n5523j506309r03534k002070j316604j943839r41447
$$ plain form
3147 212336155 208819997 201513804 197225558 191094863 182981126 172814357 165652516 157998662
3139 157998662 151084383 144529726 139561510 132502440 128291323 124962389 122387538 120560828
3131 120560828 119801752 118188398 117651481 117821760 120413744 123632179 126169543 130041754
3123 130041754 133902601 139679764 142195978 143426209 143562339 141789952 138923212 133343365
3115 133343365 128089290 122714022 115983424 108904317 102544712 95755649 91682563 89024541
3107 89024541 83615931 79614652 77168084 74516104 70593988 68931489 68466539 66837132
3099 66837132 66434381 65180960 65182873 65021444 65408290 65677830 65568802 64198456 65755051
3090 65755051 65664576 63497429 63441906 61935597 61032063 59029993 57713389 55769550 54828103
3081E4828103L20771j926375M94558m60563n14793R01858N72983P17579k084236
3072E2849885j048831k529293k11001k588736j361225j761225j484666l290047
3064C8574861l77697j444068j565029J51482m26814k702746l88790j12555L77129
3055C2085773j941525J335262j583105J41392m61828j266273j585541M73841r0049
3046B7107947N0577J54771Q18988k236975J046411q94460R11053M72619K82735
3037B7713666P88557o38938j831997j33045q00289m89634m43140K986768k469224
3028B4682724J498842r26150K80345q78458J323182j526482j47934O62101n13770
3019B4454400O40333Q76702j463199j7799K78692P83418P51608j540999k87010
$$ plain form
3081 54828103 55148874 53222499 53717057 53256494 52741701 53643559 54216542 54934121 52849885
3072 52849885 51801054 49271761 49060760 46472024 45110799 43349574 41864908 38574861
3064 38574861 38197164 36753096 35188067 35339549 34912735 32209989 31821199 31708644 32085773
3055 32085773 30144248 31479510 29896405 30037797 29575969 28309696 26724155 27197996 27107947
3046 27107947 27158524 27313295 28132283 25895308 26941719 26047259 26958312 27430931 27713666
3037 27713666 28502223 27863285 26031288 25898243 25097954 24608320 24165180 27151948 24682724
3028 24682724 26181566 25255416 25535761 24657303 25980485 24454003 24306069 24968170 24454400
3019 24454400 25094733 25971435 24508236 24490437 24769129 25552547 26304155 24763156 24476146
3010B4476146R52268R9650M12035j046125J153088K24034n92971j195915J049083
3001B5531293j066505J68598J806435k269126K226601O40911j131437P32896P85647
2992B7425313j290804j32316Q39247q21196J428543M60125n61426P44454j771380
2983B6320560J649169M95754j12440J033424j189341O66883R11759K62807j907669
2974B8130906J117783J444403M36651P64232M30145j884650J285868Q48267K239408
2965C4813013j654571K055608P49164j026541M69399K267851j213136J227049
2957C7687836J673501p05609K225337O81253N46015K263182j88107M86554J017766
2948D5687728Q18589J671820L11779J407935q74803L945118M51751K207946J873611
$$ plain form
3010 24476146 25428414 25528064 25940099 24893974 26047062 26271096 25678125 24482210 25531293
3001 25531293 24464788 24633386 26439821 24170695 26397296 27038207 25906770 26639666 27425313
2992 27425313 26134509 26002193 26841440 26020244 27448787 27908912 27347486 28091940 26320560
2983 26320560 27969729 28465483 28353043 29386467 28197126 28864009 29775768 30038575 28130906
2974 28130906 29248689 30693092 31129743 31893975 32324120 30439470 31725338 32573605 34813013
2965 34813013 33158442 35214050 35963214 34936673 35406072 37673923 36460787 37687836
2957 37687836 39361337 38655728 40881065 41562318 42108333 44371515 44183408 44669962 45687728
2948 45687728 46506317 48178137 48489916 49897851 49023048 52968166 53419917 55627863 57501474
2939E7501474j97618J088817M022400J864342M73242K361898K168952J597483
2931G0880990K735127J753029M776637P4453L241781L706411J544576K357442
2923I1070446K214655K556629K420363K459157Q87962M734558L136181J802710
2915A11282661M956503L025855M356942J946643M046516L807274L634736L688039
2907A40745169L550553L836359L130709J361601O471124L814059K079185N084119
2899A70072878R43342M572172N380450N377303L082741M530217O040425N016273
2891B05015801O896971N739511N282978N090258L652211N938932M038385M882314
2883B46537361K631002L141753K806619L300050M80800M400593K404924M139186
$$ plain form
2939 57501474 57303856 58392673 62415073 64279415 64752657 67114555 69283507 70880990
2931 70880990 73616117 75369146 80145783 80220236 83462017 87168428 88713004 91070446
2923 91070446 93285101 95841730 98262093 100721250 101609212 106343770 109479951 111282661
2915 111282661 116239164 119265019 123621961 125568604 129615120 133422394 137057130 140745169
2907 140745169 144295722 148132081 151262790 152624391 159095515 162909574 164988759 170072878
2899 170072878 171016220 175588392 180968842 186346145 189428886 193959103 199999528 205015801
2891 205015801 211912772 217652283 222935261 228025519 231677730 237616662 241655047 246537361
2883 246537361 249168363 252310116 255116735 258416785 258897585 263298178 265703102 269842288
2875B69842288L048702M509569O719317N121927O989739P967508Q394345J1032181
2867C23625576Q105412Q362625P341392O922348M445164M377337J034052J014243
2859C65228149J117007l386770j653167l413854j833589k905551j891180l414146
2851C47846899k407877k408476j830425j749761j175112j314010j138667j255827
2843C34566744k069447K61740j925403j530465n845205m925018r398607p845055
2835C01289284j0358942r689732j1613226r885370j1582044r008859r370105r406462
2827B20374544o026078o426896o038788n837168m716935l994617m965323l923409
2819A78445330l483320m411844l292773m862034m301958l227703m892869m638004
$$ plain form
2875 269842288 272890990 277400559 284119876 289241803 296231542 304199050 312593395 323625576
2867 323625576 331730988 340093613 347435005 354357353 358802517 363179854 364213906 365228149
2859 365228149 366345156 362958386 361305219 357891365 356057776 353152225 351261045 347846899
2851 347846899 345439022 343030546 341200121 339450360 338275248 336961238 335822571 334566744
2843 334566744 332497297 332759037 330833634 329303169 323457964 318532946 309134339 301289284
2835 301289284 290930342 281240610 269627384 259742014 248159970 239151111 229781006 220374544
2827 220374544 214348466 207921570 201882782 196045614 191328679 187334062 182368739 178445330
2819 178445330 174962010 170550166 167257393 162395359 158093401 154865698 149972829 145334825
2811A45334825o697679l143640m591255l485048l732118m644023n383586l475415
2803A10182061k996480m647192m076632k762632k538473l557261j599359k515470
2795H5488562j470112m240225n14126l048176k183787j529534l361940j480880
2787F7659782k050992l327228j166474m72969m201895l23821l564822k29032l177489
2778D9145060m8103k660587j26502j728475j669809l95204j276014j124672k584683
2769C7531011j042964j171620j246958j536559m86433p55789k668564Q92118k078173
2760B7436069N43357k883686J155801j979769j195415L66117N21567j604577l2768
2751B2326696o74396k71130q85523K91418q92657K04473j710576m77457J409518
$$ plain form
2811 145334825 138637146 135493506 130902251 127417203 123685085 119041062 113657476 110182061
2803 110182061 107185581 102538389 98461757 95699125 93160652 89603391 88004032 85488562
2795 85488562 84018450 79778225 79264099 76215923 74032136 72502602 69140662 67659782
2787 67659782 65608790 62281562 61115088 60642119 56440224 56116403 52551581 52322549 49145060
2778 49145060 49096957 46436370 46309868 44581393 42911584 42516380 41240366 40115694 37531011
2769 37531011 36488047 35316427 34069469 32532910 32046477 31290688 28622124 29514242 27436069
2760 27436069 27979426 25095740 26251541 24271772 23076357 23442474 23964041 22359464 22326696
2751 22326696 21652300 21381170 20495647 20787065 19894408 20098881 18388305 17910848 19320366
2742A9320366m3126j069029j285795J145396j352854K74646J34625p19628q08958
2733A5595643n04943k58677O03335Q31015j933671J304860j25926Q337J52162
2724A5672135k250555J277821l02516k338097J175695Q88603r01444J447871k108052
2715A2561461M09106O93055j049987M26788n00585r73827J612407J92382k058366
2706A1312434P50618m12638j163595J771741m53343J115141q62849j523170J461920
2697A1996259m18614J2025k50776P6572j638817L63732J390516k55602K21325
2688A1496620j337079K736040j047858j123815l43532J75942p17959K041800r48837
2679A0931322p35484Q69595j554482k31522L08398k62306J74216R6525R84272
$$ plain form
2742 19320366 19277240 18208211 16922416 18067812 16714958 16989604 17124229 16404601 15595643
2733 15595643 15090700 14832023 15435358 16266373 14332702 15637562 15511636 15519973 15672135
2724 15672135 13421580 14699401 14396885 12058788 13234483 14123086 13221642 14669513 12561461
2715 12561461 12970567 13663622 12613635 13040423 12539838 11566011 13178418 13370800 11312434
2706 11312434 12063052 11650414 10486819 12258560 11805217 12920358 12057509 10534339 11996259
2697 11996259 11577645 11589670 11338894 11415466 9776649 10140381 11530897 11275295 11496620
2688 11496620 10159541 12895581 11847723 10723908 10380376 10556318 9838359 11880159 10931322
2679 10931322 10195838 11065433 9510951 9279429 9587827 9325521 9499737 9596262 10580534
2670A0580534j984376P23606R81270p41861R36648o26163p41809p70570P36501
2661I093780k36896L5010R42233l22539K79787n88573j145853J534930O44332
2652A0236211j7814k213711O14600J33758j075102K024214j37522j01872r85155
2643H477607l11086P45508M31473o65707n30519L384285k571918Q03548j718449
2634H044742L1149M29901k53855o95922L87791k66772j8718o59345J595606R93294
2624I587871k304926L47328N94755J60312N23315n96669M7615j050979O43306
2615G951928K612878k392647L37107q34891O10996r25230J285334n41988m86747
2606G616740J640193k112253L65101j08062K31973J44172r55805K037078q22881
$$ plain form
2670 10580534 8596158 9319764 10301034 9559173 10495821 9869658 9127849 8357279 9093780
2661 9093780 8856884 8891894 9834127 9511588 9791375 9202802 8056949 9591879 10236211
2652 10236211 10218397 8004686 8619286 8753044 7677942 9702156 9564634 9462762 8477607
2643 8477607 8166521 8912029 9343502 8677795 8147276 11531561 8959643 9763191 8044742
2634 8044742 8075891 8505792 8251937 7556015 7943806 7677034 7658316 6998971 8594577 9587871
2624 9587871 7282945 7630273 8225028 8385340 8908655 8311986 8359601 7308622 7951928
2615 7951928 10564806 8172159 8509266 7674375 8285371 7360141 8645475 8103487 7616740
2606 7616740 9256933 7144680 7509781 7401719 7633692 7777864 6822059 8859137 8036256
2597H036256J019493p89169j572257J613399n82357L89525J492534k770623K104580
2588H941381M19294l003539J207181L67528M17737j879596R06522J065597n80891
2579G861214J50158j490786m25000J780619j22084j050381Q25306R28376j844311
2570F613111M31015O10911p0675o88166J699927k209667K716218k220355R23965
2561G806284J34029J488722j138957j208062O08251j94396m63634L04922J326352
2552H663511k428123K222783j157874j88781J448423j504492J313438n64911M9691
2543G853665Q22714j652135J759389j50002j15799l42350M78544j69408n72763
2534G911855K399852M9510K74253J32731L1355J78550J603541k874967K104779
$$ plain form
2597 8036256 9055749 8266580 6694323 8307722 7725365 8114890 9607424 6836801 8941381
2588 8941381 9360675 6357136 7564317 7931845 8349582 6469986 7376508 8442105 7861214
2579 7861214 8011372 6520586 6095586 7876205 7754121 6703740 7529046 8457422 6613111
2570 6613111 7044126 7655037 7584362 6896196 8596123 6386456 9102674 6882319 7806284
2561 7806284 7940313 9429035 8290078 7082016 7690267 7495871 7032237 7337159 8663511
2552 8663511 6235388 8458171 7300297 7111516 8559939 7055447 8368885 7803974 7853665
2543 7853665 8676379 7024244 8783633 8633631 8517832 8175482 8654026 8484618 7911855
2534 7911855 10311707 10361217 10635470 10768201 10799556 10978106 12581647 9706680 11811459
2525A1811459J95231j900056P48966n90237Q5459J80657n97465r27808L516657
2516A2522863k527292J064441j942334K878144j215740J980657M05094J926986
2508A5092819R51701L27610N05602k090653R96685m94293p51086k52050k36545
2499A4049790r40220o85241K333932k535207O05424J91986J323042j462530Q28024
2490A3709000J82003j477148J192417K575609K02199k75833j625826M64803l36661
2481A4610563L04313j078569j298327J607898K18963j722760P60159J119725o09728
2472A3912237J567875p85232L37609j406120j53987j94600K57566J19065L3347
2463A3687760m68917M88996p54876M98951J469801j992695k47087J443485r46458
$$ plain form
2525 11811459 12006690 10106634 10855600 10265363 10350822 10531479 9934014 9006206 12522863
2516 12522863 9995571 11060012 9117678 11995822 10780082 12760739 13165833 15092819
2508 15092819 16044520 16372130 16877732 14787079 15783764 15289471 14538385 14286335 14049790
2499 14049790 13109570 12424329 14758261 12223054 12828478 13020464 14343506 12880976 13709000
2490 13709000 13891003 12413855 13606272 16181881 16384080 16108247 14482421 14947224 14610563
2481 14610563 14914876 13836307 12537980 14145878 14364841 12642081 13402240 14521965 13912237
2472 13912237 15480112 14694880 15032489 13626369 13472382 13277782 13535348 13654413 13687760
2463 13687760 13218843 13707839 12952963 13451914 14921715 12929020 12681933 14125418 13178960
2454A3178960L16347L15116J537548n01225Q23164j991002K349099j414312J629400
2445A6243095P5536j522169J080828J58618J191765k495321Q09099J314747J343040
2436A8199238q16126j019991J554522j187557K910901P25415J021347J00266n83149
2427B0904866L95336j251124j790309J827017J105399o60027r85922J099030q97954
2418A9746312m23009Q67151q76717R01098N15658P2186J449245L92903j9664Q31967
2408B3457130J042475K232043l44231K400280L250352j46106J10249q13672l47022
2399C0841498m95810l367500k301489j453962J71114j509155k597597l384696
2391A5902403R01028n89987j013098j571795J435223j970534M3318R0052r03178
$$ plain form
2454 13178960 13495307 13810423 15347971 14846746 15669910 13678908 16028007 14613695 16243095
2445 16243095 16318631 14796462 15877290 16035908 17227673 14732352 15541451 16856198 18199238
2436 18199238 17383112 16363121 17917643 16730086 19640987 20366402 21387749 21488015 20904866
2427 20904866 21300202 20049078 18258769 20085786 21191185 20531158 19545236 20644266 19746312
2418 19746312 19323303 20190454 19313737 20214835 20730493 20802679 22251924 22644827 22625163 23457130
2408 23457130 24499605 26731648 26387417 28787697 32038049 31891943 32002192 31188520 30841498
2399 30841498 30345688 26978188 24676699 23222737 23393851 21884696 19287099 15902403
2391 15902403 16803431 16213444 15200346 13628551 15063774 13093240 13136558 13226610 12323432
2382A2323432l43126L26283N97528n60235Q10883J252685k48153P21506M38031
2373A5318834L06555m61350N97821j186413j373503P84504k405058k58618J80301
2364A1503073o35151n35040L01075j685604J402483j241802j94806L14307n08312
2355H720223o16376j201676P84450J371939j531997O62442J81577O39574r73991
2346H036165q66461J061767N81578j716586J167639m26314K73522P06805j375666
2337G442449m85061Q49805n32061n13468P4452J529460r48242o44206N4754o68044
2327F159838N11618j20015p79513j643266L098760j044908q61443p65294J490559
2318F046336O15899k613942M6388K198669p14929k649282L469280j831659J84426
$$ plain form
2382 12323432 11980306 12306589 12904117 12343882 13154765 14407450 14159297 14880803 15318834
2373 15318834 15625389 15164039 15761860 14575447 13201944 13986448 11581390 11322772 11503073
2364 11503073 10867922 10332882 10633957 8948353 10350836 9109034 8914228 9228535 8720223
2355 8720223 8103847 6902171 7686621 9058560 7526563 8189005 8370582 9010156 8036165
2346 8036165 7169704 8231471 8813049 7096463 8264102 7837788 8111310 8818115 7442449
2337 7442449 6957388 7807193 7275132 6761664 6836116 8365576 7417334 6773128 6827882 6159838
2327 6159838 6671456 6551441 5771928 4128662 7227422 6182514 5321071 4555777 6046336
2318 6046336 6662235 4048293 4094681 6293350 5578421 2929139 6398419 4566760 4751186
2309D751186J418050j452906J522799O86020j554088j109609J293374q03177P30543
2300E482192r60229J024740r15774L0039l244613K822772k150364K002347N09880
2291D600990j943061k94739l2557J258833k51649L9346j340335J364074P15373
2282D116275o49052l93109m59568j486621P12791m7112l62419J393072N43120
2273C367377J303837j553155l69833j324186j58552O17040M03716J866149k420107
2264A732286L71738Q43914p15363j04034N78538n50828R39012m64667k51501J137781
2254C516876j544729q64220O02238J250003j347566K36859j5892l85967J001835
2245B449437n00203J861709k445873J729108k76839q20886j8788K68256M10327
$$ plain form
2309 4751186 6169236 4716330 6239129 6925149 5371061 4261452 5554826 4751649 5482192
2300 5482192 4521963 5546703 4630929 4660968 1416355 4239127 2088763 4091110 4600990
2291 4600990 2657929 2363190 2330633 3589466 3337817 3377163 2036828 3400902 4116275
2282 4116275 3467223 3074114 2614546 1127925 1840716 1793604 1431185 2824257 3367377
2273 3367377 4671214 3118059 2748226 1424040 1265488 1882528 2286244 4152393 1732286
2264 1732286 2104024 2947938 2232575 2128541 2707079 2156251 3095263 2630596 2379095 3516876
2254 3516876 1972147 1107927 1710165 2960168 1612602 1849461 1833569 1447602 2449437
2245 2449437 1949234 3810943 1365070 3094178 2817339 1996453 1977665 2245921 2656248
2236B656248p53827Q76987J69375k116149L209561j480180j049036J792630r90248
2227B315361n53268P49233O00704j964205J537869q36509k16536J81415j67113
2218A646951j99630p16621J126792p0351j61264n12164J9251O23483O61853j273439
2208A144861Q36083J79992j471414K045049l90817l03621l36147q64331k21344
2199F18311J578074k15814N52618j536522j79024J139514n50600o57454J765905
2190B515008j172511P58885k50146M30391j34031J17421k80511k352790J718777
2181A350493J010095n13762j26535q5224J12515j436840j40788P82702J041662
2172A994318j82992O83625j410411K072578n75986m33135o91744P94800j02761
$$ plain form
2236 2656248 1902421 2779408 2948783 832634 4042195 2562015 1512979 3305609 2315361
2227 2315361 1762093 2511326 3112030 1147825 2685694 1849185 1632649 1814064 1646951
2218 1646951 1447321 730700 1857492 1787141 1625877 1113713 1132964 1756447 2418300 1144861
2208 1144861 1980944 2160936 689522 2734571 2343754 2040133 1703986 839655 618311
2199 618311 2196385 1980571 2533189 996667 817643 1957157 1406557 749103 2515008
2190 2515008 1342497 2101382 1851236 2281627 2147596 2265017 1984506 -368284 1350493
2181 1350493 2360588 1846826 1720291 1635067 1747582 310742 169954 952656 1994318
2172 1994318 1811326 2494951 1084540 3157118 2581132 2147997 1456253 2251053 2148292
2163B148292j24407J08820p86114K55232N63508Q71096K0233r77180j685955K467123
2153B860648q48425M49390R98776k070344J721142j082820m53626L88409p61904
2144A201246J962329p76830P70487j725002J187764r80308J853797j346235N39769
2135B687017K41158R39841j272134j122746J555289o72292J720333j19982j362226
2126B594258J245362r08063o06890M97444n57531J273965j59049l96965p78727
2117B203804J195608m35346l28127M34886N77079R60223r79770K03209K68097
2108D099663j36029Q55339o84829q72950J93536J54675K020716l379657J991286
2099D241750n05488o65088J71431L22160j083295L54657m97660N29486L12254
$$ plain form
2163 2148292 2023885 2132705 1346591 1601823 2165331 3036427 3056660 2079480 393525 2860648
2153 2860648 2012223 2461613 3460389 1390045 3111187 2028367 1574741 1963150 1201246
2144 1201246 3163575 2386745 3157232 1432230 2619994 1639686 3493483 2147248 2687017
2135 2687017 2928175 3868016 2595882 1473136 3028425 2356133 4076466 3956484 2594258
2126 2594258 3839620 2931557 2324667 2822111 2264580 3538545 3379496 2982531 2203804
2117 2203804 3399412 2964066 2635939 3070825 3647904 4608127 3628357 3831566 4099663
2108 4099663 3963634 4818973 4134144 3261194 3454730 3609405 5630121 2250464 4241750
2099 4241750 3736262 3071174 3242605 3564765 2481470 2836127 2338467 2867953 3180207
2090C180207m76548k40476M91077L25330J230519o20298j597356p83468L280203
2081D789190k305306k9692Q55761j923265K099212k343618N79539o23962O42402
2072A740261J09939j42348J065952j148210P69073j820941J426308J956332k80200
2063C676166j580067q59938O49183q07299r7109j44524J344069j828141Q47940
2054A200280K012228k954599J466567q27657J493162q75941l18282M40166N68222
2045B204146l19208j555377j78408O59596J11114J769635r12186j722969J496574
2036A552917N82058r81105K80121O89760j246741o06958N3285J669219j432679
2027E59877q0196J089288j092106J530474m35772n21841r20800J078290J201406
$$ plain form
2090 3180207 2703659 2463183 2954260 3279590 4510109 3889811 2292455 1508987 4789190
2081 4789190 2483884 2454192 3309953 1386688 3485900 1142282 1721821 1097859 1740261
2072 1740261 1850200 1707852 2773804 1625594 2394667 573726 2000034 3956366 3676166
2063 3676166 2096099 1236161 1885344 1078045 980936 836412 2180481 352340 1200280
2054 1200280 3212508 257909 1724476 896819 2389981 1514040 1195758 1635924 2204146
2045 2204146 1884938 329561 151153 810749 921863 2691498 1779312 56343 1552917
2036 1552917 2134975 1153870 1433991 2123751 877010 270052 323337 1992556 559877
2027 559877 479681 1568969 476863 2007337 1571565 1049724 128924 1207214 2408620
2018B408620j785905K019338k061564k30996O16095R76956L92774k421974J480306
2009A393650j137688n61122L67785j02108Q93332l00655J492946q28548P12903
2000A930495p20355q0758R22730k23975j938072K685057j985501k38541l30404
1991B0676J280978j334450K38296L92878l71083L32473O43580k60703q82357N69631
1981F29919Q15971j854613Q68819J085977j061387J360855j859187J53468j471358
1972a331536K031904o61544m23677N74369R61352O89522J83271m98647j831121
1963c06107J245179N36901l263530q3337L149402q43636N83235j592395J81217
1954c93071o33638J779536m32536J643628j582174p64161P26549j240864J588124
$$ plain form
2018 2408620 622715 2642053 580489 349493 965588 1942544 2335318 -86656 1393650
2009 1393650 255962 -305160 62625 -39483 853849 553194 2046140 1217592 1930495
2000 1930495 1210140 1129382 2052112 1828137 -109935 2575122 589621 351080 20676
1991 20676 1301654 -32796 205500 598378 227295 559768 1203348 942645 60288 629919
1981 629919 1445890 -408723 460096 1546073 484686 1845541 -13646 139822 -1331536
1972 -1331536 700368 38824 -384853 189516 1150868 1840390 2023661 1525014 -306107
1963 -306107 939072 1475973 -1787557 -1870894 1278508 434872 1018107 -574288 -393071
1954 -393071 -1026709 752827 320291 1963919 381745 -382416 344133 -896731 691393
1945F91393k46650R6189l2088N9916k228419K071158n081J20125q62651P87068
1935D50960J00013J12966k309131L787852q86756j629764J058669L87977N37127
1926A609913k007353O36190M61742o07120M17657K242100j678804n68460J01284
1917F07149P05058p07105O48533j52019j744499M93946P24708N95863k48236p05908
$$ plain form
1945 691393 444743 540932 508844 568760 -1659659 411499 406418 526543 -336108 450960
1935 450960 550973 663939 -1645192 2142660 1255904 -373860 684809 1072786 1609913
1926 1609913 -397440 238750 700492 93372 511029 2753129 1074325 505865 607149
1917 607149 1312207 605102 1253635 1101616 -642883 -148937 575771 1171634 923398 217490
$$ [...]
##END NTUPLES=NMR SPECTRUM
##END=
