##TITLE=abcd
##JCAMPDX= 6.0         $$ Bruker NMR JCAMP-DX V2.0
##DATA TYPE= NMR SPECTRUM
##DATA CLASS= NTUPLES
##ORIGIN= UXNMR, Bruker Analytische Messtechnik GmbH
##OWNER= root
$$ XWIN-NMR		Version 3.5
$$ Mon Aug 25 17:21:24 2025 Russian Standard Time (UT+4h)  servis@DPX200
##.OBSERVE FREQUENCY= 200.131235884673
##.OBSERVE NUCLEUS= ^1H
##.ACQUISITION MODE= SIMULTANEOUS
##.ACQUISITION SCHEME= undefined
##.AVERAGES= 32
##.DIGITISER RES= 18
##SPECTROMETER/DATA SYSTEM= spect
##.PULSE SEQUENCE= zg
##.SOLVENT NAME= CDCl3
##.SHIFT REFERENCE= (INTERNAL, CDCl3, 0, 16.4885)
##AUDIT TRAIL= $$ (NUMBER, WHEN, WHO, WHERE, WHAT)
$$ ##TITLE= Audit trail, XWIN-NMR		Version 3.5
$$ ##JCAMPDX= 5.01
$$ ##ORIGIN= Bruker BioSpin GmbH
$$ ##OWNER= servis
$$ F:\spectra/data/av/nmr/H1/1/pdata/1/auditp.txt
$$ ##AUDIT TRAIL=  $$ (NUMBER, WHEN, WHO, WHERE, WHAT)
(   1,<2025-08-25 17:20:49.18 +0400>,<servis>,<DPX200>,
      <created by zg, POWCHK disabled, PULCHK disabled
       configuration hash MD5:
       00 E9 B6 7A A2 85 ED C7 34 08 36 98 17 FE 4E 26
       data hash MD5: 32K
       0F B2 A2 DB 07 C2 91 F0 81 1D 78 5E 06 72 C7 4C>)
(   2,<2025-08-25 17:20:50.53 +0400>,<servis>,<DPX200>,
      <Start of raw data processing
       efp BC_mod = 2 LB = 0.05 FT_mod = 6 PKNL = 1 PHC0 = -278.7419 PHC1 = 0.101552 SI = 16K 
       data hash MD5: 16K
       9E 93 23 C1 D8 52 20 4A 44 AC 77 7A 14 17 FD 91>)
$$ ##END=
$$ 
$$ hash MD5
$$ 10 54 94 9A 1A 6A A3 E9 A1 4B 4E 08 DE 07 86 48
##$RELAX= 
##$RELAX= 
##$RELAX= 
##$RELAX= 
##$RELAX= 
##$RELAX= 
##$RELAX= 
##$RELAX= 
$$ Bruker specific parameters
$$ --------------------------
##$DU= <F:\spectra>
##$EXPNO= 1
##$NAME= <H1>
##$PROCNO= 1
##$TYPE= <nmr>
##$USER= <av>
##$AMP= (0..31)
100 100 100 100 100 100 100 100 100 100 100 100 100 100 100 100 100 100 
100 100 100 100 100 100 100 100 100 100 100 100 100 100 
##$AQSEQ= 0
##$AQ_mod= 1
##$AUNM= <au_zg>
##$AUTOPOS= <>
##$BF1= 200.13
##$BF2= 200.13
##$BF3= 200.13
##$BF4= 200.13
##$BF5= 500.13
##$BF6= 500.13
##$BF7= 500.13
##$BF8= 500.13
##$BYTORDA= 1
##$CFDGTYP= 0
##$CFRGTYP= 5
##$CHEMSTR= <none>
##$CNST= (0..31)
1 1 145 1 1 1 1 1 1 1 1 1 1 1 1 1 1 1 1 1 1 1 1 1 1 1 1 1 1 1 1 1 
##$CPDPRG= <>
##$CPDPRG1= <>
##$CPDPRG2= <>
##$CPDPRG3= <>
##$CPDPRG4= <mlev>
##$CPDPRG5= <mlev>
##$CPDPRG6= <mlev>
##$CPDPRG7= <mlev>
##$CPDPRG8= <mlev>
##$CPDPRGB= <>
##$CPDPRGT= <>
##$D= (0..31)
0 2 0 0 0 0 0 0 0 0.06 0 0 0 0 0 0 0.0002 0 0 0 0 0 0 0 0 0 0 0 0 0 0 
0 
##$DATE= 1756128048
##$DBL= (0..7)
120 120 120 120 120 120 120 120 
##$DBP= (0..7)
150 150 150 150 150 150 150 150 
##$DBP07= 0
##$DBPNAM0= <>
##$DBPNAM1= <>
##$DBPNAM2= <>
##$DBPNAM3= <>
##$DBPNAM4= <>
##$DBPNAM5= <>
##$DBPNAM6= <>
##$DBPNAM7= <>
##$DBPOAL= (0..7)
0.5 0.5 0.5 0.5 0.5 0.5 0.5 0.5 
##$DBPOFFS= (0..7)
0 0 0 0 0 0 0 0 
##$DE= 6
##$DECBNUC= <off>
##$DECIM= 32
##$DECNUC= <off>
##$DECSTAT= 4
##$DIGMOD= 1
##$DIGTYP= 9
##$DL= (0..7)
0 120 120 120 120 120 120 120 
##$DP= (0..7)
150 150 150 150 150 150 150 150 
##$DP07= 0
##$DPNAME0= <>
$$ [...]
##$SUBNAM4= <"">
##$SUBNAM5= <"">
##$SUBNAM6= <"">
##$SUBNAM7= <"">
##$SUBNAM8= <"">
##$SUBNAM9= <"">
##$SW= 20.6817932712277
##$SWIBOX= (0..15)
0 0 3 0 0 0 0 0 0 0 0 0 0 0 0 0 
##$SW_h= 4139.07284768212
##$TD= 32768
##$TD0= 1
##$TE= 0
##$TE2= 300
##$TE3= 300
##$TEG= 300
##$TL= (0..7)
0 120 120 120 120 120 120 120 
##$TP= (0..7)
150 150 150 150 150 150 150 150 
##$TP07= 0
##$TPNAME0= <>
##$TPNAME1= <>
##$TPNAME2= <>
##$TPNAME3= <>
##$TPNAME4= <>
##$TPNAME5= <>
##$TPNAME6= <>
##$TPNAME7= <>
##$TPOAL= (0..7)
0.5 0.5 0.5 0.5 0.5 0.5 0.5 0.5 
##$TPOFFS= (0..7)
0 0 0 0 0 0 0 0 
##$TUNHIN= 0
##$TUNHOUT= 0
##$TUNXOUT= 0
##$USERA1= <user>
##$USERA2= <user>
##$USERA3= <user>
##$USERA4= <user>
##$USERA5= <user>
##$V9= 5
##$VALIST= <valist>
##$VCLIST= <CCCCCCCCCCCCCCC>
##$VD= 0
##$VDLIST= <DDDDDDDDDDDDDDD>
##$VPLIST= <PPPPPPPPPPPPPPP>
##$VTLIST= <TTTTTTTTTTTTTTT>
##$WBST= 1024
##$WBSW= 30
##$XGAIN= (0..3)
0 0 0 0 
##$XL= 0
##$YL= 0
##$YMAX_a= 238426
##$YMIN_a= -183177
##$ZGOPTNS= <>
##$ZL1= 120
##$ZL2= 120
##$ZL3= 120
##$ZL4= 120
##$ABSF1= 0
##$ABSF2= 0
##$ABSG= 0
##$ABSL= 0
##$ALPHA= 0
##$AQORDER= 0
##$ASSFAC= 0
##$ASSFACI= 0
##$ASSFACX= 0
##$ASSWID= 0
##$AUNMP= <proc_1d>
##$AZFE= 0.1
##$AZFW= 0.1
##$BCFW= 0
##$BC_mod= 2
##$BYTORDP= 0
##$COROFFS= 0
##$CY= 18.4799938201904
##$DATMOD= 1
##$DC= 0
##$DFILT= <>
##$DTYPP= 0
##$F1P= 9.9274215381318
##$F2P= -0.165520771350173
##$FCOR= 1
##$FTSIZE= 16384
##$FT_mod= 6
##$GAMMA= 0
##$GB= 0
##$INTBC= 1
##$INTSCL= 4.127829e-11
##$ISEN= 128
##$LB= 0.05
##$LEV0= 0
##$LPBIN= 0
##$MAXI= 10000
##$MC2= 0
##$MEAN= 0
##$ME_mod= 0
##$MI= 50
##$NCOEF= 0
##$NC_proc= -8
##$NLEV= 6
##$NOISF1= 3.799351
##$NOISF2= 2.8
##$NSP= 0
##$NTH_PI= 0
##$NZP= 0
##$OFFSET= 16.48848
##$PC= 4
##$PHC0= -278.7419
##$PHC1= 0.101552
##$PH_mod= 1
##$PKNL= yes
##$PPARMOD= 0
##$PSCAL= 4
##$PSIGN= 0
##$REVERSE= no
##$SF= 200.130005582386
##$SI= 16384
##$SIGF1= 3
##$SIGF2= 2
##$SINO= 400
##$SIOLD= 16384
##$SREGLST= <1H.CDCl3>
##$SSB= 0
##$STSI= 16384
##$STSR= 0
##$SW_p= 4139.07284768211
##$SYMM= 0
##$S_DEV= 0
##$TDeff= 32768
##$TDoff= 0
##$TI= <>
##$TILT= no
##$TM1= 0
##$TM2= 0
##$TOPLEV= 0
##$USERP1= <user>
##$USERP2= <user>
##$USERP3= <user>
##$USERP4= <user>
##$USERP5= <user>
##$WDW= 1
##$XDIM= 16384
##$YMAX_p= 333980676
##$YMIN_p= -3003927
$$ End of Bruker specific parameters
$$ ---------------------------------
##NTUPLES= NMR SPECTRUM
##VAR_NAME=  FREQUENCY,     SPECTRUM/REAL,   SPECTRUM/IMAG
##SYMBOL=    X,             R,               I
##VAR_TYPE=  INDEPENDENT,   DEPENDENT,       DEPENDENT
##VAR_FORM=  AFFN,          ASDF,            ASDF
##VAR_DIM=   16384,         16384,           16384
##UNITS=     HZ,            ARBITRARY UNITS, ARBITRARY UNITS
##FACTOR=    0.252644378177508, 1,           1
##FIRST=     3299.83951724647, 0,            0
##LAST=      -839.233330435636, 0,           0
##MIN=       -839.233330435636, -3003927,    0
##MAX=       3299.83951724647, 333980676,    0
$$ Real data points
##PAGE= N=1
##DATA TABLE= (X++(R..R)), XYDATA
$$ [...]
9089D973793o80233k31046J151145k02070J00481L22184m36257P4700M99473J50384
$$ 4973793 4293560 4062514 5213659 5011589 5112070 5434254 4997997 5072697 5572170 5722554
9079E722554n58943J4122j72260J100622r09692L97064N8620l00611J367282r43973
$$ 5722554 5163611 5177733 5005473 6106095 5196403 5593467 5652087 5351476 6718758 5774785
9069E774785R896N18471N4684P90806L0312M39774n11168R96012N17514o05632
$$ 5774785 5784681 6303152 6357836 7148642 7178954 7618728 7107560 8103572 8621086 8015454
9059H015454R73674N36177J25911P40287N39314Q39860N13531J641053M73671
$$ 8015454 8989128 9525305 9651216 10391503 10930817 11770677 12284208 13925261 14398932
9050A4398932J040363J862332J735827J112933m28123q868P66900O70331J521563
$$ 14398932 15439295 17301627 19037454 20150387 19722264 19713396 20480296 21150627 22672190
9041B2672190J102344L28403K574964J811244J941120L927671o3577P00937l94017
$$ 22672190 23774534 24102937 26677901 28489145 30430265 34357936 34294359 34995296 34601279
9032C4601279j18581J76100K264661K420314M336040O746111R708857J1730856
$$ 34601279 34482698 34658798 36923459 39343773 43679813 50425924 60134781 71865637
9024G1865637J2170654P07926L243201q338518k350984k85394m552569p297396
$$ 71865637 84036291 84744217 87987418 79648900 77297916 77012522 72459953 65162557
9016F5162557r680318r551930q146513n348388m092439l318659k307491j736146
$$ 65162557 55482239 45930309 37783796 32435408 28342969 25024310 22716819 20980673
9008B0980673j662677j388712r20207j643049o71396p49107k74346j269497q34804
$$ 20980673 19317996 17929284 17009077 15366028 14694632 13945525 13671179 12401682 11566878
8999A1566878k50162m58829l60714m08686o71704n95506j42511o64309j48732
$$ 11566878 11316716 10857887 10497173 10088487 9416783 8821277 8678766 8014457 7865725
8990G865725M87402r39660N95558j819870M85384m57055N32464m35016J33984
$$ 7865725 8353127 7413467 8009025 6189155 6674539 6217484 6749948 6314932 6448916
8981F448916n3784l48380n31556M73967r44878k01949J72592O8330p1282r59022
$$ 6448916 6395132 6046752 5515196 5989163 5044285 4842336 5014928 5083258 5011976 4052954
8971D052954J451033j421764M96000J75121k08625j208237M29608p901l41051
$$ 4052954 5503987 4082223 4578223 4753344 4544719 3336482 3766090 3758189 3417138
8962C417138K72810K6817o60271J263204j071492L38809j45933K33093K25848
$$ 3417138 3689948 3716765 3056494 4319698 3248206 3587015 3441082 3674175 3900023
8953C900023n27284m7175O26538n73577R0235M858J280770j433289n53844K70990
$$ 3900023 3372739 3325564 3952102 3378525 3468760 3473618 4754388 3321099 2767255 3038245
8943C038245J25749K20133k07206r21973R17112k1011j98459J96508J26273K71570
$$ 3038245 3163994 3384127 3176921 2254948 3172060 3151049 2952590 3149098 3275371 3546941
8933C546941m37809j41892K12578l80807K3233j45445j86180P47199l03225K54118
$$ 3546941 3109132 2967240 3179818 2799011 2822244 2676799 2490619 3237818 2934593 3188711
8923C188711o63899j49260O74635n71259K23456L9106K04558K85664j94371n03230
$$ 3188711 2524812 2375552 3050187 2478928 2702384 2741490 2946048 3231712 3037341 2534111
8913B534111N00445r40958O29601l04685M15261M3392J17685n48394n50170N8195
$$ 2534111 3034556 2093598 2723199 2418514 2833775 2877167 2994852 2446458 1896288 1954483
8903A954483N57063m5324m39509r739m37581M78615R5942P97905n00562o50810
$$ 1954483 2511546 2466222 2026713 2016974 1579393 2058008 2153950 2951855 2451293 1800483
8893A800483Q0082j19836P55196m9723m08779J97268K67172m53988K58947n34369
$$ 1800483 1880565 1760729 2515925 2466202 2057423 2254691 2521863 2067875 2326822 1792453
8883A792453L08728J5823J18239L73595l12394o14531J022391l05908K10382j43970
$$ 1792453 2101181 2117004 2235243 2608838 2296444 1681913 2704304 2398396 2608778 2464808
8873B464808n87452K21600l88277Q06703k39112O89990p23355k82922N48833k45427
$$ 2464808 1877356 2098956 1710679 2517382 2278270 2968260 2244905 1961983 2510816 2265389
8863B265389K94388j287918J311976p00086M69578m31106J03706l9427M14939
$$ 2265389 2559777 1271859 2583835 1883749 2353327 1922221 2025927 1986500 2401439
8854B401439j75312m98628m4292M71586o73800O07366M65203l37096j81996P00564
$$ 2401439 2226127 1727499 1683207 2154793 1480993 2088359 2553562 2216466 2034470 2735034
8844B735034n10930m01524n29347N80863k81090J231411j203041K85662O53701
$$ 2735034 2224104 1822580 1293233 1874096 1593006 2824417 1621376 1907038 2560739
8835B560739j023276O90723r54915J114251j73972n65844n71917P90323k17194
$$ 2560739 1537463 2228186 1273271 2387522 2213550 1647706 1075789 1866112 1648918
8826A648918k2252L78192k08427o29139N28182M22899K9448l94910j16303M0046
$$ 1648918 1626666 2004858 1796431 1167292 1695474 2118373 2147821 1752911 1636608 1676654
8816A676654Q72862m35829j41317p6483q4389k52808Q39146m83866Q4379l83524
$$ 1676654 2549516 2113687 1972370 1895887 1811498 1558690 2397836 1913970 1998349 1614825
8806A614825P82117r19025P06324q2980M7151J77612r4177J8991p34391N1627
$$ 1614825 2396942 1477917 2184241 2101261 2148412 2326024 2231847 2250838 1516447 1568074
8796A568074j18849R73088n8208k74718l49587K17248j56849k08383N97131j43418
$$ 1568074 1449225 2422313 2364105 2089387 1739800 1957048 1800199 1591816 2188947 2045529
8786B045529j46915J037652m0417n49801j27933k9763K99520j97790K07027K2845
$$ 2045529 1898614 2936266 2895849 2346048 2218115 2188352 2487872 2290082 2497109 2519954
8776B519954n94297k08433N37813n83369m50682J137204k97659o8401k54998M41049
$$ 2519954 1925657 1717224 2255037 1671668 1220986 2358190 2060531 1992130 1737132 2178181
8766B178181L34352n23330N064J61488l05115k49211M43995m03589K09377J06119
$$ 2178181 2512533 1989203 1994267 2155755 1850640 1601429 2045424 1641835 1851212 1957331
8756A957331K37496K31497o20847j6698o5037k01058R85719j418687O43057l8109
$$ 1957331 2194827 2426324 1805477 1788779 1723742 1522684 2508403 1089716 1732773 1694664
8746A694664q1023N28075o71704M59695o44551J23618R62956j04665P2760j146607
$$ 1694664 1613641 2141716 1470012 1929707 1285156 1408774 2371730 2267065 2339825 1193218
8736A193218N33209O807J7820m73730L56538l02366P58961j67247m32457J329901
$$ 1193218 1726427 1733234 1751054 1277324 1633862 1331496 2090457 1923210 1490753 2820654
8726B820654j693883J33238M48279L95301l57613K10494k09150N78481q65860
$$ 2820654 1126771 1260009 1708288 2103589 1745976 1956470 1747320 2325801 1459941
8717A459941M97015j58698J87184k0854o3058j39075M28454r76319P39104P39737
$$ 1459941 1956956 1798258 1985442 1964588 1901530 1762455 2190909 1214590 1953694 2693431
8707B693431l47995R10593j038745J63505l63067M38388j107449K58749O71966
$$ 2693431 2345436 3256029 2217284 2380789 2017722 2456110 1348661 1607410 2279376
8698B279376n81503L71980o7565L39169j092115J682933o51108k41627K0443j01766
$$ 2279376 1697873 2069853 2002288 2341457 1249342 2932275 2281167 2039540 2059983 1958217
8688A958217r7506n5817K46384j78704O18266q49828l21837K59923L70472k20408
$$ 1958217 1860711 1804894 2051278 1872574 2490840 1641012 1319175 1579098 1949570 1729162
8678A729162J122337p85779J7273n09742r1967K95378K93711J98713r35054J401563
$$ 1729162 2851499 2065720 2082993 1573251 1481284 1776662 2070373 2269086 1334032 2735595
8668B735595q67576o55039R04497n30245M37931j64342k0079L50388J29702k33192
$$ 2735595 1868019 1212980 2117477 1587232 2025163 1860821 1840742 2191130 2320832 2087640
8658B087640m21504R29190M57343j379964N37202m44606j18639Q55870k69850
$$ 2087640 1666136 2595326 3052669 1672705 2209907 1765301 1646662 2502532 2232682
8649B232682K44761j015101L56687M6600K81403R2694O7843p779J85900k76180
$$ 2232682 2477443 1462342 1819029 1865629 2147032 2239726 2307569 2299790 2485690 2209510
8639B209510P6506P9362o08692N07657q52261N59262Q6521J02969j169k88172
$$ 2209510 2286016 2365378 1756686 2264343 1412082 1971344 2057865 2160834 2159665 1871493
8629A871493K96546l2899M30375r3178L80785q98043l62778Q72232M30531o11064
$$ 1871493 2168039 2135140 2565515 2472337 2853122 1955079 1592301 2464533 2895064 2284000
8619B284000J9212m05897R51079j3901L9431j415339J579647q56535m4416J86624
$$ 2284000 2303212 1897315 2848394 2834493 2873924 1458585 3038232 2181697 2137281 2323905
8609B323905m27560P05992j7316L44123l85068p83933L31651K64531q2722o88931
$$ 2323905 1896345 2602337 2585021 2929144 2544076 1760143 2091794 2356325 2273603 1584672
8599A584672J781465j029353Q01241l32787J4233j88910l64422J92494J3450k88557
$$ 1584672 3366137 2336784 3138025 2805238 2819471 2630561 2266139 2458633 2472083 2183526
8589B183526N22200r08870l50731M24018N11513K66411r04210j7284O02286L50854
$$ 2183526 2705726 1796856 1446125 1870143 2381656 2648067 1743857 1726573 2328859 2679713
8579B679713J8147l16707J47684q0082p48702K26280M21439p44215L60779M23917
$$ 2679713 2697860 2381153 2528837 2448755 1700053 1926333 2347772 1603557 1964336 2388253
8569B388253M95921j547225M58590N28209m67316M89569n21357n89430J123436
$$ 2388253 2884174 1336949 1795539 2323748 1856432 2346001 1824644 1235214 2358650
8560B358650m99829K74612Q15354j227153J287048r21876L74921m60176P06622
$$ 2358650 1858821 2133433 2948787 1721634 3008682 2086806 2461727 2001551 2708173
8551B708173q98188N87527n39919N2755m50957O17204j76977N41753Q6583n19094
$$ 2708173 1809985 2397512 1857593 1910348 1459391 2076595 1899618 2441371 2527954 2008860
8541B008860J476919n787263N732270k68638j000665L89082k08265j83031Q8371
$$ 2008860 3485779 -2301484 3430786 3162148 2161483 2550565 2342300 2159269 2247640
8532B247640Q12568j211217M43350P33799j115905Q40797j41707j82876l37868
$$ 2247640 3060208 1848991 2292341 3026140 1910235 2751032 2609325 2426449 2088581
8523B088581J24555K77050P8550m53674N06930p25680O74441n09953m92673L24583
$$ 2088581 2213136 2490186 2568736 2115062 2621992 1896312 2570753 2060800 1568127 1892710
8513A892710R9502Q43054m81494k57322L11289M66124k66615q38579N26672J84105
$$ 1892710 1992212 2835266 2353772 2096450 2407739 2873863 2607248 1768669 2295341 2479446
8503B479446j1559J99153k63240N64019r55938R40739j117887M53587m92614J94554
$$ 2479446 2467887 2667040 2403800 2967819 2011881 2952620 1834733 2288320 1795706 1990260
8493A990260M30974q29508R59258r54580M63783L95975n84021L01196M7685N92516
$$ 1990260 2421234 1591726 2550984 1596404 2060187 2456162 1872141 2173337 2221022 2813538
8483B813538p40323L76509p2062n84903J54209N66567n35099l5662K96020m06448
$$ 2813538 2073215 2449724 2377662 1792759 1946968 2513535 1978436 1942774 2238794 1832346
8473A832346O16315j51387o2579L52749k61283o05114O0074O36461J92152m79389
$$ 1832346 2448661 2297274 2234695 2587444 2326161 1721047 1781121 2417582 2609734 2130345
8463B130345j03630J81016K56025l80247k95035j48403K22991N13130J04057n80742
$$ 2130345 2026715 2207731 2463756 2083509 1788474 1640071 1863062 2376192 2480249 1899507
8453A899507N8681M10108m30308Q41141N3480j80679j2964j60232k55726J05359
$$ 1899507 1958188 2368296 1937988 2779129 2832609 2651930 2638966 2478734 2223008 2328367
8443B328367k44945P94211j100728m30911Q69819n07989J70874M51126o0818k45045
$$ 2328367 2083422 2877633 1776905 1345994 2215813 1707824 1878698 2329824 2269006 2023961
8433B023961J386661j629271J413052r01222J35605n22710P32544J25378o3852
$$ 2023961 3410622 1781351 3194403 2293181 2428786 1906076 2638620 2763998 2700146
8424B700146j32277n13839M80081L86729m96630K17325p67373r1018N69161j99942
$$ 2700146 2567869 2054030 2534111 2920840 2424210 2641535 1874162 1783144 2352305 2152363
8414B152363j97162K6425J016835l99932O7658r60997M70686K4941l19872M49015
$$ 2152363 1955201 1981626 2998461 2598529 2666187 1705190 2175876 2200817 1880945 2329960
8404B329960n83193N88429p8040o22351R57109m2101j93896m34694O06267k92757
$$ 2329960 1746767 2335196 2257156 1634805 2591914 2549813 2355917 1921223 2527490 2234733
8394B234733j15384k08153L65034J96790n53589J80965Q12487q2464j106726P12024
$$ 2234733 2119349 1911196 2276230 2473020 1919431 2100396 2912883 2830419 1723693 2435717
8384B435717M82819L2845n13753l75029j20861J016383m03223R7456r59058M02251
$$ 2435717 2918536 2951381 2437628 2062599 1941738 2958121 2554898 2652354 1693296 2095547
8374B095547J29234N98119J62109o99422M6988m64014k02294J58835L89133j77813
$$ 2095547 2224781 2822900 2985009 2285587 2332575 1868561 1666267 1825102 2214235 2036422
8364B036422J236369j503144P01276O92120n06264l12998k53508L36954J06878
$$ 2036422 3272791 1769647 2470923 3163043 2656779 2343781 2090273 2427227 2534105
8355B534105k12270O25908p63422K85336k87809J92312q35382Q68294K27599m75940
$$ 2534105 2321835 2947743 2184321 2469657 2181848 2374160 1538778 2407072 2634671 2158731
8345B158731K96597p6848o13621P04186k37420L04361P8233j47320J8598L3288
$$ 2158731 2455328 2378480 1764859 2469045 2231625 2535986 2614219 2466899 2485497 2518785
8335B518785R6019K29201o6725o11254q8933L37448l59083L69281L91814q12049
$$ 2518785 2614804 2844005 2777280 2166026 2077093 2414541 2055458 2424739 2816553 2004504
8325B004504p57954J301885k04405N22367k59447J80067j007904K09563J9801
$$ 2004504 1246550 2548435 2344030 2866397 2606950 2787017 1779113 1988676 2008477
8316B008477L94250K99952J47l03191J036656j809269N16609L27309l4273k79136
$$ 2008477 2402727 2702679 2702826 2399635 3436291 1627022 2143631 2470940 2436667 2157531
8306B157531P70119k24214J55526l55155q23750P50885l48708O40982q60331j98894
$$ 2157531 2927650 2703436 2858962 2503807 1680057 2430942 2082234 2723216 1862885 1663991
8296A663991Q94965L48161K78821j169162Q69175l63398o2080j147807J415829
$$ 1663991 2558956 2907117 3185938 2016776 2885951 2522553 2460473 1312666 2728495
8287B728495j07843l04509L57425J55008M81091n10004p0600k51270M38853J89110
$$ 2728495 2620652 2316143 2673568 2828576 3309667 2799663 2729063 2477793 2916646 3105756
8277C105756j20892k13909K06317L00392m65829q26961O64262n75691K49847P41238
$$ 3105756 2984864 2770955 2977272 3277664 2811835 1984874 2649136 2073445 2323292 3064530
8267C064530n98989O34315j091406R15989N01260n29758J70786k87316j31767
$$ 3064530 2465541 3099856 2008450 2924439 3425699 2895941 3066727 2779411 2647644
8258B647644J30105J17660n17596M5177P91398l07951L82530p92816j03242n221
$$ 2647644 2777749 2895409 2377813 2422990 3214388 2906437 3288967 2496151 2392909 2387688
8248B387688k61971O59592M0530r8034L46114j014778P44031p94819M30354J60746
$$ 2387688 2125717 2785309 2825839 2727805 3073919 2059141 2803172 2008353 2438707 2599453
8238B599453J77839p65615L73774J40916K74542l85380R26326j298076M22886
$$ 2599453 2777292 2011677 2385451 2526367 2800909 2415529 3341855 2043779 2466665
8229B466665J187733j267622l76986L05438l18900L75049k48110J371351k55458
$$ 2466665 3654398 2386776 2009790 2315228 1996328 2371377 2123267 3494618 3239160
8220C239160j485611Q98345l40189N74855k75073L26000l317q29124l56479P98335
$$ 3239160 1753549 2651894 2311705 2886560 2611487 2937487 2934170 2105046 1748567 2546902
8210B546902J68596l85837Q61737j088550P21813l47721M43719J33284l97990
$$ 2546902 2715498 2329661 3191398 2102848 2824661 2476940 2920659 3053943 2655953
8201B655953M12656q43609Q38785p48134K02908l15953j10713K40502Q87432M102956
$$ 2655953 3068609 2225000 3063785 2315651 2518559 2202606 2091893 2332395 3219827 7322783
8191G322783n297530J31480Q68521j179980J095294r0187k03310J61746l87686
$$ 7322783 2025253 2156733 3025254 1845274 2940568 2850381 2647071 2808817 2421131
8182B421131j34741J055270j205817L10645N04778k16464K12258L95887q15023
$$ 2421131 2286390 3341660 2135843 2446488 2951266 2734802 2947060 3342947 2527924
8173B527924q0014R623J99545R7932R56736p78953q9160j53295k66587o1317N15486
$$ 2527924 2447910 2457533 2657078 2755010 3711746 2932793 2843633 2690338 2423751 2362434 2877920
8162B877920r7642n32487O83678L04835o14903n23835J41920J61750j5038J28280
$$ 2877920 2780278 2247791 2931469 3236304 2621401 2097566 2239486 2401236 2386198 2514478
8152B514478L09369m65326m2822L60097L96277m70605K11785J0281o34065L36403
$$ 2514478 2823847 2358521 2315699 2675796 3072073 2601468 2813253 2823534 2189469 2525872
8142B525872L25047n51924m25491P44642J059962m61453o01142P5820k54153J31976
$$ 2525872 2850919 2298995 1873504 2618146 3678108 3216655 2615513 2691333 2437180 2569156
8132B569156j83972J29250J52447R31914m84694p1769r4465o69928j44015K57853
$$ 2569156 2385184 2514434 2666881 3598795 3114101 3042332 2947867 2277939 2133924 2391777
8122B391777K73254P82356o55079O18120l81873k82217J02621M86469m59957J36799
$$ 2391777 2665031 3447387 2792308 3410428 3028555 2746338 2848959 3335428 2875471 3012270
8112C012270l43443j80695J204767r92023N23681r04567O26170j50899j67636
$$ 3012270 2668827 2488132 3692899 2700876 3224557 2319990 2946160 2795261 2627625
8103B627625K25545J21273k76862O11895q27863Q7479K86349k71926R6072l88403
$$ 2627625 2853170 2974443 2697581 3309476 2481613 2569092 2855441 2583515 2679587 2291184
8093B291184l53592J423752q19264K99909M41410o88167J23689L65518N76776
$$ 2291184 1937592 3361344 2542080 2841989 3283399 2595232 2718921 3084439 3661215
8084C661215j037729j50556M40837l92948M29455K6611n48121L06841k19715J94001
$$ 3661215 2623486 2472930 2913767 2520819 2950274 2976885 2428764 2735605 2515890 2709891
8074B709891N69044q86444O03335L72076j22962Q2296p86624N98318J08428l15904
$$ 2709891 3278935 2392491 2995826 3367902 3244940 3327236 2540612 3138930 3247358 2931454
8064B931454j32078j32732M69367k3743m40576M988L84965n04244K53071J91254
$$ 2931454 2799376 2666644 3136011 3112268 2671692 2676680 3061645 2557401 2810472 3001726
8054C001726q14418N03791J96624J87073l74129R05440j248049M07685k75069
$$ 3001726 2187308 2691099 2887723 3074796 2700667 3606107 2358058 2765743 2490674
8045B490674K01936M99753N56557q89223k82041j5069l19558P18497l95301K27378
$$ 2490674 2692610 3192363 3748920 2859697 2577656 2562587 2243029 2961526 2566225 2793603
8035B793603O9737M35785p25348Q83248j26845m11962o12976J041006o91070L47077
$$ 2793603 2863340 3299125 2573777 3457025 3330180 2918218 2305242 3346248 2655178 3002255
8025C002255J14612n74714K70452N06578l38147k44427l31123K47478J120553
$$ 3002255 3116867 2542153 2812605 3319183 2981036 2736609 2405486 2652964 3773517
8016C773517j082641J30094K56211L12404l05315K59158l74461K11077K97499
$$ 3773517 2690876 2820970 3077181 3389585 3084270 3343428 2968967 3180044 3477543
8007C477543m44270L30630L15675q55989K36256J25150k95149m76211P81232l13692
$$ 3477543 3033273 3363903 3679578 2823589 3059845 3184995 2889846 2413635 3194867 2881175
7997B881175l46218M40433n61342R45221k97482J9359l37344m60658P69211l74897
$$ 2881175 2534957 2975390 2414048 3359269 3061787 3081146 2743802 2283144 3052355 2677458
7987B677458M05370j01981L21356n34197M7116J52915l01392P19132p1697j32548
$$ 2677458 3082828 2980847 3302203 2768006 2815122 2968037 2666645 3385777 3314080 3181532
7977C181532K832N4677k1446L95905p23236P23008n41118M84820n87031K58837
$$ 3181532 3184364 3239041 3217595 3613500 2890264 3613272 3072154 3556974 2969943 3228780
7967C228780P6247o97532R81581M90822j188418l89086L42935Q5235L36691o64857
$$ 3228780 3305027 2607495 3589076 4079898 2891480 2502394 2845329 2930564 3267255 2602398
7957B602398L36843J5792P32763p96214l17329M62540m45713L17216L53855o63250
$$ 2602398 2939241 2955033 3687796 2891582 2574253 3036793 2591080 2908296 3262151 2598901
7947B598901P00536l59807M09152p25132N85583N47032o26931n85574M05934O52607
$$ 2598901 3299437 2939630 3348782 2623650 3209233 3756265 3129334 2543760 2949694 3602301
7937C602301M09612j267381R56075j187245J23544j86382M14467K96802l78284
$$ 3602301 4011913 2744532 3700607 2513362 2636906 2450524 2864991 3161793 2783509
7928B783509L91305k34530L91306k71775O91878j382338O63214K64608q03477
$$ 2783509 3174814 2940284 3331590 3059815 3751693 2369355 3032569 3297177 2493700
7919B493700K18102Q5428j14173j60879R92640m53224M83697j76844L81003j185801
$$ 2493700 2711802 2797230 2683057 2522178 3514818 3061594 3545291 3368447 3749450 2563649
7909B563649N71205m39184P89432r51472R24033j52547K03067k70950o11047N37913
$$ 2563649 3134854 2695670 3485102 2533630 3457663 3305116 3508183 3237233 2626186 3164099
7899C164099L10307l95151M85383p26447L68805j27523L73152J86631J61668J25938
$$ 3164099 3474406 3079255 3564638 2838191 3206996 3079473 3452625 3639256 3800924 3926862
7889C926862l76786m54262k40460O86994o44091Q15678n50701L2277m96872J084832
$$ 3926862 3550076 3095814 2855354 3542348 2898257 3713935 3163234 3195511 2698639 3783471
7879C783471j072594N74183O60599p77100J89594l575K94865k31228m05056N35619
$$ 3783471 2710877 3285060 3945659 3168559 3358153 3354578 3649443 3418215 3013159 3548778
7869C548778m0424O54150j662977P62843j23761j22080P06308m57611O3578J76282
$$ 3548778 3508354 4162504 2499527 3262370 3138609 3016529 3722837 3265226 3328804 3505086
7859C505086q5075j6093K09911m28921M34868n83147O71715N19090l73927M2951
$$ 3505086 3420011 3403918 3613829 3184908 3619776 3036629 3708344 4227434 3853507 3896458
7849C896458P3789M02827p29886j7546K8088J394783k960019q41009J791657p63460
$$ 3896458 3970247 4373074 3643188 3625642 3653730 5048513 2088494 1247485 3039142 2275682
7839B275682N19768L14928m03508Q92278j68549n73859M71230k21828K33754J79422
$$ 2275682 2795450 3110378 2706870 3599148 3430599 2856740 3327970 3106142 3339896 3519318
7829C519318k86387j56217L83570k32006O68204m38212p84664J85730M2454J374170
$$ 3519318 3232931 3076714 3460284 3228278 3896482 3458270 2673606 2859336 2901790 4275960
7819D275960o57015k00907M54900j327934l76477R88181J61309M9889J43998N60802
$$ 4275960 3618945 3418038 3872938 2545004 2168527 3156708 3318017 3367906 3511904 4072706
7809D072706r61553j59856P42750p84625J06428M28030j396543Q71012J86424
$$ 4072706 3111153 2951297 3694047 2909422 3015850 3443880 2047337 2918349 3104773
7800C104773Q78479r41981P77397j064554N73450j81477K43358k18242j9747L69516
$$ 3104773 3983252 3041271 3818668 2754114 3327564 3146087 3389445 3171203 3151456 3520972
7790C520972n36425K9474J51558K66026j70348k67262m33728M25647Q06210j28775
$$ 3520972 2984547 3014021 3165579 3431605 3261257 2993995 2560267 2985914 3792124 3663349
7780C663349j89059O47469l03546j427820J359907K31392O47499q67273J12107
$$ 3663349 3474290 4121759 3818213 2390393 3750300 3981692 4629191 3761918 3874025
7771C874025k03078j82127j04786l61703L60249L3015R88319j233209P10313m85491
$$ 3874025 3670947 3488820 3384034 3022331 3382580 3415595 4403914 3170705 3881018 3395527
7761C395527l8986q10272N16509M17153p48489L19598L09335J37479P40778n73998
$$ 3395527 3356541 2546269 3062778 3479931 2731442 3051040 3360375 3497854 4238632 3664634
7751C664634m45114N60401m36549K93760n36857N87680l9530m73177L71994J26651
$$ 3664634 3219520 3779921 3343372 3637132 3100275 3687955 3648425 3175248 3547242 3673893
7741C673893j416364P42169q7135L87173K31991k47507M39049L74691j82042o11346
$$ 3673893 2257529 2999698 2912563 3299736 3531727 3284220 3723269 4097960 3915918 3304572
7731C304572O09221o21221O91282k66467n33414K74875K36144k39091n95306P12081
$$ 3304572 3913793 3292572 3983854 3717387 3183973 3458848 3694992 3455901 2860595 3572676
7721C572676l8840q65480N72818p51567Q91033L63690k15599P03956j82872l53821
$$ 3572676 3533836 2668356 3241174 2489607 3380640 3744330 3528731 4232687 4049815 3695994
7711C695994p26416J35008K43128l9848R1594j02406l91220J154834o83232K31247
$$ 3695994 2969578 3104586 3347714 3307866 3399460 3297054 2905834 4060668 3377436 3608683
7701C608683M1049p3484K65855L57723q40451M93482k01101j07832K69631p83711
$$ 3608683 3649732 3576248 3842103 4199826 3359375 3852857 3651756 3543924 3813555 3029844
7691C029844J792413r38594l00982N87233j014405J075358j9686o07921J28088
$$ 3029844 4822257 3883663 3582681 4169914 3155509 4230867 4211181 3603260 3731348
7682C731348n01666P86446J0752l03894r31336J462645m34645m05099O24559j416398
$$ 3731348 3229682 4016128 4026880 3722986 2791650 4254295 3819650 3414551 4039110 2622712
7672B622712J459673m09574k55408J42591Q3249l48042j5872J090583r97787K18237
$$ 2622712 4082385 3672811 3417403 3559994 3643243 3295201 3279329 4369912 3372125 3590362
7662C590362l11273j24858J12127L87306q48018J333564p30824J230832j836415
$$ 3590362 3279089 3154231 3266358 3653664 2805646 4139210 3408386 4639218 2802803
7653B802803M63448M54861M88131n02240O94565j275948N84683n64272M90670
$$ 2802803 3266251 3721112 4209243 3707003 4401568 3125620 3710303 3146031 3636701
7644C636701P1800q8690k05259M20909Q7303m25542j15290P78134k05942k95296
$$ 3636701 3708501 3619811 3414552 3835461 3922764 3497222 3381932 4160066 3954124 3658828
7634C658828P6493R39778o12233n23135q3112q3415l57817L08334L28209P0087
$$ 3658828 3735321 4675099 4062866 3539731 3456619 3373204 3015387 3323721 3651930 3722017
7624C722017M10919k25975l9093k45877L80164M35247l96041o71782k08163L29219
$$ 3722017 4132936 3906961 3867868 3621991 4002155 4437402 4041361 3369579 3161416 3490635
7614C490635L68659J25851j13833M02027o32471j49651J70556m40390P66849K41942
$$ 3490635 3859294 3985145 3871312 4273339 3640868 3491217 3661773 3221383 3988232 4230174
7604D230174L53450p17709R94695k43767k49745M95667k73734l28941j18667n66100
$$ 4230174 4583624 3865915 4860610 4616843 4367098 4862765 4589031 4260090 4141423 3575323
7594C575323N07235M75743o79538J9641K22865M25555j81967p25819R17665r47744
$$ 3575323 4082558 4558301 3878763 3898404 4121269 4546824 4364857 3639038 4556703 3608959
7584C608959M61135l12763J207639m95141j35963l16637O1644N60594K14742p68435
$$ 3608959 4070094 3757331 4964970 4469829 4333866 4017229 4078873 4639467 4854209 4085774
7574D085774O89367j494392L77942N35213l94911J075967p58527Q7575k83434
$$ 4085774 4775141 3280749 3658691 4193904 3798993 4874960 4116433 4204008 3920574
7565C920574k37730O69648L80713n01846K16717q18486P16861j95229k52846R16015
$$ 3920574 3682844 4352492 4733205 4231359 4448076 3629590 4346451 4151222 3898376 4814391
7555D814391m58585r24627J120626j184523J405376q2927m60710P4192k06561
$$ 4814391 4355806 3431179 4551805 3367282 4772658 4689731 4229021 4303213 4096652
7546D096652n87051O39274l95864J131190k19451p59364P50364p06774l80856
$$ 4096652 3509601 4148875 3753011 4884201 4664750 3905386 4655750 3948976 3568120
7537C568120O18903l4439J11463k70272J22257l35163r742M70891m82544N77455
$$ 3568120 4187023 4152584 4264047 3993775 4116032 3780869 3771127 4242018 3759474 4336929
7527D336929J50000o26493J003718k14949n08496M10072j019432J108911m83803
$$ 4336929 4486929 3860436 4864154 4649205 4140709 4550781 3531349 4640260 4156457
7518D156457N48734J76252j140076J092829j56042j80315n4942M03701k48294
$$ 4156457 4705191 4881443 3741367 4834196 4678154 4497839 4442897 4846598 4598304
7509D598304J87787Q8145n50012J01554K7443J51781k67222M82045p33148J370976
$$ 4598304 4786091 4874236 4324224 4425778 4453221 4605002 4337780 4819825 4086677 5457653
7499E457653j171580O37207l70114P29087j25471j057349M79434L77582l61309
$$ 5457653 4286073 4923280 4553166 5282253 5156782 4099433 4578867 4956449 4595140
7490D595140P6479M27122m51117M39792J54888k92336P74533p72768N9760N01074
$$ 4595140 4671619 5098741 4647624 5087416 5242304 4949968 5724501 4951733 5011493 5512567
7480E512567k54489J51669n16893L42815m52614O49203q8990L45153R3618j46113
$$ 5512567 5258078 5409747 4892854 5235669 4783055 5432258 5343268 5688421 5782039 5635926
7470E635926L63216n64209J3343m81026N80609J14989m23296L64392P09183k23977
$$ 5635926 5999142 5434933 5448276 4967250 5547859 5662848 5239552 5603944 6313127 6089150
7460F089150M51298P15520m10353L23241q82892Q98946l37707q34476L86439n11509
$$ 6089150 6540448 7255968 6845615 7168856 6285964 7184910 6847203 6012727 6399166 5887657
7450E887657J65168o74261L65392m00034l27241j77626M40764q68118M33049J45794
$$ 5887657 6052825 5378564 5743956 5343922 5016681 4839055 5279819 4411701 4844750 4990544
7440D990544k89840l58333R70040n19749j16484k89840O99548j50743j09527j84266
$$ 4990544 4700704 4342371 5312411 4792662 4676178 4386338 5085886 4935143 4825616 4641350
7430D641350K91453K29069L52362p47345M22234J45520r50633R67625o73519k73415
$$ 4641350 4932803 5161872 5514234 4766889 5189123 5334643 4384010 5351635 4678116 4404701
7420D404701L11245q621L54731j70093k85362L62503P0113o09178L68436J44089
$$ 4404701 4715946 4707325 5062056 4891963 4606601 4969104 5039217 4430039 4798475 4942564
7410D942564M11217J67917o05343j60695M66145N36367l07268l15867l35365j18323
$$ 4942564 5353781 5521698 4916355 4755660 5221805 5758172 5450904 5135037 4799672 4681349
7400D681349K67520J93626M63282k89311n440o84173J24783Q46836l74877j87090
$$ 4681349 4948869 5142495 5605777 5316466 5311026 4626853 4751636 5598472 5223595 5036505
7390E036505j47254L35385l58213J2356N48626o22107N93824j063195O43046J91318
$$ 5036505 4889251 5224636 4866423 4878779 5427405 4805298 5399122 4335927 4978973 5170291
7380E170291J40123o08724O23234L3765J6795o32909M09678J25294k38740P65047
$$ 5170291 5310414 4701690 5324924 5358689 5375484 4742575 5152253 5277547 5038807 5803854
7370E803854n43791O55326m21049J38732j85971k8777j06383M91089j75062M27529
$$ 5803854 5260063 5915389 5494340 5633072 5447101 5418324 5311941 5803030 5627968 6055497
7360F055497o3707m18310k48869m7005R55479o73896o22567L24077J319726j149409
$$ 6055497 5991790 5573480 5324611 5277606 6233085 5559189 4936622 5260699 6580425 5431016
7350E431016Q40437P30667j633989P56123K66048O4322q64381J216887m58769
$$ 5431016 6271453 7002120 5368131 6124254 6390302 6454624 5590243 6807130 6348361
7341F348361J88780n37727Q70712m79143m68502l23013P11540M1254l30039P13667
$$ 6348361 6537141 5999414 6870126 6390983 5922481 5599468 6311008 6352262 6022223 6735890
7331F735890k0122n56131L13416k13399p0264J79195n4185k53157M58090J5958
$$ 6735890 6715768 6159637 6473053 6259654 6189390 6368585 6314400 6061243 6519333 6535291
7321F535291J29222k4803P9858N10609n90132L99815q784J20580j49514r7011
$$ 6535291 6664513 6639710 6719568 7230177 6640045 7039860 7031076 7151656 7002142 6905131
7311F905131q71670J183550n49028j92335K5215q90o5673K91471o5011J00317
$$ 6905131 6033461 7217011 6667983 6475648 6500863 6499973 6434300 6725771 6660760 6761077
7301F761077K57718k00378k2047p01490k6855N66946m70467Q37259o30725K81123
$$ 6761077 7018795 6818417 6796370 6094880 6068025 6634971 6164504 7001763 6371038 6652161
7291F652161O7631l45366j71007n3478N44758j99663l91534L50372p04333N54812
$$ 6652161 6719792 6374426 6203419 6149941 6694699 6495036 6103502 6453874 5749541 6304353
7281F304353K46540K21481l19048j06287J17715K24154J92675j063396M77908
$$ 6304353 6550893 6772374 6453326 6347039 6464754 6688908 6881583 5818187 6296095
7272F296095N88415j41213j80409o09008O06933J11541l66205J146817q99070
$$ 6296095 6884510 6743297 6562888 5953880 6560813 6672354 6306149 7452966 6553896
7263F553896j29360N50250o80401M05397j41326K4794K40029k51210Q64061m05816
$$ 6553896 6424536 6974786 6294385 6699782 6558456 6583250 6823279 6572069 7436130 7030314
7253G030314K26362m85985j40498P32107o33362R05435j271255o0674O52893L56419
$$ 7030314 7256676 6770691 6630193 7362300 6728938 7634373 6363118 6302444 6955337 7311756
7243G311756K7900j55982k25168R1184k05446K85442j041225J325225m96648L98717
$$ 7311756 7339656 7183674 6958506 7049690 6844244 7129686 6088461 7413686 6917038 7315755
7233G315755J44354m00609K43310K57166m45674l11001P81281M49098n00146L64119
$$ 7315755 7460109 7059500 7302810 7559976 7114302 6803301 7584582 8033680 7533534 7897653
7223G897653p69091K51873m30924J12275N21015M8745r1382m26097M28528k77780
$$ 7897653 7128562 7380435 6949511 7061786 7582801 7631546 7540164 7114067 7542595 7264815
7213G264815M72495L91833n21722o5129L55489M20879L9141l32749P3930J35429
$$ 7264815 7737310 8129143 7607421 7542292 7897781 8318660 8357801 8025052 8098982 8234411
7203H234411l7130L95541K4831o47567L10890o25871k32603O79356m13382O80676
$$ 8234411 8197281 8592822 8617653 7970086 8280976 7655105 7422502 8101858 7688476 8369152
7193H369152L91524m20786O9087J028247m90117M01067n40893j26526M16245r23933
$$ 8369152 8760676 8339890 8408977 9437224 8947107 9348174 8807281 8680755 9097000 8173067
7183H173067Q94915o00552K29155K46805L3519j7724P34559m19365n02925K6922
$$ 8173067 9067982 8467430 8696585 8943390 8976909 8959185 9693744 9274379 8771454 8798376
7173H798376M34587j192325J488148m76888O82316r2589J85755o99738Q22319
$$ 8798376 9232963 8040638 9528786 9051898 9734214 9641625 9827380 9127642 9949961
7164I949961n61208K94645O40460q19383p8692l24150R50390k9943r61099J523721
$$ 9949961 9388753 9683398 10323858 9504475 9425783 9101633 10052023 10022080 9060981 10584702
7154A0584702q57243j94557M65907P15588k40619J26560L77229j081517K6273
$$ 10584702 9727459 9532902 9998809 10714397 10473778 10600338 10977567 9896050 9922323
7145I922323N79257M37004j64078r08208R75623R37434n68883l94387O91223j255805
$$ 9922323 10501580 10938584 10774506 9866298 10841921 11779355 11210472 10816085 11507308 10251503
7135A0251503J509951J58508l04674M11816j09964l7275K28955M93738k56998
$$ 10251503 11761454 11919962 11615288 12027104 11917140 11879865 12108820 12602558 12345560
7126A2345560j11767k37192J055156j87991k40674P00925j58002N93164k29620
$$ 12345560 12233793 11996601 13051757 12863766 12623092 13324017 13166015 13759179 13529559
7117A3529559j92487L46253o69017L87808K78339K60480N31314q3910N54190j013658
$$ 13529559 13337072 13683325 13014308 13402116 13680455 13940935 14472249 14388339 14942529 13928871
7107A3928871J204829L1027m66453N38952J87737J095652K39483l47396o2421
$$ 13928871 15133700 15164727 14698274 15237226 15424963 16520615 16760098 16412702 16350281
7098A6350281j1626J119940n46146J179337Q3260M109L51109O86343l86585P00190
$$ 16350281 16338655 17458595 16912449 18091786 18175046 18179155 18530264 19216607 18830022 19530212
7088A9530212L68820M21179N27433J132128P09610l72327J014053Q84840M13193
$$ 19530212 19899032 20320211 20847644 21979772 22689382 22317055 23331108 24215948 24629141
7079B4629141L96750J375054Q07266J065483J463384L92749P54279J077836J616840
$$ 24629141 25025891 26400945 27208211 28273694 29737078 30129827 30884106 31961942 33578782
7070C3578782J436958J793168J885046K042300J380458K576395J594838J591532
$$ 33578782 35015740 36808908 38693954 40736254 42116712 44693107 46287945 47879477
7062D7879477K511417J808501L210685L213568K006168K668687K909212L841974
$$ 47879477 50390894 52199395 55410080 58623648 60629816 63298503 66207715 70049689
7054G0049689M095511L999181L096794N090437M242962N004133N898329N072301
$$ 70049689 74145200 78144381 81241175 86331612 90574574 95578707 101477036 106549337
7046A06549337P156669P306584P891644P390238Q014902O808847O742905M060406
$$ 106549337 113706006 121012590 128904234 136294472 144309374 151118221 157861126 161921532
7038A61921532L390299L976833J927847R21551K31479j6021m47961k04720J909175
$$ 161921532 165311831 169288664 171216511 172138062 172369541 172353520 171905559 171700839 173610014
7029A73610014J777246L672044M739806N763231O490073O514608O921838N443307
$$ 173610014 175387260 179059304 183799110 189562341 196052414 202567022 209488860 214932167
7021B14932167M007859K331413l76693k294677l641368o264252p293250p907355
$$ 214932167 218940026 221271439 220894746 218600069 214958701 208694449 201401199 193493844
7013A93493844q634216p323169q053744p040403n709829m483504k175292j924425
$$ 193493844 184859628 177536459 169482715 162442312 156732483 152248979 150073687 148149262
7005A48149262M1438j6254l25569j327857k154643l586698l824030o231563o481872
$$ 148149262 148190700 148174446 147848877 146521020 144366377 140779679 136955649 130724086 124242214
6996A24242214p633725q988073q759651p891432p559423o410283p436195m591987
$$ 124242214 116608489 107620416 98860765 90969333 83409910 76999627 69563432 64971445
6988F4971445m132251m809840m115229k326943k729377k569332k663106j708140
$$ 64971445 60839194 56029354 51914125 49587182 46857805 44288473 41625367 39917227
6980C9917227k690569j581023j507512j297818j717774j518275o97439j177899
$$ 39917227 37226658 35645635 34138123 32840305 31122531 29604256 28906817 27728918
6972B7728918j078499j895444q7102r25543n2478j475216o86274q16869o34820
$$ 27728918 26650419 24754975 24667873 23742330 23689852 22214636 21528362 20711493 20076673
6963B0076673L66933m37997r77150k25605j389180l27540k23953M04j000348j327283
$$ 20076673 20443606 20005609 19028459 18802854 17413674 17086134 16862181 16862585 15862237 14534954
6953A4534954M91691k18432r58705L42440K41414n54114m29197k69135q4896j46745
$$ 14534954 15026645 14808213 13849508 14191948 14433362 13879248 13450051 13180916 13096020 12949275
6943A2949275k25642K84416j077790N13667M64625j016243n79997j77642k95405
$$ 12949275 12723633 13008049 11930259 12443926 12908551 11892308 11312311 11134669 10839264
6934A0839264M18410j82974r34309J652461j207868l05325J09636k6097l32866
$$ 10839264 11257674 11074700 10140391 11792852 10584984 10279659 10389295 10363198 10030332
6925A0030332j10725N45153j067972O95080l72388J6990k31536P7650K24982n11301
$$ 10030332 9919607 10464760 9396788 10091868 9719480 9736470 9504934 9582584 9807566 9296265
6915I296265q10013J65197Q34581p13540R99230o02420o05897N11221K70835j179334
$$ 9296265 8486252 8651449 9486030 8772490 9771720 9169300 8563403 9074624 9345459 8166125
6905H166125J27749P41327o76328L65250j087124N35411k25726M41455l04493
$$ 8166125 8293874 9035201 8358873 8724123 7636999 8172410 7946684 8388139 8083646
6896H083646r59311J177725q84016M96225k59413J52043p43090J373262j026541
$$ 8083646 7124335 8302060 7418044 7914269 7654856 7806899 7063809 8437071 7410530
6887G410530k02300m19854J068503l28671l08119J16667K57209p96755O03121
$$ 7410530 7208230 6788376 7856879 7528208 7220089 7336756 7593965 6797210 7400331
6878G400331j28925m90271q8952Q95857p23847L39942R3259p82045R84277l56373
$$ 7400331 7271406 6781135 6692183 7588040 6864193 7204135 7297394 6515349 7499626 7143253
6868G143253n43716L20651J57758j11177L32379p31103P78417j239395J159179
$$ 7143253 6599537 6920188 7077946 6966769 7299148 6568045 7346462 6107067 7266246
6859G266246n95467O36799j248946L62820l58338K79493K68559k42325L21344
$$ 7266246 6670779 7307578 6058632 6421452 6063114 6342607 6611166 6368841 6690185
6850F690185P63074m07208j295152J049350m41004P02033q50001O03320r04994
$$ 6690185 7453259 7046051 5750899 6800249 6359245 7061278 6211277 6814597 5909603
6841E909603M57960k36326M77255n33402M58270J09006o02025j21701l36340M82567
$$ 5909603 6367563 6131237 6608492 6075090 6533360 6642366 6040341 5918640 5582300 6064867
6831F064867r2525J56385K24159M16380r22306K43334M11994n12016K78028P09716
$$ 6064867 5972342 6128727 6352886 6769266 5846960 6090294 6502288 5990272 6268300 6978016
6821F978016l35734m93678l73111j33502R26350q16679J33733j46251M54448l3339
$$ 6978016 6642282 6148604 5775493 5641991 6568341 5751662 5885395 5739144 6193592 6160253
6811F160253O35068q34724J2241L59347o11479P46828j222713K50552M99891J747
$$ 6160253 6795321 5960597 5972838 6332185 5720706 6467534 5244821 5495373 5995264 5997011
6801E997011M00749o88383L73699n52478J064626m17334m16389J39172K31252
$$ 5997011 6397760 5709377 6083076 5530598 6595224 6177890 5761501 5900673 6131925
6792F131925N53962r66619R2884L38364m46425Q43325N4122o93190O67078l81902
$$ 6131925 6685887 5719268 5812152 6150516 5704091 6547416 6601538 5908348 6575426 6193524
6782F193524K47126K17444k56154R9257O49376o24319m51467M25909R5140m34716
$$ 6193524 6440650 6658094 6401940 6501197 7150573 6526254 6074787 6500696 6595836 6161120
6772F161120O60994j079811J021750j258212J839408p41633m53732l74493R05103
$$ 6161120 6822114 5742303 6764053 5505841 7345249 6603616 6149884 5775391 6680494
6763F680494J55638l26003J35359M4406k7357r8296N70871K21560j001364N71056
$$ 6680494 6836132 6510129 6645488 6689894 6662537 6564241 7135112 7356672 6355308 6926364
6753F926364j00789l46377N88816j067783O90929l3351Q7983k7034P02741j99585
$$ 6926364 6825575 6479198 7068014 6000231 6691160 6657809 6745792 6718758 7421499 7221914
6743G221914J77479Q22724o91694n36004N55993l00657J18726K74604L93377o26224
$$ 7221914 7399393 8222117 7530423 6994419 7550412 7249755 7368481 7643085 8036462 7410238
6733G410238L94745p9945o5163m84647J008405q77832N93447n32416M49360m24297
$$ 7410238 7804983 7725038 7659875 7175228 8183633 7305801 7899248 7366832 7816192 7391895
6723G391895N09816j79777L48576K57893Q4693j82923J99017l90685m2427q2209
$$ 7391895 7901711 7721934 8070510 8328403 8413096 8230173 8429190 8038505 7996078 7913869
6713G913869n84460K35572L00933k00537R6625j97600J37482Q0135K86276M2542
$$ 7913869 7329409 7564981 7865914 7665377 7762002 7564402 7701884 7782019 8068295 8110837
6703H110837o6542J21996l60531O47902n24322n21619N17377M89148k44756n45186
$$ 8110837 8044295 8166291 7805760 8453662 7929340 7407721 7925098 8414246 8169490 7624304
6693G624304O95668j74993m15954o07065M55929m16909k1170K45624l09410L07940
$$ 7624304 8319972 8144979 7729025 7121960 7577889 7160980 7139810 7385434 7076024 7383964
6683G383964j97177Q6832J322742p80032n16949j12373r4528l49935K32263L04167
$$ 7383964 7186787 7273619 8596361 7816329 7299380 7187007 7092479 6742544 6974807 7278974
6673G278974N70441j11064n68235R22088L38532o76862P84385j033854Q80856
$$ 7278974 7849415 7738351 7170116 8092204 8430736 7753874 8538259 7504405 8385261
6664H385261K02533j52308m85668M93739J1876K1010q264o05778P69067k71919
$$ 8385261 8587794 8435486 7949818 8443557 8455433 8476443 8468179 7862401 8631468 8359549
6654H359549J67373m59042K14203M16808n91136R06014K35780n14703N46776l50738
$$ 8359549 8526922 8067880 8282083 8698891 8107755 9013769 9249549 8734846 9281622 8930884
6644H930884m01734P93983k58483o3091J61103J91242l1019q83091J892467r18049
$$ 8930884 8529150 9323133 9064650 9001559 9162662 9353904 9322885 8439794 10332261 9414212
6634I414212K03643Q4648L65777m20429P18519K61183q27132O20271l27731k26060
$$ 9414212 9617855 9702503 10068280 9647851 10366370 10627553 9800421 10420692 10092961 9866901
6624I866901j54356O13096n56639M70851n01243L89143q7395O87631m77261P64399
$$ 9866901 9712545 10325641 9769002 10239853 9738610 10127753 10040358 10727989 10250728 11015127
6614A1015127l84587P0716L58049m14232k11746M71373p28626O541J025629j044895
$$ 11015127 10630540 10701256 11059305 10645073 10433327 10904700 10176074 10182615 11208244 10163349
6604A0163349P02089k35529P22560J32305k95991n1702L66267j051354R01470
$$ 10163349 10865438 10629909 11352469 11484774 11188783 11137081 11503348 10451994 11353464
6595A1353464j90552o90937K74715O21223m04997P3092K90012j357972O59765
$$ 11353464 11162912 10471975 10746690 11367913 10962916 11036008 11326020 9968048 10627813
6586A0627813J31054l52555n07243R18664k08553k5882O70221l13214m8310j13102
$$ 10627813 10758867 10406312 9899069 10817733 10609180 10583298 11253519 10940305 10891995 10778893
6576A0778893l66424O95009r11684J147512L2779k61826K47652N24291l47779
$$ 10778893 10412469 11107478 10195794 11343306 11376085 11114259 11361911 11886202 11538423
6567A1538423j003842J091720l81068p27060R06260r07894J308219r93630M08711
$$ 11538423 10534581 11626301 11245233 10518173 11424433 10516539 11824758 10831128 11239839
6558A1239839r28997N54556J145789p49248k73474m14615l13279J652480j220747
$$ 11239839 10310842 10865398 12011187 11261939 10988465 10573850 10260571 11913051 10692304
6549A0692304J011521m2410l45995K2504L5229m18470L41065n0224j06182m148
$$ 10692304 11703825 11661415 11315420 11337924 11373153 10954683 11295748 11245524 11139342 11135194
6539A1135194O87257n11290M30242N40528j085872P88818k15470N52708n6177
$$ 11135194 11822451 11311161 11741403 12281931 11196059 11984877 11769407 12322115 12265938
6530A2265938N83785j207794P68865n43114M02891M69876P61232j522192M69390
$$ 12265938 12849723 11641929 12410794 11867680 12270571 12740447 13501679 11979487 12448877
6521A2448877r9209O6500N04239l04577L547O5054j07533J39585l64630O60297
$$ 12448877 12349668 12416168 12920407 12615830 12619377 12684431 12576898 12716483 12351853 13012150
6511A3012150J31580k35375j8884O20831k28971N2439N98449o72526M93376M34493
$$ 13012150 13143730 12908355 12889471 13510302 13281331 13333770 13932219 13259693 13753069 14187562
6501A4187562Q12032r34020J33441l87339J635072j075276r7799J2135L84056
$$ 14187562 14999594 14065574 14199015 13811676 15446748 14371472 14273673 14285808 14669864
6492A4669864P44563j96128M6819l63973J13892L57708N24172n56415j52704k03364
$$ 14669864 15414427 15218299 15265118 14901145 15015037 15372745 15896917 15340502 15187798 14984434
6482A4984434P23822O53761K25172j268936J133666o19000K38563O43189l53302
$$ 14984434 15708256 16362017 16587189 15318253 16451919 15832919 16071482 16714671 16361369
6473A6361369L29522m15329L40821n57538R98103o72924J160070o49102K64169
$$ 16361369 16690891 16275562 16616383 16058845 17056948 16384024 17544094 16894992 17159161
6464A7159161p9632J151000j38267K80751J59372j45400k34575M41540J304291
$$ 17159161 17079529 18230529 18092262 18373013 18532385 18386985 18152410 18593950 19898241
6455A9898241j435218M52531Q23612M89279q56992Q21430q61844J116550m07954
$$ 19898241 18463023 18915554 19739166 20228445 19371453 20192883 19331039 20447589 20039635
6446B0039635J128555j16013j41395P06103k70249k9937l22100J161920k39391
$$ 20039635 21168190 21052177 20910782 21616885 21346636 21316699 20994599 22156519 21917128
6437B1917128O1391P34330m64624N90585J098793o19080M69833O5160R66584o1766
$$ 21917128 21978519 22712849 22248225 22838810 23937603 23318523 23788356 23853516 24820100 24758334
6427B4758334J07812R15356J09049j12024J437528j624497P26338J671677r25397
$$ 24758334 24866146 25781502 25890551 25778527 27216055 25591558 26317896 27989573 27064176
6418B7064176L66717J721840K98273M88113J09709N40877L02548L92689P28493
$$ 27064176 27430893 29152733 29451006 29939119 30048828 30589705 30892253 31284942 32013435
6409C2013435J240166K95336J121782K83126K26650Q26552J655702L38882K428836
$$ 32013435 33253601 33548937 34670719 34953845 35180495 36007047 37662749 38001631 40430467
6400D0430467o68786J517447R25383J714195O95416J629441J819937J510582J845428
$$ 40430467 39761681 41279128 42204511 43918706 44614122 46243563 48063500 49574082 51419510
6391E1419510K438093J290912K095087K516325K655028K774235K272959L019622
$$ 51419510 53857603 55148515 57243602 59759927 62414955 65189190 67462149 70481771
6383G0481771J988884L837786L893794K726839L762801L113689M399718N390848
$$ 70481771 72470655 76308441 80202235 82929074 86691875 89805564 94205282 99596130
6375I9596130M591755N264961M595425N897411N609286O420486O330894O636531
$$ 99596130 104187885 109452846 114048271 119945682 125554968 131975454 138306348 144942879
6367A44942879P429144Q319264Q997903R140851J0673559R409477R510216Q011926
$$ 144942879 152372023 160691287 169689190 178830041 189503600 198913077 208423293 216435219
6359B16435219P072102O382144M924196M057722L514689L113817L976643L012561
$$ 216435219 223507321 229889465 234813661 238871383 242386072 245499889 249476532 252489093
6351B52489093M959897N491607P246445R011477R514353R979240R146743Q959829
$$ 252489093 257448990 262940597 270187042 279198519 288712872 298692112 307838855 316798684
6343C16798684P394103O064082K424606J299201o80625k844024o196130o688603
$$ 316798684 324192787 330256869 332681475 333980676 333300051 330456027 324259897 317571294
6335C17571294o247839p133335o937917n954581o164847m264045m150495j590028
$$ 317571294 311323455 304190120 297252203 291297622 285132775 280868730 276718235 275128207
6327B75128207J26125P19712M583026M770729P387225P790802Q631792P411348
$$ 275128207 275254332 275974044 280557070 285327799 292715024 300505826 309137618 316548966
6319C16548966N470981L014338k198900n013894r444996j1828181j2554485j4083916
$$ 316548966 322019947 325034285 322835385 317821491 308376495 296548314 283993829 269909913
6311B69909913j7509485j5504024j6153904j3876417j2838000r402030j0079451
$$ 269909913 252400428 236896404 220742500 206866083 194028083 184626053 174546602
6304A74546602o663536o454942n392853n097054l755982k360509l144007j086748
$$ 174546602 167883066 161428124 156035271 150938217 147182235 144821726 141677719 140590971
6296A40590971K52913L33849J844495J741916K329365Q70038L25222k580920l606866
$$ 140590971 140843884 141177733 143022228 144764144 147093509 147963547 148288769 145707849 142100983
6287A42100983l790570m993619p310184p023952p242382q654262p088755o721531
$$ 142100983 138310413 133316794 126006610 118982658 111740276 103086014 95997259 89275728
6279H9275728o944630m599400n588008l592220m201984l636877m244663j530386
$$ 89275728 82331098 77731698 72143690 68551470 64349486 60712609 56467946 54937560
6271E4937560l356003k613931j255382k873694j876641j893636k013569r47522
$$ 54937560 51581557 48967626 47712244 44838550 42961909 41068273 39054704 38107182
6263C8107182j018795j222691j114589j209837o43919p48722j162473j443717
$$ 38107182 37088387 35865696 34751107 33541270 32897351 32148629 30986156 29542439
6255B9542439n67777o92848p87292N07812j139841n54107j044296O813q9464j452439
$$ 29542439 28974662 28281814 27494522 28002334 26862493 26308386 25264090 25270903 25181439 23729000
6245B3729000k11133j034925J0948j25810n18491n54298m56807j6581k05611j44780
$$ 23729000 23517867 22482942 22493890 22368080 21849589 21295291 20838484 20821903 20616292 20471512
6235B0471512O0258p40954J26317m11995M07016o05843L50394q92571o60757M17784
$$ 20471512 20531770 19790816 19917133 19505138 19912154 19306311 19656705 18764134 18103377 18521161
6225A8521161M83616j091043J036439j395958L27315r48527N52253m38480L78383
$$ 18521161 19004777 17913734 18950173 17554215 17881530 16933003 17485256 17046776 17425159
6216A7425159N36534n65491j52932j366734J209517r86437P62164k08094j007054
$$ 17425159 17961693 17396202 17243270 15876536 17086053 16099616 16861780 16653686 15646632
6207A5646632O15923j295905O98483o80891K84661R34215q31586J35873L32754
$$ 15646632 16262555 14966650 15665133 14984242 15268903 16203118 15371532 15507405 15840159
6198A5840159k65669J09756J10938k51857O67742j010316P36181J04711j272637
$$ 15840159 15574490 15684246 15795184 15543327 16211069 15200753 15936934 16041645 14769008
6189A4769008L97115J71602m24025J37070o25867P80036j343521Q91906n12418
$$ 14769008 15166123 15337725 14913700 15050770 14424903 15204939 13861418 14753324 14240906
6180A4240906k67548L61468j92732m75970M01138j32762M3175m29439J28560J53875
$$ 14240906 13973358 14334826 14142094 13666124 14067262 13934500 13977675 13548236 13676796 13830671
6170A3830671J15767L04076j147773O88448o53226l6379P69759m02324P85017
$$ 13830671 13946438 14250514 13102741 13791189 13137963 13101584 13871343 13469019 14254036
6161A4254036q92468j4361l92082J76871Q3689J59923J07204p59804l8983R94049
$$ 14254036 13361568 13347207 12955125 13131996 13215685 13375608 13482812 12723008 12684025 13678074
6151A3678074j477278k84580J959449j026008M34640o88920M1881N24998j95544
$$ 13678074 12200796 11916216 13875665 12849657 13284297 12595377 12637258 13162256 12966712
6142A2966712k32231l0447l99225P71371N94888r49069o32076O62107J04132l20763
$$ 12966712 12734481 12704034 12304809 13076180 13671068 12721999 12089923 12752030 12856162 12535399
6132A2535399m75667J297005q2402r35823N66345o2521m662l9669Q19347p31670
$$ 12535399 12059732 13356737 13274335 12338512 12904857 12842336 12837674 12798005 13617352 12885682
6122A2885682L67567L45314l67861o44066L24596l86200J350752J93276l44469
$$ 12885682 13253249 13598563 13230702 12586636 12911232 12525032 13875784 14069060 13724591
6113A3724591k26575P19770l15775J17787j76571q0302M42988N77460j102840
$$ 13724591 13498016 14217786 13902011 14019798 13843227 13762925 14205913 14783373 13680533
6104A3680533J213004n65311M48850j99803J21385n54362M18314j01000J211608
$$ 13680533 14893537 14328226 14777076 14577273 14698658 14144296 14562610 14461610 15673218
6095A5673218r07600J7361Q64417m49748J2328J028500m51902J088152m22072
$$ 15673218 14765618 14782979 15647396 15197648 15209976 16238476 15786574 16874726 16452654
6086A6452654m33990K28749n707R2950J33327Q15983o09474Q31768K17645l5662
$$ 16452654 16018664 16247413 16241706 16334656 16467983 17283966 16674492 17506260 17723905 17688243
6076A7688243m10875m4209L24093L53764J28527o18830J223714J46481M97286
$$ 17688243 17277368 17233159 17557252 17911016 18039543 17420713 18644427 18790908 19288194
6067A9288194n08195J4828L06M91083L30198n16339M49555J94570M05941n16023
$$ 19288194 18779999 18794827 18795133 19286216 19616414 19100075 19549630 19744200 20150141 19634118
6057A9634118J273595n60755j62152j89522O07010Q92877m82682r6928r3384M05860
$$ 19634118 20907713 20346958 20184806 19995284 20602294 21495171 21012489 20915561 20822177 21228037
6047B1228037j07422K69979m8097j15609j99044k26005J867718n60580j37978
$$ 21228037 21120615 21390594 21342497 21226888 21027844 20801839 22669557 22108977 21970999
6038B1970999K64211n12000J033014P7557N4684k27066L74558J77067J99455M62604
$$ 21970999 22235210 21723210 22756224 22833781 22888465 22661399 23035957 23213024 23412479 23875083
6028B3875083J45955m21526N90106O07647J16493m48277N84307L79733j54828
$$ 23875083 24021038 23599512 24189618 24797265 24913758 24465481 25049788 25429521 25274693
6019B5274693K40142J00104O83579o4654J42131R51291o83839P15431L75421R99072
$$ 25274693 25514835 25614939 26298518 26233864 26375995 27327286 26643447 27358878 27734299 28733371
6009B8733371k65093J000249j4124P56056l1352Q65115R20211K6724L09092J256070
$$ 28733371 28468278 29468527 29454403 30210459 30179107 31044222 31964433 31991157 32300249 33556319
5999C3556319J115392L67233O66823M41494J600299R27413Q70847P62234O73545
$$ 33556319 34671711 35038944 35705767 36147261 37747560 38674973 39545820 40308054 40981599
5990D0981599Q96078K009613J364776J279172J459947K323167J663279J399398
$$ 40981599 41877677 43887290 45252066 46531238 47991185 50314352 51977631 53377029
5982E3377029K512639R04533K106877K741775K385707J375697L365512J774249
$$ 53377029 55889668 56794201 58901078 61642853 64028560 65404257 68769769 70544018
5974G0544018L118519L595449L120412L857952L959829L333786M322864M555250
$$ 70544018 73662537 77257986 80378398 84236350 88196179 91529965 95852829 100408079
5966A00408079N130559N662735N769449O624467N812323N022547M432552M194369
$$ 100408079 105538638 111201373 116970822 123595289 129407612 134430159 138862711 143057080
5958A43057080K153885J181417J354552j057714p65355j604141j640655r46752
$$ 143057080 145210965 146392382 147746934 146689220 145923865 144319724 142679069 141732317
5950A41732317j242115k72744L24253J050308J689249K528158L526935L810194
$$ 141732317 140490202 140217458 140541711 141592019 143281268 145809426 149336361 153146555
5942A53146555M626945M915629N302749N552102P314210P944428P892745R912770
$$ 153146555 157773500 162689129 167991878 173543980 180858190 188802618 196695363 206608133
5934B06608133Q955578J1102633R734772R773257P482417O069372L412211J688142
$$ 206608133 215563711 226666344 236401116 246174373 253656790 259726162 263138373 264826515
5926B64826515p54427l329390m138251o522231o158815n445514m788330l703113
$$ 264826515 264072088 260742698 256604447 250082216 243923401 238477887 233689557 229986444
5918B29986444j670934j73143K726326M030798N170105M962018M118249M259484
$$ 229986444 228315510 228142367 230868693 234899491 240069596 245031614 249149863 253409347
5910B53409347K285522J007401k5483L31460j629481k106424O5900n90110m0400
$$ 253409347 255694869 256702270 256676787 257008247 255378766 253272342 253338242 252748132 252707732
5901B52707732J121582K043867J138063N2526K64234k893671j946348m712599
$$ 252707732 253829314 255873181 257011244 257063770 257328004 254434333 252487985 247775386
5893B47775386k967527k765681p17705N93976L821916N592948N791394M933907
$$ 247775386 244807859 242042178 241324473 241918449 245740365 251333313 257124707 262058614
5885B62058614M442669L25981k072834m620983o218427r312210j0605224j2580358
$$ 262058614 266501283 266827264 264754430 260133447 253915020 244602810 233997586 221417228
5877B21417228j3786862j1723094j1282021r501258q556186o299825n852239m808460
$$ 221417228 207630366 195907272 184625251 175123993 166567807 160267982 154415743 149607283
5869A49607283l942380k859222k086657k404670j376108r82230J451383Q48003
$$ 149607283 145664903 142805681 140719024 138314354 136938246 135956016 137407399 138255402
5861A38255402K218838K209756K251168K362596J848250J218871j203062j293982
$$ 138255402 140474240 142683996 144935164 147297760 149146010 150364881 149161819 147867837
5853A47867837k016649m347584m084906l561581m726872m095456l342701l134930
$$ 147867837 145851188 141503604 137418698 133857117 129130245 125034789 121692088 118557158
5845A18557158k305687m73607r90885l38973L98483J285870J214419L248435K147441
$$ 118557158 116251471 115777864 114786979 114448006 114846489 116132359 117346778 120595213 122742654
5836A22742654K104526M091822L426952L526888L814572M300673L581622M257306
$$ 122742654 124847180 128939002 132365954 135892842 139707414 144008087 147589709 151847015
5828A51847015L134149K852027L432202J996975K358684J981483J392756J955570
$$ 151847015 154981164 157833191 161265393 163262368 165621052 167602535 168995291 170950861
5820A70950861J495912J449291J518672K526028J742500K395501L552130K191691
$$ 170950861 172446773 173896064 175414736 177940764 179683264 182078765 185630895 187822586
5812A87822586L617828L038057K703157L238640L312290K182758Q86265O8071
$$ 187822586 191440414 194478471 197181628 200420268 203732558 205915316 206801581 206869652
5804B06869652N62441k387216k102770n166384m362992n078275o389356o945422
$$ 206869652 207432093 205044877 202942107 197775723 193412731 188334456 181945100 174999678
5796A74999678o236430o061571n716371n594986n104078l693245l668065l500019
$$ 174999678 168763248 162701677 156985306 151390320 146286242 142592997 138924932 135424913
5788A35424913k257476k217749j674669k113042k055891k818985j677997j994220
$$ 135424913 133167437 130949688 129275019 127161977 125106086 122287101 120609104 118614884
5780A18614884l056667l681813l461960l868449m844656n101329m446790m384371
$$ 118614884 115558217 111876404 108414444 104545995 99701339 94600010 90153220 85768849
5772H5768849n072499m758796n546684n047212k618088m152312l695991j995134
$$ 85768849 80696350 75937554 70390870 65343658 62725570 58573258 54877267 52882133
5764E2882133l653675k697552k280270j946523k572065j645209j904132j086745
$$ 52882133 49228458 46530906 44250636 42304113 39732048 38086839 36182707 35095962
5756C5095962j689731j391829j06746j536783j656043j211370n05016n32003r59012
$$ 35095962 33406231 32014402 31907656 30370873 28714830 27503460 26998444 26466441 25507429
5747B5507429j505017L75959j098122m41519j89833j013028j195423n70391Q14778
$$ 25507429 24002412 24378371 23280249 22838730 22648897 21635869 20440446 19870055 20684833
5738B0684833q31060r63628J66465k53088j159936k20952K42993m10630m75804
$$ 20684833 19853773 18890145 19056610 18803522 17643586 17422634 17665627 17254997 16779193
5729A6779193m72200Q65665j863519k63546L05996p95482K37017n30798k07411
$$ 16779193 16306993 17172658 15309139 15045593 15351589 14556107 14793124 14262326 14054915
5720A4054915Q25586j299710k22492K44152L18479j99083j132643L37386j19866
$$ 14054915 14880501 13580791 13358299 13602451 13920930 13721847 12589204 12926590 12806724
5711A2806724j60286O00971m23835j36599q8880j86384l28342o48607R67504n95922
$$ 12806724 12646438 13247409 12823574 12686975 12598095 12411711 12083369 11434762 12402266 11806344
5701A1806344P43761j567594P72011J65792o71696J22383M66401p27292J98M74451
$$ 11806344 12550105 10982511 11754522 11920314 11248618 11371001 11837402 11110110 11110308 11584759
5691A1584759r34346J073377q22849J92069j99623L52221M86794j489414K95648
$$ 11584759 10650413 11723790 10900941 11093010 10893387 11245608 11732402 10242988 10538636
5682A0538636o32745M29550R18613p92096N30122k28457k99633L21034M28968
$$ 10538636 9905891 10335441 11254054 10461958 10992080 10763623 10463990 10785024 11213992
5673A1213992p42779k32150n00328L77880P58657m60890Q48069k58262m58151
$$ 11213992 10471213 10239063 9738735 10116615 10875272 10414382 11262451 11004189 10546038
5664A0546038k15122m06712J271421j45299o48918R45013n5281k19981m22120
$$ 10546038 10330916 9924204 11195625 11050326 10401408 11346421 11291140 11071159 10649039
5655A0649039R88548j149280m55388P52725j57415o94118M62535o65187L92752
$$ 10649039 11637587 10488307 10032919 10785644 10628229 9934111 10396646 9731459 10124211
5646A0124211m7001q8014Q85337r28889J09134J65126O24899L4801n51315N75171
$$ 10124211 10077210 9989196 10874533 9945644 10054778 10219904 10844803 10879604 10328289 10903460
5636A0903460q135j85877n78942J92479K20756l33345j48194N59902J9843Q7729
$$ 10903460 10895325 10709448 10130506 10322985 10543741 10210396 10062202 10622104 10641947 10729676
5626A0729676J113996j147236K42643M68816o5379p52473J110699r20642P9765
$$ 10729676 11843672 10696436 10939079 11407895 11342516 10590043 11700742 10780100 10859865
5617A0859865K51588L04629O26338n5255q1572M73003q60470K77315n70056O82058
$$ 10859865 11111453 11416082 12042420 11987165 11905593 12378596 11518126 11795441 11225385 11907443
5607A1907443m70675n04755J042518K51662Q4411o55384N53779n2839O19647k72837
$$ 11907443 11436768 10932013 11974531 12226193 12310604 11655220 12208999 12156160 12775807 12502970
5597A2502970l57686O64845J21469N56486k96049l83212O21258L07167m13001
$$ 12502970 12145284 12810129 12931598 13488084 13192035 12808823 13430081 13737248 13324247
5588A3324247Q90196r38223N01064J04244n69280M02424k20281J43382M04794
$$ 13324247 14214443 13276220 13777284 13881528 13312248 13714672 13494391 13637773 14042567
5579A4042567r67579J049826k90476p8892L49271K47066P79802r00991L86768
$$ 14042567 13074988 14124814 13834338 13755446 14104717 14351783 15131585 14230594 14617362
5570A4617362K93244N41641o19940R45023n90055M29739Q78038k97164P62541
$$ 14617362 14910606 15452247 14832307 15777330 15187275 15617014 16495052 16197888 16960429
5561A6960429N63526o29632n1666L01901R8390L8594r4109J206835K69809r05334
$$ 16960429 17523955 16894323 16842657 17144558 17242948 17281542 17187433 18394268 18664077 17758743
5551A7758743R64402p7436K87451P26474k23790N8818J326602O84768m68544M16006
$$ 17758743 18723145 18645709 18933160 19659634 19435844 19494662 20821264 21506032 21037488 21453494
5541B1453494P79458N0297Q14102R64683P74347j97822J450231R78436J052234
$$ 21453494 22232952 22283249 23097351 24062034 24836381 24638559 26088790 27067226 28119460
5532B8119460R17985Q44483J170363N96706K152018O24844Q85373K399169J704573
$$ 28119460 29037445 29881928 31052291 31648997 33801015 34425859 35311232 37710401 39414974
5523C9414974R83250J616102J206943J560738K535874K234658J382495J392388
$$ 39414974 40398224 42014326 43221269 44782007 47317881 49552539 50935034 52327422
5515E2327422K740445K706288K280613K142903L391797K796093K770500M177333
$$ 52327422 55067867 57774155 60054768 62197671 65589468 68385561 71156061 75333394
5507G5333394L785149M200241L983822N050301L743113N417806L792911M132553
$$ 75333394 79118543 83318784 87302606 92352907 96096020 101513826 105306737 109439290
5499A09439290L912510L467728K933685J192226N32054J00616O79621m13772j111654
$$ 109439290 113351800 116819528 119753213 120945439 121477493 121578109 122257730 121843958 120732304
5490A20732304n9754o51009J069787o03302Q73688O58363J362752K882631J412891
$$ 120732304 120672550 120021541 121091328 120488026 121361714 122020077 123382829 126265460 127678351
5481A27678351L899309K428410L316197M760861N484857M469640N184836O957141
$$ 127678351 131577660 134006070 137322267 142083128 147567985 152037625 157222461 164179602
5473A64179602N100844N576385M323312K961780L302150P41872q81328k469365
$$ 164179602 169280446 174856831 179180143 182141923 185444073 186185945 185304617 182835252
5465A82835252k932943n728022n474695o010506o943713o637076o287262n417220
$$ 182835252 179902309 174174287 168699592 162689086 155745373 149108297 142821035 137403815
5457A37403815n614009m150483m424306k404262l222295j195706j712196j794952
$$ 137403815 131789806 127639323 123215017 120810755 117588460 116392754 114680558 112885606
5449A12885606J0847P82115r5397L23742O60936K929985M47423J368849N02919
$$ 112885606 112896453 113678568 113583171 113906913 114567849 117497834 117945257 119314106 119817025
5440A19817025L55874j260122l330332k245904m300082m474435n805550l893673
$$ 119817025 120172899 118912777 115582445 113336541 109036459 104562024 98756474 94862801
5432I4862801o818397n556241n697969n882510m423724n293849l140774m513937
$$ 94862801 88044404 82488163 76790194 70907684 66483960 61190111 58049337 53535400
5424E3535400l592842k993995k536304k329810j635884j933289k155175j570959
$$ 53535400 49942558 46948563 44412259 42082449 40446565 38513276 36358101 34787142
5416C4787142j884582j356401j108854m64403j185893j927146K50072j619630
$$ 34787142 32902560 31546159 30437305 29972902 28787009 26859863 27109935 25490305
5408B5490305n15265m10500j076517p27767r14692o23363Q91710j674635L62969
$$ 25490305 24975040 24564540 23488023 22760256 21845564 21222201 22113911 20439276 20802245
5399B0802245j22659j930886N07956j194978K72114K46743j053403k477j00569
$$ 20802245 20679586 18748700 19256656 18061678 18333792 18580535 17527132 17524655 17424086
5390A7424086l28708J68947o06323p9278n20190m50737K4786j043152R99876j73972
$$ 17424086 17095378 17264325 16658002 16578724 16058534 15607797 15632583 14589431 15589307 15415335
5380A5415335J01799n41169P2739K53918l52762Q2766o06500L17496K18827m21459
$$ 15415335 15517134 14975965 15048704 15302622 14949860 15032626 14426126 14743622 14962449 14540990
5370A4540990R8915o15745L19321k9414O40987o40507L40601p25403l71784J132057
$$ 14540990 14639905 14024160 14343481 14314067 14955054 14314547 14655148 13929745 13557961 14690018
5360A4690018L35649o46884K03823l27495L48092o10615J042381k55187l04392
$$ 14690018 15025667 14378783 14582606 14255111 14603203 13992588 15034969 14779782 14475390
5351A4475390O55261M21683o82337m04218O84230K61344m61381k06053l18986
$$ 14475390 15130651 15552334 14869997 14465779 15150009 15411353 14949972 14743919 14424933
5342A4424933M13126N534O06649q32613N62303J56842L60972J77509k33812N14043
$$ 14424933 14838059 14843593 15450242 14617629 15179932 15336774 15697746 15875255 15641443 16155486
5332A6155486k48943M30857N55535q36381L89309J51394K91068O05319j73317
$$ 16155486 15906543 16337400 16892935 16056554 16445863 16597257 16888325 17493644 17320327
5323A7320327k30142j17065J108269j15518m2332J089263O78873n07411j6732
$$ 17320327 17090185 16973120 18081389 17965871 17923539 19012802 19691675 19184264 19167532
5314A9167532r7165Q32410L91852Q23314J40854J358542p82262K4300J509064
$$ 19167532 19070367 19902777 20294629 21117943 21258797 22617339 21835077 21859377 23368441
5305B3368441J33769M48210K39454J914150N18121L49230J092952j49054K340719
$$ 23368441 23502210 23950420 24189874 26104024 26622145 26971375 28064327 27915273 30255992
5296C0255992R71339J87399J464087P18900N17524J716142J955576M97955L121947
$$ 30255992 31227331 31414730 32878817 33597717 34115241 35831383 37786959 38284914 41406861
5287D1406861M95098K408290R80831J765375K011912K857358K130959K311931
$$ 41406861 41901959 44310249 45291080 47056455 49068367 51925725 54056684 56368615
5279E6368615K495702K363330K888926K444946L659868L833215L131696K945459
$$ 56368615 58864317 61227647 64116573 66561519 70221387 74054602 77186298 80131757
5271H0131757M825583L725203M651452N065782L687691M848600M992379M263600
$$ 80131757 84957340 88682543 93333995 98399777 102087468 106936068 111928447 116192047
5263A16192047M184773M239592K876219L494651K770108K804953J837111J437331
$$ 116192047 120376820 124616412 127492631 130987282 133757390 136562343 138399454 139836785
5255A39836785J226769K112692J337549K678581K373867K368096K929733L069966
$$ 139836785 141063554 143176246 144513795 147192376 149566243 151934339 154864072 157934038
5247A57934038K925219M867859L598179M401985M485200M474648M653722L559664
$$ 157934038 160859257 165727116 169325295 173727280 178212480 182687128 187340850 190900514
5239A90900514K749004K116931M34790M68914n44458k610512k887504l494685
$$ 190900514 193649518 195766449 196201239 196670153 196125695 193515183 190627679 187132994
5231A87132994m613346m642375m368392n750359m705765m067953n001078l975882
$$ 187132994 182519648 177877273 173508881 167758522 163052757 158984804 153983726 150007844
5223A50007844k950513m020830k602395l141096k760954k600518k629685l590269
$$ 150007844 147057331 143036501 140434106 137293010 134532056 131931538 129301853 125711584
5215A25711584l795038k579583m396526l685005m663178n334516m536164n069464
$$ 125711584 121916546 119336963 114940437 111255432 106592254 101257738 96721574 91652110
5207I1652110n400377m239465m878818m639142m878371l543040l349828l551626
$$ 91652110 86251733 82012268 77133450 72494308 67615937 64072897 60723069 57171443
5199E7171443k413711l095199k408275k855459k248462j880656j935101k284695
$$ 57171443 54757732 51662533 49254258 46398799 44150337 42269681 40334580 38049885
5191C8049885o04654j545039j605858j228286j554394l01214j045325r82344r41498
$$ 38049885 37445231 35900192 34294334 33066048 31511654 31210440 30165115 29182771 28241273
5182B8241273j154293r56003r4617l12205r58744J09012j217998m48128j058607
$$ 28241273 27086980 26130977 26036360 25724155 24765411 24874423 23656425 23208297 22149690
5173B2149690q1294j002451j30210q32013j07275m42651r03802n76707L82734
$$ 22149690 22068396 21065945 20935735 20103722 19996447 19553796 18649994 18073287 18456021
5164A8456021k86915o41911o48713j91163K19731o48594L26262o30507l46289
$$ 18456021 18169106 17527195 16878482 16687319 16907050 16258456 16584718 15954211 15607922
5155A5607922L52158q67063P53456j357712l71117n4958L44848n24074M69777
$$ 15607922 15960080 15093017 15846473 14488761 14117644 14062686 14407534 13883460 14353237
5146A4353237n18116L22726l27554L33810j67720l61403j11564K97087k15082
$$ 14353237 13835121 14157847 13830293 14164103 13996383 13634980 13523416 13820503 13605421
5137A3605421j13217j62782m265K51731j5023r25016j80565O74942N21579p63041
$$ 13605421 13492204 13329422 13325157 13576888 13561865 12636849 12456284 13131226 13652805 12889764
5127A2889764M06620l41248L05458J70805k89112J166285j088412j61979l22778
$$ 12889764 13296384 12955136 13260594 13431399 13142287 14308572 13220160 13058181 12735403
5118A2735403Q37833k86885l02830m77369N72862R38472n73676O15209j224844
$$ 12735403 13573236 13286351 12983521 12506152 13079014 14017486 13443810 14059019 12834175
5109A2834175L48474L75242N18819o14284O16613P62030q25499R38607m96199
$$ 12834175 13182649 13557891 14076710 13462426 14079039 14841069 14015570 14954177 14457978
5100A4457978M2923M16642l06187P3818j2076N12162L23291j66563Q46747N24131
$$ 14457978 14500901 14917543 14611356 14685174 14673098 15185260 15508551 15341988 16188735 16712866
5090A6712866n97654l98708M56615J371691l38388N41822L37999K34525n4641
$$ 16712866 16115212 15716504 16173119 17544810 17206422 17748244 18086243 18320768 18266127
5081A8266127J361039l31851K5704J702417J47785Q17347N22514Q27084q34618
$$ 18266127 19627166 19295315 19321019 21023436 21171221 21988568 22511082 23338166 22503548
5072B2503548J659503L49652O60638Q27905J044997J702664N85319M94859Q96300
$$ 22503548 24163051 24512703 25173341 26001246 27046243 28748907 29334226 29829085 30725385
5063C0725385J576766P12575J330450J452055Q84310J132192K178038K529904
$$ 30725385 32302151 33014726 34345176 35797231 36681541 37813733 39991771 42521675
5055D2521675J824061J959379K511151K079506L001462K141837J204322K585061
$$ 42521675 44345736 46305115 48816266 50895772 53897234 56039071 57243393 59828454
5047E9828454N52794J079045J283060P8487J639944q83845m2241J85731J138345
$$ 59828454 60381248 61460293 62743353 62821840 64461784 63577939 63535698 63721429 64859774
5038F4859774J165311M21248J942591R74964L646225J048068J238844L132343
$$ 64859774 66025085 66446333 68388924 69363888 73010113 74058181 75297025 78429368
5030G8429368K674954K849458L788109L656462M383600L927413N258921N743781
$$ 78429368 81104322 83953780 87741889 91398351 95781951 99709364 104968285 110712066
5022A10712066N336678M717527M919137L079598K195919L56413N8127j356912
$$ 110712066 116048744 120766271 125685408 128765006 130960925 131317338 131375465 130018553
5014A30018553k297602l006854l060578l664091k518351j466171k765302l73963
$$ 130018553 127720951 124714097 121653519 117989428 115471077 114004906 111239604 110865641
5006A10865641j391110O48688J93886P28600J083711J845932K281049J038072
$$ 110865641 109474531 110123219 110317105 111045705 112129416 113975348 116256397 117294469
4998A17294469L101702L906339L295137M046030N700054N135361N239048M342190
$$ 117294469 120396171 124302510 127597647 131643677 137343731 142479092 147718140 152060330
4990A52060330L357729K012613R1810j786565k682895m569517m937992o181516
$$ 152060330 155418059 157430672 157522482 155735917 153053022 148483505 143545513 137363997
4982A37363997n683899p233146n375891n375436m124696m224309k362720l332249
$$ 137363997 131680098 124446952 119071061 113695625 109570929 105346620 102983900 99651651
4974I9651651j551684j293973r65385j591260k76813j161847K80237K32907J863780
$$ 99651651 98099967 96805994 95840609 94249349 93972536 92810689 93090926 93323833 95187613
4965I5187613J062390J948576K462186J700806J462865J180107l52990j494393
$$ 95187613 96250003 98198579 100660765 102361571 103824436 105004543 104651553 103157160
4957A03157160k607159l643568m040043m821256m604297m948739n133544l663459
$$ 103157160 100550001 96906433 92866390 88045134 83440837 78492098 73358554 69695095
4949F9695095n235199l516528k245293k915133k987556j713721j916828p63490
$$ 69695095 64459896 60943368 58698075 55782942 52795386 51081665 49164837 48401347
4941D8401347j923184p70365q95957j589949M84425j399925n85090J4688r83138
$$ 48401347 46478163 45707798 44811841 43221892 43706317 42306392 41721302 41735990 40752852
4932D0752852P25591R9705n02321j487567M00044j658882l12135k840434j176334
$$ 40752852 41478443 41578148 41075827 39588260 39988304 38329422 38017287 35176853 34000519
4923C4000519j195122j423847j518818j873781j347970j479928o71132l95725
$$ 34000519 32805397 31381550 29862732 27988951 26640981 25161053 24489921 24094196
4915B4094196j307996j318653j133301L75640j109344j366099N20663q20517q8870
$$ 24094196 22786200 21467547 20334246 20709886 19600542 18234443 18755106 17934589 17845719
4906A7845719k28539q77398M26907j536382N09428r12585O83304k30378m63641
$$ 17845719 17617180 16739782 17166689 15630307 16139735 15227150 15910454 15680076 15216435
4897A5216435J64308r86027m87692K64875k54171P3151k99367n61530o2034N35239
$$ 15216435 15380743 14394716 13907024 14171899 13917728 13990879 13691512 13129982 13067948 13603187
4887A3603187k97369K80831m39159n79928L08992N26387o74557N94751l24056
$$ 13603187 13305818 13586649 13147490 12567562 12876554 13402941 12728384 13323135 12999079
4878A2999079K39970P20989k95626o18631k37575J71418m89754k30862P33493
$$ 12999079 13239049 13960038 13664412 13045781 12808206 12979624 12489870 12259008 12992501
4869A2992501n35401L30845o37047N81891n37150j71865N1945M47698M44047j39621
$$ 12992501 12457100 12787945 12150898 12732789 12195639 12023774 12075719 12523417 12967464 12827843
4859A2827843q50717J031998l05405p4696j90436M13215k32358l94068N02271
$$ 12827843 11977126 13009124 12703719 12629023 12438587 12851802 12619444 12225376 12727647
4850A2727647l83012M38431K7405Q27494k04765l55296k75692J115616j495598
$$ 12727647 12344635 12783066 12810471 13637965 13433200 13077904 12802212 13917828 12422230
4841A2422230J056304k25211K70201j211092N44101M76893n78196L37098N65665
$$ 12422230 13478534 13253323 13523524 12312432 12856533 13333426 12755230 13092328 13657993
4832A3657993J60839j61916M95140K15929P19496j055910J094582k00266k70468
$$ 13657993 13818832 13656916 14152056 14367985 15087481 14031571 15126153 14925887 14655419
4823A4655419j28076N59386R3569k18924M6025O99943J41450R684k78253l70737
$$ 14655419 14527343 15086729 15180298 14961374 15007399 15707342 15848792 15858476 15580223 15209486
4813A5209486O02532Q77712l12530q0665M24482l48305J054640P43908J22501
$$ 15209486 15812018 16689730 16377200 16296535 16721017 16372712 17427352 18171260 18293761
4804A8293761m0842N11752k69071J020767m483J09284N51536J30390Q52260M60399
$$ 18293761 18252919 18764671 18495600 19516367 19511884 19621168 20172704 20303094 21155354 21615753
4794B1615753m19789P91011K29081P71248J109343K44557J024036K96985P97267
$$ 21615753 21195964 21986975 22216056 22987304 24096647 24341204 25365240 25662225 26459492
4785B6459492p51998J607939J164567O11472N78455R92974J592758J316362J77378
$$ 26459492 25707494 27315433 28480000 29091472 29669927 30662901 32255659 33572021 33749399
4776C3749399J446011N27836K331422Q14439K026538O35905K050818K071032J015416
$$ 33749399 35195410 35723246 38054668 38869107 40895645 41531550 43582368 45653400 46668816
4767D6668816K321335J494404J051174J971900J727430K076838J711205J363827
$$ 46668816 48990151 50484555 51535729 53507629 55235059 57311897 59023102 60386929
4759F0386929K377836K178095J064281K125763J963394K126040K255245K361612
$$ 60386929 62764765 64942860 66007141 68132904 70096298 72222338 74477583 76839195
4751G6839195K300613L022419J618268L229432K605258K466609K214397K609938
$$ 76839195 79139808 82162227 83780495 87009927 89615185 92081794 94296191 96906129
4743I6906129J931496M174086K002694L324075L419693L401079L574260L381875
$$ 96906129 98837625 103011711 105014405 108338480 111758173 115159252 118733512 122115387
4735A22115387L777192M438671M276658L830808N874876L212463N476651M980869
$$ 122115387 125892579 130331250 134607908 138438716 144313592 147526055 153002706 157983575
4727A57983575M427571M597607M798215L728586M535466L902963M335258M261877
$$ 157983575 162411146 167008753 171806968 175535554 180071020 183973983 188309241 192571118
4719A92571118L572907M857041M680402M048848L969965N731895M395467N541257
$$ 192571118 196144025 201001066 205681468 209730316 213700281 219432176 223827643 229368900
4711B29368900P236640O215985P161093P621611P762327Q400831O415148P198061
$$ 229368900 236605540 242821525 249982618 257604229 265366556 273767387 280182535 287380596
4703B87380596N557992L948795K865025J341763J337192k45676k37906j515727
$$ 287380596 292938588 296887383 299752408 301094171 302431363 302185687 301947781 300432054
4695C00432054j024091p26611j870152j254571j854925j407559p99508l122443
$$ 300432054 299407963 298681352 296811200 295556629 293701704 292294145 291494637 288372194
4687B88372194k210446j921302k601085j241918k713242k162769k041518l078572
$$ 288372194 286161748 284240446 281639361 280397443 277684201 275521432 273479914 270401342
4679B70401342l886758m550077n729124o671672p391175r099262q266185r404869
$$ 270401342 266514584 261964507 256235383 249563711 242172536 233073274 224807089 215402220
4671B15402220p619107r103007q323270p013878o291910o955674m997041m734984
$$ 215402220 207783113 198680106 190356836 183342958 177051048 170095374 165098333 160363349
4663A60363349m387022m458948m531402m003783l088687l426318l513071l630157
$$ 160363349 155976327 151517379 146985977 142982194 139893507 136467189 132954118 129323961
4655A29323961l632528m619327k725982m528035l318428m320922m157788l247458
$$ 129323961 125691433 121072106 118346124 113818089 110499661 106178739 102020951 98773493
4647I8773493m426658l649994l028677l400280k860827l293759k460860k814230
$$ 98773493 94346835 90696841 87668164 84267884 81407057 78113298 75652438 72838208
4639G2838208k548605k765135k985993j141960k693164k102602j797230k396621
$$ 72838208 70289603 67524468 64538475 63396515 60703351 58600749 56803519 54406898
4631E4406898j120688k090139j302670j943438j800423j589471j924517j885117
$$ 54406898 53286210 51196071 49893401 47949963 46149540 44560069 42635552 40750435
4623D0750435j492306j421787j085062k387543q00279r34708j978059j271270
$$ 40750435 39258129 37836342 36751280 34363737 33563458 32628750 30650691 29379421
4615B9379421r06125j678725j076346q73887j127414r07913r97796j362614j085520
$$ 29379421 28473296 26794571 25718225 24844338 23716924 22809011 21811215 20448601 19363081
4606A9363081j698386o08326m89881o88253j92172j250405n56569n67118N37327
$$ 19363081 17664695 17056369 16566488 15878235 15686063 14435658 13879089 13311971 13849298
4597A3849298k171134O44084n35380k70486o83184L17966j613129L49056O146
$$ 13849298 11678164 12322248 11786868 11516382 10833198 11151164 9538035 9887091 9893237
4588I893237p28111M52432q97688L16466j012483O29454j073718L60116j010346
$$ 9893237 9165126 9617558 8719870 9036336 8023853 8653307 7579589 7939705 6929359
4579F929359k63904P0948j62039k39775j348874J477432r95979J77358m34405
$$ 6929359 6665455 6736403 6574364 6334589 4985715 6463147 5467168 5644526 5210121
4570E210121j65996N70036k77873j037753k4693L36062o12635L71496P3996j29730
$$ 5210121 5044125 5614161 5336288 4298535 4273842 4609904 3997269 4368765 4442761 4313031
4560D313031m79866l63712K69210j99766M1614K98133p44625L20845M58155o45062
$$ 4313031 3833165 3469453 3738663 3538897 3580511 3878644 3134019 3454864 3913019 3267957
4550C267957l58107p3651J82593n39433N19173m4433j96230J68039j038917L04075
$$ 3267957 2909850 2836199 3018792 2479359 2998532 2954099 2757869 2925908 1886991 2191066
4540B191066J047513n10655M5588n3240j46029N39028k214001P89562J35525M59713
$$ 2191066 3238579 2727924 2773512 2720272 2574243 3113271 899270 1688832 1824357 2284070
4530B284070J34400o52553L06549n88039q30627R02283o37879N77593l76531N93643
$$ 2284070 2418470 1765917 2072466 1484427 653800 1556083 918204 1495797 1119266 1712909
4520A712909q15920J291161o51327J3643J112019j814111m803K93275L37845l54424
$$ 1712909 896989 2188150 1536823 1550466 2662485 848374 843571 1136846 1474691 1120267
4510A120267J44237K51248q47446N38581l30270O38496j086148Q8035O08887m56735
$$ 1120267 1264504 1515752 668306 1206887 876617 1515113 428965 517000 1125887 669152
4500F69152k60867M80185j84483Q0123k78279J25544l32059P19332o38768L37734
$$ 669152 408285 888470 703987 784110 505831 631375 299316 1018648 379880 717614
4490G17614j32407l59847J53866K01487j81003M03702l94793k06353n51403P29197
$$ 717614 585207 225360 379226 580713 399710 803412 408619 202266 -349137 380060
4480C80060J11043M86034o49778P10940o12504l99984L77767J59625n2710j34538
$$ 380060 491103 977137 327359 1038299 425795 25811 403578 563203 510493 375955
4470C75955J35428l03718j06055K52783p07399L69631J70217n0749K48612Q5862
$$ 375955 511383 207665 101610 354393 -353006 16625 186842 136093 384705 470567
4460D70567m4602l2028k04J73460l0084j79494j68763j49894n87699L93551n58574
$$ 470567 425965 393937 393733 567193 537109 357615 188852 38958 -548741 -155190 -713764
4449g13764K30710O53844O89342j126925j98823Q74732Q0760K13126j277936O59610
$$ -713764 -483054 170790 860132 -266793 -465616 409116 489876 703002 -574934 84676
4439H4676j96948N15402l81653K34647j10348P42367k96243q28786Q75014p16442
$$ 84676 -112272 403130 21477 256124 145776 888143 591900 -236886 638128 -78314
4429g8314J117272j187397R44381j58503l43326k30755J30361k6522k67149Q47455
$$ -78314 1038958 -148439 795942 637439 294113 63358 193719 167197 -99952 747503
4419G47503q73610l42621Q18614L69025p60790K06602j11192o46153K39498L54102
$$ 747503 -126107 -468728 349886 718911 -41879 164723 53531 -592622 -353124 978
4409I78O3387Q4418j95094l36171Q27724l53614J71748L1849J69955o82256k88639
$$ 978 64365 148783 -46311 -382482 445242 91628 263376 295225 465180 -217076 -505715
4398e05715k48129L05566p8388J46073J45797K79930o80732k44783k0102j8802
$$ -505715 -753844 -448278 -526666 -380593 -234796 45134 -635598 -880381 -900483 -919285
4388i19285J065358o55121n95643M72703o43320K095286j664624L42930J85515
$$ -919285 146073 -509048 -1104691 -631988 -1275308 819978 -844646 -501716 -316201
4379c16201p5463r05002J097867J66783o61794J23743o6253J60986K22943q80291
$$ -316201 -391664 -1296666 -198799 -32016 -693810 -570067 -636320 -475334 -252391 -1132682
4369a132682M91152l51821N41649n89973P78704q46341R41071p29464J24997M76571
$$ -1132682 -641530 -993351 -451702 -1041675 -262971 -1109312 -168241 -897705 -772708 -296137
4359b96137K71726K83970j035021L61622L77919p53670N88725N1064o84594K61103
$$ -296137 -24411 259559 -775462 -413840 -35921 -789591 -200866 -149802 -834396 -573293
4349e73293K70752M82443o13758J208805r83744L22450q74447Q01689k62683J71872
$$ -573293 -302541 179902 -433856 774949 -208795 113655 -760792 40897 -221786 -49914
4339d9914n49853J164906o31492k0549N28262P3401M8330m77886N8337o86475
$$ -49914 -599767 565139 -66353 -86902 441360 514761 563091 85205 143542 -542933
4329e42933Q37363r06026P68832J19282m60510p9769L4558Q39818j85907O9762
$$ -542933 294430 -611596 157236 276518 -183992 -263761 -229203 610615 424708 494470
4319D94470m15383L32964J51197j42723j79906K09091R07985m48188m51037K7132
$$ 494470 79087 412051 563248 420525 240619 449710 1357695 909507 458470 485602
4309D85602J024967p73722j17855j35588M89221J51441o92124L93658n34894O05516
$$ 485602 1510569 736847 618992 483404 972625 1124066 431942 825600 290706 896222
4299H96222m021Q92820p8288r15932N76926q7704O78322o76864O5007M2205Q15251
$$ 896222 892201 1785021 1706733 790801 1367727 1280023 1958345 1281481 1346488 1388693 2203944
4288B203944j035962o7066O56799K32693N88511m80015l35023P32367l40386K889
$$ 2203944 1167982 1100916 1757715 1990408 2578919 2098904 1763881 2496248 2155862 2158751
4278B158751K89151O1409P72386o65213N48365l10190m93781N12205K5971M05274
$$ 2158751 2447902 2509311 3281697 2616484 3164849 2854659 2360878 2873083 2899054 3304328
4268C304328j62104O60519N08851k27874L91274r26437J076320m76762K66075
$$ 3304328 3142224 3802743 4311594 4083720 4474994 3548557 4624877 4148115 4414190
4259D414190K47467m40326J68635N82288p07040P66573Q19719k32419L31777J8481
$$ 4414190 4661657 4221331 4389966 4972254 4265214 5031787 5851506 5619087 5950864 5969345
4249E969345L57222J08818R07615M55915k6185p99286J293843p65222J133430
$$ 5969345 6326567 6435385 7343000 7798915 7772730 6973444 8267287 7502065 8635495
4240H635495m74989m46060m46442l82087m88528r44519n41749q21757M97573j111352
$$ 8635495 8160506 7714446 7268004 6885917 6397389 5452870 4911121 4089364 4586937 3475585
4230C475585r9110o04954m53483j1331o00494R77206j208423L15397n88632Q18208
$$ 3475585 3376475 2771521 2318038 2306707 1706213 2683419 1474996 1790393 1201761 2019969
4220B019969m58860m84878J284509n84601N10717l55143J03605o46964P55514
$$ 2019969 1561109 1076231 2360740 1776139 2286856 1931713 2035318 1388354 2143868
4211B143868q2004J80971P13945m65190r61442L18265l10609o93206K34001m23003
$$ 2143868 2061864 2242835 2956780 2491590 1530148 1848413 1537804 844598 1078599 655596
4201F55596P77076p61251O9143j02504n08536K33924n69196J38846j25665M82366
$$ 655596 1432672 671421 740564 638060 129524 363448 -205748 -66902 -192567 289799
4191B89799L50321k42583J33754q06649L93649M42149k64860q79378J142959k350
$$ 289799 640120 397537 531291 -275358 118291 560440 295580 -583798 559161 556811
4181E56811r03757N75473M69509n25621L9650k38165l81809o22974Q11529n72113
$$ 556811 -346946 228527 698036 172415 212065 -26100 -407909 -1030883 -219354 -791467
4171g91467O1733k9520P617J89034K4544j81931M08370l5090L7120m59625m47020
$$ -791467 -729734 -759254 -751637 -562603 -538059 -719990 -311620 -346710 -309590 -769215 -1216235
4160a216235M46382L8100m09747J01704q8744R19198k68591J21415q48834L45478
$$ -1216235 -769853 -731753 -1141500 -1039796 -1128540 -209342 -477933 -356518 -1205352 -859874
4150h59874l29924M7309l05618J77656k04106O70217J65373p71668R41308r79453
$$ -859874 -1189798 -1142489 -1448107 -1270451 -1474557 -804340 -638967 -1410635 -469327 -1448780
4140a448780K81369N4985m62726O58570J45320p1766Q7074k04385J04044p44023
$$ -1448780 -1167411 -1112426 -1575152 -916582 -771262 -843028 -755954 -960339 -856295 -1600318
4130a600318P23568O41026j311331K60303K56095k70736J48425M84693j36640
$$ -1600318 -876750 -235724 -1547055 -1286752 -1030657 -1301393 -1152968 -668275 -804915
4121h04915o60821N29552J18050n81513N89248n49876m53768R88601j422315J121237
$$ -804915 -1465736 -936184 -818134 -1399647 -810399 -1360275 -1814043 -825442 -2247757 -1126520
4111a126520l57291k24777M69320Q1304m82838o45854P63865N29832J2890Q0095
$$ -1126520 -1483811 -1708588 -1239268 -1157964 -1640802 -2286656 -1522791 -992959 -980069 -899974
4101h99974j60747o417q63838N82325j13163m92719R90001n50982m37893O54866
$$ -899974 -1060721 -1067138 -1930976 -1348651 -1461814 -1954533 -964532 -1515514 -1953407 -1298541
4091a298541J20771J5549n11044j52813O64613q24186M49129k19472L78988K64229
$$ -1298541 -1177770 -1162221 -1673265 -1826078 -1161465 -1985651 -1536522 -1755994 -1377006 -1112777
4081a112777k2778p45595J6945j80260M04991O42532l96908n32103K52779q3697
$$ -1112777 -1135555 -1881150 -1864205 -2044465 -1639474 -996942 -1393850 -1925953 -1673174 -1756871
4071a756871P52503p29272J075796o50699J25621N5021K49235k28174m56914L2534
$$ -1756871 -1004368 -1733640 -657844 -1308543 -1182922 -1127901 -878666 -1106840 -1563754 -1531220
4061a531220l56234Q04636l41342K83084j28309k95877m02385R25231n37041p11224
$$ -1531220 -1887454 -1082818 -1424160 -1141076 -1269385 -1565262 -1967647 -1042416 -1579457 -2290681
4051b290681J349414j132110P54582m26857K55818N85383j294627Q53006j51061
$$ -2290681 -941267 -2073377 -1318795 -1745652 -1489834 -904451 -2199078 -1346072 -1497133
4042a497133k4256l38822J05208p4969M14901n51911J82117l25226Q37080n27406
$$ -1497133 -1521389 -1860211 -1755003 -1829972 -1415071 -1966982 -1784865 -2110091 -1273011 -1800417
4032a800417M81508L66074j298145K4660j11026R10746o42328P44824j12605j75064
$$ -1800417 -1318909 -952835 -2250980 -2226320 -2337346 -1426600 -2068928 -1324104 -1436709 -1611773
4022a611773N1977k52606K9868K14134M01036n22094j2781J08067j09861M14895
$$ -1611773 -1559796 -1812402 -1782534 -1568400 -1167364 -1689458 -1702239 -1594172 -1704033 -1289138
4012a289138j64165l4080O10965o38696q0906N00970l18951o12356R71030o18469
$$ -1289138 -1453303 -1487383 -876418 -1515114 -1596020 -1095050 -1414001 -2026357 -1055327 -1673796
4002a673796j77231j85336J299008m58279o33935M6986J146452J90108l54709
$$ -1673796 -1851027 -2036363 -737355 -1195634 -1829569 -1782583 -636131 -446023 -800732
3993h00732n05899K02022o20322L13884O1608L06291q4413N92315n3061K37231
$$ -800732 -1306631 -1104609 -1724931 -1411047 -1349439 -1043148 -1127561 -535246 -588307 -351076
3983c51076j248065P70127l33896K47473j0760K25949q73710M80516O05526l06830
$$ -351076 -1599141 -829014 -1162910 -915437 -926197 -700248 -1573958 -1093442 -487916 -794746
3973g94746J52581M21216n04455K96893q29643N75710l47108Q33683r22474Q13215
$$ -794746 -642165 -220949 -725404 -428511 -1258154 -682444 -1029552 -195869 -1118343 -305128
3963c05128j042645M30409j83632Q22838J35122q29596N74373r8346K44638k11689
$$ -305128 -1347773 -917364 -1100996 -278158 -143036 -972632 -398259 -496605 -251967 -463656
3953d63656N4270j77317K26196L30346L67508q69690k47107j72335N38819q9590
$$ -463656 -409386 -586703 -360507 -30161 337347 -532343 -779450 -951785 -412966 -502556
3943e02556M37595l93550m01400Q5615P4793P62844m81624K55788j318920J103497
$$ -502556 -64961 -458511 -859911 -774296 -699503 63341 -418283 -162495 -1481415 -377918
3933c77918O0061j006010J25633K54119P81936j017440N36230j140438Q41509
$$ -377918 -317857 -1323867 -1198234 -944115 -162179 -1179619 -643389 -1783827 -942318
3924i42318K06601j08385Q37696n26515j07286K18778l22781n46465O98290j67444
$$ -942318 -735717 -844102 -6406 -532921 -640207 -421429 -744210 -1290675 -592385 -759829
3914g59829j65195n20413O61530k32038l76522N89473o9655k8612p25799O03330
$$ -759829 -925024 -1445437 -783907 -1015945 -1392467 -802994 -872649 -901261 -1627060 -1023730
3904a023730m9233L41784K15460n62020N57552n67649k75681r2501M03580o90
$$ -1023730 -1072963 -731179 -515719 -1077739 -520187 -1087836 -1363517 -1456018 -1052438 -1053128
3894a053128K15885m12624m92137J30451N7072l43760L73633M48505j084282J250321
$$ -1053128 -837243 -1249867 -1742004 -1611553 -1554481 -1898241 -1524608 -1076103 -2160385 -910064
3884i10064k82742l52214N15457n49194j24243K77868p9644o75931O28425P7430
$$ -910064 -1192806 -1545020 -1029563 -1578757 -1703000 -1425132 -1504776 -2180707 -1552282 -1474852
3874a474852M38522n71589N71552k94611o1918j91942J97668j58981K5308o62755
$$ -1474852 -1036330 -1607919 -1036367 -1330978 -1392896 -1584838 -1387170 -1546151 -1520843 -2183598
3864b183598L92180M63533l21443L24229j33719K91082L02924o83557l17650J29915
$$ -2183598 -1791418 -1327885 -1649328 -1325099 -1458818 -1167736 -864812 -1548369 -1866019 -1736104
3854a736104R0275k54048K95417k58828Q48622k23489L48763r25784J00628J67861
$$ -1736104 -1645829 -1899877 -1604460 -1863288 -1014666 -1238155 -889392 -1815176 -1714548 -1546687
3844a546687N07037n70737N0257m49925K25525N30169j69069j39374N08975m30905
$$ -1546687 -1039650 -1610387 -1560130 -2010055 -1784530 -1254361 -1423430 -1562804 -1053829 -1484734
3834a484734N18139l93154O6948J69357l47397K30533K05463r98248O03919k6665
$$ -1484734 -966595 -1359749 -1292801 -1123444 -1470841 -1240308 -1034845 -2033093 -1429174 -1455839
3824a455839L35142o02830l755P81994m11066j69834l40711l42723N91575k19078
$$ -1455839 -1120697 -1723527 -1727282 -945288 -1356354 -1526188 -1866899 -2209622 -1618047 -1837125
3814a837125N81428n02564P98166j085432K25165L30203K44550m31913L02549
$$ -1837125 -1255697 -1758261 -960095 -2045527 -1820362 -1490159 -1245609 -1677522 -1374973
3805a374973k81483k76581m5913J32131l01999J666171j109249P14344l26075
$$ -1374973 -1656456 -1933037 -1978950 -1846819 -2148818 -482647 -1591896 -877552 -1203627
3796a203627k87053l09092N07631k58797L69473k98476J260857k209948J229941
$$ -1203627 -1490680 -1799772 -1292141 -1550938 -1181465 -1479941 -219084 -2429032 -1199091
3787a199091n11319O81143n77278K35781n6120k94815N64752q7851K54148n76959
$$ -1199091 -1710410 -1029267 -1606545 -1370764 -1426884 -1721699 -1156947 -1244798 -990650 -1567609
3777a567609n78999P24925L1659N22756r32428J84438J65188m26587L14555l13022
$$ -1567609 -2146608 -1421683 -1390024 -867268 -1799696 -1615258 -1450070 -1876657 -1562102 -1875124
3767a875124K15399K12916K34307J88353K79087p42472K86561L18545j055177
$$ -1875124 -1659725 -1446809 -1212502 -1024149 -745062 -1487534 -1200973 -882428 -1937605
3758a937605j11280L57317N64199l95753j78679O69641P48174j439814O85851
$$ -1937605 -2048885 -1691568 -1127369 -1523122 -1701801 -1032160 -283986 -1723800 -1037949
3749a037949m58330L50261k95806J91954p64019P39663o53370M27726k28402K61069
$$ -1037949 -1496279 -1146018 -1441824 -1249870 -2013889 -1274226 -1927596 -1499870 -1728272 -1467203
3739a467203p81341P05985l6614q9395q747m2849J98244n92388N21613O773M9243
$$ -1467203 -2248544 -1542559 -1579173 -1668568 -1677315 -1720164 -1521920 -2114308 -1592695 -1585922 -1536679
3728a536679L66477l62942K50273q110k88715m2234l8490M36507l81127M72753
$$ -1536679 -1170202 -1533144 -1282871 -1290981 -1579696 -1621930 -1660420 -1223913 -1605040 -1132287
$$ [...]
##END NTUPLES=NMR SPECTRUM
##END=
