##TITLE=abcd
##JCAMPDX= 6.0         $$ Bruker NMR JCAMP-DX V2.0
##DATA TYPE= NMR FID
##DATA CLASS= NTUPLES
##ORIGIN= UXNMR, Bruker Analytische Messtechnik GmbH
##OWNER= root
$$ XWIN-NMR		Version 3.5
$$ Wed Aug  6 17:47:13 2025 Russian Standard Time (UT+4h)  servis@DPX200
##.OBSERVE FREQUENCY= 200.131235884673
##.OBSERVE NUCLEUS= ^1H
##.DELAY= (6, 6)
##.ACQUISITION MODE= SIMULTANEOUS
##.ACQUISITION SCHEME= undefined
##.AVERAGES= 32
##.DIGITISER RES= 18
##SPECTROMETER/DATA SYSTEM= spect
##.PULSE SEQUENCE= zg
##.SOLVENT NAME= CDCl3
##.SHIFT REFERENCE= (INTERNAL, CDCl3, 0, 16.5164)
##AUDIT TRAIL= $$ (NUMBER, WHEN, WHO, WHERE, WHAT)
$$ ##TITLE= Audit trail, XWIN-NMR		Version 3.5
$$ ##JCAMPDX= 5.01
$$ ##ORIGIN= Bruker BioSpin GmbH
$$ ##OWNER= servis
$$ F:\spectra/data/av/nmr/H1/1/audita.txt
$$ ##AUDIT TRAIL=  $$ (NUMBER, WHEN, WHO, WHERE, WHAT)
(   1,<2025-08-06 17:28:29.04 +0400>,<servis>,<DPX200>,
      <created by zg, POWCHK disabled, PULCHK disabled
       configuration hash MD5:
       00 E9 B6 7A A2 85 ED C7 34 08 36 98 17 FE 4E 26
       data hash MD5: 32K
       60 F2 8A AF 12 A6 D5 CF FA A0 A3 1A 87 4E 9F B2>)
$$ ##END=
$$ 
$$ hash MD5
$$ C0 00 C9 49 39 68 21 BB AB BE 91 A6 67 04 B2 1A
##$RELAX= 
##$RELAX= 
##$RELAX= 
##$RELAX= 
##$RELAX= 
##$RELAX= 
##$RELAX= 
##$RELAX= 
$$ Bruker specific parameters
$$ --------------------------
##$DU= <F:\spectra>
##$EXPNO= 1
##$NAME= <H1>
##$PROCNO= 1
##$TYPE= <nmr>
##$USER= <av>
##$AMP= (0..31)
100 100 100 100 100 100 100 100 100 100 100 100 100 100 100 100 100 100 
100 100 100 100 100 100 100 100 100 100 100 100 100 100 
##$AQSEQ= 0
##$AQ_mod= 1
##$AUNM= <au_zg>
##$AUTOPOS= <>
##$BF1= 200.13
##$BF2= 200.13
##$BF3= 200.13
##$BF4= 200.13
##$BF5= 500.13
##$BF6= 500.13
##$BF7= 500.13
##$BF8= 500.13
##$BYTORDA= 1
##$CFDGTYP= 0
##$CFRGTYP= 5
##$CHEMSTR= <none>
##$CNST= (0..31)
1 1 145 1 1 1 1 1 1 1 1 1 1 1 1 1 1 1 1 1 1 1 1 1 1 1 1 1 1 1 1 1 
##$CPDPRG= <>
##$CPDPRG1= <>
##$CPDPRG2= <>
##$CPDPRG3= <>
##$CPDPRG4= <mlev>
##$CPDPRG5= <mlev>
##$CPDPRG6= <mlev>
##$CPDPRG7= <mlev>
##$CPDPRG8= <mlev>
##$CPDPRGB= <>
##$CPDPRGT= <>
##$D= (0..31)
0 2 0 0 0 0 0 0 0 0.06 0 0 0 0 0 0 0.0002 0 0 0 0 0 0 0 0 0 0 0 0 0 0 
0 
##$DATE= 1754486908
##$DBL= (0..7)
120 120 120 120 120 120 120 120 
##$DBP= (0..7)
150 150 150 150 150 150 150 150 
##$DBP07= 0
##$DBPNAM0= <>
##$DBPNAM1= <>
##$DBPNAM2= <>
##$DBPNAM3= <>
##$DBPNAM4= <>
##$DBPNAM5= <>
##$DBPNAM6= <>
##$DBPNAM7= <>
##$DBPOAL= (0..7)
0.5 0.5 0.5 0.5 0.5 0.5 0.5 0.5 
##$DBPOFFS= (0..7)
0 0 0 0 0 0 0 0 
##$DE= 6
##$DECBNUC= <off>
##$DECIM= 32
##$DECNUC= <off>
##$DECSTAT= 4
##$DIGMOD= 1
##$DIGTYP= 9
##$DL= (0..7)
0 120 120 120 120 120 120 120 
##$DP= (0..7)
150 150 150 150 150 150 150 150 
##$DP07= 0
##$DPNAME0= <>
##$DPNAME1= <>
##$DPNAME2= <>
##$DPNAME3= <>
##$DPNAME4= <>
##$DPNAME5= <>
##$DPNAME6= <>
##$DPNAME7= <>
##$DPOAL= (0..7)
0.5 0.5 0.5 0.5 0.5 0.5 0.5 0.5 
##$DPOFFS= (0..7)
0 0 0 0 0 0 0 0 
##$DQDMODE= 0
##$DR= 18
##$DS= 0
##$DSLIST= <SSSSSSSSSSSSSSS>
##$DSPFIRM= 0
$$ [...]
##$SUBNAM0= <"">
##$SUBNAM1= <"">
##$SUBNAM2= <"">
##$SUBNAM3= <"">
##$SUBNAM4= <"">
##$SUBNAM5= <"">
##$SUBNAM6= <"">
##$SUBNAM7= <"">
##$SUBNAM8= <"">
##$SUBNAM9= <"">
##$SW= 20.6817932712277
##$SWIBOX= (0..15)
0 0 3 0 0 0 0 0 0 0 0 0 0 0 0 0 
##$SW_h= 4139.07284768212
##$TD= 32768
##$TD0= 1
##$TE= 0
##$TE2= 300
##$TE3= 300
##$TEG= 300
##$TL= (0..7)
0 120 120 120 120 120 120 120 
##$TP= (0..7)
150 150 150 150 150 150 150 150 
##$TP07= 0
##$TPNAME0= <>
##$TPNAME1= <>
##$TPNAME2= <>
##$TPNAME3= <>
##$TPNAME4= <>
##$TPNAME5= <>
##$TPNAME6= <>
##$TPNAME7= <>
##$TPOAL= (0..7)
0.5 0.5 0.5 0.5 0.5 0.5 0.5 0.5 
##$TPOFFS= (0..7)
0 0 0 0 0 0 0 0 
##$TUNHIN= 0
##$TUNHOUT= 0
##$TUNXOUT= 0
##$USERA1= <user>
##$USERA2= <user>
##$USERA3= <user>
##$USERA4= <user>
##$USERA5= <user>
##$V9= 5
##$VALIST= <valist>
##$VCLIST= <CCCCCCCCCCCCCCC>
##$VD= 0
##$VDLIST= <DDDDDDDDDDDDDDD>
##$VPLIST= <PPPPPPPPPPPPPPP>
##$VTLIST= <TTTTTTTTTTTTTTT>
##$WBST= 1024
##$WBSW= 30
##$XGAIN= (0..3)
0 0 0 0 
##$XL= 0
##$YL= 0
##$YMAX_a= 831608
##$YMIN_a= -560706
##$ZGOPTNS= <>
##$ZL1= 120
##$ZL2= 120
##$ZL3= 120
##$ZL4= 120
##$ABSF1= 10
##$ABSF2= 0
##$ABSG= 5
##$ABSL= 3
##$ALPHA= 0
##$AQORDER= 0
##$ASSFAC= 0
##$ASSFACI= 0
##$ASSFACX= 0
##$ASSWID= 0
##$AUNMP= <proc_1d>
##$AZFE= 0.1
##$AZFW= 0.1
##$BCFW= 1
##$BC_mod= 2
##$BYTORDP= 0
##$COROFFS= 0
##$CY= 19
##$DATMOD= 1
##$DC= 2
##$DFILT= <>
##$DTYPP= 0
##$F1P= 11.0000007629395
##$F2P= -0.999999237060547
##$FCOR= 0.5
##$FTSIZE= 0
##$FT_mod= 4
##$GAMMA= 1
##$GB= 1
##$INTBC= 1
##$INTSCL= 1
##$ISEN= 128
##$LB= 0.05
##$LEV0= 0
##$LPBIN= 0
##$MAXI= 10000
##$MC2= 0
##$MEAN= 0
##$ME_mod= 0
##$MI= 0
##$NCOEF= 0
##$NC_proc= 0
##$NLEV= 6
##$NOISF1= 0
##$NOISF2= 0
##$NSP= 1
##$NTH_PI= 0
##$NZP= 0
##$OFFSET= 16.51637
##$PC= 1
##$PHC0= -274.4391
##$PHC1= 4.101552
##$PH_mod= 0
##$PKNL= yes
##$PPARMOD= 0
##$PSCAL= 4
##$PSIGN= 0
##$REVERSE= no
##$SF= 200.13
##$SI= 16384
##$SIGF1= 0
##$SIGF2= 0
##$SINO= 400
##$SIOLD= 16384
##$SREGLST= <1H.CDCl3>
##$SSB= 0
##$STSI= 0
##$STSR= 0
##$SW_p= 4139.07284768211
##$SYMM= 0
##$S_DEV= 0
##$TDeff= 0
##$TDoff= 0
##$TI= <>
##$TILT= no
##$TM1= 0
##$TM2= 0
##$TOPLEV= 0
##$USERP1= <user>
##$USERP2= <user>
##$USERP3= <user>
##$USERP4= <user>
##$USERP5= <user>
##$WDW= 1
##$XDIM= 8192
##$YMAX_p= 0
##$YMIN_p= 0
$$ End of Bruker specific parameters
$$ ---------------------------------
##NTUPLES= NMR FID
##VAR_NAME=  TIME,          FID/REAL,        FID/IMAG
##SYMBOL=    X,             R,               I
##VAR_TYPE=  INDEPENDENT,   DEPENDENT,       DEPENDENT
##VAR_FORM=  AFFN,          ASDF,            ASDF
##VAR_DIM=   16384,         16384,           16384
##UNITS=     SECONDS,       ARBITRARY UNITS, ARBITRARY UNITS
##FACTOR=    0.0002416,     1,               1
##FIRST=     0,             0,               0
##LAST=      3.9581328,     0,               0
##MIN=       0,             -560706,         0
##MAX=       3.9581328,     831608,          0
$$ Real data points
##PAGE= N=1
##DATA TABLE= (X++(R..R)), XYDATA
$$ [...]
4341 3 5 44 -145 -55 -6 -97 28 -184 -42 54 -47 107 19 -91 42 -17 137 82 69 41 27 161 57 48 -36 56
4367 56 -29 -9 -144 -33 -34 29 -14 41 150 -106 136 29 -28 34 11 -80 38 -32 74 -29 70 52 16 107 73 -22
4393 -22 130 38 -17 92 11 -9 -28 -46 -25 -108 -79 -117 6 0 117 -55 -13 96 106 -17 55 124 11 -22 -3 -6 13
4420 13 44 58 -55 -159 44 42 -32 25 65 -10 -10 114 88 -26 45 14 49 -78 -77 -26 26 143 30 -126 -18 137
4446 137 11 35 126 66 -54 155 109 31 -17 -20 -1 -78 99 -108 -19 95 39 11 56 19 -12 50 69 -22 107 -137
4472 -137 -11 8 -46 57 -27 -162 -29 -3 -98 -49 -42 10 89 -2 -94 0 57 -143 -64 -25 -26 -78 -52 -27 -36 17 42 87 67
4501 67 -29 183 145 131 55 40 29 -32 13 17 68 65 61 -64 -1 81 26 49 25 37 111 5 -90 -75 72 110 -83 8 -42
4530 -42 -18 1 27 7 75 22 21 20 17 129 91 -4 5 -98 -15 33 99 -22 54 -23 112 129 -131 -48 -62 140 164 -67 62
4559 62 32 133 -41 -56 -6 10 -65 -82 -79 -62 29 -234 77 105 -37 2 22 54 83 -30 -45 -77 27 -50 70 43 77
4586 77 -105 95 94 -12 -27 -122 52 66 13 -14 107 27 32 15 -67 -48 -25 -98 20 16 63 -14 76 92 111 135 17 -92
4614 -92 10 9 -13 17 60 -51 -52 -88 -64 -108 42 -55 -48 28 56 36 -20 73 109 -28 -28 -72 -34 -85 -7 5 -62 -33 19 -89
4644 -89 66 100 88 194 -12 80 -62 4 -24 29 25 76 29 -66 -5 -6 -63 -31 72 45 84 106 57 38 2 13 36 64 -70
4673 -70 -36 -100 -54 53 -108 -32 26 62 -93 107 105 45 81 133 55 -65 -26 35 -81 -64 -142 -84 -22 67 12 -147 67
4700 67 -17 99 -40 8 -71 129 1 38 -74 148 8 -144 -81 -186 83 -2 67 51 38 132 76 157 32 -19 42
4725 42 -77 10 -26 -100 -42 -252 -62 125 11 -29 -50 28 30 74 120 73 135 112 42 -43 -114 72 19 7 -71 -61 34 -26
4753 -26 -41 -77 -18 69 -38 35 74 -94 32 38 -75 -36 4 -21 -255 -72 -69 -46 -94 96 105 -10 16 128 17 124
4779 124 95 -40 -68 50 62 -68 -30 -182 43 -99 42 -153 86 36 111 105 29 167 -133 27 11 -125 -131 -56
4803 -56 31 -25 2 -47 -10 -16 -33 87 -33 26 28 44 33 51 -144 -34 -16 -187 -46 30 -22 -88 127 -13 35 86 112
4830 112 66 54 3 67 145 54 -91 -43 -98 -1 -71 -59 49 28 -58 102 144 18 50 214 99 -10 122 -49 -20
4855 -20 -35 -148 -8 -74 23 -97 -111 -61 -45 -4 41 -90 50 31 23 71 17 -69 -17 12 -172 -161 -32 -27 68 98 -22
4882 -22 102 23 101 104 -8 27 57 81 47 -59 -90 -48 33 -55 27 -104 56 -10 -57 76 -43 109 27 28 170 18
4908 18 -15 47 -51 -38 -118 -99 -158 -21 39 41 -35 140 154 0 109 144 -50 -2 9 27 -5 27 -7 -171 -42 -97 -12
4935 -12 -18 70 20 4 117 81 38 54 213 -46 62 30 -63 -64 -70 -60 -125 -79 42 11 23 -38 85 0 -27 71 45 -90
4963 -90 80 -56 -19 -10 -192 -190 61 -31 -9 7 4 105 123 93 61 89 211 117 29 52 -50 4 -160 -63 -89 -147 -85 20
4991 20 -58 80 -63 20 0 113 126 16 18 52 -115 -104 -51 -61 -142 -133 -62 -68 -60 -106 18 38 94 114 36 60 65 7 -51 -110
5021 -110 -99 -30 -106 -71 -96 -97 -78 -97 164 86 164 107 100 74 77 -9 24 -43 -145 -39 -138 -10 -49 69 -38 17 -49 127
5049 127 112 47 -1 6 46 -12 8 42 -122 5 -104 -32 -42 -151 9 -101 21 -18 102 99 -25 102 4 17 10 21
5075 21 -64 18 -60 -135 -156 0 59 -16 92 -17 87 158 145 20 -10 29 -109 -66 -2 -94 -23 -238 -130 -87 -62 42
5101 42 51 19 64 125 70 52 54 3 2 6 -67 -98 45 -87 -79 -105 -11 -129 -84 -5 91 116 50 99 -19 126 102 1 -6 50
5131 50 -84 -166 -75 -42 -18 -26 41 98 133 140 16 191 155 42 31 -69 59 -140 -14 -84 61 -79 -131 -44 -33 -13
5157 -13 44 21 46 24 24 21 2 17 -133 -47 -14 -96 88 -35 -219 -48 46 -80 108 58 287 96 0 60 17 30 -48
5184 -48 2 -42 -140 -84 -116 -72 -135 -38 -32 -42 142 40 88 180 117 55 -9 67 -66 97 -43 -43 -114 77 15 -100 -11 62
5212 62 14 28 163 19 53 78 -37 31 -29 -30 -88 13 -8 -94 -105 120 -8 -148 49 45 -1 120 29 79 63 16 34
5239 34 22 -153 -33 -67 -43 -177 -214 -75 -11 125 43 5 31 143 -20 71 -71 45 42 -151 -101 -79 -79 -48 -9 59
5265 59 -53 -7 51 103 -33 133 51 -90 105 46 -104 67 -60 13 -1 -169 -67 26 -16 -106 90 -8 119 45
5289 45 167 26 117 -26 85 -56 -38 -76 -50 -32 -89 -123 -105 -63 70 134 70 56 45 77 44 144 48 18 38 -26 -134
5316 -134 -183 -7 -76 -143 -17 70 110 107 174 64 60 101 38 94 -6 -124 -184 -114 -70 -37 -114 53 19 -34 15 180 19
5343 19 -67 -5 206 41 116 -52 -14 -33 -120 -8 -37 -46 -12 -3 28 46 101 22 101 55 71 53 47 -33 45 -31 -92 -5 -107
5372 -107 -191 -44 -2 -84 -93 8 6 12 151 102 92 169 74 -62 -28 -27 -43 -129 -189 16 -215 -64 -39 23 -43 131 62 -54
5400 -54 107 26 2 -55 28 -95 -46 -33 -20 -71 -186 190 136 70 2 92 92 176 52 25 142 140 5 23 -100 -136 -143 -144
5428 -144 -75 -65 -32 21 3 7 97 97 122 -38 118 76 62 6 -15 -8 -95 -53 -95 -9 75 -60 -10 32 -4 66 51 133 43 89
5458 89 207 -14 39 -12 -62 -17 -22 -104 28 -9 73 28 27 204 106 93 238 8 26 69 15 -80 -155 -94 -103 -132 -40 -95 -64
5487 -64 50 120 77 95 130 -54 120 82 11 -58 -7 -9 -27 -204 46 -29 -115 15 -46 19 122 158 117 145 78 47 144
5514 144 24 117 -58 38 -64 -104 -74 25 -76 -9 8 34 39 144 90 62 211 -55 92 -106 -55 -163 -71 27 -56
5539 -56 -85 -112 60 -20 -136 116 35 36 1 206 97 -38 -44 -49 -54 -2 -83 -124 -32 -30 13 -29 62 144 -50 -59 219 50 23
5568 23 33 40 -42 -12 13 -43 -155 -40 -32 41 -32 -57 -4 33 123 77 102 94 87 15 -49 -122 -112 -244 -86 -24 -60 -36 -21 37
5598 37 38 23 133 127 61 -21 84 20 -12 -59 5 -119 69 65 -147 20 119 54 30 44 135 69 3 81 94 -69 99 -41
5626 -41 -144 -11 -71 -46 -13 -144 44 -10 61 -17 104 33 54 128 43 135 -27 -66 -82 18 -101 -46 1 -22 -225 171
5652 171 79 -48 49 197 213 28 82 -9 68 -24 -16 -54 40 -37 -104 -145 -47 -109 -104 44 59 -25 83 113 62 39 -66 -58
5680 -58 -88 -209 -19 -110 -81 27 -101 11 -123 -24 85 53 153 158 -30 115 68 46 172 -82 -47 70 47 -47
5704 -47 49 59 34 -5 31 32 57 45 187 68 35 85 -18 -67 1 19 -125 -36 -105 -198 -44 0 -136 26 77 89 57
5731 57 64 156 -90 -152 -28 -84 -155 72 -15 -21 34 -9 52 34 -11 53 65 117 227 83 60 -78 -142 -16 43 -48 36 -50
5759 -50 -58 -65 -83 66 6 -4 75 147 -144 -68 52 176 -2 -30 -20 -37 -195 -153 -143 -19 -69 -42 108 81 5 83 -8
5786 -8 176 71 95 103 -3 -2 -169 -47 -163 -66 -191 -76 108 171 64 65 2 1 142 149 -36 -16 140 -102 -70 2
5812 2 -91 -19 -183 93 40 -57 119 96 -27 97 80 86 79 31 82 1 44 -23 -64 -87 17 -99 -86 62 3 4 142 22
5840 22 31 133 100 16 -46 9 -91 -153 41 8 71 -25 -8 60 108 -46 78 76 40 174 22 31 10 -76 45 27 -161
5867 -161 3 -126 -53 -35 -15 -51 1 41 116 62 -71 108 39 -8 -63 42 -101 -19 -5 22 -102 -27 -1 -2 104 87
5893 87 88 -1 174 55 144 -54 35 -35 -95 -103 3 -43 -177 31 -104 -56 -39 -32 21 -19 69 -88 130 -17 13 48 38
5920 38 -47 -34 -58 -74 55 4 -75 -128 101 29 34 89 26 18 -104 88 -26 31 156 -41 -130 32 3 -75 -5 6 22
5947 22 26 -62 125 -3 83 50 47 5 65 22 -15 78 23 53 1 -70 -166 -78 37 -32 -53 62 9 -31 28 -102 -2 27
5975 27 24 18 -176 -21 -60 1 -38 -55 -23 -31 57 66 -49 154 53 214 90 37 -89 -147 93 -131 -46 -144 32 30 81
6002 81 -111 28 31 33 -19 69 29 -109 -128 -100 -134 64 -74 -102 -110 -136 95 51 36 19 62 195 71 33 21 73 57 32
6030 32 -86 -103 -46 8 7 -79 -70 -14 71 72 61 14 174 69 118 80 28 -71 85 -33 -27 -67 -174 -7 -98 -144 -5 107
6058 107 5 113 5 -33 80 59 -74 3 -17 55 -18 4 -58 -167 11 -102 -106 3 59 17 47 -11 36 81 -58
6083 -58 126 46 -31 87 -77 -185 -38 41 -67 -89 -81 56 11 40 16 19 109 81 57 -9 -70 40 -9 -89 -103 -83 -46
6110 -46 -134 -61 117 6 90 87 149 59 112 -65 -3 -112 31 -30 -46 -13 -19 -99 107 73 67 -35 102 49 97 -22 97
6137 97 45 31 32 -18 -45 25 42 3 41 69 -82 -83 6 -40 -28 147 88 60 9 150 40 8 -96 -53 -159 -110 -88 -49
6165 -49 24 -49 79 -80 49 -14 -24 72 29 71 11 82 29 -13 101 -147 -22 -7 -17 -16 125 -34 72 150 166 117
6191 117 -34 35 68 113 -41 -60 -101 -78 -99 -66 -86 40 15 111 -47 93 125 158 1 -1 95 -93 38 -44 82 -26
6217 -26 18 -84 -10 108 -66 47 139 56 108 64 60 -10 41 39 -118 40 -40 -37 -147 -15 30 -104 -30 56 12 42 73
6244 73 106 52 40 -27 76 -61 -27 26 -12 -87 -186 -31 0 -42 -10 22 49 18 34 -26 -61 26 51 -11 -29 -46 -34 -27 -46
6273 -46 -87 46 -123 -77 12 55 29 41 11 8 51 53 170 -39 84 -16 138 -76 -133 -4 -51 42 -30 20 3 -79 -34
6300 -34 -17 -47 26 14 -108 -7 -61 -62 -102 10 -11 -37 41 96 -60 4 123 13 65 159 -26 79 51 -53 5 -77
6326 -77 -31 -16 13 129 -6 1 -26 57 -55 125 90 -52 52 156 119 18 33 -70 31 -36 -19 8 20 149 79
6351 79 -11 17 -43 -56 74 87 -21 15 0 -60 -51 -83 -34 -82 -37 6 25 -23 165 65 12 110 91 141 74 61 105 9 -13
6380 -13 -88 -22 -82 17 -15 8 96 18 -53 -1 -53 -106 101 111 135 62 -12 28 -38 -111 -39 -17 -88 -71 -95 -58 -58 12 56 31
6410 31 138 18 -49 12 1 -51 -83 15 -3 -52 82 -17 66 47 3 -22 -33 40 7 47 10 19 64 -29 -11 -48 48 -109 129
6439 129 -38 -22 87 8 80 78 -72 135 -105 -78 62 -11 -6 -113 28 -94 -27 50 -8 -52 62 61 -17 12 63 108
6465 108 63 63 42 -30 -8 147 16 -4 -23 31 26 -39 -62 -119 88 62 -3 108 72 35 111 148 -16 92 64 3 10 17 11
6494 11 -87 4 38 28 -87 35 82 -38 120 96 0 1 -102 57 -83 -14 14 -145 -62 12 -12 2 8 35 3 82 -57
6521 -57 80 -47 -81 32 -29 101 -60 -142 -59 83 -56 -43 -14 100 -5 -8 46 75 -14 27 -53 6 -21 -23 -16 -24 64 -45
6549 -45 -15 20 77 -5 104 79 36 83 -13 -33 170 112 6 -135 138 -84 -67 -57 114 40 28 74 -9 1 46 -6 18
6576 18 5 90 -2 -57 96 23 -36 -112 -18 -101 9 -10 -55 26 29 52 -21 -21 12 -74 60 105 -51 -28 26 -15 -24 -5 13 58
6606 58 -24 59 16 -19 -8 -10 -28 73 -47 2 3 -14 -50 -71 14 -10 62 42 14 168 12 37 4 27 13 -2 -10 110 -57
6635 -57 -112 -50 -8 -43 -84 -72 -78 -26 -102 -14 -89 84 125 -61 -40 82 -40 -108 -29 -107 -36 -136 -63 -6 -31 129 -19
6662 -19 56 28 42 -76 -46 173 24 -37 -78 118 109 80 -52 -92 -107 -13 26 50 42 -53 198 -5 -4 -45 47 121 -28 -19
6690 -19 -49 -79 -12 -105 -79 -94 76 21 106 109 80 123 -21 61 151 136 -61 17 -38 61 -33 -85 -48 68 13 -87 -56 -83
6718 -83 20 92 -28 53 52 10 -16 -2 -145 42 34 -114 30 61 -5 -31 20 82 52 103 -35 31 -119 -42 -68 57 152
6745 152 139 -124 -128 84 -23 112 -159 -12 37 21 -13 87 51 6 103 -7 -114 -31 -76 94 78 -3 72 -61 -102
6770 -102 11 184 23 38 48 -45 -56 -78 31 -108 -1 -64 -22 14 -26 20 -97 -108 -28 -32 118 19 46 7 -91 54
6796 54 -1 -26 136 71 79 -34 -28 -13 -82 -12 -122 -125 15 41 -3 65 -33 89 -76 -33 86 -85 31 27 11 -13 -40 -68
6824 -68 -27 0 -16 32 22 103 -63 2 -86 -64 54 -3 6 -49 -1 -64 -38 63 59 2 46 -62 3 121 0 33 50 38
6852 38 -8 -11 0 -32 8 27 -5 45 60 82 51 23 -45 88 84 7 96 -55 31 5 -28 10 9 -76 17 -29 -61 21 142 16
6882 16 38 -6 -5 -95 17 0 46 0 -1 -17 32 -55 -149 48 -79 -12 -34 98 46 2 -24 -36 9 90 18 -109 -45 -113 33
6911 33 -15 -88 -37 -31 -46 8 20 -12 -49 -63 70 4 31 129 -79 -108 -41 -50 -63 -124 49 -1 -138 -19 73 109 5 -16
6939 -16 3 71 -81 -30 -89 -19 37 31 -6 -15 -24 -49 182 62 39 16 86 69 52 47 -23 65 -10 -30 -119 -66 11 -77 -34 -101 -54
6970 -54 -160 10 -41 -7 -7 -80 -36 -110 83 124 -54 -96 15 147 -27 -71 -12 -28 25 -89 15 32 -46 84 -85
6995 -85 3 45 -31 5 7 3 -90 -84 -23 22 -35 -22 -17 31 8 60 123 -19 -36 -39 -73 38 -32 -11 -82 -82 -8 -16 5 43 4 -2 -85
7028 -85 -96 63 131 160 83 38 33 204 82 1 41 -43 -110 -34 -124 19 -43 54 63 -13 151 -2 49 24 -102 59 -55
7055 -55 -101 -116 -79 37 32 -5 -26 -77 124 46 64 168 52 7 36 218 68 -67 62 -14 3 -162 77 15 -67 -96
7081 -96 15 78 80 -32 -2 43 48 -14 -23 31 -22 46 -78 54 32 81 -99 -53 -8 18 69 -4 -12 -36 52 31 -29 -27 59 -48
7111 -48 -136 -25 -193 -77 -76 -17 20 88 84 32 0 126 40 15 38 -28 -85 38 133 80 -24 5 -59 -50 -28 22 19 132 -25
7140 -25 -12 25 106 68 -87 -19 -72 10 79 -66 42 -64 -17 30 114 55 33 -15 114 -17 12 -4 -117 -57 13 -21 -42
7167 -42 -39 -74 -89 13 -19 -26 -3 96 10 217 82 -3 93 42 19 40 -42 -15 -42 37 -65 -85 96 9 184 49 60 -31
7195 -31 -19 114 44 24 86 -101 -88 -24 52 -89 34 -10 48 -2 139 -34 -32 91 114 11 -44 -19 62 -99 24 8
7221 8 -153 53 25 -45 50 71 -34 -22 -73 151 200 30 -13 -3 -13 -2 3 -52 63 14 65 -18 -103 -99 43 87 11 37
7249 37 191 -51 145 -111 16 15 -98 -90 -71 56 -103 -168 -20 0 47 -19 70 45 0 23 140 -45 93 89 -3 36
7275 36 -68 -5 -185 49 15 38 -38 -1 -40 65 133 50 -60 126 19 -57 -72 -42 14 -35 -33 22 -81 73 -56 72
7301 72 -29 67 120 24 58 41 -9 -30 -56 -8 19 -47 41 -79 -94 93 -72 -133 -30 -66 22 30 148 130 41 43 51 -62
7329 -62 106 -29 -18 -74 -70 -83 -13 51 19 -114 72 10 79 46 56 -5 42 84 -32 0 -22 -102 16 76 9 -1 -36 54
7357 54 71 38 43 -10 15 91 -10 9 -81 55 -42 -45 -87 30 -81 107 82 6 85 96 117 166 85 134 78 80 -49 -12 10
7386 10 -170 -17 -39 -60 100 -62 29 -119 106 -1 66 -97 47 91 -66 -125 31 84 42 -91 61 -39 -84
7409 -84 6 16 -21 -41 -35 14 -29 35 97 -52 68 23 -39 112 -111 38 36 -59 48 60 8 40 7 116 55 -27 -51 5
7437 5 -27 -23 -27 -106 -25 -132 -100 16 39 -3 -28 -65 99 97 59 63 14 96 -75 -11 37 -103 -16 46 -3 14 40 32 -25 84
7467 84 -56 -74 59 44 143 9 215 30 -37 -16 11 -37 43 -42 -100 -40 -108 149 11 128 -2 56 42 69 93 34
7493 34 -48 -62 -271 -84 -28 -166 -123 15 52 -28 -3 58 -49 68 75 -56 69 71 47 -64 -6 30 -39 -11 79 -8 51
7520 51 93 25 -43 158 58 64 173 97 4 52 -61 -45 -42 -75 -36 -87 6 27 90 38 72 -15 81 146 -5 30 38 -126 -49
7549 -49 13 -35 -35 -149 -37 19 -68 -11 12 61 15 107 7 26 -66 99 1 -38 40 10 -68 -73 -84 -70 -95 44 -22 8 5
7578 5 -5 131 13 35 133 65 60 20 -39 89 78 -9 -4 -32 -27 -18 4 -137 -4 107 35 105 68 19 109 -89 82 -79
7606 -79 -71 -8 -93 46 -64 14 -8 100 51 72 57 89 99 13 60 -33 -48 21 56 -80 -34 -132 136 -13 68 87 -18
7633 -18 27 73 61 31 92 -48 -50 49 -67 -163 38 -48 -111 -126 -9 -26 74 1 36 68 -14 29 42 121 61 -55 -78 34
7661 34 -151 11 -101 60 93 -52 -36 9 117 -5 18 8 41 40 -97 81 -104 -39 -138 -96 -47 -37 -18 13 -72 -57
7687 -57 108 168 9 -6 146 70 28 18 -213 -45 -27 16 -185 54 -17 -98 21 -60 26 -68 89 -2 57 31 -41 -52
7713 -52 -9 -60 75 2 -25 36 14 17 -56 78 27 53 109 6 -11 96 55 72 -65 64 32 10 -89 -93 -86 -5 24 -40 -9
7742 -9 -9 109 49 88 116 55 33 53 -63 -29 -43 -56 -6 23 -138 40 -19 -59 -36 -19 106 96 165 61 62 -64 -44 13
7770 13 -22 -28 -81 -55 49 -105 63 25 211 32 129 162 -22 -116 -44 7 38 -38 -13 -119 -21 -36 -128 -28 -16 61 73
7797 73 58 55 11 146 164 83 -25 107 -74 -17 41 -74 -41 18 23 -68 -94 22 108 89 97 107 48 76 56 -20 -82 -33 -36
7826 -36 -123 -77 -67 9 -11 -1 -73 102 -5 76 -37 62 -6 -62 85 3 -89 -70 41 -112 -183 7 -104 -3 -76 60
7852 60 -51 89 77 28 152 -12 -10 29 -43 -13 64 13 -44 2 26 -10 -137 -27 -33 34 76 167 34 54 41 43 43 -110
7880 -110 39 -51 -60 -84 14 -161 6 19 23 9 16 179 0 43 7 12 5 -117 7 16 -21 -56 40 -28 -99 -55 35 50 34
7909 34 138 95 113 -55 -49 53 -39 -117 -111 -103 -36 -22 -26 -7 -51 33 85 13 133 90 100 20 55 10 -24 -29 49 -21 25 -82
7939 -82 -103 -34 -9 37 -14 101 86 31 133 101 93 88 -49 -52 -65 -20 -10 -15 -6 82 -200 -6 88 106 64 5 30 28 -82 55
7969 55 49 -48 40 -25 -50 29 42 102 -88 -1 54 47 51 8 -1 25 59 113 40 16 0 65 -123 -60 -45 84 -46 -61 67 46
7999 46 5 -12 -59 91 30 -66 90 52 -24 25 -88 7 67 -88 32 -20 -4 -86 -5 169 129 13 -32 59 23 -26 97
8026 97 21 84 162 -88 -35 -140 -48 -55 108 -35 13 104 172 63 14 139 194 26 53 7 -65 -105 63 -86 107 -1
8052 -1 37 1 134 113 6 -36 177 116 -62 -39 -45 -40 58 -5 -72 -114 -39 -80 -48 6 -102 73 72 163 70 10 91 59 -35
8081 -35 10 -34 -90 -121 -57 -107 -17 -6 37 106 98 41 125 130 27 -64 -3 97 23 -71 20 0 -145 -36 -54 84 178 73
8109 73 16 91 162 86 40 34 142 66 -56 36 45 -2 -73 93 21 -23 1 10 102 40 -7 6 -4 31 -63 -32 -58 18 52 26
8139 26 -102 -174 26 -73 -53 -12 27 39 44 61 70 29 167 -64 -61 105 -15 -88 -52 -44 37 99 -58 21 69 150 9 77
8167 77 32 -6 86 6 104 -75 -69 -52 -84 -93 38 -36 -76 -51 44 26 22 34 72 88 57 48 142 107 20 1 14 -31 102 -7
8197 -7 -92 40 -86 60 60 35 2 52 123 -26 99 -49 67 -46 35 -95 -67 -61 -6 -59 -28 123 31 2 153 117
8223 117 17 -6 2 -30 -4 -2 -38 -118 -63 -48 -60 -133 -70 -36 -63 13 85 38 35 148 40 -59 40 63 -152 -68 7 -140 -25
8252 -25 -57 -82 -3 101 29 105 35 57 173 4 187 83 -15 -14 -90 -23 -23 -40 26 40 61 -18 66 77 41 125 67 148 85
8281 85 15 90 7 -160 -86 -93 9 28 -13 -56 63 159 59 172 21 65 39 91 41 32 -71 -158 -68 -55 13 -107 -42
8308 -42 32 -23 -3 89 44 -34 65 120 15 18 -24 11 -101 -72 -65 69 -9 -108 -31 -53 133 -62 -6 176 76 49 37 122
8336 122 -78 16 17 26 19 -128 -70 -16 -10 30 5 -123 103 94 90 -20 72 39 28 0 25 -38 6 61 22 9 9 -198 -50 65
8366 65 53 8 127 8 -64 -44 13 45 -1 64 -131 65 -6 -68 -8 -53 -28 -73 -32 49 141 139 77 103 59 21 35 26 -11
8395 -11 -29 -99 -108 -40 -31 20 -24 -52 75 -87 96 101 85 -21 85 -42 8 49 -134 -67 -31 -128 -151 -58 57 -48 68
8422 68 -4 138 139 -2 170 -60 82 80 -7 -156 23 -82 -192 5 -118 -26 -58 -35 -40 117 47 -13 -35 99 -31
8447 -31 -16 -128 -55 -49 -120 -37 -157 -45 18 41 50 -77 147 125 -24 170 118 64 42 -46 29 -49 -26 -87 -91 55 -3 -20
8475 -20 -41 32 106 53 62 74 76 66 -16 -70 58 -56 -64 -123 8 -45 -90 49 72 88 -14 -43 65 183 37 -47 5 57
8503 57 66 -40 54 -27 -78 -98 -69 -18 -10 102 -4 48 -71 71 0 -9 44 92 -29 30 105 -226 -109 -153 -108 33 128
8530 128 81 74 40 110 51 55 17 149 196 45 20 -21 -31 -47 42 13 -4 62 42 73 -6 27 -61 33 58 37 71 -72 20
8559 20 -10 -64 -136 -12 19 -88 -70 67 -7 -57 43 99 110 75 -81 67 29 85 26 -59 39 59 27 -98 56 17
8585 17 -91 61 -86 -23 169 30 -31 -8 -59 -93 17 30 -178 -141 -24 -37 -34 7 -5 -87 -10 -32 34 95 77 -25
8611 -25 -16 15 -55 46 85 -84 -80 -79 -21 -127 -76 90 104 89 79 152 27 101 -11 9 -11 95 30 -26 -144 -31 -8
8638 -8 -30 135 43 22 32 66 -25 59 217 36 5 3 -77 -49 -85 12 -74 50 -171 -42 -3 -19 -31 122 32 43 40 36 103
8667 103 107 -11 -190 -5 -59 91 -66 -82 -27 -11 45 -44 163 -55 -45 62 -7 -71 70 67 -8 -104 33 66 -152
8692 -152 -101 75 -6 -60 43 84 15 46 160 30 145 -24 1 -8 -78 21 -102 -45 74 -51 -41 79 -21 -62 83
8717 83 40 92 63 69 -11 -2 -84 -53 5 -104 -59 -123 -131 -33 -18 19 -106 -13 6 57 -2 16 165 -25 65 26 -6 -160 -3
8746 -3 21 57 -14 8 -92 -47 -11 102 195 73 -2 20 -25 162 -18 5 -27 -55 -34 -1 12 8 -82 44 150 50 129
8773 129 100 137 77 116 -10 -42 8 -76 -102 -57 69 -23 -6 110 136 11 4 4 51 46 71 98 -82 11 -89 -66 59 -9
8801 -9 -87 37 -33 -140 -38 1 44 -42 57 58 117 -15 126 -28 54 -42 -47 -50 -23 -19 -86 70 65 165 19 157 10 -49
8829 -49 81 -39 -3 -112 -82 -86 -32 -58 -95 -32 -22 -42 60 -36 68 -2 44 39 -7 -61 75 -4 -44 94 -17 65 -39
8856 -39 6 39 -71 49 45 -21 -22 20 76 46 -17 0 135 -79 -26 -54 57 -134 34 -51 -101 95 59 57 82 39 54 -14
8884 -14 106 35 -34 -20 -78 -71 -12 -153 -52 0 -52 -134 -84 -26 -63 -2 -20 24 27 166 49 51 52 -19 0 -38 -54 -16 -118
8913 -118 -11 124 -8 58 19 80 -103 23 146 107 69 -30 94 30 25 -58 65 -1 -60 -42 -88 -51 84 8 42 24
8939 24 -14 -16 -75 -60 3 -16 -78 -77 15 -45 -10 40 37 26 18 69 22 62 104 17 73 183 65 31 31 -7 -53 -49 -2 16 -50 24
8971 24 95 1 -80 -28 90 1 73 -78 -18 -75 -54 -101 -59 -2 -20 -81 -5 16 -26 46 138 -7 -6 111 17 55 60 9 -50
9000 -50 -69 -16 -78 -69 36 -91 -81 -19 -108 -11 78 52 74 51 28 58 -79 -12 -111 -115 5 -111 -68 -71 140 -18 12 -40
9028 -40 91 130 52 -34 48 -43 -13 -141 -8 -107 -28 -29 -34 -33 54 36 -30 45 -38 -25 23 76 25 -7 77 8 -109 -93 -71 -34
9058 -34 -47 -47 22 -35 -51 -56 -9 -72 -34 0 13 12 61 22 -84 -34 58 -125 -24 -101 -68 -35 -84 133 -37 116 68 148 80
9087 80 82 107 -45 -122 -105 50 -50 -86 -88 -114 -19 -77 -103 116 29 46 76 41 -46 76 44 25 39 69 7 -80 -83 85 -177
9116 -177 -56 38 -62 46 155 91 27 40 92 79 30 60 -104 -73 -87 125 -10 -19 -63 -86 -29 -10 -72 -3 48 111 -17
9143 -17 6 -59 55 -21 -2 -53 -158 -75 -64 62 52 -67 36 -20 210 22 9 132 84 12 -104 28 -51 21 -80
9168 -80 -17 -56 28 -12 -82 21 74 119 -40 65 48 -50 -61 62 -57 -89 -11 -58 -17 -77 -70 37 29 10 0 92 144 108
9196 108 -25 16 70 -31 -83 -22 21 50 -91 -61 -67 -129 -80 -24 95 -2 33 9 25 28 40 -29 55 -76 -89 87 -85
9223 -85 -67 47 -243 -95 -27 105 -58 77 131 141 -12 -37 146 26 -84 -161 45 -49 -11 42 10 -46 21 -86
9247 -86 64 28 -53 21 15 82 91 58 -74 -36 -192 31 -201 -40 -122 43 -83 32 10 -35 59 35 46 -39 57 -7 198
9274 198 -23 -96 -20 -76 7 -18 21 61 2 54 91 40 -46 -40 86 40 154 -2 -80 -31 160 -55 -54 59 -20 37 79
9301 79 -3 56 4 60 -100 8 74 10 -39 -22 -134 -79 -36 -80 -78 74 9 82 51 21 20 106 -11 -48 102 -22 70 -52
9329 -52 -35 -16 122 -62 -27 71 75 -12 20 30 29 92 -31 49 15 54 73 -125 -143 27 -63 -83 19 -75 1 63 -84 68
9357 68 58 142 134 74 39 86 -9 84 -27 -157 39 -82 1 -52 -40 -115 -5 53 102 105 33 -35 10 -10 8 -6 67 19 119
9386 119 32 -50 -73 -29 -15 138 -8 37 -62 -139 55 -35 1 64 29 16 -40 74 13 35 -24 -42 -18 -50 -53 56 -90
9413 -90 -24 31 -31 119 8 170 -58 10 10 -101 -39 35 -76 -7 -78 -77 -104 26 35 2 29 50 76 -9 30 105 53 17
9441 17 31 -74 -77 -29 -54 -8 -76 42 -1 60 116 68 -59 -70 32 -61 -151 -17 -138 -49 -31 -145 -46 -111 68 -66
9467 -66 54 107 -82 -182 173 -13 15 82 -180 -5 -102 -1 -41 -75 35 117 74 8 83 35 11 49 -26 11 12 -13
9493 -13 -9 -163 -27 -12 -98 -15 -110 -118 22 46 -75 -32 101 55 101 70 79 -18 -50 -34 -1 29 23 -98 -7 -63 45 -12 -140
9522 -140 -28 79 -60 -169 -113 -14 -8 -2 -153 -44 43 12 4 -116 -155 -34 152 79 -18 121 66 -11 51 -4 -2 -22 -48
9549 -48 -10 125 10 17 -68 88 2 -49 -54 -113 -35 2 23 -52 -42 -71 -45 -18 33 5 -73 -13 -56 16 -66 -29 -79 14 -33 127
9579 127 -88 -45 10 25 -35 37 26 -5 -103 -96 -51 -137 78 -28 50 -18 -23 32 17 113 -14 60 45 -18 33 -80 -18 -60
9607 -60 -78 -55 -86 27 -86 -55 -34 -88 99 53 -128 20 4 -7 -23 48 -79 -75 9 -138 -75 22 75 -19 60 67 -16 -58
9635 -58 56 117 5 67 -87 28 11 6 18 4 -111 4 -7 -88 17 -72 31 49 47 9 17 52 -83 -3 76 -42 -93
9662 -93 -24 1 -48 -45 -91 68 -45 -35 59 35 -18 85 8 40 48 26 -58 31 52 35 -71 6 -54 -55 26 8 45 104 -81
9691 -81 -44 23 28 -44 -37 -29 -101 -74 -148 -25 102 -36 -21 -152 36 -49 -112 -51 -68 88 25 128 37 -12 -39 36 114 82
9719 82 15 -109 -37 51 31 119 84 3 -22 138 65 6 -33 -4 -12 -19 -55 -105 -35 50 0 -2 57 55 -92 5 -4 -27 21 -3 -17
9750 -17 -39 79 -58 36 36 13 -53 -169 1 -64 8 -40 50 73 104 1 157 23 35 73 -54 6 -80 23 -11 -24
9776 -24 37 0 -14 33 17 16 137 -6 -108 47 18 80 79 -79 -60 9 -40 -4 24 75 20 10 -11 76 -53 119 -15
9803 -15 -8 16 -45 110 -66 -82 98 -81 54 17 -157 -101 124 36 -41 76 120 74 -49 31 110 -45 0 -64 -61 -17
9829 -17 -153 46 42 45 -32 -5 -39 45 -86 -39 -58 -44 26 24 10 33 -23 -91 10 -70 10 63 -73 -57 62 -5 80 192
9857 192 53 -17 9 31 -98 -5 13 -57 -127 30 -76 -31 -106 -13 -14 105 64 -128 -33 -36 -125 -66 82 76 -126 -80 -33
9884 -33 -12 60 -10 62 7 -29 -11 116 -17 -11 -87 -40 116 -115 -50 -33 -23 -54 -44 61 -64 58 -2 -11 3 21 148
9911 148 -45 -72 72 -40 -19 -44 -32 -65 -17 -48 71 17 95 -1 71 -35 29 26 79 37 -42 56 -37 13 -113 74 85
9938 85 -67 5 -17 -10 59 -11 49 -63 89 43 96 -46 65 -117 51 82 -17 -137 -46 -66 -9 -59 38 68 7 42 -18
9965 -18 27 -49 11 -122 42 -62 45 -59 -12 -74 -26 -71 -50 37 24 58 3 96 -29 -49 70 -17 27 130 -55 0
9991 0 -69 -59 -184 -44 12 9 -17 -41 -36 -23 78 -88 18 2 30 -8 91 -86 61 -97 -98 -58 -136 15 -11 -12 49 9
10019 9 61 -81 -9 84 -48 -96 25 41 -24 -115 -22 -73 -45 -21 -34 -40 167 101 94 61 -26 -71 -45 -46 54 -18 -55 33 -50
10048 -50 -24 -118 -30 -17 -103 -45 -80 50 47 -50 -34 68 162 -100 76 12 -44 91 -109 -62 25 -136 -6 140 48 98
10074 98 92 -16 18 -19 -5 -27 18 60 -76 -56 -73 -81 -31 22 1 1 22 83 73 101 45 60 29 95 46 27 -71 -3 -104 -20
10104 -20 -225 -34 99 -43 -82 53 50 115 -118 59 56 -24 19 74 -12 -12 27 -47 6 -30 30 -156 154 91 43 115 62
10131 62 75 -57 56 21 -123 94 43 -55 -99 59 -17 -48 -39 23 97 86 38 -66 57 148 105 -2 87 84 24 -89
10157 -89 -24 -1 15 -35 74 19 -67 2 97 -38 56 -46 19 117 104 -84 -36 -84 -41 -79 -29 -38 -45 43 74 -6 53 80 105
10186 105 112 43 -14 -69 30 -8 -66 79 -7 13 9 -17 8 -50 -46 -7 33 19 -17 6 109 -22 -48 -17 -20 30 -60 -66 84 1
10216 1 45 53 112 -15 74 64 96 28 -23 -4 -14 16 4 -97 20 -1 -41 -30 -20 -85 43 84 23 -59 10 -17 73 12 -16
10245 -16 3 -48 -24 -15 -42 -8 -13 -23 92 17 46 29 134 60 -110 68 85 -68 -42 -38 19 75 -140 11 27 74 25 -49
10273 -49 16 7 71 -22 82 -36 -32 -106 30 -44 6 -46 19 -49 -45 -97 -48 0 -53 59 15 23 20 21 78 -35 -17 136 17
10302 17 -55 20 -11 -52 -112 -81 24 82 -71 24 -36 -51 24 -6 -79 26 -108 87 9 29 -14 -12 23 -49 -15 -33 43 -133
10330 -133 153 37 86 -33 16 -83 13 33 -21 10 -58 -173 -80 3 -72 -25 -41 187 -56 20 -33 146 34 55 49 43
10356 43 -4 -24 82 -41 -71 78 -48 -32 68 157 27 -21 112 -27 70 -43 -2 -9 -59 -193 38 -23 4 -71 -87
10381 -87 -29 85 71 -1 -92 -52 198 -10 3 44 -20 -25 20 1 88 4 -69 36 -6 18 -42 -11 118 61 1 86 24 -7
10409 -7 -25 -122 -120 -43 -154 -2 -20 -148 -7 -72 18 31 200 97 17 -53 -31 70 28 3 -19 -58 -114 58 -24 119
10435 119 -26 153 15 39 36 73 -9 41 102 120 45 -85 5 -35 22 -26 -13 1 -11 50 -53 22 65 -17 8 143 49
10462 49 71 -24 -24 163 -44 110 109 -36 -165 -148 1 -119 55 43 77 168 25 78 79 -40 2 -34 -59 59 -40 -8
10488 -8 -51 14 8 46 117 77 52 66 134 69 40 13 -41 61 86 -24 -93 11 -140 22 -3 -10 -61 -4 89 93 5 -81 11
10517 11 -24 120 -109 -31 -101 99 -82 7 -43 6 -169 67 58 -49 55 0 -26 44 -44 25 41 49 -29 -61 -3 -96 -141
10544 -141 -89 -70 34 0 30 42 106 56 24 -34 -66 5 64 -56 -115 -40 9 80 -45 27 -23 -39 48 34 153 109 88
10571 88 153 50 77 20 -40 -105 -74 -50 -135 -46 -157 -147 -31 83 40 42 27 110 164 153 87 43 24 -11 168 -2 -2 88
10599 88 -49 -10 -63 6 110 19 32 -2 66 96 30 -36 71 -128 -73 -110 -129 -121 -15 62 51 22 11 41 -41 59 85
10626 85 -69 67 32 -28 11 -107 -28 -59 -43 -94 -36 25 71 -88 -31 98 -18 7 129 38 57 -119 38 -54 -43
10651 -43 -125 -158 -5 -122 -50 -47 57 -47 67 31 -95 59 -57 -74 -90 -11 -23 -38 -41 -79 42 23 -81 -6 -50 0
10677 0 59 103 102 15 25 -24 -44 73 18 1 94 -84 -16 22 -75 -62 -33 -7 19 7 -103 91 142 -39 3 -10 -14 89
10705 89 -23 -32 -53 -16 25 57 42 38 137 -62 15 26 13 -2 -40 29 -25 10 -39 -99 44 26 -81 -44 -56 -73 177 48
10733 48 31 0 57 73 -47 78 -31 23 38 -20 -8 -76 -87 -17 -95 2 -15 12 45 2 65 -26 124 51 0 78 -104
10760 -104 -115 -128 -116 -101 -207 -58 20 -1 -36 -108 -14 174 184 -24 64 60 20 122 21 -73 -5 32 15 10 -120 -7
10786 -7 99 -116 115 11 28 -15 106 42 -64 -57 -91 23 -121 -134 -55 54 -125 -155 24 -5 -64 -65 -58 23 111 -11
10812 -11 -101 47 -106 -6 -44 -141 -42 54 65 -43 -17 84 49 77 0 9 46 90 -7 -35 23 -17 -2 -45 -89 -87 -44 24
10840 24 -86 153 42 -52 58 96 103 10 74 170 32 -8 68 -23 -143 -9 -108 -15 78 10 30 123 103 29 93 26 21
10867 21 33 3 -85 22 -2 111 -42 -65 -41 57 -29 8 133 -51 -51 86 141 -95 56 -55 95 45 5 -38 -68
10892 -68 -51 19 -94 42 37 112 149 184 -22 -45 104 -30 -7 -181 11 -43 69 -4 -78 74 -110 -103 27 -8 93
10917 93 -34 114 9 -57 119 -23 161 -30 89 78 -47 70 62 41 -36 104 -33 31 78 -7 78 105 53 -98
10941 -98 54 -6 -115 -145 -44 -9 -54 -28 -51 -20 -79 64 14 -34 0 -10 -31 78 14 -65 -22 -6 -65 -26 9 -32 3
10968 3 81 38 22 4 22 51 -82 56 31 27 101 -80 -14 -48 38 -36 149 -31 -76 19 -59 33 -42 18 121 -4 82
10995 82 -73 -51 1 -59 -113 10 66 39 -71 -171 8 46 25 -10 83 67 118 74 18 60 -118 -91 -69 31 69 5
11021 5 16 94 33 -138 79 33 66 107 54 -49 13 -40 4 -91 -54 23 -69 -33 -67 -19 -185 -35 25 66 6 -54 -53 74
11049 74 -29 6 83 -1 -65 -48 30 -32 -22 -102 7 69 -47 -29 33 45 111 200 185 78 85 -28 -8 35 10 -29 55 10
11077 10 -34 48 -77 76 25 16 104 -28 63 84 4 19 33 -102 37 -70 -119 -67 68 -78 -111 -27 37 162 81 56
11103 56 52 38 -27 13 81 28 -23 -76 -4 17 -154 14 10 101 10 29 56 47 -42 -27 126 5 -15 23 -42 18 -153 -81 -30
11132 -30 -26 -34 -3 -23 -36 9 35 101 -41 -77 -26 55 77 -28 57 -100 -89 -33 -101 -44 152 63 78 62 47 51 1 37 40 -17
11162 -17 144 103 -8 79 -70 -1 30 32 30 11 -122 -59 135 51 112 48 -33 23 -33 -3 39 -16 -32 -15 -21 67 9 87 125
11191 125 15 -54 -71 -7 37 35 18 -117 -76 56 -85 -23 154 -17 -65 28 -84 -59 -50 88 44 -53 64 29 -52 -26
11217 -26 30 6 35 -12 16 71 44 -65 6 74 22 75 -5 41 -51 122 -59 -55 -58 -65 -30 -63 -15 -39 101 -107 91 81
11245 81 88 79 -30 -42 53 36 -28 -9 -42 29 -99 137 -14 -102 23 -36 10 35 30 -34 75 27 -139 -44 -125 111 99
11272 99 -118 -83 -82 -67 -106 0 5 -17 -125 87 -13 36 55 -113 -54 132 -82 -88 81 -37 0 37 -28 -25 -74 46
11298 46 14 -5 -83 52 -3 64 59 79 -7 26 61 81 -152 -40 -171 -58 89 -129 -18 13 64 43 37 -13 52 62 50
11325 50 73 -67 -42 103 -121 -5 -91 -28 106 100 -30 -121 -8 43 -22 29 -10 86 118 75 -110 -2 65 -105 -2
11350 -2 -116 45 -82 80 -8 -64 -9 60 78 127 84 -15 12 88 43 -38 -12 -120 -102 -95 -44 -74 41 170 144 -53 20
11377 20 94 39 -13 69 -75 72 125 28 -34 50 50 6 -45 -3 -7 35 -62 63 130 117 133 0 88 -66 -130 -15 -92 -104
11405 -104 -47 -66 2 72 86 112 33 56 -64 95 -8 13 86 41 -54 27 9 -67 -32 0 150 -24 -15 -140 -13 -86
11431 -86 45 -43 -28 77 32 44 32 -61 -8 49 33 1 -67 -57 -32 -71 76 68 -49 -52 127 -13 -44 74 -24 -20 155
11458 155 -73 -39 35 90 -90 -32 10 -17 88 -74 -31 92 -191 -49 10 -67 95 -118 106 -162 22 -105 9
11481 9 -82 77 30 39 153 30 -101 -36 -70 33 -46 64 75 -42 -57 80 -44 86 106 -33 102 117 44 75 -1
11506 -1 76 97 -76 127 -101 30 -42 -25 44 58 68 45 -84 2 29 105 103 111 16 137 17 40 6 24 -169 -6 71
11533 71 33 -36 -140 84 67 -66 74 96 -10 -143 208 -28 26 65 27 109 -39 -61 39 -34 -3 13 1 57 89
11558 89 -117 -12 52 -19 -92 26 130 76 -16 -28 9 31 -73 -51 -167 -90 -16 -63 93 69 49 105 129 -19 39 -10
11584 -10 56 -111 0 42 -68 -73 25 -141 36 -8 90 86 14 82 -40 10 144 -30 -82 62 -35 24 48 54 -30 -51 49
11611 49 37 -48 18 9 -52 -155 -19 16 -54 -118 29 -79 62 -42 -40 -212 -185 76 41 25 75 4 36 44 -48 -14 -44
11638 -44 41 37 60 -73 -130 -11 17 10 -21 110 -31 57 25 12 59 94 -78 -7 32 48 12 -20 71 36 0 -178 -84 -27
11666 -27 -8 72 -3 206 -17 118 6 -23 28 -9 4 -44 -96 -66 -39 -1 49 97 35 53 39 20 168 -25 44 -21 -44
11693 -44 40 -58 -115 -46 -133 -13 -81 14 18 35 75 64 92 51 -25 -24 -5 -23 35 -29 -64 50 -75 -20 -55 -103 -123 -39 -79
11722 -79 119 -54 -56 38 -65 51 91 95 179 4 -12 -50 23 -55 -59 65 -82 0 -58 17 -2 51 -84 -67 -11 52 38
11749 38 -73 33 -37 -9 -39 37 115 -113 -76 -7 2 -31 13 -13 44 97 0 62 38 89 -21 -34 -70 -3 -40 15 -22 -23 -5
11778 -5 9 24 108 -61 144 35 -46 24 -11 57 20 -10 -61 12 -48 -64 -33 25 -51 -3 58 78 122 62 -42 -21 109 -31
11806 -31 8 -42 -119 -131 35 -30 -17 69 61 -30 -113 93 36 18 85 182 -71 -11 34 49 -14 -109 40 -78 -87 54 -124
11833 -124 52 178 -49 -32 28 -78 125 6 -51 20 51 -6 -105 65 -28 -48 -91 62 -31 -129 -11 89 110 49
11857 49 7 94 -63 -58 -13 -27 -95 85 -45 61 -16 88 -45 68 93 109 -15 156 -18 -3 30 29 43 188 -8
11882 -8 -6 96 16 12 -54 51 -28 69 53 87 -95 10 41 10 57 25 40 -52 32 78 106 40 25 15 3 27 -53 44 -21
11911 -21 46 -63 63 26 84 -30 70 37 -9 21 -44 32 -17 31 30 -20 3 121 99 -15 33 129 -52 54 -62 -61
11937 -61 31 -36 6 121 163 -9 -24 61 19 -8 124 25 25 54 39 -29 -61 90 0 -72 18 74 -12 -20 69 74 -19 59 67 76
11967 76 22 -10 67 32 -20 108 33 -36 49 -12 34 -17 -9 30 6 104 112 59 106 6 6 -1 94 46 -4 12 -45 -76 -96 -23 87
11998 87 51 199 91 32 70 71 21 95 -5 18 -55 0 -16 59 24 -18 44 -103 -58 78 -61 48 44 38 -120 31 24
12025 24 -19 62 74 69 -152 -14 -75 -19 -71 53 -15 69 -82 137 30 26 169 11 27 -16 7 -92 -122 -42 1 93 47
12052 47 50 136 43 9 -2 -64 -40 12 13 53 -91 -39 -50 39 -117 10 -67 -10 -50 -7 72 131 72 1 -2 -10 43 99 -145 -87
12082 -87 15 -12 1 -6 -31 57 -12 -104 -26 64 231 -13 -7 -25 156 12 33 22 68 57 -87 62 -63 55 17 14 95
12109 95 -23 61 29 38 9 36 -110 -75 2 36 -50 -20 0 -5 34 -1 9 77 85 47 21 52 37 64 -11 -3 -34 107 46 18
12139 18 -59 -53 -84 -26 4 -11 79 -45 92 2 57 75 88 4 -144 83 -17 58 82 -74 41 16 54 -11 -40 -21 50
12166 50 127 -27 77 38 84 -8 12 238 65 -1 4 -34 61 79 47 54 66 81 60 96 18 -150 38 11 -109 -111 71
12193 71 9 97 -158 -62 6 11 66 62 -77 -47 44 104 48 -59 -41 -22 -46 -82 -59 -34 4 -78 32 25 30 1 -40 54 84 29
12223 29 53 124 73 -16 4 40 24 19 49 -13 -57 -49 -35 66 22 169 -35 175 66 -13 -67 -8 19 -77 66 106 116 -4
12251 -4 -39 -5 30 112 132 126 -58 42 -35 18 -123 103 11 11 51 55 28 -76 16 -68 94 80 25 83 41 72 109 36 -19
12280 -19 -75 14 77 -82 -40 94 -39 32 111 -14 -33 -51 64 121 -26 -50 88 70 42 -22 -91 -21 11 144 37
12305 37 -31 57 38 -8 28 -58 9 1 72 -28 -162 7 92 -106 93 39 -40 -60 9 -114 -45 -31 -16 -87 -40 45 46 151
12333 151 -56 46 18 40 6 2 47 -84 49 54 24 1 7 76 41 4 -50 -34 74 -71 97 17 10 13 -117 93 91 -88
12361 -88 97 79 -4 43 55 67 -31 143 -106 -48 -28 -5 -67 -15 95 21 -82 -17 98 -21 29 29 96 55 26 34 -94
12388 -94 65 160 35 -4 9 -12 -39 106 50 -55 -6 27 -62 -17 72 62 -50 6 14 -65 -75 142 18 7 95 25 -38
12415 -38 -113 21 -16 46 -95 8 -5 31 21 -37 13 24 -22 -33 -67 19 53 -26 25 61 13 -92 -1 -128 -56 70 42
12442 42 -3 124 -46 -27 44 59 -24 21 -37 -4 -61 -92 -14 122 -56 -39 -65 63 78 19 -15 -53 -93 -125 67 -86
12468 -86 -188 -8 -27 -50 -92 -66 -2 21 81 5 16 56 50 -84 -76 -91 15 -151 -79 -19 -56 4 -129 52 -114 36
12494 36 31 115 113 -20 -104 89 -63 -52 101 66 -78 11 67 60 106 8 -22 85 -10 -11 58 18 -9 16 -69 25 -31 -49 -47
12523 -47 -114 96 47 -113 60 13 -33 -19 53 132 4 28 48 57 -39 -68 -58 -79 -49 -47 63 13 -116 36 -40 32 -12
12550 -12 23 52 45 -24 -60 -45 167 89 -53 68 39 68 -30 -34 -16 -15 -58 50 86 22 -11 -2 -37 19 -41 -70 18 4 45 -22
12580 -22 152 1 -74 190 31 4 65 74 -2 126 -11 0 58 -19 -63 -46 -15 40 -51 -111 117 -58 153 -4 -3 -25
12606 -25 13 -23 -34 87 18 -5 -63 12 46 -1 -34 49 47 -134 19 78 28 77 -40 48 12 125 -27 -46 -55 -25 -30 -27 18
12635 18 48 20 38 214 -31 44 -36 29 18 66 -41 -4 54 30 43 65 -10 -49 -57 116 25 -150 29 108 61 -3 -57
12662 -57 -73 22 25 -106 13 40 -56 26 -6 -77 30 -3 -26 -13 -19 45 -42 -4 -93 -28 98 11 -75 -8 -76 -101 34 20
12690 20 -62 75 39 106 92 -33 92 -100 -28 82 37 79 18 132 73 -49 42 10 -55 81 67 -61 -75 -31 104
12715 104 -58 -48 91 32 -14 8 47 49 71 47 -2 -15 15 20 8 -18 57 -58 95 91 113 11 28 -12 -25 16 150 -15
12743 -15 -42 25 22 32 -143 -41 44 148 34 8 54 62 -19 -8 11 -116 -19 13 30 -74 -6 -6 -101 -75 18 -83 -31 38
12771 38 -3 12 -40 83 -117 72 28 6 -10 1 133 12 93 13 -1 73 -93 44 -43 1 -51 -80 -50 -32 -37 12 -43
12798 -43 116 2 -67 12 -1 84 70 -30 42 57 49 -7 83 -31 -86 -124 94 -106 5 67 -32 -37 22 61 -6 -13 -12 59
12826 59 -14 13 75 -52 51 -11 5 110 5 -24 -56 86 42 46 24 75 15 -30 75 23 32 119 -8 -5 -79 -44 15 -122
12854 -122 -88 21 7 -11 -64 37 -111 48 12 119 35 12 31 33 -108 25 -83 80 -31 32 20 52 68 79 80
12879 80 78 71 -6 10 68 60 67 45 -34 -23 -5 -34 -176 -84 -44 -11 88 1 3 67 12 -10 -36 24 23 -41 23 -61 1 -54 28 -129
12911 -129 56 -43 34 -11 -96 -57 55 40 -52 65 17 -69 107 111 -32 147 61 -17 47 -40 50 -5 113 2 -31 67
12937 67 74 51 -20 54 -7 -41 -49 -106 -59 71 -64 80 90 -72 74 -33 104 5 -11 190 142 -65 71 -20 -129
12962 -129 -35 -74 -28 -35 76 35 -9 -55 10 33 17 -106 55 49 -38 47 117 -26 -35 -21 -23 -79 29 -72 140 -57 12
12989 12 42 91 169 241 -98 135 75 -13 77 70 -31 -36 -14 -45 -86 -49 -57 -17 17 24 199 78 -41 50 -152 69 8 -60
13017 -60 -26 -66 -5 -13 -17 26 35 91 10 62 13 0 52 112 74 30 58 14 76 -6 26 -16 -70 35 -81 2 49 0 -79 10
13047 10 -75 -43 36 -7 127 -66 -44 11 -92 -22 -131 -14 -25 -79 -42 9 -8 72 -8 7 -7 123 -44 -75 35 -39
13073 -39 74 16 99 -51 -35 -94 -108 8 55 57 56 -13 -63 80 42 75 118 -29 1 21 32 -72 75 -53 -11 -71 29
13100 29 -11 -47 146 110 9 59 150 -31 -47 -48 -5 -53 50 88 45 65 -31 -63 12 -12 -15 10 -11 54 190 42 -24 43
13128 43 -73 -23 56 12 79 1 110 10 -88 -8 -78 -71 52 55 5 -48 32 -45 -15 34 -113 -20 -57 27 72 52 -23 -45
13156 -45 7 -134 9 54 -23 27 28 -1 50 -2 34 -176 -44 26 59 -18 160 15 62 -22 131 64 -46 -16 74 -105
13182 -105 -45 160 -44 46 16 -67 70 75 19 -22 50 107 -25 -9 85 -56 -68 -123 -24 39 13 24 -68 -68 -47 -43 4 -39
13210 -39 -11 -10 -46 21 -41 98 -30 -6 -4 54 47 53 -8 111 89 85 63 -63 55 39 -49 -45 114 -45 -5 162 -45 51
13238 51 26 9 -2 -78 49 38 102 18 11 51 136 121 4 0 -81 -9 35 -62 65 -109 -19 6 27 -59 -13 54 22 23 3
13267 3 45 99 62 16 134 60 -45 44 -84 49 -15 147 53 58 -38 -16 -6 85 103 49 -11 -58 -58 -85 -23 -70 25 -75
13295 -75 -76 -97 45 -7 -9 14 -148 -7 -20 47 -47 38 48 25 -22 -27 3 72 41 94 -2 105 28 7 -170 87 -18 -53
13323 -53 -82 13 90 16 -13 62 34 -26 -27 -4 51 0 -31 52 -20 70 139 -4 -88 30 -46 55 24 -12 -53 -22 -68 -15 -62
13352 -62 28 -28 94 116 -89 -9 26 3 4 -58 62 63 -85 33 54 102 46 -52 -34 40 63 13 -34 -1 56 -91 -9 28
13380 28 -9 78 70 88 -28 -69 4 -65 -105 23 32 -66 48 24 -30 46 -108 -99 26 14 -46 28 -8 -109 70 -25 72 6
13408 6 -103 -22 103 110 64 -23 -61 -54 71 72 -7 45 57 -18 63 -94 29 -20 51 48 35 -15 -114 122 57 97 -148 95
13436 95 96 26 14 59 -24 -57 49 6 -47 -21 32 18 -60 -26 -35 82 -48 98 -29 61 -23 75 100 74 -79 70 36
13463 36 36 26 -76 20 17 5 65 -16 76 -41 68 8 50 5 121 60 18 -11 -49 -72 -49 6 15 -129 128 -44 -32 42
13491 42 40 5 -39 -78 -38 -24 18 -36 -25 104 -27 83 32 -71 27 31 77 4 45 86 -22 -18 -102 11 -39 -39 -29 31 -100
13520 -100 75 49 8 102 -101 -20 78 134 26 -19 -47 -85 -37 -62 -65 -87 59 34 19 1 -38 112 -74 34 99 7
13546 7 33 27 2 57 127 -172 -7 -23 5 -33 -9 34 34 -93 -18 -31 19 69 -57 -51 -47 46 81 33 77 -146 16 20 103 -67
13576 -67 -11 50 99 96 106 46 -18 7 -52 20 -13 22 3 77 -25 29 107 13 -25 -61 35 73 -19 41 12 55 8 -7 99
13605 99 23 6 -49 44 152 17 -16 21 30 -67 -106 19 17 150 12 91 21 -53 -20 77 -15 -22 -63 24 110 -61 36 14
13633 14 113 58 203 -77 -66 45 38 -8 54 40 72 -67 54 131 105 21 -24 -172 -16 -46 20 -18 107 -84 -9 13
13659 13 -63 -45 74 75 -109 -11 84 -1 -3 139 -23 16 54 -57 -27 -17 123 26 44 99 -56 -10 75 -145 34 -26
13685 -26 72 136 29 84 4 -27 20 -7 159 -20 31 110 -36 87 165 -9 39 60 -1 42 55 -84 74 -27 -100
13710 -100 -36 -110 63 83 -115 -137 8 33 53 66 -4 42 -104 52 -65 -73 -52 -22 -13 -7 -30 22 -43 6 2 -30 36 -68
13738 -68 35 41 -33 2 14 -32 -16 16 13 -25 76 -37 21 -41 6 23 53 63 37 27 25 -74 3 -10 -142 23 61 5 89
13767 89 10 -72 -77 3 -1 77 5 86 67 82 -56 40 27 55 37 -48 20 -23 43 -14 16 50 108 22 50 -74 -72 -11 76 -97
13797 -97 17 -13 192 131 36 74 -101 9 70 33 17 67 -14 -102 -140 -24 -70 25 107 36 14 2 -95 62 -67 72
13823 72 -30 135 119 -50 -130 -23 24 38 81 112 -10 -59 63 36 -37 26 -139 44 15 104 -82 -7 -49 62 -119
13848 -119 -107 59 16 30 74 78 -60 -115 44 14 23 -66 -1 -46 -10 76 -18 6 9 -27 8 -18 -12 -116 57 102 -34 3
13876 3 -69 -86 79 100 25 65 -100 -76 60 -59 19 30 3 7 -74 78 1 23 -106 3 51 43 29 -33 54 7 17 17
13904 17 20 37 81 146 -44 36 -6 83 -42 -11 -112 -97 25 -27 64 68 -89 74 50 -117 -62 -23 56 -113 -112 72 37
13931 37 92 -48 108 149 9 -17 -6 -76 -49 -39 42 -28 -41 -77 12 -31 48 -23 31 21 1 -14 1 -42 -61 79 -72
13958 -72 -61 50 14 -38 36 61 -28 7 32 24 -22 48 -87 42 -75 -66 -26 66 8 -33 87 -2 44 59 130 51 5 81
13986 81 -28 112 47 61 -10 37 36 -19 16 -82 70 -93 -59 59 52 29 104 39 -2 42 15 -94 18 36 40 -17 -50 54
14014 54 -47 -52 -41 53 -111 -15 10 -55 -17 -67 -66 13 -23 -4 41 100 -46 44 -82 -47 54 -109 -58 40 22 71 53 -25
14042 -25 63 -104 -95 -17 -154 55 133 -34 -53 -41 -55 56 49 -57 106 -4 -78 -8 -42 -42 197 61 -55 -104 -4
14067 -4 62 -39 -9 -35 94 108 -94 42 2 39 96 111 -30 -9 77 48 -55 150 176 44 -46 -77 -16 -62 68 169
14093 169 -101 2 -103 -26 -30 13 -68 -98 61 -3 70 -23 -2 -56 61 8 72 66 -71 -124 -55 30 -17 25 -3 -48 142
14120 142 -164 -7 2 32 -63 -3 -24 75 -47 18 -82 -39 52 96 92 -8 -62 -28 -46 13 63 -5 4 13 94 83 58 -58
14148 -58 -117 -65 -99 31 3 2 41 -8 -39 50 12 37 -26 -27 -128 -58 34 68 -33 -48 -19 -10 4 -1 -14 204 128 -122 146
14177 146 -58 44 42 19 79 21 -74 18 20 -14 32 -28 1 -20 66 -49 -50 13 -69 -3 62 -212 1 33 129 59 -9 0 9
14206 9 -12 -52 -26 42 -112 -44 96 -45 -48 -3 -131 3 -50 -35 39 57 86 -23 -45 -22 3 -1 -16 60 -54 -52 52 -1
14234 -1 -24 28 30 65 -32 18 43 -68 -39 39 67 57 -1 135 17 -20 -34 -27 55 30 -186 110 68 -9 38 80 -22 96
14262 96 30 35 90 -68 35 -86 73 39 -101 12 8 64 58 41 18 57 -114 8 1 -9 93 -23 -60 34 33 6 -132
14289 -132 -50 -6 -24 -12 3 -26 -8 -68 -17 28 -99 -34 54 -51 -65 1 46 27 59 124 32 19 11 22 69 -126 73 -101
14317 -101 -80 89 -110 20 -46 -73 19 0 -28 -76 14 123 184 47 -83 45 -112 -18 -49 -1 -78 21 39 38 -35 -1
14343 -1 14 72 -60 3 -16 -57 -68 -21 148 -55 40 -47 90 211 -115 -76 34 2 -43 -17 -151 19 -15 47 47 176
14369 176 29 -33 3 -37 -5 3 53 -27 -17 136 -104 -35 91 25 -116 -90 8 -52 50 73 -99 -20 61 -44 146
14394 146 -39 -36 101 -61 -87 90 -59 -40 3 145 103 24 27 76 -18 167 -42 -10 -72 89 -18 -1 -47 7 -10
14419 -10 -36 14 57 141 14 -18 85 39 -13 -27 30 -1 27 -45 135 81 -73 47 77 -2 -38 21 -17 82 -27 42 36
14446 36 33 -13 81 -3 -6 -56 55 66 20 38 -94 -95 -106 14 91 119 29 79 -5 -57 12 55 145 111 107 -18 -21 -31 130 -112
14476 -112 127 -111 -19 1 20 44 95 1 -23 96 -30 -34 84 65 -53 45 -29 26 -8 -15 -10 -7 47 -111 111 -79 3
14503 3 -104 -4 -8 57 -49 6 -80 116 42 -27 -5 33 23 -10 22 26 44 34 -40 -49 -78 -7 -53 -64 -24 -12 -53 -18 76 30
14533 30 9 -43 56 75 -17 127 74 -139 70 -119 53 -57 -103 -57 2 35 126 87 -21 27 69 47 21 -59 -4 -30
14559 -30 -76 -27 90 6 19 50 21 -23 -108 -20 -83 -60 33 67 -73 93 -90 -14 39 -52 53 15 121 -90 18 -48
14585 -48 110 -125 31 56 82 16 -4 71 -73 11 98 81 -25 13 28 -139 -54 37 23 -26 3 -45 45 153 36 100
14611 100 -195 -61 52 -37 -23 -80 136 18 34 -5 -31 -6 -36 -43 13 20 26 -115 71 -44 -85 41 165 -30 1
14636 1 -41 136 128 7 -77 -41 -75 -63 32 34 -56 40 58 16 40 86 74 0 -67 34 -7 -71 -11 -99 -70 1 37 -59 -50 103
14666 103 122 29 72 103 -25 -24 46 0 20 -3 -161 37 0 -6 -79 -36 62 28 -62 68 76 75 67 49 -34 2 -40 11 -34 -26
14696 -26 14 8 -93 -19 21 -19 23 7 32 2 -115 16 19 35 -13 -17 -9 55 -123 27 -75 -29 177 68 -25 25 -37 -205
14724 -205 -54 -25 126 -37 -11 31 -119 -84 86 -8 41 6 -39 -11 -43 -94 -12 65 18 -32 79 -3 -44 -37 128 7
14750 7 75 56 90 -51 50 75 -77 161 52 -33 -22 -55 33 91 40 -117 54 19 -3 36 136 87 -58 33 -85
14775 -85 32 0 -24 19 -30 50 -12 -30 34 49 43 -71 -104 29 48 28 22 -68 -54 -18 -10 61 7 9 71 78 -39 33 -16 -98
14805 -98 28 28 -167 -18 58 56 -13 67 46 -21 -47 -135 -27 65 120 -43 -50 51 -8 -31 22 -65 -3 -75 93 -112 74
14832 74 -84 -43 46 39 -63 -31 -41 20 2 -11 7 -34 0 21 6 -81 106 78 -124 -8 -64 76 53 26 -9 27 -27
14859 -27 -95 -48 -32 -43 -27 -65 -5 72 52 -10 8 3 -5 71 3 -1 -23 85 32 -48 -80 80 35 -14 -2 4 17 36 66 -31 92
14890 92 3 61 -138 101 -31 8 -31 -68 -34 -32 -48 72 45 -55 33 -6 92 44 49 -28 -27 21 66 68 55 5 -65 -78 36
14919 36 -22 -20 34 -30 24 15 -36 96 17 -42 -60 -78 -11 1 29 23 -11 -58 96 34 49 -94 4 6 -8 94 -52 -9 -14 65
14949 65 34 32 -35 50 -116 -40 -51 144 -45 53 28 -57 8 53 -47 -30 -57 134 28 -26 72 -55 -97 -11 -10 10 -49
14976 -49 14 -16 -58 96 37 -7 -38 -70 -45 -23 110 -18 -19 104 51 -96 24 -34 94 -30 -27 -12 -118 100 -15
15001 -15 9 142 -106 13 39 23 -34 -33 -11 -74 5 -6 74 -30 -33 -102 9 14 -5 -121 -34 -23 16 -20 -17 62 -11 32 -16
15030 -16 58 -75 -8 141 -69 33 34 -94 50 90 -6 -14 127 -2 -33 35 -42 -31 -86 132 106 107 -64 45 51 190
15056 190 -18 11 -37 -16 69 -8 50 -2 87 52 -12 22 -59 -25 31 -82 87 40 -124 54 -123 10 100 -91 33
15081 33 24 4 51 -38 -12 98 -127 -26 38 -41 121 -19 99 26 138 -34 8 7 -56 84 -101 -117 -134 48 76
15106 76 22 54 -96 25 57 8 -38 36 -36 -105 -146 -135 -34 -52 48 -93 46 -49 9 152 14 42 -48 -23 54 14
15132 14 124 14 62 -7 -64 48 -161 78 2 27 -51 -112 61 92 17 -22 81 11 -38 -17 51 -52 -21 -19 -4 -10 48
15159 48 -79 126 97 6 -47 -10 91 -77 148 -53 -16 40 54 10 93 -107 -31 10 13 34 -65 -4 81 51 22 84 123
15186 123 86 66 -19 38 -70 -68 -83 -129 69 33 -35 -132 42 -1 84 -39 -65 19 -12 -93 13 -113 33 54 -50 -56
15212 -56 106 -75 43 65 -26 -86 30 -112 10 -47 40 -49 -18 -9 -7 102 -18 25 -69 31 -8 34 166 -149 -51
15237 -51 27 -21 -48 -26 43 -37 -127 -51 -3 75 -55 157 -57 45 122 -87 -50 83 46 -140 -91 38 0 35 34 86
15263 86 -15 69 17 -100 -16 31 -17 -8 -79 64 -28 62 -15 -23 -57 -39 -40 36 -101 -119 -93 28 -69 -154 -28 44 12 58
15291 58 56 18 62 8 -58 -18 -57 -17 68 45 -24 37 22 93 71 21 -62 -27 -52 -61 94 -34 -11 -25 14 -145 83 -49
15319 -49 71 59 -23 -36 -70 -22 -20 3 64 44 115 -71 -62 34 37 87 -61 -6 97 -110 -71 -71 -65 -2 74 -40 6 61 66 39
15349 39 47 46 -38 -37 72 -83 63 -16 -86 -82 -148 105 3 68 -7 -16 -8 87 -26 -95 39 43 52 5 -17 -8 85 -41 -1 -26
15379 -26 46 11 55 74 77 69 161 -58 -12 -55 13 -12 32 94 57 -12 21 -38 31 13 -10 61 7 -39 39 -34 -129 -29 13 -101
15409 -101 -24 113 3 33 43 -104 -1 15 -16 88 -12 -29 65 86 138 50 20 18 -88 100 57 55 2 -26 59 18
15435 18 -66 -119 53 16 -18 111 -91 106 75 30 83 -15 -42 -38 -56 -60 3 27 -83 -23 55 -15 44 -82 -80 -47 17 -55
15463 -55 -63 13 -44 140 152 25 35 -21 43 -111 -85 74 32 8 15 -6 -106 22 127 -9 -165 -11 15 8 75 41
15489 41 48 68 -86 58 -67 2 -66 11 -25 -55 -18 -2 88 50 -17 17 -71 -18 22 13 -109 35 56 -24 98 -23 90
15516 90 80 -15 15 4 -49 -5 61 -74 -91 16 37 78 63 -14 60 -77 79 -20 -26 54 -97 -19 -6 45 -65 -20 78
15543 78 19 -13 -45 -172 18 -29 -17 152 -24 -67 66 14 33 -16 -12 64 -15 5 -38 47 173 187 51 -23 -52 24 60
15570 60 -11 -92 -23 58 64 29 12 -21 -41 -91 34 -17 -20 54 -69 23 1 -19 -74 -14 -75 54 -105 -84 19 -26 -35 -59 45
15599 45 -76 48 -12 84 14 -1 43 86 -22 -70 17 -92 46 -41 10 -78 -10 51 53 -115 -54 106 48 31 -29 46 -110
15626 -110 15 -48 11 -139 16 -64 -14 -105 29 -53 59 -11 92 18 -42 1 9 107 19 26 59 8 -131 33 -30 53
15652 53 -4 67 52 -49 62 69 45 73 1 -11 61 109 70 -30 -197 81 -70 -53 57 -42 43 -44 45 -72 -82 -98
15678 -98 -69 88 30 58 67 -67 -50 -55 -50 -106 -43 -120 -53 23 -97 16 -29 101 -56 25 -6 37 32 -21 -95 7 144 61
15706 61 -2 111 -11 66 -20 -45 46 -52 -24 -18 64 -76 -7 84 118 -130 4 -14 77 26 47 -128 0 110 110 -113
15732 -113 109 20 -6 33 -72 -22 -42 96 -26 -13 -56 84 33 -84 -94 -65 63 83 123 -2 -99 -15 -1 50 -133
15757 -133 -7 -19 33 27 33 82 18 2 36 -26 34 -48 84 133 76 -56 -19 -90 59 9 43 2 52 -111 12 -41 19
15784 19 -40 -78 -30 147 69 44 53 67 28 -7 -78 -3 13 180 -14 -103 -17 82 -14 54 47 -74 26 6 12 35 107 78 111
15813 111 -29 -62 -44 20 35 -1 35 50 6 -64 71 -92 -46 15 -69 71 -29 -4 -34 76 49 -2 79 31 -60 -98
15839 -98 -79 -42 55 35 -25 57 128 52 -68 2 21 14 -60 -18 65 43 -78 6 24 -54 -13 44 69 -65 95 -30 76
15866 76 82 173 25 -18 16 6 20 23 78 3 62 47 -127 -11 -107 27 -59 16 -74 -32 35 22 19 -63 69 -55 69 92
15894 92 -38 -2 -51 -66 102 27 9 150 8 -101 123 -18 96 149 -72 4 -55 -75 101 -52 -52 -2 -49 46 123
15919 123 48 -27 66 -94 3 1 57 -17 -33 -27 -22 104 73 36 14 38 95 -42 9 164 36 -23 -55 -11 -11 28 50 41 10
15948 10 101 92 55 14 -8 35 -54 -23 -111 48 5 -56 41 6 -19 11 -52 7 48 -36 -71 -85 72 12 58 78 40 -61 -105
15977 -105 -55 38 2 -128 10 -15 -25 -57 -118 21 93 29 -2 -2 -20 88 159 24 40 12 27 41 1 -92 -101 8 34
16004 34 -34 -34 65 -31 67 90 21 -48 27 12 -111 -45 -70 -101 -85 -28 -10 -54 34 -37 39 -67 -106 29 -19 -88 37 -22
16032 -22 -97 18 -69 55 -98 40 89 34 -121 17 86 84 116 32 46 17 24 -31 57 22 -69 78 71 -39 -139 13
16058 13 -6 -25 -75 -10 113 -1 -51 -14 138 44 -51 -6 4 -38 8 76 -77 3 -46 -10 -10 9 48 -59 8 1 91 27
16086 27 -89 -75 12 -57 28 28 -5 -128 58 45 41 59 202 3 -9 58 39 -35 -10 143 -90 141 -16 95 -67
16111 -67 -25 -13 -21 117 17 -45 76 -59 -56 -46 34 -77 82 14 -42 16 6 -48 -106 -77 67 42 -28 -8 -7 119 113 76
16139 76 -2 -42 87 -107 -5 -9 79 -14 71 117 99 4 -59 -73 -36 -40 12 -57 102 -109 96 30 -95 22 -9 -12 1
16166 1 7 -40 2 57 21 115 56 -9 -92 111 -74 -47 59 33 30 16 23 -103 53 67 33 -75 102 -7 44 -3 14 14
16194 14 -37 33 96 -109 96 202 107 80 3 -15 -35 4 1 -44 -60 81 -41 -23 -9 -47 -3 38 -61 -127 5 59 15
16221 15 64 -152 -25 21 -3 -33 -117 57 36 137 77 5 29 38 -77 -63 -63 40 28 17 -47 69 -34 -102 -12 -109 80
16248 80 80 -143 31 107 48 -19 48 -73 -94 -91 39 -77 114 130 23 -96 64 -86 77 -12 46 -18 -17 -113 85
16273 85 59 -51 117 26 59 -7 -2 38 97 78 43 -7 83 -22 30 38 -59 39 -50 -48 -1 67 -64 -32 -119 53 88 103 92
16302 92 -24 87 141 128 -45 24 -48 69 29 1 -16 75 8 -60 16 -43 15 -34 -65 37 8 12 95 34 -36 42 -62
16329 -62 -93 72 54 6 82 30 -10 -79 106 126 -4 -69 -68 -57 95 -33 -55 -115 41 -15 3 35 16 15 14 -16 8 50
16357 50 -37 -129 -43 14 17 -31 1 -68 -54 -7 -18 -70 31 8 21 53 -65 31 -62 -63 -78 -103 -68 147 120 -28
16383b8
$$ Imaginary data points
##PAGE= N=2
##DATA TABLE= (X++(I..I)), XYDATA
0 0 0 0 0 0 0 0 0 0 0 0 0 0 -32 32 -32 32 -64 64 -96 96 -128 128 -160 192 -224 257 -320 353 -416 480 -545
31 -545 640 -705 801 -922 1025 -1153 1303 -1442 1624 -1796 2008 -2220 2465 -2722 3009 -3324
47 -3324 3662 -4037 4445 -4895 5397 -5948 6562 -7245 8023 -8901 9911 -11082 12460
60 12460 -14106 16131 -18671 21981 -26494 33037 -43494 62931 -111824 508047 752777
71 752777 -215203 -560706 -389047 44005 10476 -75859 -239182 -15794 35366 38033 -38634
82 -38634 50831 140560 78280 -4952 -10712 103748 201301 74020 -133533 -272391 -152390
93 -152390 -60258 -49629 -14646 108145 259313 186049 -23043 -230808 -187445 13527 86640
104 86640 72904 38561 106066 27385 -103751 -170047 -58580 109301 90633 -46660 -111526
115 -111526 68339 201486 82472 -141379 -194528 -36591 92111 52197 -82917 -94597
125 -94597 74256 171793 51868 -123797 -108848 81401 183898 97686 -99571 -140941 -31476
136 -31476 18377 -89880 -182833 -60936 112053 187791 112244 27297 8798 19510 -653
147 -653 -52551 -17710 34662 -4222 -114925 -147859 -56453 40868 74569 37708 14222 58689
159 58689 93084 49536 -40092 -55541 -23637 -13872 -30904 -50271 -11155 50245 78117 2927
171 2927 -67805 -42027 10303 12466 -19113 16624 70873 63662 -48562 -151649 -84809 101536
183 101536 194477 80473 -73964 -110310 -43403 24523 21378 -22287 -38788 -6258 12435 -7825
195 -7825 -3743 21389 27592 34 -20487 -7036 39059 86731 58707 -15471 -58263 -49202 -49802
208 -49802 -66046 -46445 3138 51800 48739 -1091 -30370 13382 71162 56773 14823 5652
220 5652 9798 -12989 -48091 -61374 -49646 -20723 -13269 -22589 3261 59451 81139 38802 -6453
233 -6453 -26760 -19516 2926 7112 -10829 -13597 18220 20473 -17730 -44203 -26389 13157 32527
246 32527 16549 -16704 -10549 20237 9791 -32047 -38217 637 30346 38431 33393 18303 4809
259 4809 -11080 -31653 -36621 -6556 12720 -9466 -28528 -19515 483 12465 17681 5182 -3446
272 -3446 21522 47499 38406 8582 -10109 -21975 -26094 -24014 -28878 -24876 -1999 7239 -13238
285 -13238 -14193 17844 33960 21817 13271 18551 22948 15880 -9248 -33800 -21492 4543 -2217
298 -2217 -26855 -26664 -9715 1182 12097 14258 3937 2231 15395 17521 9283 8597 5270 -3815
312 -3815 -6221 -6154 -11378 -5922 3082 -10659 -24982 -9391 10767 5260 -4906 -417 8621 15411
326 15411 13503 605 -200 16706 17357 -5054 -12278 -3375 -7282 -15896 -13044 -10445 -12643 -7903 -3895
341 -3895 -1930 11296 25517 21500 13040 12454 6900 1502 5882 -819 -22306 -25340 -9171 -6236
355 -6236 -15237 -13804 -4486 4819 12992 11441 7303 17655 25875 8720 -7928 -1360 3271 -5737
369 -5737 -9125 -6752 -11571 -14207 -11926 -11868 -5791 7648 10113 4973 10215 14259 7303 6496 11665 3871
385 3871 -5984 -746 1601 -8212 -12935 -10990 -11320 -9567 -6249 -6721 776 14384 10995 -2049 4530
400 4530 18930 14853 5514 5644 3565 -4203 -9780 -15506 -17686 -9131 -5020 -12101 -10225 2935 6866
415 6866 7240 16525 19019 8888 5836 9359 3849 -3706 -5255 -7782 -9736 -8051 -12537 -16948 -6588
430 -6588 4154 -1149 -3164 7575 11677 8483 12766 16560 9396 1048 -3441 -6430 -2419 714 -10132
445 -10132 -20427 -14600 -8852 -10375 -1918 12536 14134 9778 11037 9328 3724 3140 2476 207 3084
460 3084 2985 -7653 -12789 -8695 -11330 -14204 -3135 5677 -1565 -5659 3528 13267 16562 13226 2648
475 2648 -1831 7042 10995 2101 -4205 -8697 -21210 -25507 -12174 -749 711 4476 9617 9458 9929
490 9929 9959 4633 3071 6000 772 -4892 1642 3996 -7407 -13257 -6930 -4843 -6273 -3939 -3650 -4946
506 -4946 1104 8259 9180 10043 7464 -635 3308 18879 18418 -1380 -14877 -17190 -19556 -18080 -10560
521 -10560 -3918 2807 10598 9669 5317 8357 9587 3382 4357 9658 3128 -5843 -3101 -1184 -8067
536 -8067 -11065 -7905 -5553 -2379 -1421 -5180 -1700 9352 7862 -4214 -3168 9088 16762 21302 20717
551 20717 3600 -19250 -26957 -21003 -10329 539 1678 -5985 -4858 4012 4973 5348 14539 16957
565 16957 5439 -1726 486 1872 1882 -557 -9972 -16066 -9189 -893 1836 3869 391 -9658 -8901
580 -8901 2958 5400 497 6692 18159 21133 15656 2080 -14619 -18840 -10787 -6479 -6668 -3805
594 -3805 -5936 -11401 -4254 9564 12652 10298 10956 7578 1008 1304 3490 1473 -1011 -7029 -15463
609 -15463 -11130 4281 8113 -557 -4278 -4742 -8155 -6757 -662 1756 6819 17762 21004 12964 1681
624 1681 -9486 -13895 -3812 5911 -2547 -14804 -14614 -10862 -8587 52 9558 11322 11288 10771 6483
639 6483 4562 6996 2042 -7206 -8170 -6729 -7802 -1691 7392 2927 -8787 -12819 -10693 -6707 2569
654 2569 9835 11196 14361 15645 6002 -4336 -3621 -491 115 2804 -457 -14508 -21998 -15282 -5430
669 -5430 2518 9710 11154 8314 8484 6979 2164 4436 8702 -677 -13482 -11874 -1753 4894 7128
684 7128 1313 -11708 -16894 -9372 -170 6628 10933 6852 4 2708 8114 4885 2137 5328 4321
699 4321 -567 -2388 -7000 -15072 -15897 -9920 -4413 2200 7827 6318 4678 10459 11984 4643 727
714 727 468 -3533 -4954 677 3362 -270 -5464 -12212 -15315 -7159 3256 4419 3966 7304 6526 3580
730 3580 5151 4728 -403 1220 7828 6302 -2379 -10511 -15471 -13543 -4547 291 -913 2234 6425
745 6425 3624 2666 8436 8806 1204 -2761 -1607 504 3677 3264 -3172 -6250 -3912 -5537 -7952 -2239
761 -2239 2790 -457 -2958 -1530 -1131 1879 9705 13088 11035 8765 3647 -4072 -6787 -7133 -10850 -11002
777 -11002 -5678 -5841 -9132 -3349 6404 8815 8398 9873 9577 8926 7524 1184 -4323 -3645 -5656 -12791
793 -12791 -12582 -4691 -1219 -1174 1874 2553 264 1970 5037 5550 7346 8195 2928 -1595 -557 -1778
809 -1778 -5334 -3914 -2994 -6859 -5733 979 1556 -2756 -3526 -1630 1733 6731 8021 4540 5926 8483
825 8483 1943 -5570 -4256 -2710 -5420 -4791 -1966 -2854 -3500 -2416 -3383 -2398 3027 5189 4474 7869 9442
842 9442 3976 277 1070 -2436 -6240 -2585 551 -2442 -5487 -6711 -8254 -6038 -899 663 4053
857 4053 11424 11961 6010 5177 6974 1629 -4838 -5249 -4949 -5605 -5262 -7004 -8718 -4012 1075 506 2505
874 2505 9121 10401 7093 6179 3105 -3807 -5027 -1211 -1169 -2802 -2409 -3285 -3945 -1100 -1153 -4223 -1376
891 -1376 2898 516 -252 4889 6283 2120 1688 3318 2849 3027 2422 -1878 -4379 -3885 -7676 -11076 -6665
908 -6665 -1751 -1756 1040 7025 7773 5915 7052 6375 3712 3445 1809 -3451 -5270 -5106 -8816 -10068 -6104
925 -6104 -5034 -5232 1770 9398 8954 6314 6368 5101 3339 3055 -313 -3355 -1764 -1795 -6953 -8236 -4986
942 -4986 -5271 -5101 1119 5858 5355 5536 5562 2381 521 808 -846 -714 2630 1663 -2634 -2001 -959 -4986
960 -4986 -6330 -2233 -236 -734 1499 2680 1092 1386 1816 473 2273 5680 3883 1448 3420 1935
976 1935 -5209 -8307 -6451 -5868 -4623 -1075 -30 318 2580 2972 1718 4615 7421 4958 3750 5107
992 5107 1489 -4560 -5205 -4760 -7745 -8418 -5953 -3735 -7 4387 4214 3573 6211 6287 2986 3809 5815
1009 5815 2359 -2282 -3050 -5104 -8400 -7761 -5443 -3642 67 2703 1367 2094 5476 4551 1863 3637
1025 3637 4889 1312 -483 675 -1093 -3270 -3576 -5425 -6093 -3157 -1270 -1400 1606 4476 1552 -314
1041 -314 2851 4457 3124 4080 4323 764 -1738 -2546 -4900 -5068 -2849 -3066 -3858 -747 553 -1872 -788
1058 -788 3509 3998 3071 4953 5390 3356 2724 1369 -2292 -3603 -4122 -7133 -7184 -2825 -1427 -2383 675
1075 675 3501 2160 2501 6001 6929 5363 3940 122 -3987 -3495 -3076 -5269 -4343 -1681 -2585 -3085 792
1092 792 2178 -223 428 3252 3128 3092 3637 2100 1776 3579 994 -3881 -3674 -2195 -4734 -4854 -1659
1109 -1659 -1459 -2766 -775 733 1190 4589 7328 5814 4124 3010 -1005 -2985 -680 -1473 -5848 -5302
1125 -5302 -2024 -2198 -2459 -525 -711 -918 2064 3949 3455 5058 5547 2225 1169 2286 -999 -5579
1141 -5579 -4454 -2264 -3228 -3376 -2678 -3610 -2527 1120 2352 3054 6688 7365 3402 1735 1752 -1075 -2269
1158 -2269 -871 -2939 -6170 -4460 -1413 -1377 -1490 -968 -1355 723 4759 4076 2041 4002 4857 1326 -382
1175 -382 354 -1462 -3262 -1938 -2047 -3851 -3406 -3241 -3790 -852 2615 2290 2642 5965 5205 1648 1875
1192 1875 2652 -149 -2155 -2016 -3494 -4487 -2714 -2541 -3188 -1639 -602 -1310 1854 6117 4551 1578
1208 1578 3102 4018 1409 -328 -702 -1912 -1270 -1164 -4274 -5590 -3029 -2266 -3021 40 3571 3030 3145
1225 3145 5177 4141 1836 1903 1414 -992 -1918 -2376 -3874 -2859 -876 -3291 -5044 -1525 1262 526
1241 526 2036 4610 3985 2727 2961 1875 1033 1489 -341 -3259 -2231 -1613 -4578 -5153 -1861 -823 -1677
1258 -1677 335 2532 2538 3648 4399 2789 2237 2766 365 -1924 -1122 -1676 -4310 -3450 -1601 -3307 -3908
1275 -3908 -664 1496 1225 2300 2748 2598 3958 3962 1108 398 1874 -372 -4032 -3274 -1972 -3466 -3461 -1715
1293 -1715 -1669 -927 1400 2032 2075 3830 3765 1795 2608 3304 207 -2153 -843 -1430 -3994 -3972 -2917 -3199
1311 -3199 -2148 -499 -100 1434 3802 3039 2033 4225 4813 1006 -643 355 -1311 -3684 -3312 -2931
1327 -2931 -3196 -2144 -1840 -2310 276 3104 1982 1569 4205 4217 1825 1815 1807 -819 -2160 -1248 -1977 -3084
1345 -3084 -2598 -2983 -2985 -549 567 -924 712 4109 3598 2077 3219 3230 848 -361 -784 -2101 -2082 -1632
1363 -1632 -3517 -3736 -1365 -985 -2288 -35 2554 1728 1663 3793 3745 2224 1937 1119 -859 -585 -936 -3344
1381 -3344 -3690 -2245 -3058 -3377 -626 587 -341 1635 4452 3925 2579 2844 1962 719 596 -1144 -3439
1398 -3439 -2336 -1480 -3495 -3847 -1152 -647 -1190 766 2506 2120 2763 3584 2172 1407 1870 271 -1191
1415 -1191 -364 -1100 -3796 -3391 -1725 -2682 -2816 -524 923 1102 2586 3427 2550 2696 2658 773 121 970
1433 970 -988 -3606 -2348 -1344 -3041 -3347 -1299 -559 51 1445 1604 1243 3003 3104 1274 1619 2401
1450 2401 264 -1251 -448 -1739 -3749 -3001 -1698 -2444 -2206 -317 290 1349 2932 2443 1669 3388 3712
1467 3712 875 -272 436 -1099 -2930 -2610 -2369 -2877 -1993 -1077 -1217 268 1950 1228 1345 3452 3500 1438
1485 1438 1695 2051 -103 -1571 -1163 -2343 -3530 -2561 -2305 -2423 -740 492 -89 1388 3341 2429 1384
1502 1384 3301 3363 813 -728 -620 -1782 -2511 -2399 -3176 -2890 -568 -142 -1361 -22 1827 1369 1622
1519 1622 3557 2990 1761 1874 1320 -765 -1822 -2129 -3282 -3039 -1438 -1944 -1901 353 1153 -155 1070
1536 1070 3276 2794 1913 2575 1843 173 -247 -1527 -2758 -2037 -1123 -2375 -2208 114 -92 -1323 -362
1553 -362 1389 1241 1719 2744 1851 1813 2217 970 -829 -1047 -1563 -3202 -2467 -1223 -2218 -2611 -277 668
1571 668 308 1309 2583 2871 3132 3085 1150 121 258 -1341 -3241 -2316 -1450 -2673 -2415 -451 -316 -242
1589 -242 1087 1665 1466 2379 2657 1593 1781 2020 -297 -2072 -1220 -1535 -2754 -2147 -1118 -1801 -1507 -67
1607 -67 262 787 2151 2231 1969 2975 2612 350 -369 458 -820 -2743 -2228 -1948 -2585 -1689 -847 -699 197
1626 197 1595 1585 1583 3076 2707 1255 1531 1404 -930 -2169 -1352 -1588 -2517 -2222 -1886 -1870 -187 727 287
1645 287 1166 2900 2147 1263 2134 1943 48 -253 41 -1322 -2350 -2115 -2277 -2028 -664 -737 -1020 722
1663 722 2320 1382 1268 2696 2091 883 976 676 -893 -1229 -1152 -2068 -2347 -1650 -2109 -1781 509 1177 240
1682 240 1138 2841 2142 965 1570 1063 294 339 -176 -1572 -1544 -1286 -2367 -2328 -740 -992 -1382 575 2173
1701 2173 1497 1304 2181 2077 1497 1101 -5 -813 -308 -992 -2936 -2942 -1662 -2111 -1811 209 1211 862 1924
1720 1924 2813 2218 1981 1862 479 -121 181 -1140 -2811 -1778 -1186 -2529 -2216 -649 -48 164 1662
1737 1662 1906 1591 1702 1815 1014 846 894 -693 -1376 -228 -938 -2789 -2609 -1122 -896 -749 291 455
1755 455 911 2049 2045 1194 1752 1736 360 -129 418 -1000 -2311 -1601 -1250 -2133 -1951 -469 -85 582 1418
1774 1418 908 1132 2493 2238 567 815 1143 -426 -1395 -1135 -1634 -2509 -2025 -1122 -1085 -265 416 338 1421
1793 1421 2675 2024 822 1571 1751 264 -609 -443 -1334 -1978 -1611 -1610 -1788 -892 -345 -522 707 1598 1000
1812 1000 945 2548 2129 553 390 571 -361 -1046 -1296 -2137 -1808 -654 -1176 -1657 -383 660 416 1028
1830 1028 2164 1849 1412 1796 1351 21 -420 -1018 -1891 -1723 -1254 -1954 -1837 -329 -145 -534 386 1562
1848 1562 1230 1578 2240 1779 813 611 -19 -1106 -982 -1329 -2313 -1631 -609 -1114 -1551 -170 733 650 1434
1867 1434 2088 1612 1844 1870 679 -529 -508 -1236 -1914 -1377 -1372 -2114 -1608 -27 -13 -118 940 1645 1432 1795
1887 1795 1519 628 605 716 -543 -1364 -681 -921 -1951 -1551 -767 -1146 -1110 186 641 863 1619 1802 1280
1906 1280 1655 1418 -9 -467 -45 -818 -1977 -1242 -1243 -1792 -1292 -245 -124 226 1180 1474 1598 2236 1595
1925 1595 196 485 835 -530 -1406 -902 -1119 -1730 -1323 -1165 -1354 -357 554 514 1072 2170 1813 1040 1400
1944 1400 1114 -143 -535 -257 -1011 -1847 -1324 -1527 -1664 -647 -338 -428 667 1699 1318 1220 1837 1358 191
1963 191 446 506 -782 -1062 -910 -1373 -1528 -1169 -1284 -1311 144 901 478 1123 2135 1657 904 1206 870 -257
1983 -257 -351 -592 -1318 -1545 -1363 -1546 -1364 -345 -217 -307 1019 1963 1235 976 1634 1280 458 527 12 -807
2003 -807 -746 -833 -1692 -1538 -767 -1220 -954 446 837 506 1099 1932 1555 1025 1167 531 -313 -152 -846 -1783
2023 -1783 -1438 -945 -1710 -1304 -43 95 33 1053 1615 1174 1178 1373 812 358 449 -557 -1334 -617 -932 -1911
2043 -1911 -1557 -567 -653 -558 509 799 759 1339 1659 1040 1185 1001 32 -430 -45 -976 -1970 -1318 -957 -1464
2063 -1464 -1019 135 285 463 1049 1164 888 1381 1188 309 512 531 -743 -1197 -601 -912 -1582 -1186 -586
2082 -586 -587 -213 420 433 709 1623 1369 877 1345 1198 16 -375 -226 -1031 -1830 -1340 -1034 -1265 -664 -28 10
2103 10 775 1235 924 984 1702 1264 315 402 383 -718 -1139 -1008 -1345 -1567 -904 -943 -667 415 791 451 976
2124 976 1888 1187 791 1190 889 -251 -361 -613 -1376 -1419 -1201 -1366 -1122 -166 180 90 952 1491 810 664
2144 664 1409 977 106 128 -18 -778 -822 -1063 -1468 -1101 -401 -721 -716 561 846 340 930 1532 1195 817 1047
2165 1047 461 -192 -316 -887 -1411 -1171 -1002 -1563 -1109 28 190 71 1042 1464 1051 1100 1228 633 320 181
2185 181 -545 -1139 -728 -906 -1673 -1214 -188 -537 -445 536 990 849 1290 1284 714 774 813 -50 -393 -140 -678
2206 -678 -1406 -967 -789 -1169 -925 180 100 291 961 1033 1026 1272 1081 261 323 382 -557 -1210 -630 -883 -1476 -950
2228 -950 -283 -711 -326 629 698 828 1599 1104 718 1056 819 -346 -612 -223 -905 -1460 -923 -759 -1014 -437
2248 -437 57 159 653 1213 997 857 1460 928 50 81 216 -756 -1173 -925 -998 -1182 -860 -618 -596 438 935
2269 935 577 842 1496 972 479 825 408 -366 -587 -363 -1013 -1257 -863 -1102 -876 3 365 -119 677 1452
2289 1452 796 794 1190 714 119 237 -122 -802 -853 -895 -1222 -1035 -363 -382 -458 397 852 377 668 1383 996 572
2311 572 749 232 -460 -325 -658 -1374 -1110 -813 -1028 -922 47 185 179 928 1212 926 809 1015 535 142 211
2332 211 -591 -1068 -845 -810 -1386 -954 -228 -310 -177 696 925 554 863 1081 586 598 581 -222 -413 -224 -852
2353 -852 -1422 -1034 -635 -896 -530 268 329 368 769 944 696 789 865 219 196 372 -588 -1087 -584 -740 -1372 -809
2375 -809 -293 -393 177 708 801 689 1100 1108 491 659 609 -278 -528 -235 -797 -1267 -821 -525 -698 -309 257
2396 257 121 582 1062 766 580 929 786 133 23 121 -662 -890 -653 -790 -1084 -661 -337 -356 118 641 326
2417 326 655 1315 799 460 585 345 -451 -575 -473 -902 -1145 -795 -670 -754 -22 250 77 880 1377 748
2437 748 739 1197 559 16 12 -200 -788 -826 -762 -917 -816 -363 -282 -339 471 716 465 784 1195 762 208 374 208
2460 208 -460 -539 -590 -988 -737 -694 -967 -665 83 381 218 845 1329 668 588 937 447 -254 -85 -455 -704
2481 -704 -689 -676 -1041 -684 -106 -514 -241 664 728 466 894 1104 571 328 363 -164 -429 -396 -652 -1113 -573 -446
2503 -446 -917 -641 253 302 288 872 937 673 635 676 -36 -82 25 -632 -934 -306 -545 -1142 -616 -155 -361 -6
2525 -6 573 607 733 896 830 426 423 206 -524 -554 -371 -817 -1135 -630 -392 -768 -359 225 326 436 919 726
2547 726 581 911 706 -202 -177 -99 -586 -928 -529 -589 -926 -583 -97 -288 32 553 494 715 1117 586 269
2568 269 487 403 -356 -663 -282 -763 -928 -541 -583 -607 33 205 160 738 1104 650 497 842 478 -252 -89
2589 -89 -62 -752 -759 -749 -787 -753 -190 -263 -310 411 571 378 661 1106 400 60 245 164 -486 -406 -532 -895 -706 -407
2613 -407 -627 -415 223 353 142 708 911 554 529 715 308 -46 -74 -336 -700 -631 -530 -901 -544 -24 -83
2634 -83 -152 576 708 467 692 744 425 292 327 -151 -378 -370 -760 -1047 -638 -394 -649 -250 230 248 135 632
2656 632 799 432 532 610 42 22 -130 -540 -817 -476 -560 -914 -438 47 -120 -32 621 722 398 688 637 405
2678 405 425 347 -408 -571 -277 -616 -920 -559 -351 -423 -241 290 349 396 788 707 593 698 461 -88 -5 5 -615
2701 -615 -944 -488 -678 -799 -357 -39 -68 217 539 386 581 809 605 86 411 158 -534 -640 -354 -665
2721 -665 -876 -481 -347 -332 63 367 234 461 973 566 400 755 337 -262 -100 -161 -709 -812 -705 -628 -601
2742 -601 -116 -58 -6 445 575 432 555 717 428 29 269 56 -498 -491 -531 -761 -502 -344 -381 -250 285 260
2764 260 192 569 926 414 466 556 215 -84 -130 -346 -803 -496 -534 -606 -449 45 -95 -149 452 670 314 573
2786 573 817 343 110 306 -179 -457 -300 -557 -894 -614 -230 -380 -259 240 195 146 602 738 445 473 505
2807 505 -1 -245 -65 -445 -790 -303 -463 -809 -359 42 -23 60 679 570 453 662 710 340 199 139 -295
2828 -295 -454 -381 -591 -964 -477 -329 -398 -94 437 226 403 678 645 439 497 346 -169 -167 -101 -596 -779 -361
2850 -361 -473 -671 -309 192 63 295 525 374 494 696 492 118 292 233 -357 -509 -270 -534 -739 -291
2870 -291 -211 -301 42 286 186 416 610 575 320 531 314 -233 -103 -265 -645 -670 -479 -567 -549 -128 -23 122
2892 122 442 588 425 487 633 475 89 265 112 -581 -533 -350 -686 -587 -318 -295 -129 226 265 278 626 770
2914 770 397 356 548 172 -247 -245 -267 -623 -580 -482 -661 -349 -44 -18 -27 577 589 224 552 719 365 165 230 -68
2938 -68 -445 -442 -530 -723 -328 -223 -399 -218 398 242 215 671 743 324 297 322 40 -76 -25 -475 -524 -197 -505
2961 -505 -713 -353 5 -62 57 452 670 446 500 521 240 198 172 -248 -429 -378 -597 -722 -287 -195 -339 -65
2983 -65 377 418 371 610 484 483 257 137 -249 -255 -151 -617 -707 -310 -217 -474 -123 84 94 171 559 432 481 742
3007 742 407 179 314 49 -381 -391 -212 -552 -631 -258 -210 -293 5 357 226 424 564 354 349 507 221 -160
3029 -160 -125 -65 -622 -568 -339 -333 -353 -231 46 -7 293 465 335 438 564 347 -61 -9 -53 -449 -574 -402 -453
3052 -453 -507 -285 -236 -206 139 246 234 412 667 334 322 411 251 -313 -144 -344 -510 -490 -377 -544 -394 80
3074 80 -8 57 462 661 232 441 533 351 -24 62 -208 -412 -447 -491 -434 -412 -167 -386 -126 305 387 241 570
3097 570 612 396 300 236 -34 -84 -173 -321 -527 -233 -265 -568 -240 20 96 42 307 420 376 394 439 226 155 96
3121 96 -357 -509 -238 -423 -523 -390 -144 -235 -13 298 311 245 454 516 244 329 137 -132 -295 -183 -393 -462
3143 -462 -213 -308 -338 -115 117 -31 195 443 462 316 530 271 105 213 105 -382 -305 -259 -405 -443 -252 -193
3165 -193 -204 49 243 252 299 576 443 274 409 138 -301 -185 -214 -528 -496 -291 -407 -337 -100 82 116 358 450
3188 450 404 413 540 131 -7 -38 -72 -502 -266 -150 -350 -426 -101 -97 -82 284 333 258 447 582 308 130 289 100
3212 100 -232 -167 -195 -345 -488 -207 -273 -228 7 -34 61 299 491 210 425 503 192 -76 17 -197 -316 -401 -417
3235 -417 -494 -358 -104 -252 -50 309 274 267 501 471 212 146 184 62 -120 -69 -208 -361 -205 -306 -484 -169 75
3258 75 -45 99 342 464 297 469 292 58 44 55 -274 -350 -288 -414 -555 -239 -133 -324 11 214 372 190
3280 190 447 368 228 374 183 -39 -249 -185 -363 -480 -187 -213 -458 -214 206 86 257 449 306 356 525
3301 525 352 87 74 134 -392 -346 -138 -436 -386 -292 -17 -184 160 235 158 295 333 283 226 360 170 -137 -267
3324 -267 -188 -403 -482 -326 -365 -337 -27 146 137 281 348 126 235 326 230 13 106 -103 -256 -268 -233 -298 -448 -91
3348 -91 -112 -233 133 97 201 255 524 236 128 264 82 -63 -190 -259 -378 -440 -252 -267 -185 48 39 -77 396
3371 396 286 211 403 319 148 -159 94 -97 -316 -209 -299 -476 -229 -164 -182 -21 235 259 165 441 498 226 152
3394 152 264 11 -232 -72 -145 -412 -270 -267 -410 -164 57 -134 88 270 329 288 300 292 83 43 -111 -214 -305
3417 -305 -267 -403 -460 -182 -57 -152 -37 305 262 223 448 373 103 244 237 -62 -116 -141 -299 -305 -177 -166 -159 -96 59
3442 59 78 69 423 520 375 338 249 23 -25 -159 -362 -349 -184 -292 -323 -164 -231 -206 -59 248 149 235 276 283 120 374
3468 374 104 -180 -148 -91 -358 -248 -215 -291 -157 58 74 53 191 465 297 272 316 191 8 183 -54 -372 -244
3491 -244 -134 -274 -358 -160 -31 -25 73 258 189 290 323 118 74 145 -38 -115 -113 -124 -398 -230 -239 -264 -230 97 32 -9
3517 -9 231 323 92 248 269 119 -110 -12 -136 -308 -176 -127 -305 -233 64 -59 61 201 180 140 326 379 237
3540 237 83 272 -74 -55 -15 -246 -268 -320 -161 -202 -135 26 120 38 324 246 66 239 252 1 -81 68 -197 -279
3564 -279 0 -239 -455 -197 -98 -93 -56 203 314 259 277 165 -1 123 40 -80 -205 -95 -277 -362 -117 -245 -258
3587 -258 -8 172 37 48 241 305 162 316 164 107 71 6 -295 -247 -198 -307 -169 -107 -64 30 -39 230 106 117
3611 117 400 181 101 60 92 -178 -144 -107 -388 -312 -169 -186 -313 101 177 48 101 118 286 192 153 36 -10 43 27
3636 27 -325 -318 -77 -191 -237 -53 -63 -62 2 142 118 299 341 74 150 67 86 -290 -88 -46 -230 -189 -63 -206 -252
3661 -252 -37 36 24 140 239 175 225 173 -40 -81 60 -224 -298 -185 -265 -193 -279 -88 -93 -202 217 216 172 262 370 79
3687 79 167 104 -78 -107 -129 -130 -184 -189 -210 -221 -149 -14 115 184 150 245 89 185 147 -28 -134 -44 -178 -313 -158 -284
3713 -284 -204 -158 -191 -85 77 292 223 52 275 345 121 33 126 -128 -179 -147 -229 -187 -134 -31 -212 72 171 87 81
3738 81 364 183 140 132 158 -30 -131 -116 -193 -114 -91 -229 -186 -51 -19 -87 144 107 83 60 182 66 68 89 -6 2 -105
3765 -105 -159 -225 -359 -52 -127 -230 109 101 125 -32 169 153 155 197 82 9 -13 -69 -284 -329 -80 -169 -214 15 42 -30
3791 -30 66 47 43 127 180 168 -79 134 -84 -146 -84 -211 -204 -257 -96 -230 -130 67 63 39 35 130 99 197 59 70 -12 113
3819 113 -187 -181 -109 -39 -251 -249 118 -66 -10 245 85 82 82 250 77 32 187 -35 -206 -106 -140 -154 -125 -117 -197 -101
3845 -101 77 102 -2 174 171 48 162 107 -19 -105 -48 -45 -76 -175 -89 -276 -55 -73 -16 105 138 150 115 74 284 -6
3871 -6 -30 72 -12 -145 -60 -200 -135 -172 -11 -153 10 239 -35 100 142 252 38 100 111 -91 -15 -163 -183 -89
3895 -89 -168 -171 -262 -70 112 17 24 13 158 100 202 154 33 43 -126 -86 -158 -44 -174 -282 -178 -70 -41 -63 63
3920 63 70 21 80 151 233 128 66 -48 -35 41 -187 -54 -50 -125 -140 -24 45 -14 -42 157 -61 48 247 61 61 5 -46
3947 -46 -266 -112 -120 -278 -8 -56 -81 -18 -23 1 135 318 39 194 98 58 100 22 -59 -62 -208 -165 -68 -138 -106 63 23
3974 23 -4 79 76 204 162 84 70 135 56 -11 -205 -148 -119 -209 -93 -44 5 -35 116 -3 122 111 125 141 41 7 -36
4001 -36 -125 24 -142 -234 -173 -47 -128 -55 95 10 121 96 147 -12 178 95 66 58 -69 -52 -33 -68 -164 -289 -10 -131
4027 -131 -127 38 25 -54 88 95 -16 29 84 -45 101 -35 -87 -62 -241 -165 -210 -162 -113 26 -14 154 208 97 143 184
4053 184 47 105 53 -9 -84 19 -62 -149 -167 20 -17 26 60 54 34 116 180 207 19 231 140 11 31 -78 -44 -81 -1
4080 -1 48 -40 -58 20 -9 35 111 -3 58 146 -34 16 -26 49 -176 -82 -161 -212 -186 -9 -42 -71 133 22 -20 44 171
4107 171 37 161 50 81 -218 -179 42 -90 -155 -21 -128 42 12 -26 -51 25 -58 60 94 177 97 -11 23 -38
4131 -38 -146 -71 -153 -193 -43 -35 -60 -18 111 82 142 114 84 73 94 49 -38 18 -95 -218 -147 -86 91 -69 21 -17 7
4158 7 -77 102 56 155 50 43 -57 -15 131 -35 -90 -98 22 -43 -68 -75 -14 92 7 79 -19 64 150 24 77 -6 -121 -42
4186 -42 1 -155 -63 37 -80 -128 -69 36 -54 8 76 141 108 -31 142 -45 -43 -78 -102 -75 -25 -132 -112 -9 15 4
4212 4 94 19 -12 7 198 98 3 -27 39 -73 4 -61 -148 12 -69 -92 -10 32 10 -5 37 -32 -18 154 101 -16 19 72
4240 72 88 -155 -43 -73 -160 -68 -64 42 -121 -87 -23 36 62 61 132 -29 42 32 -127 -61 71 -59 -107 -84 -48 32 -136
4267 -136 118 32 5 96 127 87 115 -65 -71 8 -94 -174 -156 -35 -131 -184 -3 -14 48 -68 224 107 167 107 -8 39
4293 39 8 -11 -24 -112 -4 23 8 -67 -42 -97 71 56 -76 92 40 115 -50 190 -99 -41 101 29 -89 -113 -121 33
4319 33 -1 32 -101 16 51 55 44 37 10 90 -5 50 -115 -99 -98 20 59 -88 -23 -133 121 57 43 41 89 12 42 224
4347 224 7 -46 -74 -9 -150 -12 -94 -46 -21 15 141 58 150 55 -36 131 94 -22 5 26 85 8 -56 -26 3 74 9
4374 9 62 -16 -73 3 -74 40 -74 72 -52 -73 -20 89 -72 -101 -49 -69 -98 -15 -15 110 -27 29 23 -1 94 -50 -99
4401 -99 -96 -53 -26 -144 -66 -47 -16 -78 -14 -3 -66 -21 63 -98 9 112 101 102 -31 -13 -78 -43 -90 -79 -164 -47 -73 7
4429 7 -20 38 -88 6 14 -68 -19 -37 126 -11 -172 34 -19 37 -61 32 -54 -20 61 -12 11 132 15 49 80 -33 56
4456 56 -37 -42 25 -95 -98 34 41 -37 14 70 42 27 -39 -30 67 35 -13 -76 -67 -49 -24 -135 -19 44 -6 -29 -103 24 -43 -15
4486 -15 -32 -83 157 19 17 158 43 -11 34 66 48 -26 -58 -77 6 0 -77 36 128 -32 106 103 76 57 -95 83 -29
4513 -29 -7 -63 -4 3 -82 -76 -136 38 70 59 -27 -86 50 53 42 -5 -5 73 -57 -174 -121 -32 -52 -70 -34 -48 -82 -27 119 59
4543 59 69 87 -25 167 -11 -5 -73 -18 -44 45 -51 -2 71 -60 16 23 140 114 -119 -19 20 -26 -78 -93 -113 125 -125
4570 -125 -48 -19 -104 -197 -3 52 34 29 -87 73 26 41 -36 -37 26 -69 -50 6 -15 21 -48 -16 87 45 5 110 64 76
4598 76 72 93 122 61 -22 -51 -28 -196 -32 -134 -52 -181 29 -82 -78 -1 104 54 -32 -12 15 6 -56 -99 -91 -120 5 -73
4626 -73 -120 -26 22 50 -31 -19 -147 -19 175 29 -40 3 30 4 -59 33 -59 -222 -54 31 -50 153 -37 12 -15 89
4652 89 81 44 -37 20 151 5 -161 -48 -68 -186 -75 -41 -60 -56 -90 -29 106 -89 59 -22 -16 33 -14 -122 2 -128
4678 -128 -19 27 37 28 -57 -1 28 50 94 81 124 117 -24 188 -15 -60 -13 -111 36 -46 -49 -79 9 -45 65 -95 33
4705 33 25 17 115 -9 -26 46 19 17 -124 -112 -86 -76 35 22 -31 -116 -62 21 107 95 60 12 107 17 109 -80 -8 -104 -22 136
4735 136 20 -46 3 143 123 180 113 47 23 77 186 62 44 177 9 -81 -90 -65 -115 -144 -25 -84 -75 84 92 49 154
4762 154 -45 -43 -16 -14 -14 -31 -42 49 -103 -163 8 -122 -71 -3 -9 -76 105 33 11 73 -33 -38 -112 -1 -120 -14 -110 -149
4790 -149 -70 14 40 -39 -70 21 25 -3 132 34 0 113 17 -3 19 -39 -69 -41 -57 -58 -113 -97 169 41 67 36 30 77 61
4819 61 -70 44 41 -3 -59 -50 12 -72 -105 -43 -33 43 99 28 9 78 65 23 38 6 119 78 55 -142 -101 -31 -77 -32 -105
4848 -105 -13 -31 45 136 100 73 47 14 76 -52 17 -100 -51 -73 -90 -95 -101 -34 -83 -90 -7 201 34 -18 -24 208 42 102 14
4877 14 82 -5 -84 -100 -39 -89 -92 -14 -172 -65 10 61 4 16 69 112 99 99 36 34 -28 -83 -128 -84 -222 -153 33 -69 -85
4906 -85 53 53 -19 10 111 -1 86 60 90 -2 30 -80 -127 -46 -25 74 32 164 25 175 143 7 140 95 -90 -9
4932 -9 42 -44 -135 -31 16 -87 94 -43 10 -4 83 -78 38 144 0 14 -48 90 -120 -89 62 -28 -18 -188 0
4957 0 -84 14 87 86 40 62 162 -6 41 61 89 -8 141 -90 -65 -113 -82 -166 -45 31 -50 111 89 133 103 227 75
4984 75 120 24 29 18 10 15 -69 -204 -55 -123 -106 -83 71 71 61 169 -52 -8 60 19 -22 -98 -152 -62 -185 -128 -171 -100 -158
5013 -158 -53 36 47 62 29 72 109 -25 32 135 28 -148 -49 -37 -36 -89 -75 -26 32 24 2 49 153 149 65 74 50 38 -101
5042 -101 -13 -7 2 -54 -249 -24 -119 60 0 25 -23 -37 63 45 65 63 -7 23 -99 -19 -125 -211 -44 67 -74 -90 0
5069 0 -24 38 11 130 95 -25 111 87 -102 82 35 -118 -185 34 0 -137 -54 179 -6 -61 10 -63 -93 124 17
5094 17 -30 -51 53 -159 -95 -37 -164 -210 -149 -12 -190 -16 7 -39 69 48 59 63 172 54 -109 -22 61 1 -27 -1
5120 -1 -20 -181 -83 125 64 31 44 81 -112 -13 126 52 79 68 -82 -115 62 -68 -154 -120 -16 -122 7 -11 -62 -4
5146 -4 36 31 4 26 43 -172 -39 -86 -174 -73 -21 1 -103 -42 -1 -25 66 83 127 83 131 179 2 258 145 -1 -38
5173 -38 61 -105 -117 -14 17 7 19 -2 98 57 94 60 19 51 -18 -99 -77 -119 -192 -32 -21 -140 -49 -2 -34 -43 135 111
5201 111 105 -9 -70 138 62 -19 54 -54 -119 -46 -64 -100 -17 -97 54 12 78 178 144 113 37 125 -5 25 -73 2 -100
5228 -100 -61 -5 -23 -96 -114 -119 -142 63 90 28 -26 86 27 -55 8 -75 -94 -126 -31 -104 -198 -107 -102 -44 -6 92 106 69 117 65
5258 65 109 98 67 28 -47 41 -82 -89 -41 -131 -180 -59 63 -23 -27 118 119 -72 175 -24 17 26 92 -129 -99 -162 -81 -55
5286 -55 13 -106 -112 -23 120 -34 44 76 35 -53 67 106 123 -5 26 -64 -66 -65 -62 -119 -122 101 3 62 44 52 106 240 -2
5315 -2 101 5 51 -25 -23 -115 -125 -33 -50 -144 -23 62 102 38 199 55 -5 -3 49 48 -26 -29 -110 -56 -84 51 13 4 -38 12 -79
5346 -79 -9 160 173 100 49 -14 43 106 66 -51 -29 -122 -78 -28 -116 52 -8 40 153 64 190 176 48 48 -16 -38 -66 -46
5374 -46 -93 -160 -101 -138 -170 -93 -39 96 32 39 53 133 47 190 -55 1 -66 -77 -143 -124 -14 -151 50 -106 -70 -65 103
5401 103 0 23 54 92 42 43 9 -3 10 -28 -52 -141 -112 -13 -135 21 148 0 133 96 73 120 47 33 37 15 -54 -114
5429 -114 35 -34 -26 -142 -33 -59 -58 2 15 35 29 190 113 82 68 -69 -37 30 -49 -129 -160 -116 -36 -18 -1 -10 53 108 49
5458 49 51 13 -77 8 -64 25 55 -130 -31 -66 -135 -60 -42 32 -84 8 33 16 -16 202 -74 55 143 -2 41 -17 -97 -99
5486 -99 -189 -152 -113 -170 -35 76 -141 134 199 136 252 140 -53 -102 -23 -6 -139 -61 -174 -46 -210 -82 -106 -11
5510 -11 175 77 49 123 170 35 108 27 81 3 -82 -134 -110 -33 -71 -69 -85 -65 35 -72 62 83 83 10 120 -87 76
5537 76 -72 -121 -40 -39 0 49 47 -28 54 162 152 64 166 150 33 -16 54 108 -17 -114 20 -204 -32 20 -58 14 69
5564 69 -72 11 -7 104 5 -127 80 60 86 135 25 -103 -76 21 -138 -62 -104 -53 -72 -55 -54 -3 98 146 67 -77
5590 -77 116 -23 103 -70 -84 -43 -10 -3 9 -75 -10 70 156 18 73 7 176 184 -8 4 26 63 32 -49 -61 -5 10 -38
5618 -38 -108 52 70 20 23 138 104 27 114 81 25 -10 85 -21 -64 -75 -68 1 -69 -5 -65 92 99 -7 31 82 77 47 79 30
5648 30 -3 -121 -35 -35 47 -88 -30 -104 -7 75 94 49 11 53 33 -73 -9 -30 -13 9 -21 -24 -80 -135 -189 -3 27 20 -91
5677 -91 265 91 78 151 38 5 0 14 -20 -28 -153 -83 -96 12 -118 4 76 77 -41 30 103 113 145 38 69 -58 -93
5704 -93 -75 -68 -108 -37 20 -92 -16 53 -169 118 38 38 50 98 -10 34 26 -80 -85 5 -36 -175 -268 -81 49 10 59 -101
5732 -101 -28 84 -20 64 71 132 -76 -44 7 -21 -117 -33 -45 -102 21 -43 88 31 73 130 68 163 95 -5 0 -91 -6 -1
5760 -1 -200 -91 -47 -102 -11 -135 -89 -69 -23 86 90 31 25 -41 56 -37 -48 -81 -38 -150 83 -122 -21 -47 -61 -19 -17 85
5788 85 104 96 138 2 -12 27 56 17 -156 -65 -122 -30 -26 -41 -117 122 -4 51 20 127 83 80 178 104 11 -87 -56 -72 -17
5817 -17 -12 -178 -90 -59 6 34 44 119 79 62 62 68 49 -24 25 -39 -70 74 -16 -18 41 -19 42 -59 62 46 64 -15 176 6
5847 6 9 107 42 -10 8 -147 -164 -7 -90 -40 17 -6 -89 17 119 2 49 53 73 53 -20 44 -150 -69 2 -73 -135 -114 -117
5876 -117 -60 50 75 -17 41 104 124 16 -10 135 22 -90 44 -113 -63 30 -80 17 51 48 92 -2 -83 123 -63
5901 -63 58 9 -41 -26 5 -141 -102 90 -71 -72 31 -51 -54 -35 46 -67 65 109 -111 22 -82 21 -48 -92 -66 -87
5927 -87 -102 -76 -5 -136 -48 38 -45 82 30 110 30 8 -33 32 153 -41 -51 -158 93 -148 -8 -28 -14 -28 -13 -61
5953 -61 12 52 43 -88 20 76 1 24 -40 -25 -30 -108 -64 -29 -71 -18 -25 -38 49 112 -80 89 51 154 -8 117 -19 48
5981 48 -169 -31 -13 -21 35 69 -83 42 6 45 15 -45 91 116 14 1 -17 31 -122 -179 -55 1 -117 -35 31 -35
6007 -35 40 23 101 24 -6 93 -58 -2 -98 -16 -23 -96 41 -81 -45 2 23 107 184 39 35 80 2 54 126 49 -106 22
6035 22 5 -66 -32 -67 -64 -180 0 91 -102 -5 140 97 -6 110 33 -75 42 14 32 -102 -98 -38 -126 41 -121 -152
6061 -152 23 38 131 134 63 16 -5 -19 -5 -40 -85 115 -57 -10 61 -145 -17 33 129 5 98 2 72 124 121 88 -76
6088 -76 71 28 12 -79 64 -99 -17 -17 -73 -29 28 66 38 193 23 48 56 -74 59 -82 93 -69 55 -47 -30
6113 -30 -130 -70 -56 -30 2 132 89 61 112 101 19 -20 -101 -24 -5 -9 2 -23 -38 -3 72 -84 -56 35 -25 150 35 -6
6141 -6 -18 -29 -10 72 12 -94 39 -51 -86 -132 -61 80 -179 0 44 -63 130 200 30 105 68 34 30 -30 -28 -62 -68 -78
6169 -78 12 83 -28 116 -18 86 106 -60 91 83 50 23 -81 -126 -57 -127 -91 -167 -114 0 55 -99 -17 115 1
6194 1 -26 56 22 -37 -26 -159 -28 -44 -196 -12 -70 -32 -145 20 29 -1 -72 112 99 31 50 -52 -7 36 13 -49 -46 -32
6222 -32 50 -60 83 26 -65 167 -40 -7 -5 50 38 17 34 -48 -56 -102 62 6 -54 -108 54 6 94 10 5 -42 88 16
6250 16 58 18 -79 44 -34 29 -129 -199 -37 -38 -24 60 -30 -100 2 6 47 59 88 156 -57 71 -19 -5 25 -109 41
6277 41 -114 46 -34 -99 -62 84 48 103 -67 36 115 -89 -164 -50 14 -19 35 73 -74 -162 -73 -15 102 -16 -71
6302 -71 57 79 25 -18 -59 23 -129 33 -117 -88 -9 -17 -135 -140 32 -19 11 231 21 -57 -25 58 31 46 75 -21 2
6329 2 30 -144 -126 7 -115 -34 0 -19 87 -48 -87 -49 -76 57 -100 -11 47 -93 -39 -79 -84 -60 37 12 75 -77 -48
6356 -48 53 116 74 33 1 53 55 -6 31 -24 46 -37 -87 -29 -76 7 57 147 58 76 98 24 176 140 83 -11 -114 57 -73
6385 -73 -86 -36 -41 -72 -83 -63 31 -78 -28 13 31 129 57 67 86 9 82 -65 -45 83 -66 -32 -5 58 33 9 109 126
6413 126 -28 15 136 140 -10 -36 68 -93 -63 6 -63 55 -113 -66 51 -70 67 43 -121 171 -57 -25 28 51
6437 51 -22 -64 35 -67 -113 -70 -106 -79 19 10 -31 74 8 -14 78 52 56 -105 -42 83 51 -69 -10 -108 -31 21 -37 14 -45
6466 -45 26 -5 -43 63 -14 -3 42 171 -62 -56 -37 -140 -31 -82 -75 -17 -19 37 -60 -134 32 -23 -4 28 -44 -42 -150 -39
6494 -39 -80 -82 -77 -42 -16 -98 -153 35 -77 -7 -83 60 50 -35 -32 15 -99 -111 69 -61 -42 -106 26 -3 -125 -12 95
6521 95 36 37 -32 -17 -29 71 -13 -109 5 -103 -59 -132 -96 4 -26 15 62 -135 86 57 4 -3 -107 8 72 113 33
6548 33 5 36 -25 66 -69 -11 1 32 -137 11 -93 -29 57 95 54 39 -158 -29 70 -13 -34 29 -12 -25 -2 -5 -78 5
6576 5 32 70 -43 171 19 -64 33 -24 -98 27 25 -7 -77 -77 20 -113 -15 50 -81 99 102 4 -91 97 12 -10 -3 20 -58
6605 -58 109 21 0 29 -79 -93 97 -12 -24 67 184 -11 -25 46 -59 -139 -74 -54 112 -8 -109 13 22 39 -85
6630 -85 -117 28 -93 9 2 6 60 -207 93 -3 6 3 -136 -75 2 -40 66 34 -36 27 126 23 97 46 75 34 -109 -7
6658 -7 -10 58 -19 -111 -61 -28 -38 8 133 93 20 20 50 106 -83 51 -94 -21 80 33 -54 61 -76 -77 -79 -32 40 59 144
6687 144 44 -34 42 32 85 15 89 62 -112 -57 -65 51 92 -87 -4 100 160 31 -104 52 29 -2 73 81 55 -29 139
6714 139 -78 -77 -19 -27 -84 -153 -71 -54 25 21 13 59 -19 31 106 31 -49 -6 -83 120 -19 -96 49 59 -64 46 -11 53 51
6743 51 14 85 6 14 5 12 -34 -58 -49 -47 83 -189 -87 -73 71 -42 19 21 -101 81 -48 43 -18 53 115 -92 -106 -9 65
6772 65 19 -65 81 4 -8 -31 -3 75 85 109 -42 28 -61 -55 34 13 -41 18 -32 21 0 -66 -15 -17 116 27 13 25 145
6801 145 -23 -66 -53 -52 16 -46 -45 -12 -36 2 -46 -43 78 23 -72 65 22 -6 74 99 4 -3 -89 -58 -49 -30 -54 30 -16 -19 -9
6832 -9 7 5 -69 10 -26 24 -60 116 -24 -23 -19 -17 79 -50 -26 113 59 -40 20 59 -82 106 -150 -63 49 -70 -108 -38
6860 -38 6 -43 -16 52 -55 3 -4 138 -25 22 88 41 47 -8 30 -43 -14 -72 48 -49 -87 -11 -44 34 -29 -21 85 78 -20 -118
6890 -118 -55 69 -38 -29 52 -56 91 7 32 -25 -38 -25 -49 -3 67 156 13 -31 63 56 17 52 60 -33 23 27 46 -54 -45
6919 -45 24 26 0 -31 -23 -27 72 81 27 80 -44 -53 -79 53 -29 34 63 17 66 20 -37 -12 42 93 21 178 87 42 42 109 57 1
6951 1 4 -176 -60 77 2 -27 78 65 -21 37 17 8 70 18 85 -53 -26 5 53 -25 66 -8 -84 -39 -63 -13 63 41 20
6980 20 108 -11 -3 24 61 36 40 -21 -70 19 19 167 36 71 -3 -22 32 -26 107 230 136 -55 -90 -29 -8 -191 -85 100
7008 100 12 -73 -86 37 -61 27 118 -44 23 78 -25 124 -33 -131 49 -76 -4 -18 -83 -86 -132 -80 31 33 14 -16 40
7035 40 28 -28 81 4 -68 16 -70 -172 -3 -81 -58 6 123 50 -95 -180 -16 2 85 -7 80 53 -52 88 29 -94
7061 -94 -48 -1 -62 31 58 -25 -37 62 -86 73 101 61 -64 1 50 30 -20 4 -14 -45 -44 -11 20 63 -3 -23 -66 108 -29
7090 -29 109 152 36 -50 1 66 -37 9 79 51 -56 -37 -34 50 70 107 -52 20 48 74 54 -39 -51 47 48 -41 -50 -111 -80
7119 -80 46 -56 -24 118 30 97 -40 109 42 17 97 75 94 25 26 79 -38 -10 -17 17 -33 64 -5 -75 120 73 109 -45
7147 -45 -4 135 3 -98 105 -41 87 -5 -105 -103 -57 2 48 -131 115 46 159 -8 63 92 -65 28 2 -2 8
7172 8 -30 -147 2 -30 60 88 173 -26 -24 181 108 -25 52 -67 -69 0 2 6 -1 -50 -26 54 7 128 83 128 -33 63 48
7201 48 -32 26 -19 -76 -13 106 -95 -78 -103 -55 -75 29 -10 68 -4 -34 -12 68 96 92 57 -15 -100 4 -149 -56 -1 -52
7229 -52 0 30 -7 -20 67 82 8 102 79 48 72 -52 -105 -26 -50 33 6 -31 -143 -84 77 24 14 20 86 96 190 16 110
7258 110 -78 59 -21 -91 1 -66 -34 -72 -48 39 8 -1 -55 49 138 93 66 88 161 -7 -91 -131 -22 -54 -27 -34 -66 -10
7286 -10 58 50 66 13 120 55 6 88 -12 -68 98 -115 -64 -90 -75 19 -6 -11 -53 3 107 -143 -10 22 79 31 -45 -18
7314 -18 23 36 -73 -135 -145 -67 -12 -62 55 -53 -2 40 76 22 138 138 16 1 0 -52 -76 105 -66 148 -23 -79 45
7341 45 39 -65 -23 -90 32 93 18 11 109 -12 -3 -69 -46 -42 -3 69 -176 -48 -11 -56 42 40 100 46 69 87 -79 102 -126
7370 -126 73 -71 -55 -93 -74 -53 -99 -118 36 57 -20 99 33 22 -60 31 76 22 -12 -100 -35 -77 -77 30 -54 -38 -112 48
7398 48 62 31 -10 -43 41 -7 -31 46 -53 44 9 -102 -6 -129 46 32 -8 28 93 64 125 -8 19 -55 57 30 21 -71
7426 -71 69 17 11 26 -49 -200 58 146 -14 95 78 -31 48 24 44 91 -60 -40 -154 -131 -145 -79 -95 46 -114 23
7452 23 -74 -15 -34 21 43 68 53 46 -9 2 -29 47 -11 -80 -120 57 -49 -12 45 120 70 80 54 10 61 -34 55 -101 -65
7481 -65 -43 -17 27 -119 -77 -19 -18 -5 118 -41 -16 114 78 26 13 -68 -13 -60 4 -77 -49 28 -68 -42 30 -36 -100 -22 198
7510 198 38 69 33 -21 70 8 111 -14 23 -21 -42 -119 -86 42 -12 -30 -2 40 42 129 165 -92 -10 -95 -47 -28 -70 -190
7538 -190 -2 -24 26 -42 -10 15 -37 12 43 61 12 59 -19 -1 13 8 -73 -8 -71 -104 -117 -40 126 -53 204 109 142 2
7566 2 168 77 -39 -24 46 -180 -227 4 -52 -75 43 -32 -54 48 -111 142 99 101 68 38 215 -89 21 -21 -85 5
7592 5 -104 -105 -70 -56 -242 -55 37 20 73 39 63 61 0 74 66 -61 -125 -102 -39 -94 -65 64 -115 -69 76 96 -77 32
7620 32 -13 2 31 101 21 -33 63 -44 17 -174 -30 13 -38 37 -34 -41 -33 -4 -87 24 -42 -94 -6 0 -40 -86 28 -72 17
7649 17 -126 85 -84 -81 125 -45 34 -1 13 -32 144 28 -16 24 125 -21 -9 -117 -6 40 73 -31 -152 4
7673 4 135 56 47 109 58 23 -78 13 73 25 -37 -62 -46 -183 -33 -238 6 16 26 -25 100 -74 -52 25 37 -31 -156
7700 -156 66 21 44 66 -58 55 -45 -73 -27 15 194 39 -16 139 11 13 89 25 -56 19 -51 33 -108 -22 24 -33
7726 -33 127 143 30 95 -64 -1 47 56 80 -126 -17 -99 -127 3 -61 -115 -19 -7 -94 -125 -43 -4 57 142 135 -101 63
7753 63 -8 -27 -3 -57 39 41 -215 -37 36 -15 -103 -34 -40 -29 125 91 43 99 -7 -156 -74 -94 0 -160 -89 -80 -73 -119 -12
7782 -12 -82 -85 126 137 135 51 -55 -18 34 27 -56 -34 -12 -6 -86 -28 2 -8 73 -41 59 -47 23 70 26 74 117 -38 102
7811 102 -134 -73 -94 -62 -94 111 18 5 99 150 -32 49 36 113 27 93 30 1 -166 -94 -43 -56 -52 -87 18 15 0 -30
7839 -30 93 145 -52 105 62 -92 -41 -25 -25 -73 -138 -34 -13 -109 13 -71 -104 -6 31 22 24 161 39 58 53 -45 -83 37
7867 37 -110 -134 11 -94 -94 -64 49 17 -40 43 60 4 -89 -6 -12 85 27 16 -35 -60 61 -95 14 -25 -26 57 35 47
7895 47 12 67 95 -10 -1 115 -23 -6 -63 -172 -79 -131 -26 7 -2 -2 -57 -15 34 95 36 105 -79 34 -15 -29 -103 27
7923 27 -7 -60 -103 -52 -173 -37 0 3 17 40 50 42 -103 -18 59 -40 -62 -62 -101 -128 -30 49 8 -86 -35 -42 52 207 88 23
7953 23 23 -38 -76 -58 29 20 -27 -31 -141 -52 -51 80 -29 22 -26 -19 33 52 46 28 85 38 -60 -57 -39 -110 22 92 -71 -194 -13
7984 -13 41 -86 100 27 130 83 137 36 -12 -95 5 -81 -143 30 -152 -67 106 16 33 132 67 68 74 46 -23 12 48
8011 48 -43 -101 -100 45 -52 -45 -68 -139 3 88 96 10 86 50 -1 107 78 -84 -121 136 -73 41 37 53 47 -26 -65 -160 102
8040 102 37 -12 -27 150 79 -18 74 2 -72 -2 35 -58 -56 -175 -114 -50 -53 -50 -88 85 -29 6 38 100 73 -52 -108 -13 20
8069 20 -114 -71 -11 5 -19 109 -63 34 31 155 11 120 74 26 66 27 -107 -58 -122 43 -38 -93 -1 -78 -42 -24 -37
8096 -37 -54 111 28 9 98 129 15 4 -4 11 -110 -61 -65 -73 -10 59 22 -49 -26 53 22 -19 99 7 109 -28 -71 -78 -86 -68
8126 -68 49 -56 -6 13 29 -28 123 50 -5 88 127 88 21 67 -57 9 -7 -218 -70 -35 28 13 8 -60 43 95 21
8153 21 57 76 17 -8 -35 135 -148 132 -151 -132 -87 -130 -95 -141 -89 -10 -16 8 110 2 21 61 72 71 -60 12 -140
8180 -140 -42 -82 -107 -46 24 -15 2 164 138 224 96 47 44 74 -81 80 -51 18 -90 -49 -68 55 -157 10 16 69
8206 69 129 195 119 -7 130 104 -2 -47 -65 -35 -133 -58 -67 -105 9 -8 17 11 -65 -28 43 74 62 120 68 -6 71 62 -63
8235 -63 -111 25 4 -56 -48 -28 -33 50 39 159 5 183 86 125 29 -40 -54 -56 -81 -173 93 -16 -77 10 106 -28 4 -12
8263 -12 15 144 -55 9 -4 -92 -148 48 -154 -86 -54 -28 -63 -70 -17 56 128 -21 101 100 23 19 93 8 -41 92 -116 -101
8291 -101 51 -33 17 16 -79 -48 7 21 17 89 97 -85 10 -113 -70 -62 19 -101 5 -89 -25 44 -30 -54 -51 88 45 12 56
8320 56 53 -29 57 -94 -11 -71 -74 13 20 -36 -95 -56 -17 -83 63 81 37 34 7 89 90 142 -20 -67 -16 -21 -138 -34 28 -99
8350 -99 26 4 59 16 -51 21 -47 -68 114 14 32 57 -76 8 -58 36 -86 -120 -4 100 31 -25 91 12 33 85
8376 85 -14 -14 55 -39 -56 -26 79 57 -67 -38 -22 -49 32 72 -3 41 7 13 142 70 -16 -53 58 34 -5 -22 -201 -169 -38
8405 -38 -37 -42 -51 -107 28 34 70 137 -25 171 -11 -52 -52 13 -123 -133 123 -27 -35 4 19 75 69 61 4 -54 95 -82 67
8434 67 72 -139 -65 -55 -41 -184 -123 55 -108 32 -47 38 -17 -1 18 100 -7 94 65 -105 -51 -60 -128 -92 -65 -4 32
8461 32 36 -57 -16 97 15 -10 53 72 67 6 92 -71 -107 -65 -62 -45 -38 56 9 41 57 13 -158 165 53 61 67 127 -63 -79
8491 -79 29 -235 -34 5 23 -51 6 -64 -84 -11 68 29 -53 2 81 -63 39 -37 -140 -35 -70 3 16 -41 33 125 -43
8518 -43 90 82 133 176 28 -118 21 8 -30 -46 40 -113 -36 -3 -78 -144 33 48 -119 56 117 17 -18 119 -40
8543 -40 -129 -19 -37 -33 -24 -95 -32 -9 -160 14 -63 -38 82 -94 73 113 48 -37 -25 87 9 -94 116 -58 -4 -43
8569 -43 38 -48 -33 127 27 131 92 7 73 52 -40 -105 96 -45 1 -108 26 -65 -46 8 -7 76 65 2 66 71 103
8596 103 154 33 87 0 -21 -76 -117 -95 -107 16 -184 -15 56 -43 63 113 35 153 -12 98 151 -15 -79 -4 -144
8621 -144 -2 59 -35 34 -52 9 -9 -4 158 125 42 -14 -40 88 -8 -43 -88 -70 -116 -21 -15 -44 -103 -111 27 -91 100 96 58
8650 58 24 80 183 -80 44 -69 -14 8 -50 -70 -78 58 -2 -48 141 127 92 -1 116 42 88 51 47 -27 -7 -65 -131 -135
8678 -135 -67 20 -94 -13 69 176 31 59 43 -33 -45 38 -4 7 37 -113 -85 -113 -123 -103 -64 111 -77 9 197 100
8704 100 123 57 62 -57 2 3 -10 -66 -4 -154 -7 -35 -62 -81 21 2 37 -32 13 67 -107 22 63 44 -8 -130 -162
8731 -162 -63 -40 14 -166 -40 -79 -27 2 -18 -101 105 81 103 10 -7 -2 -77 29 -5 37 -181 -56 34 -60 41 1 -28
8758 -28 155 81 -3 174 195 -42 -73 37 61 -32 43 -16 -49 -123 -35 -51 -4 102 -15 30 51 39 -68 52 34 -7
8784 -7 -43 51 -95 -21 -73 -26 12 54 15 -18 -9 34 114 -4 69 31 -44 84 32 12 37 52 20 -11 -34 64 -17 26 24 14
8814 14 5 76 94 -17 28 57 -102 7 -128 -84 -43 -24 108 -25 -65 -10 -38 -77 124 38 -7 40 56 165 -138 41
8840 41 -91 16 -60 20 -72 -5 -118 -88 -5 96 114 145 25 72 81 -13 43 -122 -58 71 -64 -82 -49 72 -106 -5
8866 -5 7 147 57 49 32 27 24 -41 -44 50 21 -157 -36 -197 -72 -49 30 -26 -20 50 109 8 140 141 -29 98 239 -27
8894 -27 -42 -68 -30 -48 -47 152 -36 -43 -32 146 -54 -28 -75 -18 25 -83 84 -67 -96 -72 -29 37 59 -87 -96 -3 1 -42
8922 -42 139 59 -12 64 -12 20 -164 -29 -92 -5 -96 -81 -48 -27 -130 -82 98 112 46 -37 41 171 -28 -182 55 -81
8948 -81 24 -123 -57 -85 -8 -87 51 -53 98 -13 103 37 105 22 67 32 14 -10 -78 -48 -159 -101 -10 -126 -34 21
8974 21 -63 -12 101 -43 16 79 54 -5 -70 -51 23 -27 -110 -2 13 -39 -74 -75 -44 -14 -80 1 86 67 -93 36 137 -29
9002 -29 44 20 -72 -73 18 39 -5 -103 -101 134 122 95 -20 40 -12 56 81 -88 -57 -130 -94 52 -46 -60 -26 -154 -58 -66 -21
9031 -21 -16 139 76 -6 -42 125 101 -40 -86 17 -68 -27 -51 47 27 19 101 40 48 77 145 41 201 108 45 94 -24 -2
9059 -2 64 -85 -30 21 20 -95 29 38 -62 21 -42 105 -49 -33 -77 78 -117 -79 58 -23 -120 -7 0 -48 -85 -145 -34
9086 -34 -92 20 88 2 25 81 -91 2 88 59 -17 -113 -119 -12 -135 -21 -142 -53 -35 45 -60 64 -39 7 119 84
9112 84 61 -101 55 -1 -75 -116 -47 -102 93 -19 -31 -29 -61 86 108 98 -154 -28 -29 -70 -63 -120 -11 -82 28 -177 -30
9139 -30 -103 103 102 84 96 60 -20 5 -13 82 92 -13 -133 -101 -61 -134 -78 45 52 10 8 35 -3 91 -25 -2 24 54 124
9168 124 22 -27 -43 34 70 -137 -108 28 18 35 3 144 69 91 -19 89 97 39 11 -81 -25 30 45 -103 24 48
9194 48 -48 -129 50 59 35 -82 107 83 46 152 84 -117 -20 1 -94 4 -102 -58 -69 -5 -73 2 -35 42 46 38 110 -75
9222 -75 104 -89 0 -45 -27 -43 -58 66 13 -27 -82 -46 -43 60 -15 18 110 101 -47 16 57 -21 -21 24 -1 -37 -68 -58 58
9251 58 -88 -57 79 10 72 33 -24 -5 5 -120 -16 -146 -72 -120 -13 -12 15 -12 -16 147 -30 -15 37 79 47 69 -7
9278 -7 -23 -103 16 59 -68 -51 -103 -44 -4 47 52 91 49 25 17 166 70 53 39 -56 -38 -96 64 -45 -135 -4 75 -135
9306 -135 56 10 67 51 53 -29 -70 -3 8 -74 -117 -195 29 -14 24 -3 -56 -114 -83 -56 -17 29 -60 -68 53 112 56 99 7
9335 7 -103 -126 -47 9 4 125 1 -4 51 66 138 32 123 2 3 -39 -90 38 10 -44 -46 -8 -4 -79 -3 89 78 -52 -32 41
9365 41 75 -19 -25 -16 26 -76 -156 -105 -32 90 15 -66 18 -67 100 53 108 149 131 33 -34 -57 50 109 23 -28 -167 -54
9393 -54 91 -40 19 18 92 -4 -99 -42 85 123 -18 214 62 -97 -65 107 -48 -70 -177 -153 3 86 -114 72
9417 72 -8 47 111 -107 98 -13 41 -114 -46 33 35 -115 48 37 -10 -9 -14 69 -8 82 41 69 89 -10 73 89 94 122 21
9446 21 -35 -16 -53 -80 -208 -21 13 -70 66 -30 82 31 -96 -37 -40 144 -47 -64 -62 -91 -47 -3 -44 19 66 145 134 -47
9474 -47 36 102 -35 -44 124 -16 -70 -27 48 -30 -76 -45 -16 13 6 -21 43 66 -2 18 187 5 -12 -70 -37 71 68 -83
9502 -83 -118 -107 -87 -1 -11 -133 11 1 71 158 109 136 16 21 -61 -35 -24 23 -38 -112 -34 -20 77 29 70 14 45 33 105
9531 105 59 75 72 27 27 23 -5 25 -103 -37 -75 -110 -5 82 33 -55 79 27 -93 10 -44 -25 -53 114 55 -27 41 -69
9559 -69 -129 7 18 1 -22 -8 113 -43 19 57 73 30 34 -76 -110 -46 3 33 82 58 34 -8 -46 -19 43 -18 86 6
9587 6 -7 83 56 -117 69 -164 -14 -56 -59 -32 -79 -94 -73 -34 44 5 -56 -127 -14 107 8 -8 -35 -52 112 0 -86
9614 -86 120 83 74 -125 -76 73 -122 134 -84 89 -7 7 96 -2 -65 6 52 54 -62 -29 -62 -44 -103 -1 -66 -33 35
9641 35 24 29 43 -67 -104 -30 -39 -136 -104 -58 -181 -142 -34 5 81 67 88 -14 7 -10 132 50 -30 -101 -67 3 79 -51
9669 -51 -20 59 -5 -74 2 22 -1 2 27 147 122 3 -61 -68 -82 -1 -41 -36 46 40 0 -55 -13 76 10 -15 50 -69 58 -10
9699 -10 -53 6 -131 -23 -90 -25 4 -107 -9 50 -60 -13 -2 -141 127 50 -159 61 128 120 4 -66 6 -42 -34 117
9725 117 -107 26 -19 -15 84 85 20 17 -5 -139 70 76 -96 -90 -115 -142 78 -89 -23 -92 105 -12 -43 85 -45 -74 32
9752 32 -21 -121 45 48 -34 5 -28 4 -34 62 -85 24 44 77 96 -44 104 -32 19 21 -15 23 -2 -143 9 22 -38
9779 -38 71 31 17 18 -58 -21 -14 -38 113 -42 -77 -13 111 -17 -88 -21 -92 -173 -85 18 5 44 48 8 12 139 -113 61
9807 61 2 -81 149 50 -42 21 -4 -100 -62 -2 -12 -72 -25 46 82 -12 14 -5 56 29 41 -52 -92 95 -22 -32 -112 -108 62
9836 62 -49 22 11 36 -5 116 17 -60 52 104 -59 36 -60 121 -86 14 16 -81 58 -33 66 126 222 59 93 18
9862 18 35 18 -25 9 13 13 -6 65 -61 -15 90 9 41 97 14 -44 151 22 80 109 -16 28 39 -136 -111 -41 49 -35
9890 -35 34 106 25 -18 63 27 36 60 -29 -22 -69 -74 65 17 51 -4 -87 38 -100 -4 -16 43 0 18 79 97 50 38 20 -5
9920 -5 -18 49 -169 8 -29 -19 -23 18 31 -70 -43 -13 101 15 38 -68 20 -5 65 -18 -30 -61 -37 86 5 105 -134
9947 -134 -10 38 94 2 -9 -6 13 112 8 -3 51 -66 42 -37 -34 26 -28 18 117 -6 81 -11 9 20 23 53 -105 -111 -35
9976 -35 1 -14 -57 51 -16 -96 109 11 -77 43 105 85 6 81 -19 12 32 98 95 -61 24 -24 -9 -25 152 -28 2
10003 2 -81 0 22 -5 -60 -50 1 -73 66 -24 -24 28 -90 -32 -48 -63 -47 45 27 4 88 69 46 -24 52 -3 -15 -105 -59 -17
10033 -17 -83 -96 24 -32 -40 78 -46 -1 -67 118 151 2 63 -8 -21 -54 13 51 -40 -113 -65 148 -79 -33 -74 61
10059 61 16 41 87 101 -47 -5 51 18 -56 -55 -37 20 46 42 -18 14 -3 106 -52 27 -45 52 -3 -44 -12 -12 -92 -78 -19 -22
10089 -22 64 -56 -137 59 2 -22 20 88 110 27 89 3 87 22 34 32 70 16 -3 88 -29 116 -87 159 -13 -56 125
10116 125 82 -4 -85 82 -11 -77 -56 55 -7 -15 -65 -60 -60 11 -73 -111 -40 93 -21 12 -10 0 -86 36 -77 45 7
10143 7 -34 -42 -130 -41 -58 -10 23 57 0 104 17 43 84 75 -72 -172 72 16 -48 17 -29 40 -22 18 -81 41 66 62 -224
10172 -224 29 -102 -29 -50 -68 5 35 -5 59 -39 13 -46 -57 52 11 41 4 196 -22 -7 -8 -103 -37 -5 73 -62 -102
10199 -102 -63 -65 -11 90 -48 3 58 151 -12 0 -28 -31 13 47 -26 -60 -10 -128 11 13 11 -144 -82 80 39 -33 27 -30
10227 -30 -63 -18 0 28 -117 -75 8 10 -146 -21 7 102 -79 98 85 119 -23 170 -25 -29 53 113 -100 25 -59 -16
10253 -16 17 -92 -58 -17 57 -35 -63 -11 38 91 67 -29 -54 74 -27 -88 -50 88 -55 -57 30 -56 -6 -2 1 -19 13 -46 -21
10282 -21 17 55 -41 -21 74 -101 -9 20 -18 -7 -53 14 -182 26 -1 44 47 0 5 -127 114 48 -33 -46 74 11 -61 25
10310 25 25 22 46 -62 8 -44 -30 5 110 78 3 -36 69 -130 7 -63 -49 -64 -35 -151 10 -15 -65 -45 69 -14 27
10337 27 11 17 97 26 155 -49 -37 43 -83 -107 83 -65 -61 57 60 1 -39 37 -2 62 48 54 36 13 47 -41 -49 -61 -134
10366 -134 -35 46 142 -173 -68 -60 51 6 32 46 11 -3 -35 67 -94 53 -134 -94 -33 7 -12 -55 -68 87 28 -36
10392 -36 23 35 -90 -163 -66 34 58 21 -7 0 -56 -78 -118 -82 11 4 73 61 -49 102 39 8 -103 -94 -10 -90 -95 31 77
10421 77 -71 33 127 33 -3 76 96 121 77 -35 48 80 -118 -105 -153 0 -40 -62 -102 -168 116 40 -63 53 1 3
10447 3 56 136 74 -112 -71 -153 -9 14 -108 -53 34 -33 128 129 21 25 -11 1 91 -17 -41 -11 -30 34 2 -31 -107 -35
10475 -35 -73 -3 -42 -41 13 15 81 53 32 -111 41 13 -1 53 8 64 -21 -80 54 37 38 5 71 58 -14 28 6 -31 49 65
10505 65 -152 -70 -28 -100 113 -114 -21 -47 40 -42 13 -4 58 -65 26 117 -17 19 97 -72 -9 0 19 -66 -85 -93 31
10532 31 8 31 94 -108 5 -26 153 14 17 87 65 -35 31 -81 78 113 -38 10 -91 11 45 82 -14 -22 -9 117
10558 117 72 42 -29 79 -52 -138 -11 18 -46 25 -22 -59 9 -6 35 39 -19 5 -14 6 -88 -144 100 2 -123 -73 38
10585 38 134 -47 15 -180 163 44 -30 103 71 153 -8 -25 -21 10 98 -20 7 -113 -62 -95 -71 -136 1 -33 1 160
$$ [...]
16383d9
##END NTUPLES=NMR FID
##END=
