##TITLE=abcd
##JCAMPDX= 6.0         $$ Bruker NMR JCAMP-DX V2.0
##DATA TYPE= NMR SPECTRUM
##DATA CLASS= NTUPLES
##ORIGIN= UXNMR, Bruker Analytische Messtechnik GmbH
##OWNER= root
$$ XWIN-NMR		Version 3.5
$$ Mon Aug 18 18:50:54 2025 Russian Standard Time (UT+4h)  servis@DPX200
##.OBSERVE FREQUENCY= 200.131235884673
##.OBSERVE NUCLEUS= ^1H
##.ACQUISITION MODE= SIMULTANEOUS
##.ACQUISITION SCHEME= undefined
##.AVERAGES= 32
##.DIGITISER RES= 18
##SPECTROMETER/DATA SYSTEM= spect
##.PULSE SEQUENCE= zg
##.SOLVENT NAME= CDCl3
##.SHIFT REFERENCE= (INTERNAL, CDCl3, 0, 16.4885)
##AUDIT TRAIL= $$ (NUMBER, WHEN, WHO, WHERE, WHAT)
$$ ##TITLE= Audit trail, XWIN-NMR		Version 3.5
$$ ##JCAMPDX= 5.01
$$ ##ORIGIN= Bruker BioSpin GmbH
$$ ##OWNER= servis
$$ F:\spectra/data/av/nmr/H1/1/pdata/1/auditp.txt
$$ ##AUDIT TRAIL=  $$ (NUMBER, WHEN, WHO, WHERE, WHAT)
(   1,<2025-08-18 18:48:57.06 +0400>,<servis>,<DPX200>,
      <created by zg, POWCHK disabled, PULCHK disabled
       configuration hash MD5:
       00 E9 B6 7A A2 85 ED C7 34 08 36 98 17 FE 4E 26
       data hash MD5: 32K
       EE C4 50 11 83 D5 0B D1 C5 21 3B 43 D8 F7 C4 26>)
(   2,<2025-08-18 18:50:20.89 +0400>,<servis>,<DPX200>,
      <Start of raw data processing
       efp BC_mod = 2 LB = 0.05 FT_mod = 6 PKNL = 1 PHC0 = -195.2202 PHC1 = 0.101552 SI = 16K 
       data hash MD5: 16K
       5C 3A 31 65 8A 94 1E 05 1B ED F8 CC 18 34 D8 AF>)
$$ ##END=
$$ 
$$ hash MD5
$$ 1F A4 04 C4 39 9C D9 42 E2 B1 66 A4 C6 A0 FF 72
##$RELAX= 
##$RELAX= 
##$RELAX= 
##$RELAX= 
##$RELAX= 
##$RELAX= 
##$RELAX= 
##$RELAX= 
$$ Bruker specific parameters
$$ --------------------------
##$DU= <F:\spectra>
##$EXPNO= 1
##$NAME= <H1>
##$PROCNO= 1
##$TYPE= <nmr>
##$USER= <av>
##$AMP= (0..31)
100 100 100 100 100 100 100 100 100 100 100 100 100 100 100 100 100 100 
100 100 100 100 100 100 100 100 100 100 100 100 100 100 
##$AQSEQ= 0
##$AQ_mod= 1
##$AUNM= <au_zg>
##$AUTOPOS= <>
##$BF1= 200.13
##$BF2= 200.13
##$BF3= 200.13
##$BF4= 200.13
##$BF5= 500.13
##$BF6= 500.13
##$BF7= 500.13
##$BF8= 500.13
##$BYTORDA= 1
##$CFDGTYP= 0
##$CFRGTYP= 5
##$CHEMSTR= <none>
##$CNST= (0..31)
1 1 145 1 1 1 1 1 1 1 1 1 1 1 1 1 1 1 1 1 1 1 1 1 1 1 1 1 1 1 1 1 
##$CPDPRG= <>
##$CPDPRG1= <>
##$CPDPRG2= <>
##$CPDPRG3= <>
##$CPDPRG4= <mlev>
##$CPDPRG5= <mlev>
##$CPDPRG6= <mlev>
##$CPDPRG7= <mlev>
##$CPDPRG8= <mlev>
##$CPDPRGB= <>
##$CPDPRGT= <>
##$D= (0..31)
0 2 0 0 0 0 0 0 0 0.06 0 0 0 0 0 0 0.0002 0 0 0 0 0 0 0 0 0 0 0 0 0 0 
0 
##$DATE= 1755528536
##$DBL= (0..7)
120 120 120 120 120 120 120 120 
##$DBP= (0..7)
150 150 150 150 150 150 150 150 
##$DBP07= 0
##$DBPNAM0= <>
##$DBPNAM1= <>
##$DBPNAM2= <>
##$DBPNAM3= <>
##$DBPNAM4= <>
##$DBPNAM5= <>
##$DBPNAM6= <>
##$DBPNAM7= <>
##$DBPOAL= (0..7)
0.5 0.5 0.5 0.5 0.5 0.5 0.5 0.5 
##$DBPOFFS= (0..7)
0 0 0 0 0 0 0 0 
##$DE= 6
##$DECBNUC= <off>
##$DECIM= 32
##$DECNUC= <off>
##$DECSTAT= 4
##$DIGMOD= 1
##$DIGTYP= 9
##$DL= (0..7)
0 120 120 120 120 120 120 120 
##$DP= (0..7)
150 150 150 150 150 150 150 150 
##$DP07= 0
##$DPNAME0= <>
$$ [...]
##$SUBNAM4= <"">
##$SUBNAM5= <"">
##$SUBNAM6= <"">
##$SUBNAM7= <"">
##$SUBNAM8= <"">
##$SUBNAM9= <"">
##$SW= 20.6817932712277
##$SWIBOX= (0..15)
0 0 3 0 0 0 0 0 0 0 0 0 0 0 0 0 
##$SW_h= 4139.07284768212
##$TD= 32768
##$TD0= 1
##$TE= 0
##$TE2= 300
##$TE3= 300
##$TEG= 300
##$TL= (0..7)
0 120 120 120 120 120 120 120 
##$TP= (0..7)
150 150 150 150 150 150 150 150 
##$TP07= 0
##$TPNAME0= <>
##$TPNAME1= <>
##$TPNAME2= <>
##$TPNAME3= <>
##$TPNAME4= <>
##$TPNAME5= <>
##$TPNAME6= <>
##$TPNAME7= <>
##$TPOAL= (0..7)
0.5 0.5 0.5 0.5 0.5 0.5 0.5 0.5 
##$TPOFFS= (0..7)
0 0 0 0 0 0 0 0 
##$TUNHIN= 0
##$TUNHOUT= 0
##$TUNXOUT= 0
##$USERA1= <user>
##$USERA2= <user>
##$USERA3= <user>
##$USERA4= <user>
##$USERA5= <user>
##$V9= 5
##$VALIST= <valist>
##$VCLIST= <CCCCCCCCCCCCCCC>
##$VD= 0
##$VDLIST= <DDDDDDDDDDDDDDD>
##$VPLIST= <PPPPPPPPPPPPPPP>
##$VTLIST= <TTTTTTTTTTTTTTT>
##$WBST= 1024
##$WBSW= 30
##$XGAIN= (0..3)
0 0 0 0 
##$XL= 0
##$YL= 0
##$YMAX_a= 70982
##$YMIN_a= -51054
##$ZGOPTNS= <>
##$ZL1= 120
##$ZL2= 120
##$ZL3= 120
##$ZL4= 120
##$ABSF1= 0
##$ABSF2= 0
##$ABSG= 0
##$ABSL= 0
##$ALPHA= 0
##$AQORDER= 0
##$ASSFAC= 0
##$ASSFACI= 0
##$ASSFACX= 0
##$ASSWID= 0
##$AUNMP= <proc_1d>
##$AZFE= 0.1
##$AZFW= 0.1
##$BCFW= 0
##$BC_mod= 2
##$BYTORDP= 0
##$COROFFS= 0
##$CY= 18.4799938201904
##$DATMOD= 1
##$DC= 0
##$DFILT= <>
##$DTYPP= 0
##$F1P= 9.9274215381318
##$F2P= -0.165520771350173
##$FCOR= 1
##$FTSIZE= 16384
##$FT_mod= 6
##$GAMMA= 0
##$GB= 0
##$INTBC= 1
##$INTSCL= 4.127829e-11
##$ISEN= 128
##$LB= 0.05
##$LEV0= 0
##$LPBIN= 0
##$MAXI= 10000
##$MC2= 0
##$MEAN= 0
##$ME_mod= 0
##$MI= 50
##$NCOEF= 0
##$NC_proc= -8
##$NLEV= 6
##$NOISF1= 3.799351
##$NOISF2= 2.8
##$NSP= 0
##$NTH_PI= 0
##$NZP= 0
##$OFFSET= 16.48848
##$PC= 4
##$PHC0= -195.2202
##$PHC1= 0.101552
##$PH_mod= 1
##$PKNL= yes
##$PPARMOD= 0
##$PSCAL= 4
##$PSIGN= 0
##$REVERSE= no
##$SF= 200.130005582386
##$SI= 16384
##$SIGF1= 3
##$SIGF2= 2
##$SINO= 400
##$SIOLD= 16384
##$SREGLST= <1H.CDCl3>
##$SSB= 0
##$STSI= 16384
##$STSR= 0
##$SW_p= 4139.07284768211
##$SYMM= 0
##$S_DEV= 0
##$TDeff= 32768
##$TDoff= 0
##$TI= <>
##$TILT= no
##$TM1= 0
##$TM2= 0
##$TOPLEV= 0
##$USERP1= <user>
##$USERP2= <user>
##$USERP3= <user>
##$USERP4= <user>
##$USERP5= <user>
##$WDW= 1
##$XDIM= 16384
##$YMAX_p= 439014530
##$YMIN_p= -6409364
$$ End of Bruker specific parameters
$$ ---------------------------------
##NTUPLES= NMR SPECTRUM
##VAR_NAME=  FREQUENCY,     SPECTRUM/REAL,   SPECTRUM/IMAG
##SYMBOL=    X,             R,               I
##VAR_TYPE=  INDEPENDENT,   DEPENDENT,       DEPENDENT
##VAR_FORM=  AFFN,          ASDF,            ASDF
##VAR_DIM=   16384,         16384,           16384
##UNITS=     HZ,            ARBITRARY UNITS, ARBITRARY UNITS
##FACTOR=    0.252644378177508, 1,           1
##FIRST=     3299.83951724647, 0,            0
##LAST=      -839.233330435636, 0,           0
##MIN=       -839.233330435636, -6409364,    0
##MAX=       3299.83951724647, 439014530,    0
$$ Real data points
##PAGE= N=1
##DATA TABLE= (X++(R..R)), XYDATA
$$ [...]
$$ plain form
5461 358811 473555 586757 384632 442787 382925 365186 415889 456694 431093 482887 454298
5450 454298 365318 364071 351914 498838 376034 453177 293911 424318 513549 491856 399283
5439 399283 434310 343221 489905 370055 467606 453755 497906 518638 387438 457238 598840
5428 598840 582848 427432 602414 584006 500140 632091 557750 558745 598634 443534 405457
5417 405457 448992 461531 586802 575601 633424 536539 615857 622592 694783 652825 656884 675622
5405 675622 566223 624226 656630 626699 641200 687121 749347 792794 866858 948507 854415
5394 854415 1061259 958114 1042783 1064137 1132614 1165930 1137684 1024363 986211 1158456 1159295
5383 1159295 1229408 1195404 1040261 1088258 990382 945143 1024553 921634 959563 1129870 821140
$$ packed form
5461C58811J14744J13202k02125N8155n9862j7739N0703M0805k5601N1794k8589
5450D54298q8980j247j2157J46924j22804P7143j59266J30407Q9231k1693r2573
5439C99283L5027r1089J46684j19850R7551j3851M4151K0732j31200O9800J41602
5428E98840j5992j55416J74982j8408q3866J31951p4341R95L9889j55100l8077
5417D05457M3535J2539J25271j1201N7823r6885P9318O735P2191m1958M059J8738
5405F75622j09399N8003L2404k9931J4501M5921O2226M3447P4064Q1649r4092
5394H54415K06844j03145Q4669K1354O8477L3316k8246j13321l8152J72245Q39
5383A159295P0113l4004j55143M7997r7876m5239P9410j02919L7929J70307l08730
$$ plain form
5372 821140 903148 934669 841920 944865 908502 833676 886960 1038602 923813 972052 752636
5361 752636 867356 783557 693100 1011659 925898 978679 1004987 1012295 875690 999817 970082
5350 970082 1055067 880197 976762 969507 857163 958176 929591 1046428 998767 950150 886738
5339 886738 868268 1025241 862849 945325 983399 860419 927150 981590 947231 1030037 913350
5328 913350 926279 921096 1003623 972418 953368 967290 1087705 1070157 937982 1080889 1096874
5317 1096874 1076265 1065472 1064544 1123023 1023752 1054160 997124 1025866 1074579 976646 940218 949355
5305 949355 929588 1030382 991678 991091 1172914 997113 969014 994002 1020084 1054465 1149190
5294 1149190 1059247 1004807 1171568 1053512 1115495 1216122 1068978 1166710 1188311 1271945 1139317
$$ packed form
5372H21140Q2008L1521r2749J02945l6363p4826N3284J51642j14789M8239k19416
5361G52636J14720q3799r0457L18559q5761N2781K6308P308j36605J24127k9735
5350I70082Q4985j74870R6565p255j12344J01013k8585J16837m7661m8617o3412
5339H86738j8470J56973j62392Q2476L8074j22980O6731N4440l4359Q2806j16687
5328I13350J2929n183Q2527l1205j9050J3922J20415j7548j32175J42907J5985
5317A096874k0609j0793r28N8479r9271L0408n7036K8742M8713r7933l6428R137
5305I49355j9767J00794l8704n87J81823j75801k8099K4988K6082L4381R4725
5294A149190q9943n4440J66761j18056O1983J00627j47144R7732K1601Q3634j32628
$$ plain form
5283 1139317 1199611 1181408 1115659 1137351 1182334 1010596 1200426 1359726 1274489 1261917 1398219
5272 1398219 1308538 1295520 1400623 1354681 1416102 1440943 1513133 1612067 1518989 1451771 1436001
5261 1436001 1598655 1544863 1630085 1684335 1624398 1738684 1587365 1508589 1611954 1506556
5251 1506556 1514879 1540780 1462869 1591144 1499738 1560047 1424515 1455309 1364203 1599460 1560202
5240 1560202 1639282 1666335 1604206 1762463 1655567 1632659 1602716 1729946 1676586 1805642 1700360
5229 1700360 1737377 1678992 1724605 1703054 1699292 1674493 1491724 1931289 1880361 1920511 1836730
5218 1836730 1955605 2008794 2014145 1941305 1900956 1938703 1948143 1970266 2055675 1998683 1891548
5207 1891548 1860723 1981174 1954759 1911693 1980585 2019644 2033217 1982375 2084878 2079267 2072822
$$ packed form
5283A139317O0294j8203o5749K1692M4983j71738J89830J59300q5237j2572J36302
5272A398219q9681j3018J05103m5942O1421K4841P2190R8934r3078o7218j5770
5261A436001J62654n3792Q5222N4250n9937J14286j51319p8776J03365j05398
5251A506556Q323K5901p7911J28275r1406O0309j35532L0794r1106K35257l9258
5240A560202P9080K7053o2129J58257j06896k2908k9943J27230n3360J29056j05282
5229A700360L7017n8385M5613k1551l762k4799j82769M39565n0928M0150q3781
5218A836730J18875N3189N351p2840m0349L7747R440K2123Q5409n6992j07135
5207A891548l0825J20451k6415m3066O8892L9059J3573n0842J02503n611o445
$$ plain form
5196 2072822 1982890 2124477 2241722 2000522 2183869 2113917 2070473 2214927 2183648 2232884
5186 2232884 2196719 2254658 2295910 2325169 2391144 2336806 2360074 2377694 2473631 2534471 2432017
5175 2432017 2422633 2564461 2652351 2658651 2753338 2871087 3022843 2916928 3077109 3185156 3182190
5164 3182190 3249450 3238844 3440685 3430150 3652126 3693315 3757981 3915326 3947340 4039087 4243431
5153 4243431 4390674 4494300 4724373 4938195 5004647 5224762 5340764 5389456 5420892 5477409
5143 5477409 5557417 5732578 5794728 5881951 5976205 6203712 6451308 6505562 6671147 6953425
5133 6953425 7081224 7272801 7633036 7786513 8085050 8419789 8557159 8747928 9169919 9229308
5123 9229308 9412122 9628729 9887574 10208706 10469023 11001255 11428587 11747736 12086917 12191529
$$ packed form
5196B072822q9932J41587J17245k41200J83347o9952m3444J44454l1279M9236
5186B232884l6165N7939M1252K9259O5975n4338K3268J7620R5937O0840j02454
5175B432017r384J41828Q7890O300R4687J17749J51756j05915J60181J08047k966
5164C182190O7260j0606K01841j0535K21976M1189O4666J57345L2014R1747K04344
5153D243431J47243J03626K30073K13822O6452K20115J16002M8692L1436N6517
5143E477409Q0008J75161O2150Q7223R4254K27507K47596N4254J65585K82278
5133F953425J27799J91577L60235J53477K98537L34739J37370J90769M21991N9389
5123I229308J82814K16607K58845L21132K60317N32232M27332L19149L39181J04612
$$ plain form
5113 12191529 12175573 12349751 12293168 12479152 12673665 12796925 12883794 13316089 13304693 13688895
5103 13688895 13745999 14176107 14530191 14936231 15583593 16098626 16476357 17192054 17541481 18012090
5093 18012090 18245995 18371938 18619504 18789415 18993737 19379101 19864170 20574707 21262879
5084 21262879 22513408 23704549 25132189 26938135 28955511 31134347 33166118 35219748
5076 35219748 36845511 37631883 38036090 38277380 38607186 39183242 40047623 41098495 41965028
5067 41965028 42421722 42334065 42053838 41906651 42503410 43294418 44494637 46152363 47955914
5058 47955914 49849598 51710728 52909245 53521002 53710485 53388927 53456716 53345866 53227931
5049 53227931 53135547 52876679 52195652 51323900 50054347 48595245 47180094 45391392 43951615
$$ packed form
5113A2191529j5956J74178n6583J85984J94513J23260Q6869M32295j1396L84202
5103A3688895N7104M30108L54084M06040O47362N15033L77731P15697L49427M70609
5093A8012090K33905J25943K47566J69911K04322L85364M85069P10537O88172
5084B1262879J250529J191141J427640J805946K017376K178836K031771K053630
5076C5219748J625763P86372M04207K41290L29806N76056Q64381J050872Q66533
5067D1965028M56694q7657k80227j47187N96759P91008J200219J657726J803551
5058D7955914J893684J861130J198517O11757J89483l21558O7789j10850j17935
5049E3227931r2384k58868o81027q71752j269553j459102j415151j788702j439777
$$ plain form
5040 43951615 42896125 42319516 42131381 42116639 42319105 42222975 41523787 40253207 38707379
5031 38707379 37015800 35818024 35154344 34448685 34112564 33033092 31582616 29539921 27465579
5022 27465579 25319038 23383597 21688165 19960303 18621574 17311512 16232471 15266994
5014 15266994 14303807 13753483 12917576 12275111 11723329 11261873 10728482 10385513 10066156
5005 10066156 9557903 9091583 8912044 8645891 8372685 8247273 8024618 7776306 7655564
4996 7655564 7430237 7231021 7192664 6839982 6599004 6465084 6227605 6118612 6096958 5917341
4986 5917341 5835800 5573760 5522265 5467444 5384733 5164881 5185764 5252167 4947290 4920007 4834062
4975 4834062 4831128 4772414 4628114 4562262 4442580 4467460 4457528 4312031 4241193 4122157 4158604
$$ packed form
5040D3951615j055490n76609j88135j4742K02466r6130o99188j270580j545828
5031C8707379j691579j197776o63680p05659l36121j079472j450476k042695k074342
5022B7465579k146541j935441j695432j727862j338729j310062j079041r65477
5014A5266994r63187n50324q35907o42465n51782m61456n33391l42969l19357
5005A0066156n08253m66320j79539k66153k73206j25412k22655k48312j20742
4996G655564k25327j99216l8357l52682k40978j33920k37479j08993k1654j79617
4986E917341q1541k62040n1495n4821q2711k19852K0883O6403l04877k7283q5945
4975D834062k934n8714j44300o5852j19682K4880r932j45497p0838j19036L6447
$$ plain form
4964 4158604 3925221 3975456 3900761 3733373 3748893 3756511 3693401 3544060 3644440 3369688 3178444
4953 3178444 3283275 3241764 3089384 3082706 3175115 3052268 2952395 2876517 2914482 2665534 2703828
4942 2703828 2669456 2611445 2427701 2507210 2209253 2423726 2362877 2251179 2151297 2053985 2039232
4931 2039232 2079314 2101001 2041733 1966013 1952215 2014258 1886494 1987860 1695595 1715065 1768111
4920 1768111 1846313 1717567 1744712 1733979 1623583 1680842 1677519 1628404 1594207 1466704 1695820
4909 1695820 1512381 1596755 1639666 1505423 1529666 1576274 1439648 1594175 1490955 1390633
4899 1390633 1455101 1392653 1458909 1568020 1351461 1517363 1368306 1510352 1383113 1387674
4889 1387674 1468922 1507871 1496983 1396730 1441704 1348403 1296015 1445026 1326873 1451901 1409303
$$ packed form
4964D158604k33383N0235p4695j67388J5520P618o3110j49341J00380k74752j91244
4953C178444J04831m1511j52380o678R2409j22847r9873p5878L7965k48948L8294
4942B703828l4372n8011j83744P9509k97957K14473o0849j11698r9882r7312j4753
4931B039232M0082K1687n9268p5720j3798O2043j27764J01366k92265J9470N3046
4920A768111P8202j28746K7145j0733j10396N7259l323m9115l4197j27503K29116
4909A695820j83439Q4374M2911j34243K4243M6608j36626J54527j03220j00322
4899A390633O4468o2448O6256J09111k16559J65902j49057J42046j27239M561
4889A387674Q1248L8949j0888j00253M4974r3301n2388J49011j18153J25028m2598
$$ plain form
4878 1409303 1402806 1388626 1374234 1318534 1260001 1256346 1370958 1272102 1271171 1261662 1177604 1100380
4866 1100380 1196803 1180121 1370912 1254883 1195960 1183056 1227239 1294853 1272546 1287769 1203941
4855 1203941 1285388 1337192 1241061 1237400 1346449 1202451 1154794 1225721 1253017 1279846 1311122
4844 1311122 1176766 1276367 1204699 1159572 1211915 1139600 1163414 1289737 1146158 1244456 1113147
4833 1113147 1228668 1238952 1326477 1161128 1178837 1096736 887908 1235392 1079431 1241333
4823 1241333 1121885 1278483 1226480 1001729 1137594 1210210 1102237 1058580 1180524 1266482
4813 1266482 1080432 1147429 1167968 1064221 1161027 1174546 1211622 1166924 1079959 1203861 1138962
4802 1138962 1173913 1116417 1069989 995989 1205255 1183903 1166504 1097548 1150739 1157362 1219237
$$ packed form
4878A409303o497j4180j4392n5700n8533l655J14612r8856r31r509q4058p7224
4866A100380R6423j6682J90791j16029n8923j2904M4183O7614k2307J5223q3828
4855A203941Q1447N1804r6131l661J09049j43998m7657P0927K7296K6829L1276
4844A311122j34356R9601p1668m5127N2343p2315K3814J26323j43579R8298j31309
4833A113147J15521J0284Q7525j65349J7709q2101k08828L47484j55961J61902
4823A241333j19448J56598n2003k24751J35865P2616j07973m3657J21944Q5958
4813A266482j86050O6997K0539j03747R6806J3519L7076m4698q6965J23902o4899
4802A138962L4951n7496m6428p4000K09266k1352j7399o8956N3191O623O1875
$$ plain form
4791 1219237 1244807 1089864 1258273 1263081 1213033 1325076 1229030 1314940 1285466 1318056 1308382
4780 1308382 1339231 1316254 1232941 1384605 1248707 1218178 1424511 1301471 1344927 1293594 1394444
4769 1394444 1312929 1490248 1381371 1478474 1382243 1400271 1516775 1470587 1494958 1475090 1453975
4758 1453975 1466077 1567421 1420748 1511065 1719745 1601075 1558201 1676561 1683756 1567477
4748 1567477 1605325 1528453 1538436 1660929 1619788 1670412 1663915 1660912 1845240 1792065 1948998
4737 1948998 1834927 1869527 1904239 2018338 2015004 1979876 1991237 1990765 2093248 2110461 2129238
4726 2129238 2172067 2056389 2081271 2209949 2151489 2115401 2094451 2086472 2076424 2072129 1934548
4715 1934548 2115684 2034936 2251127 2144803 2204953 2275034 2168796 2265750 2254809 2347115 2276633
$$ packed form
4791A219237K5570j54943J68409M808n0048J12043r6046Q5910k9474L2590r674
4780A308382L0849k2977q3313J51664j35898l0529K06333j23040M3456n1333J00850
4769A394444q1515J77319j08877R7103r6231J8028J16504m6188K4371j9868k1115
4758A453975J2102J01344j46673R0317K08680j18670m2874J18360P195j16279
4748A567477L7848p6872R983J22493m1141N0624o497l003J84328n3175J56933
4737A948998j14071L4600L4712J14099l334l5128J1361m72J02483J7213J8777
4726B129238M2829j15678K4882J28678n8460l6088k0950p979j0048m295j37581
4715A934548J81136q0748K16191j06324O0150P0081j06238R6954j0941R2306p0482
$$ plain form
4704 2276633 2487953 2315824 2364347 2512676 2419702 2265863 2532697 2467336 2349677 2414168
4694 2414168 2559345 2380087 2496745 2460449 2486521 2521724 2624136 2639655 2754963 2685035
4684 2685035 2687815 2814773 2811275 2882112 3022329 3152171 3356729 3396553 3462252 3764094 4019408
4673 4019408 3951022 4141998 4319166 4527952 4891034 4768383 4931440 4895776 4631602 4603132
4663 4603132 4755168 4546939 4448647 4547219 4399483 4432338 4375577 4405456 4343660 4369008 4446634
4652 4446634 4463645 4375496 4379645 4427143 4652796 4739948 4916417 4918652 5106087 5462795 5672151
4641 5672151 5883049 6228179 6460533 6982974 7532855 8231174 8784219 9662467 10536523 11450260
4631 11450260 12364083 13017732 13474620 13388638 13306535 13183400 12799240 12824456 12784406 13172168
$$ packed form
4704B276633K11320j72129M8523J48329r2974j53839K66834o5361j17659O4491
4694B414168J45177j79258J16658l6296K6072L5203J02412J5519J15308o9928
4684B685035K780J26958l498P0837J40217J29842K04558L9824O5699L01842K55314
4673D019408o8386J90976J77168K08786L63082j22651J63057l5664k64174k8470
4663D603132J52036k08229r8292R8572j47736L2855n6761K9879o1796K5348P7626
4652D446634J7011q8149M149M7498K25653Q7152J76469K235J87435L56708K09356
4641E672151K10898L45130K32354N22441N49881O98319N53045Q78248Q74056R13737
4631A1450260R13823O53649M56888q5982q2103j23135l84160K5216m0050L87762
$$ plain form
4621 13172168 13076942 12764340 11905789 11247514 10504562 9698779 8925267 8182690 7563158 7349248
4611 7349248 6978818 6539411 6480363 6136940 5926221 5604752 5537359 5347454 5217477 5011312
4601 5011312 4988789 4959360 4813648 4674968 4605857 4683824 4455445 4444478 4370494 4385345 4399825
4590 4399825 4133439 4247941 4202576 4134693 4288065 4280742 4183691 4066694 4144251 4209306 4250301
4579 4250301 4211761 4256809 4234984 4378995 4377917 4403308 4474465 4401504 4619534 4613520 4730232
4568 4730232 4865525 4796152 4962520 4999648 5069262 5206273 5346240 5462452 5602975 5741495
4558 5741495 5899112 5948528 6134100 6140856 6319452 6496359 6661885 6750944 6854150 7207621
4548 7207621 7330920 7585194 7887749 8130326 8417456 8886162 9144026 9504296 9782186 10123688
$$ packed form
4621A3172168r5226l12602q58551o58275p42952q05783p73512p42577o19532k13910
4611G349248l70430m39407n9048l43423k10719l21469o7393j89905j29977k06165
4601E011312k2523k9429j45712j38680o9111P7967k28379j0967p3984J4851J4480
4590D399825k66386J14502m5365o7883J53372p323r7051j16997P7557O5055M0995
4579D250301l8540M5048k1825J44011j078K5391P1157p2961K18030o014J16712
4568D730232J35293o9373J66368L7128O9614J37011J39967J16212J40523J38520
4558E741495J57617M9416J85572O756J78596J76907J65526Q9059J03206L53471
4548G207621J23299K54274L02555K42577K87130M68706K57864L60270K77890L41502
$$ plain form
4538 10123688 10193668 10246943 10157612 10068322 10047012 9854044 9867253 9814652 9729855 10058021 10070075
4527 10070075 10010320 10096036 10215729 10452020 10555885 10682696 10982544 11314640 11647542 12002058
4517 12002058 12504293 12873498 13521617 14313557 15093513 15646206 16446793 17278503 18385592
4508 18385592 19197905 20011997 20733086 21061224 20866035 20475955 20026964 19423461 18958461
4499 18958461 18525911 18214149 17921979 17617321 17430082 17423259 17335012 17542437 17448940 17506652
4489 17506652 17976224 18082686 18652429 18892267 19538340 20250871 20974950 22066019 23353526
4480 23353526 24704561 26146314 28043773 30350260 32805499 35870313 39577491 43845691
4472 43845691 48981572 54691419 60891169 67029226 72421535 76579572 78821402 79710300
$$ packed form
4538A0123688O9980N3275q9331q9290k1310j92968J3209n2601q4797L28166J2054
4527A0070075n9755Q5716J19693K36291J03865J26811K99848L32096L32902L54516
4517A2002058N02235L69205O48119P91940P79956N52693Q00587Q31710J107089
4508A8385592Q12313Q14092P21089L28138j95189l90080m48991o03503m65000
4499A8958461m32550l11762k92170l04658j87239o823q8247K07425r3497N7712
4489A7506652M69572J06462N69743K39838O46073P12531P24079J091069J287507
4480B3353526J351035J441753J897459K306487K455239L064814L707178M268200
4472D3845691N135881N709847O199750O138057N392309M158037K241830Q88898
$$ plain form
4464 79710300 79225748 78626104 78040005 77966274 78204003 77994913 76895792 74314431 70243587
4455 70243587 65314585 59819320 54244405 48967860 44246626 40389763 36650488 33517217
4447 33517217 30960849 28495181 26528779 24477398 22959620 21506996 20071970 18964978
4439 18964978 17751588 16758861 15899226 15127245 14232544 13608070 12960677 12397263 11752369
4430 11752369 11534382 10979878 10686793 10068367 9827189 9534943 9099821 8723628 8566625
4421 8566625 8306700 7913484 7804134 7598813 7452932 7277381 7023412 7021069 6703474 6437664
4411 6437664 6429230 6149398 6225347 6049107 5793240 5798565 5615158 5665546 5426033 5305409 5238785
4400 5238785 5133960 5048049 5045799 4952627 4857656 4736074 4782256 4741091 4697022 4470177 4462433
$$ packed form
4464G9710300m84552n99644n86099p3731K37729k09090j099121k581361m070844
4455G0243587m929002n495265n574915n276545m721234l856863l739275l133271
4447C3517217k556368k465668j966402k051381j517778j452624j435026j106992
4439A8964978j213390r92727q59635p71981q94701o24474o47393n63414o44894
4430A1752369k17987n54504k93085o18426k41178k92246m35122l76193j57003
4421H566625k59925l93216j09350k05321j45881j75551k53969k343l17595k65810
4411F437664q434k79832P5949j76240k55867N325j83407N0388k39513j20624o6624
4400E238785j04825q5911k250r3172r4971j21582M6182m1165m4069k26845p744
$$ plain form
4389 4462433 4617777 4578608 4501597 4527632 4529913 4436632 4218579 4347377 4285278 4252481 4089374
4378 4089374 4283144 4289585 4123552 4227593 4255893 4205084 4169693 4109839 4131403 4204118 4103404
4367 4103404 4115564 4076382 4112249 3925613 4060574 4056637 4044952 4039705 3979132 3995491 4147348
4356 4147348 3963655 4083843 3944679 3905223 3933666 3836825 3786004 3772574 3737693 3933702 3653774
4345 3653774 3685515 3673851 3679375 3618253 3510609 3548998 3389773 3473641 3408330 3269841 3413857
4334 3413857 3285833 3305129 3275713 3255984 3201929 3267910 3242725 3258987 3273379 3301047 3254807
4323 3254807 3199236 3250670 3333957 3225346 3358535 3337722 3223759 3331604 3440033 3418488
4313 3418488 3482738 3545653 3551585 3672480 3693744 3758454 3856657 3828282 3804179 3638829 3744414
$$ packed form
4389D462433J55344l9169p7011K6035K281r3281k18053J28798o2099l2797j63107
4378D089374J93770O441j66033J04041K8300n0809l5391n9854K1564P2715j00714
4367D103404J2160l9182L5867j86636J34961l937j1685n247o0573J6359J51857
4356D147348j83693J20188j39164l9456K8443r6841n0821j3430l4881J96009k79928
4345C653774L1741j1664N524o1122j07644L8389j59225Q3868o5311j38489J44016
4334C413857j28024J9296k9416j9729n4055O5981k5185J6262J4392K7668m6240
4323C254807n5571N1434Q3287j08611J33189k0813j13963J07845J08429k1545
4313C418488O4250O2915N932J20895K1264O4710R8203k8375k4103j65350J05585
$$ plain form
4302 3744414 3646972 3716920 3659258 3612280 3591744 3426478 3447801 3390111 3249642 3022037 3033782
4291 3033782 3118511 2872051 2944623 2971037 2754700 2604220 2502505 2488891 2679415 2392728
4281 2392728 2610638 2438228 2343378 2297328 2325821 2255796 2245864 2449412 2232658 2276476 2203014
4270 2203014 2278522 2199085 2253133 2222639 2201344 2227986 2249089 2370846 2122311 2327356 2185769
4259 2185769 2243536 2165888 2153808 2189143 2114960 2122536 2263654 2314172 2336474 2318553 2305592
4248 2305592 2003850 2084121 2207969 2104764 2127190 2202277 2123871 2016669 1941944 1980344 2067649
4237 2067649 1827772 1889920 1784493 1907205 1893417 1910978 1822189 1846405 1835776 1791411 1821442
4226 1821442 1802300 1827844 1762499 1724291 1624512 1746188 1607927 1576060 1441010 1692626 1674785
$$ packed form
4302C744414r7442O9948n7662m6978k0536j65266K1323n7690j40469k27605J1745
4291C033782Q4729k46460P2572K6414k16337j50480j01715j3614J90524k86687
4281B392728K17910j72410r4850m6050K8493p0025r932K03548k16754M3818p3462
4270B203014P5508p9437N4048l0494k1295K6642K1103J21757k48535K05045j41587
4259B185769N7767p7648j2080L5335p4183P576J41118N0518K2302j7921j2961
4248B305592l01742Q0271J23848j03205K2426P5087p8406j07202p4725L8400Q7305
4237B067649k39877O2148j05427J22712j3788J7561q8789K4216j0629m4365L0031
4226A821442j9142K5544o5345l8208r9779J21676j38261l1867j35050K51616j7841
$$ plain form
4215 1674785 1579021 1598555 1543304 1598158 1509357 1524259 1511448 1510163 1575278 1566720 1577848 1584338
4203 1584338 1535646 1712407 1642656 1770329 1686414 1688059 1751361 1707167 1735506 1639861 1691336
4192 1691336 1643180 1794869 1707415 1645233 1709979 1677583 1509075 1456730 1568158 1624660 1540744
4181 1540744 1317011 1461943 1296033 1339905 1264986 1187245 1439140 1353496 1479507 1291962
4171 1291962 1281922 1228071 1320569 1375477 1402685 1393774 1467997 1334047 1474277 1431428 1411115
4160 1411115 1472078 1501283 1564043 1605828 1549024 1630542 1566244 1646548 1455108 1411074 1577026
4149 1577026 1406140 1345052 1463250 1390228 1420550 1409045 1255730 1513296 1266590 1221057
4139 1221057 1288896 1236995 1268889 1168691 1272726 1002875 1316476 1233440 1185987 1079662
$$ packed form
4215A674785r5764J9534n5251N4854q8801J4902j2811j285O5115q558J1128O490
4203A584338m8692J76761o9751J27673q3915J645O3302m4194K8339r5645N1475
4192A691336m8156J51689q7454o2182O4746l2396j68508n2345J11428N6502q3916
4181A540744k23733J44932j65910M3872p4919p7741K51895q5644J26011j87545
4171A291962j0040n3851R2498N4908K7208q911P4223j33950J40230m2849k0313
4160A411115O0963K9205O2760M1785n6804Q1518o4298Q0304j91440m4034J65952
4149A577026j70886o1088J18198p3022L0322j1505j53315K57566k46706m5533
4139A221057O7839n1901L1894j00198J04035k69851L13601q3036m7453j06325
$$ plain form
4129 1079662 1156158 1309000 1180556 1226234 1145156 1165652 1190308 1095524 1197600 1196098 1234301
4118 1234301 1098635 1211307 1290447 1335347 1222511 1299708 1391306 1237106 1244273 1288202 1344669
4107 1344669 1363074 1216712 1274627 1417954 1332604 1488777 1482303 1257071 1335833 1335113 1354992
4096 1354992 1400053 1324272 1324941 1288061 1316415 1308370 1376075 1331030 1150826 1365244 1286450 1235023
4084 1235023 1313008 1350952 1384546 1394201 1228999 1149234 1298385 1229095 1353722 1434933 1376902
4073 1376902 1472481 1267105 1357352 1424258 1395475 1314824 1375054 1351803 1414853 1369624 1418642
4062 1418642 1410652 1398513 1418044 1275408 1409233 1457041 1476374 1396224 1462680 1398539 1413638
4051 1413638 1444920 1431648 1492651 1477524 1469700 1549704 1496383 1453405 1446816 1444868 1482863 1447758
$$ packed form
4129A079662P6496J52842j28444M5678q1078K0496K4656r4784J02076j502L8203
4118A234301j35666J12672P9140M4900j12836P7197R1598j54200P167M3929N6467
4107A344669J8405j46362N7915J43327q5350J56173o474k25232P8762p20J9879
4096A354992M5061p5781O69l6880K8354q045O7705m5045j80204K14418p8794n1427
4084A235023P7985L7944L3594R655j65202p9765J49151o9290J24627Q1211n8031
4073A376902R5579k05376R0247O6906k8783q0651O0230k3251O3050m5229M9018
4062A418642p990j2139J9531j42636J33825M7808J9333q0150O6456o4141J5099
4051A413638L1282j3272O1003j5127p824Q0004n3321m2978o589j948L7995l5105
$$ plain form
4039 1447758 1339023 1413542 1378257 1371498 1414670 1354282 1548120 1378296 1623375 1396201 1393261
4028 1393261 1520194 1564752 1390271 1500751 1421322 1532577 1462229 1588520 1499890 1427363
4018 1427363 1571021 1499321 1545014 1548252 1380454 1486818 1615289 1491470 1389233 1425231
4008 1425231 1467605 1503085 1340635 1556252 1539233 1427379 1423285 1450046 1489419 1587475 1479680
3997 1479680 1577357 1475373 1523195 1629855 1463687 1489697 1476739 1541355 1582008 1549086 1653580
3986 1653580 1540249 1585266 1643596 1563588 1544353 1637467 1570330 1637568 1610802 1621596 1722844
3975 1722844 1620710 1573612 1624497 1829506 1581145 1670552 1657358 1781488 1707665 1804058 1726301
3964 1726301 1631353 1754485 1833275 1771891 1816602 1772624 1903787 1850454 1846444 2059164 1945673
$$ packed form
4039A447758j08735P4519l5285o759M3172o0388J93838j69824K45079k27174k940
4028A393261J26933M4558j74481J10480p9429J11255p0348J26291q8630p2527
4018A427363J43658p1700M5693L238j67798J06364J28471j23819j02237L5998
4008A425231M2374L5480j62450K15617j7019j11854m094K6761L9373R8056j07795
3997A479680R7677j01984M7822J06660j66168K6010j2958O4616M0653l2922J04494
3986A653580j13331M5017N8330q0008j9235R3114o7137O7238k6766J0794J01248
3975A722844j02134m7098N0885K05009k48361Q9407j3194J24130p3823R6393p7757
3964A726301r4948J23132P8790o1384M4711m3978J31163n3333m010K12720j13491
$$ plain form
3953 1945673 1820325 1913383 2011099 1873895 1884588 1972594 1829190 2034505 1889784 2051610
3943 2051610 2097244 2073029 2052893 2116000 2145689 2020404 2028973 2092859 2113050 2016308 2117343
3932 2117343 2008507 2053313 2095965 2169905 2240793 2232987 2343943 2272342 2227829 2398482 2345197
3921 2345197 2301316 2422583 2420201 2428349 2500586 2565750 2502061 2564259 2675179 2701415 2767032
3910 2767032 2707723 2692183 2950300 2829213 2967455 2976898 3065739 3061525 3117311 3291359 3295159
3899 3295159 3463677 3448202 3501295 3642120 3736035 3838385 3922080 4066093 4124789 4168005 4307485
3888 4307485 4250714 4602624 4577500 4739746 4963072 5095824 5256043 5514021 5791888 5768629
3878 5768629 5967300 6106082 5993798 6105921 6128396 6459930 6532478 6783880 6782307 6952747
$$ packed form
3953A945673j25348R3058R7716j37204J0693Q8006j43404K05315j44721J61826
3943B051610M5634k4215k0136O3107K9689j25285Q569O3886K0191r6742J01035
3932B117343j08836M4806M2652P3940P0888p806J10956p1601m4513J70653n3285
3921B345197m3881J21267k382Q148P2237O5164o3689O2198J10920K6236O5617
3910B767032n9309j5540K58117j21087J38242R443Q8841m214N5786J74048L800
3899C295159J68518j5475N3093J40825R3915J02350Q3695J44013N8696M3216J39480
3888D307485n6771L51910k5124J62246K23326J32752J60219K57978K77867k3259
3878E768629J98671J38782j12284J12123K2475L31534P2548K51402j573J70440
$$ plain form
3868 6952747 7121410 7239951 7465274 7870498 7898825 8083229 8344037 8578624 8814689 9049914
3858 9049914 9217082 9593171 9730119 9871460 10249673 10271728 10601204 10940664 11244910 11605610
3848 11605610 12092753 12641691 12965586 13107269 13360715 13166593 13290483 13507531 13446433 13805051
3838 13805051 13929210 14246139 14447606 14631850 14952915 15564291 15895605 16418096 17244208
3829 17244208 18013639 18874870 19591621 20225087 20608764 20788524 21114812 21167095 21424127 21713243
3819 21713243 22097510 22694733 23272180 24013426 24859701 25840077 27185586 28879458 30984939
3810 30984939 33217142 35513742 37835318 39666731 40996499 41286950 41273257 41323303 41780991
3801 41780991 42332256 43489271 44243948 44754744 44549881 43998148 43519087 43608218 44010919
$$ packed form
3868F952747J68663J18541K25323M05224K8327J84404K60808K34587K36065K35225
3858I049914J67168L76089J36948J41341L78213K2055L29476L39460L04246L60700
3848A1605610M87143N48938L23895J41683K53446j94122J23890K17048o1098L58618
3838A3805051J24159L16929K01467J84244L21065O11376L31314N22491Q26112
3829A7244208P69431Q61231P16751O33466L83677J79760L26288N2283K57032K89116
3819B1713243L84267N97223N77447P41246Q46275R80376J345509J693872K105481
3810C0984939K232203K296600K321576J831413J329768K90451j3693N0046M57688
3801D1780991N51265J157015P54677N10796k04863n51733m79061Q9131M02701
$$ plain form
3792 44010919 44673477 45794830 47216851 48690593 50232265 51300190 52257811 52565174 52497808
3783 52497808 52093447 51511457 51119186 50633823 50395696 50123683 49269002 48180534 46715730
3774 46715730 44734436 42862875 41059327 39697606 38837787 38341709 38154494 38321134 38108861
3765 38108861 37372249 36214647 34504714 32854238 31680936 31036692 30728184 30233798 29402338
3756 29402338 28059800 26303799 24137912 22177273 20506733 19062380 17499717 16232175
3748 16232175 15057662 14088374 13343184 12517371 11825458 11259428 10683502 10246282 9771400
3739 9771400 9292127 8819946 8555554 8169824 7799524 7629961 7445067 6989682 6866132 6812695
3729 6812695 6549104 6305070 6205433 6194625 5935693 5681867 5654586 5481893 5324975 5296488
$$ packed form
3792D4010919O62558J121353J422021J473742J541672J067925R57621L07363o7366
3783E2497808m04361n81990l92271m85363k38127k72013q54681j088468j464804
3774D6715730j981294j871561j803548j361721q59819m96078j87215J66640k12273
3765C8108861p36612j157602j709933j650476j173302o44244l08508m94386q31460
3756B9402338j342538j756001k165887j960639j670540j444353j562663j267542
3748A6232175j174513r69288p45190q25813o91913n66030n75926m37220m74882
3739I771400m79273m72181k64392l85730l70300j69563j84894m55385j23550n3437
3729F812695k63591k44034r9637j0808k58932k53826k7281j72693j56918k8487
$$ plain form
3719 5296488 5085965 4973463 4775569 4747194 4670296 4607396 4556786 4466607 4379852 4311534 4227744
3708 4227744 4135380 3944777 4052788 3914989 3892670 3842853 3698751 3730191 3599505 3524497
3698 3524497 3523010 3423865 3365519 3316580 3359281 3213573 3082743 3264023 3295476 3218073 3055437
3687 3055437 3122546 2945213 3082363 3074831 2904952 2944160 2856499 2858820 2908163 2847408 2778335
3676 2778335 2786256 2942339 2899610 2779249 2756051 2668416 2646760 2650009 2666197 2481933 2577670
3665 2577670 2666942 2554688 2494715 2482199 2426006 2485284 2398733 2322670 2305712 2352731 2130077
3654 2130077 2180819 2124835 2111567 2008363 2032591 2046703 2094178 2136768 2111388 1824685 1929014
3643 1929014 2009713 1816319 1800826 1881286 1830946 1725472 1791708 1714601 1540941 1787778 1664482
$$ packed form
3719E296488k10523j12502j97894k8375p6898o2900n0610r0179q6755o8318q3790
3708D227744r2364j90603J08011j37799k2319m9817j44102L1440j30686p5008
3698C524497j487r9145n8346m8939M2701j45708j30830J81280L1453p7403j62636
3687C055437O7109j77333J37150p532j69879L9208q7661K321M9343o0755o9073
3676B778335P921J56083m2729j20361k3198q7635k1656L249J6188j84264R5737
3665B577670Q9272j12254n9973j2516n6193N9278q6551p6063j6958M7019k22654
3654B130077N0742n5984j3268j03204K4228J4112M7475M2590k5380k86703J04329
3643A929014Q0699j93394j5493Q0460n0340j05474O6236p7107j73660K46837j23296
$$ plain form
3632 1664482 1795963 1719940 1736719 1733166 1669570 1663718 1655441 1535287 1580157 1489988 1668451
3621 1668451 1573550 1531057 1519777 1515117 1529628 1406039 1536853 1418081 1468031 1488491 1551588
3610 1551588 1604331 1509094 1437983 1509657 1455958 1583570 1462973 1479397 1460202 1442903 1584776
3599 1584776 1537418 1558709 1397292 1348064 1398286 1495785 1363656 1424352 1303678 1411961 1377223
3588 1377223 1331310 1303061 1407486 1371896 1239323 1291961 1187505 1287169 1194693 1326191 1323944
3577 1323944 1216842 1277356 1211812 1305999 1242271 1284300 1267515 1389511 1425631 1351258 1314080
3566 1314080 1278320 1302252 1369392 1313371 1326835 1389765 1287369 1280943 1337120 1232085 1348821
3555 1348821 1369142 1299163 1385578 1242050 1201228 1289854 1276993 1191912 1208869 1317219 1234612
$$ packed form
3632A664482J31481p6023J6779l553o3596n852q277j20154M4870r0169J78463
3621A668451r4901m2493j1280m660J4511j23589J30814j18772M9950K0460O3097
3610A551588N2743r5237p1111P1674n3699J27612j20597J6424j9195j7299J41873
3599A584776m7358K1291j61417m9228N0222R7499j32129O0696j20674J08283l4738
3588A377223m5913k8249J04425l5590j32573N2638j04456R9664r2476J31498k247
3577A323944j07102O0514o5544R4187o3728M2029j6785J21996L6120p4373l7178
3566A314080l5760K3932O7140n6021J3464O2930j02396o426N6177j05035J16736
3555A348821K0321o9979Q6415j43528m0822Q8626j2861q5081J6957J08350q2607
$$ plain form
3544 1234612 1225360 1207884 1316833 1284294 1258224 1366946 1353828 1316349 1376597 1477010 1370923
3533 1370923 1368357 1464282 1486395 1586153 1649475 1700673 1764604 1680521 1803390 1732648 1844027
3522 1844027 1701898 1897482 1865676 1803310 1771737 1732651 1796203 1687739 1758124 1662044 1556897
3511 1556897 1533510 1592570 1449669 1488081 1521271 1202537 1367182 1450847 1363329 1245158 1419286
3500 1419286 1288238 1273569 1165658 1222748 1215298 1274087 1227779 1245942 1105807 1293312 1273927
3489 1273927 1092835 1226111 1132611 1121720 1207446 1122742 1075997 1048024 1174015 1039732 1039443
3478 1039443 1038186 892544 974204 994813 922711 1046468 907256 933578 1012923 956874 980868
3467 980868 1002971 987698 949612 883552 826058 782706 879783 823501 812934 929979 843461
$$ packed form
3544A234612r252j7476J08949l2539k6070J08722j3118l7479O0248J00413j06087
3533A370923k566R5925K2113R9758O3322N1198O3931q4083J22869p0742J11379
3522A844027j42129J95584l1806o2366l1573l9086O3552j08464P0385r6080j05147
3511A556897k3387N9060j42901L8412L3190l18734J64645Q3665q7518j18171J74128
3500A419286j31048j4669j07911N7090p450N8789m6308J8163j40135J87505j9385
3489A273927j81092J33276r3500j0891Q5726q4704m6745k7973J25991j34283k89
3478A039443j257j45642Q1660K0609p2102J23757j39212K6322P9345n6049K3994
3467I80868K2103j5273l8086o6060n7494m3352R7077n6282j0567J17045q6518
$$ plain form
3456 843461 927931 827951 812863 750148 744346 731924 654642 724185 666516 815821 836137 782896
3444 782896 731715 666351 736678 742510 809043 778553 803606 818555 681354 699446 802114
3433 802114 788750 742850 762275 727478 853137 775128 794811 599611 811798 835287 771633
3422 771633 622191 706904 782543 693833 803204 822366 827730 715421 776400 673338 715538
3411 715538 770206 705669 751743 739778 737684 825077 631413 704659 734811 784285 773504 645630
3399 645630 672172 727404 784283 672653 576211 660134 747395 746619 694143 739452 739160 689932
3387 689932 571389 640525 728182 677625 648838 583547 661601 715975 709893 650838 708248 726763
3375 726763 597764 545770 715859 595900 676298 694653 684096 499182 624302 504119
$$ packed form
3456H43461Q4470r9980j5088o2715n802j2422p7282O9543n7669J49305K0316n3241
3444G82896n1181o5364P0327N832O6533l0490K5053J4949j37201J8092J02668
3433H02114j3364m5900J9425l4797J25659p8009J9683j95200K12187K3489o3654
3422G71633j49442Q4713P5639q8710J09371J9162N364j12309O0979j03062M2200
3411G15538N4668o4537M6074j1965k094Q7393j93664P3246L0152M9474j0781j27874
3399F45630K6542N5232N6879j11630r6442Q3923Q7261p76n2476M5309k92m9228
3387F89932j18543O9136Q7657n0557k8787o5291P8054N4374o082n9055N7410J8515
3375G26763j28999n1994J70089j19959Q0398J8355j0557j84914J25120j20183
$$ plain form
3365 504119 654833 573781 600840 629984 527519 531927 677917 625163 499982 654933 626591
3354 626591 540012 595119 582882 569953 663443 678808 745854 583972 560107 508109 573045
3343 573045 641944 753696 564895 558962 597031 528951 721056 635597 568821 702909 751565
3332 751565 667948 665561 582800 639938 645829 680818 625217 656325 692303 698245 671927 776315
3320 776315 734168 731714 839904 718601 807973 717026 693686 613756 777015 774134 811586
3309 811586 598987 716570 792299 724462 766355 819436 945312 980231 855595 988829 877227
3298 877227 979173 989583 1103333 971809 1076033 1018150 1097443 979244 1067371 1019528 1097170
3287 1097170 1202202 1005385 1155358 1095236 1095198 1079001 1157499 1119037 1136265 1120446 1113553 1108320
$$ packed form
3365E04119J50714q1052K7059K9144j02465M408J45990n2754j25181J54951k8342
3354F26591q6579N5107j2237j2929R3490J5365O7046j61882k3865n1998O4936
3343E73045O8899J11752j88801n933L8069o8080J92105q5459o6776J34088M8656
3332G51565q3617k387q2761N7138N891L4989n5601L1108L5978N942k6318J04388
3320G76315m2147k454J08190j21303Q9372r0947k3340p9930J63259k881L7452
3309H11586k12599J17583P5729o7837M1893N3081J25876L4919j24636J33234j11602
3298H77227J01946J0410J13750j31524J04224n7883P9293j18199Q8127m7843P7642
3287A097170J05032j96817J49973o0122l8j6197P8498l8462J7228j5819o893n233
$$ plain form
3275 1108320 996690 1048665 1060416 1117031 1026425 1298202 1308525 1261876 1241869 1185371 1117104
3264 1117104 1268802 1349332 1343190 1310192 1315078 1494307 1313091 1374841 1444154 1578091 1612287
3253 1612287 1474820 1627055 1563912 1572408 1662789 1630125 1709710 1675538 1529631 1617004 1671585
3242 1671585 1657178 1602202 1559401 1498979 1484659 1519101 1496882 1412864 1458240 1395495 1339690
3231 1339690 1520218 1362148 1372080 1333801 1299915 1338697 1454384 1281855 1374248 1397347 1323070
3220 1323070 1461847 1305116 1509155 1284935 1266591 1339308 1339475 1470189 1384509 1384886 1425367
3209 1425367 1535131 1456049 1523389 1587284 1557809 1340841 1518863 1590083 1488558 1521301 1644915
3198 1644915 1452643 1654992 1410985 1426960 1450570 1599498 1306861 1427591 1367370 1401802
$$ packed form
3275A108320j11630N1975J1751N6615r0606K71777J0323m6649k0007n6498o8267
3264A117104J51698Q0530o142l2998M886J79229j81216O1750O9313J33937L4196
3253A612287j37467J52235o3143Q496R0381l2664P9585l4172j45907Q7373N4581
3242A671585j4407n4976m2801o0422j4320L4442k2219q4018M5376o2745n5805
3231A339690J80528j58070R932l8279l3886L8782J15687j72529R2393K3099p4277
3220A323070J38777j56731K04039k24220j8344P2717J67J30714q5680L77M0481
3209A425367J09764p9082O7340O3895k9475k16968J78022P1220j01525L2743J23614
3198A644915j92272K02349k44007J5975K3610J48928k92637J20730o0221L4432
$$ plain form
3188 1401802 1466423 1468342 1375940 1467929 1441588 1517892 1538908 1388532 1519748 1404692 1512881
3177 1512881 1447444 1401596 1518616 1447744 1545206 1522150 1585386 1683253 1709687 1722711 1824572
3166 1824572 1889687 2018943 2019466 2153768 2292634 2280104 2160314 2155258 2276027 2323336 2373070
3155 2373070 2379283 2246560 2318687 2386006 2278958 2226207 2346388 2247978 1999071 2072726 1970006
3144 1970006 1852923 1931051 1959024 1880005 1839621 1819089 1834324 1843022 1785305 1600560 1627694
3133 1627694 1665834 1731928 1589477 1687791 1769057 1674721 1641174 1607176 1682974 1661551 1737236
3122 1737236 1774860 1766225 1741840 1837724 2039402 1708551 1679289 1804537 1644570 1735961 1738621
3111 1738621 1817928 1812505 1771823 1753444 1777158 1611838 1702743 1810583 1751715 1707192 1658540
$$ packed form
3188A401802O4621J919r2402R1989k6341P6304K1016j50376J31216j15056J08189
3177A512881o5437m5848J17020p0872R7462k3056O3236R7867K6434J3024J01861
3166A824572O5115J29256N23J34302J38866j2530j19790n056J20769M7309M9734
3155B373070O213j32723P2127O7319j07048n2751J20181r8410k48907P3655j02720
3144A970006j17083P8128K7973p9019m0384k0532J5235Q698n7717j84745K7134
3133A627694L8140O6094j42451R8314Q1266r4336l3547l3998P5798k1423P5685
3122A737236L7624q635k4385R5884K01678l30851k9262J25248j59967R1391K660
3111A738621P9307n423m0682j8379K3714j65320R0905J07840n8868m4523m8652
$$ plain form
3100 1658540 1779052 1823689 1898270 1864996 1838343 1787825 1840776 1978558 1864837 1837776 2012724
3089 2012724 2024116 1972105 2120996 2010622 2047049 1880169 2137041 2234181 2171102 2040784
3079 2040784 2101145 2296293 2117978 2232931 2215419 2186695 2242291 2437267 2184199 2358873
3069 2358873 2281285 2343870 2377907 2261412 2356294 2472276 2327713 2404604 2511523 2534002 2529883
3058 2529883 2477679 2561837 2618708 2700332 2600772 2625705 2627613 2660785 2610900 2772403 2624759
3047 2624759 2915782 2865261 2732634 2929137 2733730 2837276 2780102 2937376 3005670 2924772
3037 2924772 2861748 3082909 2993510 3054355 3100722 3160074 3129074 3248247 3359512 3222001 3247596
3026 3247596 3394676 3332492 3436186 3481796 3597486 3551368 3475488 3657228 3589042 3691924
$$ packed form
3100A658540J20512M4637P4581l3274k6653n0518N2951J37782j13721k7061J74948
3089B012724J1392n2011J48891j10374L6427j66880K56872R7140o3079j30318
3079B040784O0361J95148j78315J14953j7512k8724N5596J94976k53068J74674
3069B358873p7588O2585L4037j16495R4882J15982j44563P6891J06919K2479m119
3058B529883n2204Q4158N6871Q1624r9560K4933J908L3172m9885J61503j47644
3047B624759K91023n0521j32627J96503j95407J03546n7174J57274O8294q0898
3037B924772o3024K21161q9399O0845M6367N9352l1000J19173J11265j37511K5595
3026C247596J47080o2184J03694M5610J15690m6118p5880J81740o8186J02882
$$ plain form
3016 3691924 3825442 3750035 3791588 3957743 3890016 3823501 3951750 4137424 3907665 4164352
3006 4164352 4106320 4177422 4324539 4243280 4400422 4450822 4416078 4518988 4606351 4715110 4518476
2995 4518476 4801660 4952681 4809181 4979612 4956276 4956878 5061215 5240253 5370328 5310254
2985 5310254 5379179 5413460 5522895 5668150 5766986 5776182 5937561 5947663 6025059 6099067 6259518
2974 6259518 6325540 6544697 6527300 6550850 6948011 6783608 6980722 6961969 7040309 7224285
2964 7224285 7447330 7392843 7581541 7499256 7699573 7792361 7998789 8152117 8226076 8285042
2954 8285042 8526549 8627518 8753233 8743214 8916389 9062262 9248027 9438144 9689394 9622821
2944 9622821 9824574 9938767 10112151 10366142 10372078 10545402 10702585 10844222 10991049 11300252
$$ packed form
3016C691924J33518p5407M1553J66155o7727o6515J28249J85674k29759K56687
3006D164352n8032P1102J47117q1259J57142N0400l4744J02910Q7363J08759j96634
2995D518476K83184J51021j43500J70431k3336O02J04337J79038J30075o0074
2985E310254O8925L4281J09435J45255R8836R196J61379J0102P7396P4008J60451
2974F259518O6022K19157j7397K3550L97161j64403J97114j8753P8340J83976
2964G224285K23045n4487J88698q2285K00317R2788K06428J53328P3959N8966
2954H285042K41507J00969J25715j0019J73175J45873J85765J90117K51250o6573
2944I622821K01753J14193J73384K53991N936J73324J57183J41637J46827L09203
$$ plain form
2934 11300252 11575707 11753102 11877686 12108323 12198873 12433252 12642643 12792327 13096515 13261762
2924 13261762 13482459 13507270 13877980 14008924 14265391 14445062 14718388 15044619 15158931 15263325
2914 15263325 15493837 15682155 16036044 16229411 16522373 16702024 16887668 17211641 17450606
2905 17450606 17551227 17852134 18125829 18492577 18512632 18933002 19355493 19407766 19686986 20062358
2895 20062358 20356028 20510186 20767832 20942423 21232138 21653266 21803239 22049351 22276734
2886 22276734 22526176 22664925 22851221 23139796 23269680 23408342 23488802 23648390 23873514 23894300
2876 23894300 23943348 23810354 23671120 23717610 23713848 23640335 23518280 23449524 23363956 23143991 22834124
2865 22834124 22689756 22515340 22237039 21944448 21783593 21558292 21166297 20844401 20499338
$$ packed form
2934A1300252K75455J77395J24584K30637R0550K34379K09391J49684L04188J65247
2924A3261762K20697K4811L70710J30944K56467J79671K73326L26231J14312J04394
2914A5263325K30512J88318L53889J93367K92962J79651J85644L23973K38965
2905A7450606J00621L00907K73695L66748K0055M20370M22491N2273K79220L75372
2895B0062358K93670J54158K57646J74591K89715M21128J49973K46112K27383
2886B2276734K49442J38749J86296K88575J29884J38662Q0460J59588K25124K0786
2876B3894300M9048j32994j39234M6490l762p3513j22055o8756q5568k19965l09867
2865B2834124j44368j74416k78301k92591j60855k25301l91995l21896l45063
$$ plain form
2856 20499338 20318814 19911789 19586171 19073656 18969106 18583452 18266966 17855898 17644658
2847 17644658 17370161 16935958 16715825 16328191 16043006 15666888 15336761 14974859 14759715
2838 14759715 14558998 14469938 14136310 13927796 13622849 13314609 13032024 13028154 12737676 12530383
2828 12530383 12397706 12152428 12123312 11869631 11623322 11450950 11354696 11093259 10879095 10642595
2818 10642595 10613819 10351249 10211214 10103080 9926224 9732748 9762979 9517227 9502124 9371325
2808 9371325 9340224 9077943 8969724 9105878 9002690 8897037 8774852 8667692 8523059 8591536
2798 8591536 8494550 8547619 8476726 8489555 8599658 8617769 8547517 8797207 8799509 8845925 9006993
2787 9006993 9060760 9100533 9107344 9114026 9106903 9165310 8903137 8943989 8889469 8852381 8892563 8783116
$$ packed form
2856B0499338j80524m07025l25618n12515j04550l85654l16486m11068k11240
2847A7644658k74497m34203k20133l87634k85185l76118l30127l61902k15144
2838A4759715k00717q9060l33628k08514l04947l08240k82585l870k90478k07293
2828A2530383j32677k45278k9116k53681k46309j72372r6254k61437k14164k36500
2818A0642595k8776k62570j40035j08134j76856j93476L0231k45752j5103j30799
2808I371325l1101k62281j08219J36154j03188j05653j22185j07160j44633O8477
2798H591536r6986N3069p0893J2829J10103J8111p0252K49690K302M6416J61068
2787I006993N3767L9773O811O682p123N8407k62173M0852n4520l7088M0182j09447
$$ plain form
2775 8783116 8596424 8466021 8283497 8103805 7849908 7748990 7687002 7554611 7535399 7349353
2765 7349353 7269411 7306112 7313810 7201684 7021208 7047042 7079466 6955544 7046258 7054800 6811785
2754 6811785 7044119 7066738 6899905 6976760 6934148 6926207 6870586 6961465 6946809 6949870 6803766
2743 6803766 6790856 6906541 6881785 6830816 6845883 6801345 6715284 6772956 6929622 6722340 6673402
2732 6673402 6754680 6893355 6700250 6627527 6769881 6773883 6894736 6789243 6782516 6899111 6915542
2721 6915542 6938176 6993692 6970554 7181872 7038845 7042669 7104722 7002293 7229999 7117929 7160642
2710 7160642 7256300 7236877 7208058 7379385 7271558 7267128 7448681 7471636 7416684 7367572 7579535
2699 7579535 7624720 7631815 7608479 7657592 7702439 7825623 7920089 7865920 7918104 7982063 8042947
$$ packed form
2775H783116j86692j30403j82524j79692k53897j00918o1988j32391j9212j86046
2765G349353p9942L6701P698j12126j80476K5834L2424j23922R0714Q542k43015
2754F811785K32334K2619j66833P6855m2612p941n5621R0879j4656L061j46104
2743F803766j2910J15685k4756n0969J5067m4538q6061N7672J56666k07282m8938
2732F673402Q1278J38675j93105p2723J42354M002J20853j05493o727J16595J6431
2721F915542K2634N5516k3138K11318j43027L824O2053j02429K27706j12070M2713
2710G160642R5658j9423k8819J71327j07827m430J81553K2955n4952m9112K11963
2699G579535M5185P095k3336M9113M4847J23184R4466n4169N2184O3959O0884
$$ plain form
2688 8042947 7991184 8010792 8253028 8259933 8404177 8483972 8463835 8646768 8659268 8778299 8637188
2677 8637188 8743886 8897434 9004537 9136031 9216629 9295603 9529037 9436082 9400704 9829029
2667 9829029 9908050 9897710 9989103 10136314 10185672 10342524 10529332 10687890 10614293 10996823
2657 10996823 10943949 11104472 11206106 11595088 11716008 11946697 12134255 12366474 12471040 12632934
2647 12632934 12898343 13309252 13339770 13556160 13849654 14148977 14435336 14798588 15277968 15486882
2637 15486882 15749450 16262229 16566043 16863591 17486920 17833736 18550490 19102527 19748368
2628 19748368 20338958 20836233 21410661 22002970 22604124 23167342 23711465 24486555 25306436
2619 25306436 26233911 27016657 27998466 29134757 30481024 31634253 33356200 35474719 37893393
$$ packed form
2688H042947n1763J9608K42236O905J44244P9795k0137J82933J2500J19031j41111
2677H637188J06698J53548J07103J31494Q0598P8974K33434r2955l5378M28325
2667I829029P9021j0340R1393J47211M9358J56852J86808J58558p3597L82530
2657A0996823n2874J60523J01634L88982J20920K30689J87558K32219J04566J61894
2647A2632934K65409M10909L0518K16390K93494K99323K86359L63252M79380K08914
2637A5486882K62568N12779L03814K97548O23329L46816P16754N52037O45841
2628A9748368N90590M97275N74428N92309O01154N63218N44123P75090Q19881
2619B5306436R27475P82746R81809J136291J346267J153229J721947K118519K418674
$$ plain form
2610 37893393 40516647 42337862 43123187 42886597 41205407 40084151 39546517 39566691 39759586
2601 39759586 40021897 40452446 40943980 41266494 41702932 42364655 43074582 43562877 44616859
2592 44616859 45562148 46785885 48082203 49761503 51487577 53833708 56621521 59850937
2584 59850937 63876220 67584693 70860607 74378392 78314085 82993525 88405199 95409315
2576 95409315 104302504 110404133 106530267 99646722 94169536 90055029 87514087 85464665
2568 85464665 83905545 82504252 81498254 80829175 80353686 80058216 79859011 80127055 80683249
2559 80683249 81767741 83373579 85295194 87505190 90542437 93946671 98381916 103195136
2551 103195136 108899574 115983225 124436255 133596571 143592883 155275552 169459038 186582095
$$ packed form
2610C7893393K623254J821215P85325k36590j681190j121256n37634K0174J92895
2601C9759586K62311M30549M91534L22514M36438O61723P09927M88295J053982
2592D4616859R45289J223737J296318J679300J726074K346131K787813L229416
2584E9850937M025283L708473L275914L517785L935693M679440N411674P004116
2576I5409315Q893189O101629l873866o883545n477186m114507k540942k049422
2568H5464665j559120j401293j005998o69079m75489k95470j99205K68044N56194
2559H0683249J084492J605838J921615K209996L037247L404234M435245M813220
2551A03195136N704438P083651Q453030R160316R996312J1682669J4183486J7123057
$$ plain form
2543 186582095 206449792 230307611 261362728 299999232 338809731 380617227 420703917
2536 420703917 439014530 437961838 410132611 384255199 375678663 379755494 394701374
2529 394701374 417671753 429931758 417861740 384540102 342603844 306958595 277600826
2522 277600826 251268045 227893760 208431890 192101318 178647201 167431201 158052647
2515 158052647 149671755 142385779 135808388 130451492 125737127 121565152 118138546 115280054
2507 115280054 113358380 113161004 114181410 115699644 118072901 119329297 117927509 113769891
2499 113769891 107532823 103088858 100943445 100183636 100385787 101146735 99475873 95206056
2491 95206056 88937233 82549155 77351434 72880623 69133218 65530202 62603602 60353594
$$ packed form
2543A86582095J9867697K3857819L1055117L8636504L8810499M1807496M0086690
2536D20703917J8310613j052692k7829227k5877412q576536M076831J4945880
2529C94701374K2970379J2260005j2070018l3321638m1936258l5645249k9357769
2522B77600826k6332781k3374285j9461870j6330572j3454117j1216000r378554
2515A58052647q380892p285976o577391n356896m714365m171975l426606k858492
2507A15280054j921674j97376J020406J518234K373257J256396j401788m157618
2499A13769891o237068m443965k145413p59809K02151P60948j670862m269817
2491I5206056o268823o388078n197721m470811l747405l603016k926600k250008
$$ plain form
2483 60353594 58186994 56672055 55285939 54205238 53547713 53135878 53102316 53623966 54458885
2474 54458885 55532251 56035116 56378269 56148321 54955498 53536220 52189385 51200953 50599799
2465 50599799 50239429 49850465 48996006 47484532 45415014 42887055 40504458 38207136 36140074
2456 36140074 34198231 32465474 30986137 29555860 28292703 27294610 26395234 25418136 24493764
2447 24493764 23891333 22916559 22386518 21602577 21059913 20462681 19755989 19272679 18844397
2438 18844397 18534784 18179968 17926533 17519973 17303136 17035779 16853659 16658669 16634698 16634308
2428 16634308 16510976 16596542 16515312 16081619 15558223 15264225 15051557 14624313 14461489 14344854
2418 14344854 14105723 13629884 13356007 12805985 12339340 12044698 11596842 11102549 10659713
$$ packed form
2483F0353594k166600j514939j386116j080701o57525m11835l3562N21650Q34919
2474E4458885J073366N02865L43153k29948j192823j419278j346835r88432o01154
2465E0599799l60370l88964q54459j511474k069518k527959k382597k297322k067062
2456C6140074j941843j732757j479337j430277j263157r98093q99376r77098r24372
2447B4493764o02431r74774n30041p83941n42664n97232p06692m83310m28282
2438A8844397l09613l54816k53435m06560k16837k67357j82120j94990k3971l90
2428A6634308j23332Q5566q1230m33693n23396k93998k12668m27244j62824j16635
2418A4344854k39131m75839k73877n50022m66645k94642m47856m94293m42836
$$ plain form
2409 10659713 10415592 9978130 9695059 9324982 9163112 9087673 8783465 8524454 8290199 8177633
2399 8177633 7803641 7728796 7581256 7518765 7214793 7199121 6918847 6799857 6626287 6606422
2389 6606422 6516155 6373592 6085780 6070751 6033532 5777412 5722106 5429524 5513442 5388113
2379 5388113 5261798 5139693 4973535 5031559 4765774 4830750 4613248 4658141 4533083 4537270
2369 4537270 4360350 4269817 4264174 4243367 4155615 4092135 4089725 3873189 3902463 3974160 4000936
2358 4000936 3792441 3704970 3720446 3690572 3604506 3591860 3567586 3609561 3442682 3341799 3445604
2347 3445604 3222309 3222713 3189497 3268267 3109380 3015791 3034719 3025562 3073839 3005665 2851844
2336 2851844 3005992 2815930 2876968 2900685 2816621 2768503 2792283 2871391 2692256 2768129 2796023
$$ packed form
2409A0659713k44121m37462k83071l70077j61870p5439l04208k59011k34255j12566
2399H177633l73992p4845j47540o2491l03972j5672k80274j18990j73570j9865
2389F606422r0267j42563k87812j5029l7219k56120n5306k92582Q3918j25329
2379E388113j26315j22105j66158N8024k65785O4976k17502M4893j25058M187
2369D537270j76920r0533n643k0807q7752o3480k410k16536K9274P1697K6776
2358D000936k08495q7471J5476k9874q6066j2646k4274M1975j66879j00883J03805
2347C445604k23295M04l3216P8770j58887r3589J8928r157M8277o8174j53821
2336B851844J54148j90062O1038K3717q4064m8118K3780P9108j79135P5873K7894
$$ plain form
2325 2796023 2893175 2849823 2779056 2862926 2818118 2790695 2773448 2712595 2546638 2669390 2481714
2314 2481714 2703956 2325729 2461805 2372017 2509984 2461427 2519614 2434273 2409242 2397176 2415723
2303 2415723 2427265 2305813 2404146 2363393 2469354 2459466 2429700 2454514 2566742 2522959 2590141
2292 2590141 2561490 2796293 2928555 3094596 3156316 3310100 3576093 3610208 3637484 3692454
2282 3692454 3613591 3500816 3495018 3575019 3567585 3424462 3533938 3417318 3331093 3130442 3055374
2271 3055374 2957437 2774829 2565918 2373532 2446578 2164265 2226990 2100336 2025231 2056717
2261 2056717 2019733 1828428 1902441 1906401 1927361 1794207 2005373 1740513 1731026 1801602 1762908
2250 1762908 1751423 1688804 1785742 1701449 1819308 1541713 1757146 1725991 1683706 1641923 1660572
$$ packed form
2325B796023R7152m3352p0767Q3870m4808k7423j7247o0853j65957J22752j87676
2314B481714K22242l78227J36076q9788J37967m8557N8187q5341k5031j2066J8547
2303B415723J1542j21452R8333m0753J05961r888k9766K4814J12228m3783O7182
2292B590141k8651K34803J32262J66041O1720J53784K65993L4115K7276N4970
2282C692454p8863j12775n798Q0001p434j43123J09476j16620q6225k00651p5068
2271C055374r7937j82608k08911j92386P3046k82313O2725j26654p5105L1486
2261B056717l6984j91305P4013L960K0960j33154K11166k64860r487P0576l8694
2250A762908j1485o2619R6938q4293J17859k77595K15433l1155m2285m1783J8649
$$ plain form
2239 1660572 1644158 1555476 1649622 1455091 1564729 1455222 1440873 1583352 1451367 1538156
2229 1538156 1428368 1453516 1500388 1538045 1399856 1580777 1332842 1447064 1500776 1423033
2219 1423033 1538052 1502717 1358631 1457413 1422056 1352818 1470882 1353192 1487453 1358617
2209 1358617 1356421 1346297 1265442 1362280 1267142 1331896 1255735 1346613 1271290 1308153 1325636 1403864
2197 1403864 1303360 1253834 1312435 1370366 1359240 1324021 1359984 1310327 1286557 1267094 1266442 1266034
2185 1266034 1396684 1384508 1334315 1317261 1322016 1294677 1393668 1250301 1378422 1326346 1274664
2174 1274664 1430952 1333114 1451461 1323124 1317426 1312087 1210762 1359743 1389245 1454397 1296003
2163 1296003 1478574 1340993 1339516 1307881 1387128 1538280 1420096 1472189 1564574 1477581 1595464
$$ packed form
2239A660572j6414q8682R4146j94531J09638j09507j4349J42479j31985Q6789
2229A538156j09788K5148M6872L7657j38189J80921k47935J14222N3712p7743
2219A423033J15019l5335j44086R8782l5357o9238J18064j17690J34261j28836
2209A358617k196j0124q0855R6838r5138O4754p6161R0878p5323L6863J7483P8228
2197A403864j00504m9526N8601N7931j1126l5219L5963m9657k3770j9463o52m08
2185A266034J30650j2176n0193j7054M755k7339R8991j43367J28121n2076n1682
2174A274664J56288r7838J18347j28337n698n339j01325J48981K9502O5152j58394
2163A296003J82571j37581j477l1635P9247J51152j18184N2093R2385q6993J17883
$$ plain form
2152 1595464 1498057 1493902 1478189 1699454 1494916 1616602 1633781 1539289 1559167 1490608 1480363
2141 1480363 1620315 1443458 1425431 1450938 1393427 1414842 1428041 1350113 1423154 1494751 1313023
2130 1313023 1498149 1538360 1358094 1326097 1517519 1315341 1232736 1269881 1302715 1316717 1176182
2119 1176182 1269226 1166423 1101279 1234807 1191556 1177315 1119555 1092662 1127973 1063577 1131192
2108 1131192 1194111 1033266 1139325 1017091 1182102 880778 1064909 989985 1114649 1086965
2098 1086965 949995 1061563 1016032 988093 942100 981872 1082671 962062 974460 874004
2088 874004 941356 974448 963170 899340 1052965 937882 942758 865338 941513 811079 828281
2077 828281 827215 711419 687089 577539 604983 511048 538961 520652 497087 309219 344839
$$ packed form
2152A595464r7407m155j5713K21265k04538J21686J7179r4492J9878o8559j0245
2141A480363J39952j76857j8027K5507n7511K1415J3199p7928P3041P1597j81728
2130A313023J85126M0211j80266l1997J91422k02178q2605L7145L2834J4002j40535
2119A176182R3044j02803o5144J33528m3251j4241n7760k6893L5311o4396O7615
2108A131192O2919j60845J06059j22234J65011l01324J84131p4924J24664k7684
2098A086965j36970J11568m5531k7939m5993L9772J00799j20609J2398j00456
2088H74004O7352L3092j1278o3830J53625j15083M876p7420P6175j30434J7202
2077H28281j066j15796k4330j09550K7444r3935K7913j8309k3565j87868L5620
$$ plain form
2066 344839 277811 278337 357565 324503 165557 240012 259274 182194 133232 112306 97556 183357
2054 183357 167237 75216 14432 73570 12032 -18967 -96379 2703 16663 18955 -8772 -48907
2042 -48907 33739 -80366 -15541 111585 -151168 -65700 -128679 -10732 -23301 -167890 -58840
2031 -58840 -64496 -87316 -80667 -20798 -69225 -150138 -260038 -220813 -108584 -267286 -151676
2020 -151676 -144107 -149837 -110941 -158298 -112684 -148962 -114177 -248674 -151320 -131922 -87060 -164701
2008 -164701 -129992 -254978 -127358 -161500 -235806 -214005 -231285 -216441 -188568 -238713 -285381
1997 -285381 -155658 -165854 -165711 -422815 -226660 -245502 -178570 -309622 -203022 -273661 -228845
1986 -228845 -285220 -257068 -235433 -435439 -329016 -383923 -192993 -219469 -159828 -430271 -411299
$$ packed form
2066C44839o7028N26P9228l3062j58946P4455J9262p7080m8962k0926j4750Q5801
2054A83357j6120r2021o0784N9138o1538l0999p7412R9082J3960K292k7727m0135
2042d8907Q2646j14105O4825J27126k62753Q5468o2979J17947j2569j44589J09050
2031e8840n656k2820O649N9869m8427q0913j09900L9225J12229j58702J15610
2020a51676P569n730L8896m7357M5614l6278L4785j34497R7354J9398M4862p7641
2008a64701L4709j24986J27620l4142p4306K1801j7280J4844K7873n0145m6668
1997b85381J29723j0196J43k57104J96155j8842O6932j31052J06600p0639M4816
1986b28845n6375K8152K1635k00006J06423n4907J90930k6476N9641k70443J8972
$$ plain form
1975 -411299 -254480 -134554 -291163 -273598 -299422 -310409 -272007 -245084 -322556 -393583 -398169
1964 -398169 -362874 -416367 -288910 -342161 -258615 -352395 -400549 -308232 -359675 -363560 -250739
1953 -250739 -426698 -352838 -348863 -440910 -364386 -266481 -335041 -245636 -254629 -479537 -379820 -421861
1941 -421861 -182165 -293831 -428756 -393823 -287512 -382660 -361740 -370638 -351402 -229101 -443053
1930 -443053 -259807 -455462 -225175 -174628 -492320 -430143 -329887 -336683 -335414 -353212 -367418
1919 -367418 -373365 -328593 -199444 -238875 -379608 -262787 -256327 -365572 -262443 -345558 -359461
1908 -359461 -350394 -219669 -323411 -323694 -295273 -295087 -319860 -312211 -258127 -276430 -345646 -368956
1896 -368956 -394810 -331599 -414900 -393530 -296842 -249607 -335154 -325678 -289714 -411094 -356446 -310911
$$ packed form
1975d11299J56819J19926j56609J7565k5824j0987L8402K6923p7472p1027m586
1964c98169L5295n3493J27457n3251Q3546r3780m8154R2317n1443l885J12821
1953b50739j75959P3860L975r2047P6524R7905o8560Q9405q993k24908R9717m2041
1941d21861K39696j11666j34925L4933J06311r5148K0920q898J9236J22301k13952
1930d43053J83246j95655K30287N0547l17692O2177J00256o796J269j7798j4206
1919c67418n947M4772J29149l9431j40733J16821O460j09245J03129q3115j3903
1908c59461R067J30725j03742k83K8421J86k4773P649N4084j8303o9216k3310
1896c68956k5854O3211q3301K1370R6688M7235q5547R476L5964j21380N4648M5535
$$ plain form
1884 -310911 -387267 -367433 -234397 -373310 -352418 -384704 -231186 -273768 -397137 -473409 -279224
1873 -279224 -250341 -532503 -406477 -397818 -436677 -360803 -501345 -464512 -331777 -317727 -479562
1862 -479562 -331859 -261121 -364099 -310899 -262452 -391666 -392590 -498229 -498936 -329476 -376794
1851 -376794 -375350 -370140 -384696 -427828 -360204 -498203 -355917 -397918 -433454 -383979 -475875 -498883
1839 -498883 -464005 -455812 -446864 -448470 -326563 -476639 -312422 -445241 -551065 -422440 -553125
1828 -553125 -477144 -302167 -545582 -372997 -540881 -311204 -461810 -377656 -413223 -397590
1818 -397590 -401504 -245972 -506127 -348912 -403014 -191064 -202293 -262467 -366955 -446326 -314356
1807 -314356 -421173 -373895 -365209 -526589 -499994 -373075 -376800 -434804 -341988 -462409 -511976
$$ packed form
1884c10911p6356J9834J33036j38913K0892l2286J53518m2582j23369p6272J94185
1873b79224K8883k82162J26026Q659l8859P5874j40542L6833J32735J4050j61835
1862d79562J47703P0738j02978N3200M8447j29214r24j05639p07J69460m7318
1851c76794J444N210j4556m3132O7624j37999J42286m2001l5536M9475r1896k3008
1839d98883L4878Q193Q948j606J21907j50076J64217j32819j05824J28625j30685
1828e53125P5981J74977k43415J72585j67884K29677j50606Q4154l5567J5633
1818c97590l914J55532k60155J57215n4102K11950j1229o0174j04488p9371J31970
1807c14356j06817M7278Q686j61380K6595J26919l725n8004R2816j20421m9567
$$ plain form
1796 -511976 -409849 -229264 -360017 -337944 -444158 -460176 -321035 -320029 -458088 -337323
1786 -337323 -389388 -431474 -522936 -293354 -474218 -404617 -401765 -437833 -359149 -382995 -393921
1775 -393921 -377505 -272495 -496594 -401471 -351130 -376528 -369748 -295903 -450798 -287286 -413085
1764 -413085 -392812 -391848 -316812 -338937 -302755 -424192 -345642 -493001 -363246 -506464 -466519
1753 -466519 -542844 -287244 -464274 -482779 -393946 -395506 -381668 -330895 -410233 -452497 -454605 -297834
1741 -297834 -496615 -386386 -425841 -504296 -500322 -374626 -320240 -481638 -328000 -400437 -386403
1730 -386403 -367287 -385942 -425245 -351495 -451474 -363107 -279775 -399321 -306894 -421345 -304812
1719 -304812 -435819 -318673 -239536 -354990 -303385 -360177 -474025 -364974 -453609 -306555
$$ packed form
1796e11976J02127J80585j30753K2073j06214j6018J39141J006j38059J20765
1786c37323n2065m2086r1462K29582j80864O9601K852l6068P8684k3846j0926
1775c93921J6416J05010k24099R5123N0341k5398O780P3845j54895J63512j25799
1764d13085K0273R64P5036k2125L6182j21437P8550j47359J29755j43218L9945
1753d66519p6325K55600j77030j8505Q8833j560J3838N0773p9338m2264k108J56771
1741b97834j98781J10229l9455p8455L974J25696N4386j61398J53638p2437J4034
1730c86403J9116j8655l9303P3750r9979Q8367Q3332j19546R2427j14451J16533
1719c04812j31007J17146P9137j15454N1605n6792j13848J09051q8635J47054
$$ plain form
1709 -306555 -415369 -434817 -326172 -360362 -377997 -352962 -426117 -338274 -376960 -396364 -399755
1698 -399755 -346769 -421449 -452615 -515263 -440788 -334370 -496153 -400641 -393825 -296797 -522338
1687 -522338 -330785 -383321 -440673 -306771 -295460 -258184 -360269 -495493 -404131 -407604 -357622
1676 -357622 -450740 -243348 -254823 -347615 -431409 -268141 -408264 -353254 -304800 -301689 -367451
1665 -367451 -367091 -228318 -215601 -343110 -248268 -294478 -346527 -370932 -429293 -329329 -255441 -308762
1653 -308762 -340998 -334012 -197234 -362931 -337797 -272144 -357490 -404450 -350298 -419057 -318619
1642 -318619 -346831 -292580 -319453 -284517 -311026 -277989 -242262 -279214 -278336 -359594 -380851 -313426
1630 -313426 -224578 -291517 -363043 -418154 -265485 -408107 -252832 -324787 -300889 -148797 -312579
$$ packed form
1709c06555j08814j9448J08645l4190j7635K5035p3155Q7843l8686j9404l391
1698c99755N2986p4680l1166o2648P4475J06418j61783R5512O816R7028k25541
1687e22338J91553n2536n7352J33902J1311L7276j02085j35224R1362l473M9982
1676c57622r3118K07392j1475r2792q3794J63268j40123N5010M8454L111o5762
1665c67451L60J38773J2717j27509R4842m6210n2049k4405n8361R9964P3888n3321
1653c08762l2236O986J36778j65697K5134O5653q5346m6960N4152o8759J00438
1642c18619k8212N4251k6873L4936k6509L3037L5727l6952Q78q1258k1257O7425
1630c13426Q8848o6939p1526n5111J52669j42622J55275p1955K3898J52092j63782
$$ plain form
1619 -312579 -292526 -263735 -196091 -229488 -329680 -331819 -351704 -239189 -250431 -284233 -342941
1608 -342941 -325090 -219908 -398501 -304434 -372131 -228643 -262128 -239649 -354180 -354999 -371311
1597 -371311 -321367 -333156 -301401 -230090 -324229 -210003 -306138 -252689 -492541 -351071 -240794
1586 -240794 -204405 -419817 -341702 -234873 -205943 -359649 -282177 -221362 -316292 -259909 -191694
1575 -191694 -144343 -285609 -312289 -332354 -296774 -217544 -244680 -291019 -292642 -126900 -245571
1564 -245571 -158019 -257486 -282410 -258899 -293496 -207862 -129343 -300615 -175648 -251052 -267434
1553 -267434 -160492 -144124 -194482 -203966 -35753 24072 -121027 -253561 -170357 -230765 -181028
1542 -181028 -234617 -265370 -131937 -175756 -69121 -127082 -156434 -162567 -163353 -139597 -84907 -178977
$$ packed form
1619c12579K0053K8791O7644l3397j00192k139j9885J12515j1242l3802n8708
1608c42941J7851J05182j78593R4067o7697J43488l3485K2479j14531q19j6312
1597c71311M9944j1789L1755P1311r4139J14226r6135N3449k39852J41470J10277
1586b40794L6389k15412P8115J06829K8930j53706P7472O0815r4930N6383O8215
1575a91694M7351j41266k6680k0065L5580P9230k7136m6339j623J65742j18671
1564b45571Q7552r9467k4924K3511l4597Q5634P8519j71272J24967p5404j6382
1553b67434J06942J6368n0358r484J68213N9825j45099j32534Q3204o0408M9737
1542a81028n3589l0753J33433m3819J06635n7961k9352o133p86K3756N4690r4070
$$ plain form
1530 -178977 -86839 -146763 -153515 -49607 -48881 -148274 -74823 -60890 118726 124863 35788 -33509
1518 -33509 119036 28103 -7436 46442 -71232 112642 -16532 266782 160788 227144 194072
1507 194072 287488 226944 308213 420411 359621 408450 416581 283920 387182 490288 227748
1496 227748 330535 335463 396080 270958 429033 339522 491134 429641 436974 402078 412340
1485 412340 491252 437598 491919 561365 604369 686322 760833 724508 840485 1037359 991323
1474 991323 983667 1137600 1311223 1478538 1689316 1392588 1302292 1135456 1116828 1156063 1128656
1463 1128656 885078 901249 1006160 941931 800545 853815 900317 783537 879519 876819 755565
1452 755565 887390 954412 1045708 1082063 1192217 1264075 1381366 1558918 1605932 1742617 1772450
$$ packed form
1530a78977R2138n9924o752J03908P26r9393P3451J3933J79616O137q9075o9297
1518c3509J52545r0933l5539N3878j17674J83874j29174K83314j05994O6356l3072
1507A94072R3416o0544Q1269J12198o0790M8829Q131j32661J03262J03106k62540
1496B27748J02787M928O0617j25122J58075q9511J51612o1493P333l4896J0262
1485D12340P8912n3654N4321O9446M3004Q1953P4511l6325J15977J96874m6036
1474I91323p656J53933J73623J67315K10778k96728r0296j66836j8628L9235k7407
1463A128656k43578J6171J04911o4229j41386N3270M6502j16780R5982k700j21254
1452G55565J31825O7022R1296L6355J10154P1858J17291J77552M7014J36685K9833
$$ plain form
1441 1772450 2074883 2209917 2643819 2983006 3360874 4144064 4815036 5601809 6289717 7282168
1431 7282168 7461445 7183809 6436856 5928170 5948402 6102660 6373238 6845715 7201356 6737911
1421 6737911 5972935 5300857 4575046 3966958 3553662 3097744 2561032 2255836 2092087 1884952
1411 1884952 1901342 1750865 1476261 1358597 1191642 1229828 934032 1028033 956621 684157
1401 684157 722902 568131 419598 353825 463880 406698 459034 413347 405307 276647 327088
1390 327088 239805 40985 180428 245336 282820 130361 13170 62476 9819 108003 41035
1379 41035 44751 31106 15761 -8170 -11044 79258 -21244 -45620 -94826 -64746 -48123 7476
1367 7476 -38707 -847 75351 -68651 86379 -41787 -64356 34832 -15439 24783 -73050
$$ packed form
1441A772450L02433J35034M33902L39187L77868P83190O70972P86773O87908R92451
1431G282168J79277k77636p46953n08686K0232J54258K70578M72477L55641m63445
1421F737911p64976o72078p25811o08088m13296m55918n36712l05196j63749k07135
1411A884952J6390j50477k74604j17664j66955L8186k95796R4001p1412k72464
1401F84157L8745j54771j48533o5773J10055n7182N2336m5687q040j28660N0441
1390C27088q7283j98820J39443O4908L7484j52459j17191M9306n2657R8184o6968
1379D1035L716j3645j5345k3931k874R0302j00502k4376m9206L0080J6623N5599
1367G476m6183L7860P6198j44002J55030j28166k2569R9188n0271M0222r7833
$$ plain form
1356 -73050 -64516 -13875 -73113 -159128 -70115 -145260 -73141 26131 -72431 -138024 -122377 -138495
1344 -138495 -262223 -12962 -107714 -109632 -234031 -27254 -29612 67006 -101543 -192417 60983
1333 60983 -59330 -54916 -95475 11412 -140436 -51030 -12019 -96984 -273778 -172345 -150664
1322 -150664 -250617 -161501 -219476 -197514 -181319 -155646 -217698 -246682 -290328 -160144 -144834
1311 -144834 -201004 -273773 -453159 -292899 -263035 -371162 -197775 -244385 -158600 -348678 -219472
1300 -219472 -232643 -247098 -312809 -306329 -274399 -273233 -477797 -364679 -423580 -448159 -365773 -506152
1288 -506152 -430015 -472924 -286145 -471407 -408787 -382730 -512967 -440240 -327269 -454623 -383695
1277 -383695 -382741 -368510 -449300 -485179 -364358 -473143 -496408 -388090 -517480 -538178 -408917
$$ packed form
1356g3050Q534N0641n9238q6015Q9013p5145P2119R9272r8562o5593J5647j6118
1344a38495j23728K49261r4752j918j24399K06777k358R6618j68549r0874K53400
1333F0983j20313M414m0559J06887j51848Q9406L9011q4965j76794J01433K1681
1322a50664r9953Q9116n7975K1962J6195K5673o2052k8984m3646J30184J5310
1311a44834n6170p2769j79386J60260K9864j08127J73387m6610Q5785j90078J29206
1300b19472j3171j4455o5711O480L1930J166k04564J13118n8901k4579Q2386j40379
1288e06152P6137m2909J86779j85262O2620K6057j30237P2727J12971j27354P0928
1277c83695R54J4231q0790l5879J20821j08785k3265J08318j29390k0698J29261
$$ plain form
1266 -408917 -393742 -433028 -462414 -336752 -408634 -521501 -362705 -384997 -273111 -384534 -274406
1255 -274406 -309160 -429737 -447989 -340162 -326437 -244601 -399643 -285815 -308564 -358205 -285318
1244 -285318 -275739 -391678 -412534 -257668 -368873 -322119 -191085 -403932 -192171 -311916
1234 -311916 -179478 -211754 -278962 -235205 -368961 -264771 -228771 -212831 -235421 -207100 -177662
1223 -177662 -453052 -355043 -229967 -234133 -70432 -247830 -133210 -231017 -273068 -364781 -246374
1212 -246374 -201767 -211917 -197638 -284716 -207778 -169695 -216602 -223366 -289187 -345995 -242161 -226293
1200 -226293 -248333 -111809 -252343 -106523 -192946 -168172 -336714 -245773 -324553 -334060 -340397
1189 -340397 -262046 -267715 -311402 -404231 -234551 -256393 -362663 -447805 -248119 -384173 -408726
$$ packed form
1266d08917J5175l9286k9386J25662p1882j12867J58796k2292J11886j11423J10128
1255b74406l4754j20577j8252J07827J3725Q1836j55042J13828k2749m9641P2887
1244b85318R579j15939k0856J54866j11205M6754J31034k12847K11761j19745
1234c11916J32438l2276o7208M3757j33756J04190L6000J5940k2590K8321K9438
1223a77662k75390R8009J25076m166J63701j77398J14620r7807m2051r1713J18407
1212b46374M4607j0150J4279q7078P6938L8083m6907o764o5821n6808J03834J5868
1200b26293k2040J36524j40534J45820q6423K4774j68542R0941p8780r507o337
1189c40397P8351n669m3687r2829J69680k1842j06270q5142J99686j36054k4553
$$ plain form
1178 -408726 -206978 -296890 -487398 -433684 -307665 -447335 -241944 -372725 -310835 -331579
1168 -331579 -407321 -402267 -407158 -372276 -347991 -382612 -404945 -345150 -363434 -383586 -353838 -342971
1156 -342971 -379439 -273278 -433725 -412530 -464613 -375360 -503312 -374780 -534964 -489864 -457329
1145 -457329 -480532 -326599 -432575 -392528 -397391 -480991 -526559 -418960 -333840 -193892 -505927
1134 -505927 -399486 -441928 -265913 -424616 -537611 -377692 -413180 -390839 -324708 -453147
1124 -453147 -426404 -331742 -383001 -439720 -483392 -430257 -411113 -509190 -407177 -361101 -379366
1113 -379366 -322311 -261628 -315204 -423132 -574273 -346115 -227360 -439086 -457521 -351982
1103 -351982 -426320 -460064 -304530 -404805 -439623 -340116 -402273 -456889 -462107 -295642 -409220
$$ packed form
1178d08726K01748q9912j90508N3714J26019j39670K05391j30781O1890k0744
1168c31579p5742N054m891L4882K4285l4621k2333N9795j8284k0152K9748J0867
1156c42971l6468J06161j60447K1195n2083Q9253j27952J28532j60184M5100L2535
1145d57329k3203J53933j05976M0047m863q3600m5568J07599Q5120J39948l12035
1134e05927J06441m2442J76015j58703j12995J59919l5488K2341O6131j28439
1124d53147K6743R4662n1259n6719m3672N3135J9144r8077J02013M6076j8265
1113c79366N7055O0683n3576j07928j51141K28158J18755k11726j8435J05539
1103c51982p4338l3744J55534j00275l4818R9507o2157n4616n218J66465j13578
$$ plain form
1092 -409220 -497178 -221887 -347408 -302186 -412353 -303984 -260383 -225279 -373457 -235577
1082 -235577 -278382 -341987 -321177 -470428 -275217 -450525 -354025 -478244 -345706 -371914 -413260
1071 -413260 -296199 -205422 -236413 -418981 -391305 -482094 -374099 -403264 -356041 -408758 -447675
1060 -447675 -402759 -318859 -327551 -366824 -466122 -546684 -361269 -504454 -330983 -321585 -280702
1049 -280702 -370448 -461869 -334085 -421163 -407129 -238516 -337296 -278890 -364362 -350582 -369286
1038 -369286 -469595 -460200 -363498 -392982 -380619 -310115 -362432 -333014 -362511 -433903 -393345 -484733
1026 -484733 -270659 -347989 -277791 -219773 -357976 -412476 -427559 -327712 -415030 -286915 -371370
1015 -371370 -456850 -332555 -432915 -406277 -422698 -397554 -365944 -347979 -372359 -294638 -219812
$$ packed form
1092d09220q7958K75291j25521M5222j10167J08369M3601L5104j48178J37880
1082b35577m2805o3605K0810j49251J95211j75308R6500j24219J32538k6208m1346
1071d13260J17061R0777l0991j82568K7676r0789J07995k9165M7223n2717l8917
1060d47675M4916Q3900q692l9273r9298q0562J85415j43185J73471R398M0883
1049b80702q9746r1421J27784q7078J4034J68613r8780N8406q5472J3780j8704
1038c69286j00309R395R6702k9484J2363P0504n2317K9418k9497p1392M0558r1388
1026d84733K14074p7330P0198N8018j38203n4500j5083R9847q7318J28115q4455
1015c71370q5480J24295j00360K6638j6421K5144L1610J7965k4380P7721P4826
$$ plain form
1004 -219812 -255832 -226882 -166707 -526940 -311229 -330993 -330414 -422338 -441931 -381872 -456156 -393058
992 -393058 -463060 -266166 -400371 -391952 -291762 -418499 -359437 -353134 -261076 -384934 -456325
981 -456325 -345843 -377462 -286007 -270168 -351957 -447282 -335853 -204064 -439467 -338176 -392129
970 -392129 -398077 -404169 -489258 -147036 -304984 -268868 -413996 -496045 -290374 -298288 -243624 -486248
958 -486248 -294094 -267717 -419279 -186959 -337556 -384104 -293940 -336882 -319781 -275478 -394171
947 -394171 -393176 -419362 -348362 -262233 -367223 -437430 -420756 -300966 -434553 -448947 -447876 -245071
935 -245071 -517672 -302002 -299178 -450371 -478401 -354905 -331277 -236083 -260676 -379400 -332181
924 -332181 -405551 -384198 -312555 -345085 -303147 -297012 -373332 -330576 -380660 -320417 -321146 -333021
$$ packed form
1004b19812l6020K8950O0175l60233K15711j9764N79r1924j9593O0059p4284O3098
992c93058p0002J96894j34205Q419J00190j26737N9062O303R2058j23858p1391
981d56325J10482l1619R1455J5839q1789r5325J11429J31789k35403J01291n3953
970c92129n948o092q5089L42222j57948L6116j45128q2049K05671p914N4664k42624
958d86248J92154K6377j51562K32320j50597m6548R0164m2942J7101M4303j18693
947c94171R95k6186P1000Q6129j04990p0207J6674J19790j33587j4394J071K02805
935b45071k72601K15670K824j51193k8030J23496K3628R5194k4593j18724M7219
924c32181p3370K1353P1643l2530M1938O135p6320M2756n0084O0243p29j1875
$$ plain form
912 -333021 -321846 -324214 -220343 -319364 -355372 -396017 -325503 -326689 -372181 -304142 -417243 -331099
900 -331099 -408252 -281633 -289723 -316146 -286460 -327693 -281073 -396442 -331169 -363406 -301039 -258759
888 -258759 -426506 -337730 -356236 -369687 -301528 -227216 -450807 -355808 -365462 -282558 -380519 -357508
876 -357508 -382565 -298660 -412719 -483996 -342307 -432751 -410855 -339880 -217702 -227195 -493611
865 -493611 -280600 -364162 -348528 -427558 -344479 -392414 -381984 -325657 -277853 -305826 -351341 -314855
853 -314855 -402038 -360794 -146300 -381425 -455703 -297817 -371075 -473813 -365089 -429125 -356686
842 -356686 -381137 -376380 -342294 -429915 -314174 -226184 -236314 -324461 -392730 -372154 -254708 -217522
830 -217522 -473195 -414680 -322068 -413513 -515978 -361664 -290469 -372859 -289790 -399220 -303880
$$ packed form
912c33021J1175k368J03871r9021l6008m0645P0514j186m5492O8039j13101Q6144
900c31099p7153J26619q090k6423K9686m1233M6620j15369O5273l2237O2367M2280
888b58759j67747Q8776j8506j3451O8159P4312k23591R4999r654Q2904r7961K3011
876c57508k5057Q3905j14059p1277J41689r0444K1896P0975J22178r493k66416
865d93611K13011q3562J5634p9030Q3079m7935J0430N6327M7804k7973m5515L6486
853c14855q7183M1244K14494k35125p4278J57886p3258j02738J08724o4036P2439
842c56686k4451M757L4086q7621J15741Q7990j0130q8147o8269K0576J17446L7186
830b17522k55673N8515R2612r1445j02465J54314P1195q2390Q3069j09430R5340
$$ plain form
819 -303880 -460841 -251301 -271600 -285799 -341448 -303455 -352561 -330329 -316857 -328291 -359992
808 -359992 -471420 -370068 -413125 -399482 -363434 -285183 -220628 -318391 -400053 -383063 -360639
797 -360639 -281030 -498658 -367695 -425390 -471304 -235280 -309726 -429271 -585815 -386335 -373130
786 -373130 -451031 -380603 -404583 -310502 -332308 -373419 -383848 -280768 -377427 -333718 -426601 -328052
774 -328052 -450217 -399037 -319423 -426643 -454114 -362987 -306624 -393209 -303654 -358217 -383144
763 -383144 -511938 -363108 -345100 -253381 -437016 -447897 -293158 -333608 -513766 -499180 -361435
752 -361435 -348713 -386259 -498560 -460477 -475841 -296349 -456042 -298620 -420334 -362951 -341275
741 -341275 -321876 -351364 -423291 -342525 -344119 -458043 -362949 -417776 -350007 -319011 -437694 -243524
$$ packed form
819c03880j56961K09540k0299j4199n5649L7993m9106K2232J3472j1434l1701
808c59992j11428J01352m3057J3643L6048P8251O4555r7763q1662J6990K2424
797c60639P9609k17628J30963n7695m5914K36024p4446j19545j56544J99480J3205
786c73130p7901P0428k3980R4081k1806m1111j0429J03080r6659M3709r2883R8549
774c28052j22165N1180P9614j07220k7471R1127N6363q6585Q9555n4563k4927
763c83144j28794J48830J8008R1719j83635j0881J54739m0450j80158J4586J37745
752c61435J2722l7546j12301L8083j5364J79492j59693J57422j21714N7383K1676
741c41275J9399k9488p1927Q0766j594j13924R5094n4827O7769L0996j18683J94170
$$ plain form
729 -243524 -319863 -421281 -352777 -285804 -428642 -300022 -162628 -298816 -398634 -368872 -357644
718 -357644 -335862 -356885 -472566 -250382 -393695 -365253 -511115 -309087 -257951 -311072 -323010
707 -323010 -255994 -434902 -290994 -377053 -302292 -277890 -229502 -364342 -334615 -330999 -366094
696 -366094 -178822 -256623 -240748 -319336 -251836 -213290 -406311 -149730 -241159 -259349 -274247
685 -274247 -253385 -438313 -149107 -382463 -204344 -296280 -193743 -239589 -219504 -184471 -420172
674 -420172 -317089 -218409 -329384 -309254 -305065 -170316 -251518 -353546 -229915 -288986 -228721
663 -228721 -239917 -133565 -197905 -189837 -263101 -152999 -182809 -280571 -405027 -135881 -287714
652 -287714 -328474 -384389 -271036 -253028 -256745 -255754 -326509 -206943 -265642 -285381 -324384 -291495
$$ packed form
729b43524p6339j01418O8504O6973j42838J28620J37394j36188r9818K9762J1228
718c57644K1782k1023j15681K22184j43313K8442j45862K02028N1136n3121j1938
707c23010O7016j78908J43908q6059P4761K4402M8388j34840K9727L616l5095
696c66094J87272p7801J5875p8588O7500L8546j93021K56581r1429j8190j4898
685b74247K0862j84928K89206k33356J78119r1936J02537m5846K0085L5033k35701
674d20172J03083R8680j10975K0130M189J34749q1202j02028J23631n9071O0265
663b28721j1196J06352o4340Q068p3264J10102k9810r7762j24456K69146j51833
652b87714m0760n5915J13353J8008l717R91p0755J19566n8699j9739l9003L2889
$$ plain form
640 -291495 -296470 -300997 -378846 -298270 -402882 -334760 -244777 -240244 -265818 -250822 -398716 -373955
628 -373955 -343625 -322623 -326058 -322334 -323205 -391502 -414556 -328087 -352066 -352928 -357792 -505949 -400165
615 -400165 -435539 -416767 -380824 -461334 -483625 -460511 -505765 -701968 -662037 -355185 -656729
604 -656729 -509676 -540675 -554237 -547359 -550577 -572620 -432322 -374054 -361096 -572702 -429994
593 -429994 -199464 -383139 -293205 -350744 -429080 -357559 -313561 -383380 -384484 -406432 -390708 -512874
581 -512874 -427998 -331371 -319945 -377655 -254163 -220879 -431398 -323001 -275569 -378925 -168418
570 -168418 -244968 -269570 -308854 -216899 -313765 -323955 -254292 -181827 -297196 -225967 -233683 -318890
558 -318890 -379193 -166961 -259342 -63003 -288913 -210064 -223165 -191558 -190400 -185076 -227677 -298193
$$ packed form
640b91495m975m527p7849Q0576j04612O8122Q9983M533k5574J4996j47894K4761
628c73955L0330K1002l435L724q71o8297k3054Q6469k3979q62m864j48157J05784
615d00165l5374J8772L5943q0510k2291K3114m5254j96203L9931L06852l01544
604f56729J47053l0999j3562O878l218k2043J40298N8268J2958k11606J42708
593d29994K30530j83675Q9934n7539p8336P1521M3998o9819j104k1948J5724j22166
581e12874Q4876R6627J1426n7710J23492L3284k10519J08397M7432j03356K10507
570a68418p6550k4602l9284R1955r6866j0190O9663P2465j15369P1229p716q5207
558c18890o0303K12232r2381J96339k25910P8849j3101L1607J158N324m2601p0516
$$ plain form
546 -298193 -308357 -340490 -141204 -238298 -224528 -202065 -227076 -214668 -276439 -175139 -279949
535 -279949 -307411 -263243 -244233 -216234 -242280 -248605 -252594 -261266 -212249 -199622 -349477 -323347
523 -323347 -178971 -257717 -262313 -239250 -259837 -191770 -238527 -271575 -184783 -287204 -218016 -346244
511 -346244 -258530 -310919 -366863 -386988 -390349 -282070 -240098 -225522 -284949 -387413 -143485
500 -143485 -299479 -429218 -359485 -219769 -386400 -322649 -317515 -292000 -305339 -332233 -340994
489 -340994 -274334 -407935 -475459 -397211 -318200 -293016 -399643 -306716 -243270 -226399 -404923
478 -404923 -385421 -429059 -327908 -530604 -306770 -363135 -356933 -391578 -389482 -366720 -332625 -360421
466 -360421 -321583 -463580 -241331 -388281 -350775 -347620 -357117 -328774 -430124 -320057 -447791
$$ packed form
546b98193j0164l2133J99286r7094J3770K2463k5011J2408o1771J01300j04810
535b79949k7462M4168J9010K7999k6046o325l989q672M9017J2627j49855K6130
523c23347J44376p8746m596K3063k0587O8067m6757l3048Q6792j02421O9188j28228
511c46244Q7714n2389n5944k0125l361J08279M1972J4576n9427j02464K43928
500a43485j55994j29739O9733J39716j66631O3751N134K5515j3339k6894q761
489c40994O6660j33601o7524P8248P9011K5184j06627R2927O3446J6871j78524
478d04923J9502m3638J01151k02696K23834n6365O202l4645K096K2762L4095k7796
466c60421L8838j41997K22249j46950L7506L155r497K8343j01350J10067j27734
$$ plain form
455 -447791 -356250 -351512 -312667 -364424 -338288 -421151 -372153 -301507 -362623 -296496 -432148 -416733
443 -416733 -519032 -336166 -310517 -420705 -263896 -373085 -377783 -426821 -335536 -383507 -228204
432 -228204 -343315 -353233 -388332 -325883 -277001 -248916 -375251 -303200 -336861 -305312 -445802
421 -445802 -380015 -210875 -197421 -383291 -318772 -297568 -361215 -363366 -283641 -153584 -347637
410 -347637 -399322 -399740 -321633 -411215 -354224 -298426 -207515 -560787 -289835 -320176 -319740 -431738
398 -431738 -257874 -361903 -571299 -192403 -387489 -297835 -258573 -364276 -383543 -221978
388 -221978 -260845 -417307 -331978 -319728 -205503 -354411 -396437 -188754 -288401 -329626 -328447
377 -328447 -230194 -397465 -386725 -343296 -272436 -465520 -450792 -243902 -294595 -339185 -317435
$$ packed form
455d47791R1541M738L8845n1757K6136q2863M8998P0646o1116O6127j35652J5415
443d16733j02299J82866K5649j10188J56809j09189m698m9038R1285m7971J55303
432b28204j15111r918l5099O2449M8882K8085j26335P2051l3661L1549j40490
421d45802O5787J69140J3454j85870O4519K1204o3647k151P9725J30057j94053
410c47637n1685m18P8107q9582N6991N5798R0911l53272K70952l0341M36j11998
398d31738J73864j04029k09396L78896j95086Q9654L9262j05703j9267J61565
388b21978l8867j56462Q5329J2250J14225j48908m2026K07683r9647m1225J179
377c28447R8253j67271J0740M3429P0860j93084J4728K06890n0693m4590K1750
$$ plain form
366 -317435 -396917 -341619 -324356 -367895 -171752 -251422 -329775 -287490 -320165 -299527 -380110 -271547
354 -271547 -499597 -321539 -443001 -437481 -348738 -271189 -238902 -283379 -113676 -230795 -450806
343 -450806 -361696 -251677 -208609 -360833 -292644 -315526 -304045 -301446 -208769 -248613 -380757
332 -380757 -245388 -266472 -174660 -292397 -273129 -269268 -251156 -257908 -201905 -237381 -370736 -304453
320 -304453 -183768 -363675 -301244 -290461 -270568 -364880 -303564 -328421 -254595 -113052 -252183
309 -252183 -334213 -229750 -308341 -416423 -405250 -269411 -316994 -340943 -264617 -227176 -392539
298 -392539 -173446 -307243 -254448 -356042 -237351 -365505 -327066 -365181 -322663 -330145 -225713
287 -225713 -333995 -320983 -312255 -391377 -386792 -295058 -251622 -290224 -460782 -314533 -330189 -259253
$$ packed form
366c17435p9482N5298J7263m3539J96143p9670p8353M2285l2675K0638q0583J08563
354b71547k28050J78058j21462N520Q8743P7549L2287m4477J69703j17119k20011
343d50806Q9110J10019M3068j52224O8189k2882J1481K599R2677l9844j32144
332c80757J35369k1084R1812j17737J9268L861J8112o752N6003l5476j33355O6283
320c04453J20685j79907O2431J0783J9893r4312O1316k4857P3826J41543j39131
309b52183q2030J04463p8591j08082J1173J35839m7583k3949P6326L7441j65363
298c92539K19093j33797N2795j01594J18691j28154L8439l8115M2518p482J04432
287b25713j08282J3012Q728p9122M585R1734M3436l8602j70558J46249j5656P0936
$$ plain form
275 -259253 -333508 -272823 -175104 -208120 -395438 -306430 -450448 -202193 -305596 -313774 -362336
264 -362336 -394030 -348480 -355187 -145399 -294146 -358143 -349417 -392438 -203468 -325869 -197574
253 -197574 -408912 -185220 -292734 -382716 -191749 -355517 -335913 -364944 -301901 -288303 -243325
242 -243325 -288505 -356044 -277159 -336253 -422383 -332594 -164190 -282162 -199550 -240379 -386923
231 -386923 -342082 -369316 -234240 -341970 -298824 -217813 -308686 -195312 -210042 -380554 -281175
220 -281175 -262666 -245427 -274260 -201694 -202459 -305547 -415124 -536598 -366012 -306729 -261338
209 -261338 -387568 -347061 -352355 -188749 -271445 -175469 -302507 -300575 -323733 -377851 -384547 -297418
197 -297418 -368056 -352562 -346764 -339203 -298768 -313800 -249749 -295027 -288226 -279516 -390100 -412253
$$ packed form
275b59253p4255O0685R7719l3016j87318Q9008j44018K48255j03403q178m8562
264c62336l1694M5550o707K09788j48747o3997Q726m3021J88970j22401J28295
253a97574k11338K23692j07514q9982J90967j63768J9604k9031O3043J3598M4978
242b43325m5180o7539P8885n9094q6130Q9789J68404j17972Q2612m0829j46544
231c86923M4841k7234J35076j07730M3146Q1011r0873J13374j4730j70512R9379
220b81175J8509J7239k8833P2566p65j03088j09577j21474J70586N9283M5391
209b61338j26230M0507n294J63606q2696R5976j27038J932k3158n4118o696Q7129
197b97418p0638J5494N798P561M0435j5032O4051m5278O801Q710j10584k2153
$$ plain form
185 -412253 -377725 -324774 -270531 -282157 -304622 -491116 -125304 -346456 -359359 -249260 -326030
174 -326030 -341974 -281291 -279602 -269074 -327006 -245627 -359486 -317803 -141733 -426958 -439333
163 -439333 -423910 -283051 -283278 -235451 -409041 -363578 -316132 -371122 -387443 -425436 -376918 -258009
151 -258009 -420157 -414041 -427589 -351390 -424133 -289413 -461225 -310546 -319339 -302011 -367299
140 -367299 -329996 -377488 -337085 -283281 -342182 -407350 -367299 -397678 -372828 -450199 -362726 -288640
128 -288640 -305183 -359706 -374455 -291227 -365835 -261294 -363032 -287296 -302499 -283606 -380864
117 -380864 -376054 -341322 -320261 -326858 -317222 -311711 -328565 -281846 -158854 -306928 -275761 -282027
105 -282027 -369708 -326313 -281926 -288860 -208738 -187492 -183705 -394434 -204549 -315957 -300047 -330715
$$ packed form
185d12253L4528N2951N4243j1626k2465j86494L65812k21152j2903J10099p6770
174c26030j5944O0683J689J0528n7932Q1379j13859M1683J76070k85225j2375
163d39333J5423J40859k27M7827j73590M5463M7446n4990j6321l7993M8518J18909
151b58009j62148O116j3548P6199p2743J34720j71812J50679q793J7328o5288
140c67299L7303m7492M0403N3804n8901o5168M0051l0379K4850p7371Q7473P4086
128b88640j6543n4523j4749Q3228p4608J04541j01738P5736j5203J8893r7258
117c80864M810L4732K1061o597R636N511j6854M6719J22992j48074L1167o266
105b82027q7681M3395M4387o934Q0122K1246L787k10729J89885j11408J5910l0668
$$ plain form
93 -330715 -219430 -273451 -179409 -264813 -229067 -287103 -310681 -219690 -339272 -347664 -260495 -160463
81 -160463 -231270 -231521 -272175 -203506 -250863 -238031 -254700 -250180 -174571 -261938 -321311 -223697 -340717
68 -340717 -355397 -284629 -246692 -171322 -208331 -213835 -241561 -347641 -278814 -223877 -291233 -284102
56 -284102 -242494 -327536 -405673 -307438 -301784 -259509 -292097 -402397 -385381 -297830 -227737 -246390
44 -246390 -361495 -312895 -332365 -387330 -365170 -319389 -404983 -334562 -362963 -300813 -372016 -334599
32 -334599 -402476 -319539 -422306 -490420 -399280 -371082 -390459 -400453 -430639 -424261 -437214 -325103
20 -325103 -468657 -349962 -364810 -336759 -378675 -332335 -394974 -398718 -427407 -371693 -432952 -429618
8 -429618 -462910 -295482 -318876 -264538 -329902 -347327 -385058 -366678
$$ packed form
93c30715J11285n4021R4042q5404L5746n8036k3578R0991j19582q392Q7169J00032
81a60463p0807k51m0654O8669m7357J2832j6669M520P5609q7367n9373R7614j17020
68c40717j4680P0768L7937P5370l7009n504k7726j06080O8827N4937o7356P131
56b84102M1608q5042p8137R8235N654M2275l2588j10300J7016Q7551P0093j8653
44b46390j15105M8600j9470n4965K2160M5781q5594P0421k8401O2150p1203L7417
32c34599o7877Q2937j02767o8114R1140K8198j9377r994l0186O378j2953J12111
20c25103j43554J18695j4848K8051m1916M6340o2639l744k8689N5714o1259L334
8d29618l3292J67428k3394N4338o5364j7425l7731J8380
$$ plain form
0 -366678
$$ packed form
0c66678
$$ Imaginary data points
##PAGE= N=2
##DATA TABLE= (X++(I..I)), XYDATA
$$ plain form
16383 -1588539 -1611126 -1600712 -1580379 -1601738 -1600236 -1547468 -1484972 -1476284 -1466485 -1452430 -1416533 -1432450
16371 -1432450 -1410196 -1421415 -1380919 -1327983 -1411549 -1437456 -1311935 -1236104 -1195774 -1227773 -1204175
16360 -1204175 -1211337 -1222293 -1270904 -1191545 -1163508 -1122793 -1042520 -1044717 -1087620 -1085253 -969352 -995907
16348 -995907 -972781 -932070 -926764 -931249 -863261 -868931 -903938 -854997 -795365 -778583 -729665 -794663
16336 -794663 -711951 -746506 -742601 -734799 -838474 -815318 -680936 -684614 -583858 -692885 -644470
16325 -644470 -599730 -513669 -534571 -586670 -552371 -560748 -570039 -520425 -484042 -445313 -423427 -342526
16313 -342526 -456225 -375077 -344514 -202001 -258545 -205375 -359025 -209066 -347588 -189540
16303 -189540 -309825 -315334 -259767 -236713 -272669 -225590 -97934 -23813 29129 -96119 -117068
$$ packed form
16383a588539k2587J0414K0333k1359J502N2768O2496Q688R799J4055L5897j5917
16371a432450K2254j1219M0496N2936q3566k5907J25521P5831M0330l1999K3598
16360a204175p162j0956m8611P9359K8037M0715Q0273k197m2903K367J15901k6555
16348i95907K3126M0711N306m485O7988n670l5007M8941N9632J6782M8918o4998
16336g94663Q2712l4555L905P802j03675K3156J34382l678J00756j09027M8415
16325f44470M4740Q6061k0902n2099L4299q377r291M9614L6383L8729K1886Q0901
16313c42526j13699Q1148L0563J42513n6544N3170j53650J49959j38522J58048
16303a89540j20285n509N5567K3054l5956M7079J27656P4121N2942j25248k0949
$$ plain form
16292 -117068 -45032 5808 -77050 28242 -59679 -15754 6647 27895 109730 118673 59944
16281 59944 34052 94359 155159 187706 114805 212977 155642 177560 150206 213130 173176 247168
16269 247168 251503 336966 290494 301563 249376 310496 340876 381293 341147 387767 297004 396449
16257 396449 453720 423590 475012 471362 432877 452790 449533 467110 521822 487187 598664 581160
16245 581160 553664 503286 531001 524837 583496 621284 482114 633762 620596 528939 632026
16234 632026 779475 594290 611040 683897 679156 639522 695183 740987 760355 763790 793743
16223 793743 686549 735926 809884 764088 821800 762742 817016 695051 839633 881350 813867
16212 813867 813676 878428 848761 878530 843223 916918 903323 953772 831546 974746 944187
$$ packed form
16292a17068P2036N0840q2858J05292q7921M3925K2401K1248Q1835Q943n8729
16281E9944k5892O0307O0800L2547p2901R8172n7335K1918k7354O2924l9954P3992
16269B47168M335Q5463m6472J1069n2187O1120L0380M0417m0146M6620r0763R9445
16257C96449N7271l0130N1422l650l8485J9913l257J7577N4712l4635J11477j7504
16245E81160k7496n0378K7715o164N8659L7788j39170J51648j3166r1657J03087
16234F32026J47449j85185J6750P2857m741l9634N5661M5804J9368L435K9953
16223G93743j07194M9377P3958m5796N7712n9058N4274j21965J44582M1717o7483
16212H13867j91O4752k9667K9769l5307P3695j3595N0449j22226J43200l0559
$$ plain form
16201 944187 906847 921011 901954 983506 941821 1010170 981191 1062231 903505 919916 914266
16190 914266 1033769 1028388 955375 996820 950175 936266 1001241 1036124 1114857 988608 1074840
16179 1074840 1042812 1060357 1009546 1101433 1143236 1154232 1015466 1094388 1091531 994999 1088991
16168 1088991 1114907 1035604 1059930 1103913 1129718 1029133 1062190 1172809 1127128 1224480 1276712
16157 1276712 1134003 1106569 1132245 1214867 1189923 1171316 1121599 1239981 1283298 1151105 1144861
16146 1144861 1165244 1095996 1155971 1143623 1263940 1150600 1168052 1100775 1193576 1261403 1300482
16135 1300482 1214943 1248791 1326942 1248342 1265753 1382789 1340082 1286761 1299086 1258353 1205614
16124 1205614 1146916 1073995 1201841 1318979 1277983 1266282 1210087 1200153 1439829 1176870 1254497
$$ packed form
16201I44187l7340J4164j9057Q1552m1685O8349k8979Q1040j58726J6411n650
16190I14266J19503n381p3013M1445m6645j3909O4975L4883P8733j26249Q6232
16179A074840l2028J7545n0811R1887M1803J0996j38766P8922k857r6532R3992
16168A088991K5916p9303K4326M3983K5805j00585L3057J10619m5681R7352N2232
16157A276712j42709k7434K5676Q2622k4944j8607m9717J18382M3317j32193o244
16146A144861K0383o9248N9975j2348J20317j13340J7452o7277R2801O7827L9079
16135A300482q5539L3848P8151p8600J7411J17036m2707n3321J2325m0733n2739
16124A205614n8698p2921J27846J17138m0996j1701n6195r934K39676k62959P7627
$$ plain form
16113 1254497 1127970 1275059 1290679 1187679 1176142 1230249 1242134 1383592 1148461 1248235
16103 1248235 1272938 1311575 1272056 1373333 1224904 1353709 1391856 1323548 1230382 1227316 1226269
16092 1226269 1392389 1418414 1438304 1377470 1324319 1308367 1229838 1410826 1487579 1373724 1345217
16081 1345217 1282151 1311819 1376330 1396503 1402773 1300138 1263076 1296948 1217546 1281428 1396149
16070 1396149 1380189 1271278 1383255 1354471 1336915 1221033 1257091 1392113 1285118 1430317
16060 1430317 1296522 1460598 1292611 1439225 1303959 1294463 1276245 1241625 1284205 1223660
16050 1223660 1217663 1315403 1382833 1261450 1449122 1400689 1304196 1381272 1241903 1368500 1333079
16039 1333079 1256342 1292104 1330116 1372439 1400164 1196756 1393246 1318214 1351672 1343886 1205381
$$ packed form
16113A254497j26527J47089J5620j03000j1537N4107J1885J41458k35131R9774
16103A248235K4703L8637l9519J01277j48429J28805L8147o8308r3166l066j047
16092A226269J66120K6025J9890o0834n3151j5952p8529J80988P6753j13855k8507
16081A345217o3066K9668O4511K0173O270j02635l7062L3872p9402O3882J14721
16070A396149j5960j08911J11977k8784j7556j15882L6058J35022j06995J45199
16060A430317j33795J64076j67987J46614j35266r496j8218l4620M2580o0545
16050A223660n997R7740O7430j21383J87672m8433r6493P7076j39369J26597l5421
16039A333079p6737L5762L8012M2323K7725k03408J96490p5032L3458p786j38505
$$ plain form
16028 1205381 1175233 1392301 1447053 1313447 1361450 1257577 1385905 1325436 1244952 1381554
16018 1381554 1304728 1271798 1383817 1265784 1260845 1329593 1283676 1449490 1447431 1320893 1355296
16007 1355296 1235385 1420836 1307132 1278823 1323952 1308321 1375685 1385305 1396283 1272379 1268836
15996 1268836 1264805 1314065 1237996 1400372 1388112 1376186 1358769 1366755 1292930 1312943 1362424
15985 1362424 1400833 1485986 1415652 1424018 1286265 1246074 1392195 1352939 1377192 1285806 1281600
15974 1281600 1347251 1263629 1366282 1325724 1361790 1418415 1321888 1305813 1323567 1375579 1381313
15963 1381313 1271030 1440712 1410766 1388847 1297114 1338883 1469335 1412159 1405406 1334026 1317577
15952 1317577 1357868 1310720 1458512 1387305 1349605 1420243 1505094 1368846 1491619 1387153
$$ packed form
16028A205381l0148K17068N4752j33606M8003j03873J28328o0469q0484J36602
16018A381554p6826l2930J12019j18033m939O8748m5917J65814k059j26538L4403
16007A355296j19911J85451j13704k8309M5129j5631O7364R620J0978j23904l543
15996A268836m031M9260p6069J62376j2260j1926j7417P986p3825K0013M9481
15985A362424L8409Q5153p0334Q366j37753m0191J46121l9256K4253r1386m206
15974A281600O5651q3622J02653m0558L6066N6625r6527j6075J7754N2012N734
15963A381313j10283J69682k9946k1919r1733M1769J30452n7176o753p1380j6449
15952A317577M0291m7148J47792p1207l7700P0638Q4851j36248J22773j04466
$$ plain form
15942 1387153 1448794 1238043 1325228 1346397 1331122 1415761 1416856 1294740 1311759 1231703 1350054
15931 1350054 1356273 1457030 1246272 1529147 1217094 1381277 1389882 1316671 1321568 1404875 1303510
15920 1303510 1482686 1406546 1435559 1454616 1474196 1269634 1372112 1301290 1509298 1349721
15910 1349721 1410253 1406454 1448983 1480883 1371410 1414599 1387017 1318024 1465984 1369589 1382282
15899 1382282 1331645 1314419 1423527 1423833 1429835 1315167 1355039 1343724 1426733 1428966 1381534 1449863
15887 1449863 1271492 1314505 1312086 1368341 1360700 1369674 1320146 1412405 1604721 1261282 1383747
15876 1383747 1314393 1371629 1504713 1478076 1346201 1378122 1349660 1381646 1332004 1319973 1439890
$$ packed form
15942A387153O1641k10751Q7185K1169j5275Q4639J095j22116J7019q0056J18351
15931A350054O219J00757k10758K82875l12053J64183Q605p3211M897Q3307j01365
15920A303510J79176p6140K9013J9057J9580k04562J02478p0822K08008j59577
15910A349721O0532l799M2529L1900j09473M3189k7582o8993J47960r6395J2693
15899A382282n0637j7226J09108L06O002j14668L9872j1315Q3009K233m7432O8329
15887A449863j78371M3013k419N6255p641Q974m9528R2259J92316l43439J22465
15876A383747o9354N7236J33084k6637j31875L1921k8462L1986m9642j2031J19917
$$ [...]
##END NTUPLES=NMR SPECTRUM
##END=
