##TITLE=abcd
##JCAMPDX= 6.0         $$ Bruker NMR JCAMP-DX V2.0
##DATA TYPE= NMR SPECTRUM
##DATA CLASS= NTUPLES
##ORIGIN= UXNMR, Bruker Analytische Messtechnik GmbH
##OWNER= root
$$ XWIN-NMR		Version 3.5
$$ Mon Aug 18 19:02:50 2025 Russian Standard Time (UT+4h)  servis@DPX200
##.OBSERVE FREQUENCY= 200.131235884673
##.OBSERVE NUCLEUS= ^1H
##.ACQUISITION MODE= SIMULTANEOUS
##.ACQUISITION SCHEME= undefined
##.AVERAGES= 32
##.DIGITISER RES= 18
##SPECTROMETER/DATA SYSTEM= spect
##.PULSE SEQUENCE= zg
##.SOLVENT NAME= CDCl3
##.SHIFT REFERENCE= (INTERNAL, CDCl3, 0, 16.4885)
##AUDIT TRAIL= $$ (NUMBER, WHEN, WHO, WHERE, WHAT)
$$ ##TITLE= Audit trail, XWIN-NMR		Version 3.5
$$ ##JCAMPDX= 5.01
$$ ##ORIGIN= Bruker BioSpin GmbH
$$ ##OWNER= servis
$$ F:\spectra/data/av/nmr/H1/1/pdata/1/auditp.txt
$$ ##AUDIT TRAIL=  $$ (NUMBER, WHEN, WHO, WHERE, WHAT)
(   1,<2025-08-18 19:02:04.31 +0400>,<servis>,<DPX200>,
      <created by zg, POWCHK disabled, PULCHK disabled
       configuration hash MD5:
       00 E9 B6 7A A2 85 ED C7 34 08 36 98 17 FE 4E 26
       data hash MD5: 32K
       97 44 F4 F6 18 EA 2C 39 2C F4 AB 07 98 B0 19 B8>)
(   2,<2025-08-18 19:02:17.29 +0400>,<servis>,<DPX200>,
      <Start of raw data processing
       efp BC_mod = 2 LB = 0.05 FT_mod = 6 PKNL = 1 PHC0 = -195.2202 PHC1 = 0.101552 SI = 16K 
       data hash MD5: 16K
       41 ED B3 97 80 00 E6 A8 C2 32 A3 23 1C 85 85 49>)
$$ ##END=
$$ 
$$ hash MD5
$$ FA 00 A9 23 E0 6F 26 FA C1 67 B2 71 9F 8C 4C 45
##$RELAX= 
##$RELAX= 
##$RELAX= 
##$RELAX= 
##$RELAX= 
##$RELAX= 
##$RELAX= 
##$RELAX= 
$$ Bruker specific parameters
$$ --------------------------
##$DU= <F:\spectra>
##$EXPNO= 1
##$NAME= <H1>
##$PROCNO= 1
##$TYPE= <nmr>
##$USER= <av>
##$AMP= (0..31)
100 100 100 100 100 100 100 100 100 100 100 100 100 100 100 100 100 100 
100 100 100 100 100 100 100 100 100 100 100 100 100 100 
##$AQSEQ= 0
##$AQ_mod= 1
##$AUNM= <au_zg>
##$AUTOPOS= <>
##$BF1= 200.13
##$BF2= 200.13
##$BF3= 200.13
##$BF4= 200.13
##$BF5= 500.13
##$BF6= 500.13
##$BF7= 500.13
##$BF8= 500.13
##$BYTORDA= 1
##$CFDGTYP= 0
##$CFRGTYP= 5
##$CHEMSTR= <none>
##$CNST= (0..31)
1 1 145 1 1 1 1 1 1 1 1 1 1 1 1 1 1 1 1 1 1 1 1 1 1 1 1 1 1 1 1 1 
##$CPDPRG= <>
##$CPDPRG1= <>
##$CPDPRG2= <>
##$CPDPRG3= <>
##$CPDPRG4= <mlev>
##$CPDPRG5= <mlev>
##$CPDPRG6= <mlev>
##$CPDPRG7= <mlev>
##$CPDPRG8= <mlev>
##$CPDPRGB= <>
##$CPDPRGT= <>
##$D= (0..31)
0 2 0 0 0 0 0 0 0 0.06 0 0 0 0 0 0 0.0002 0 0 0 0 0 0 0 0 0 0 0 0 0 0 
0 
##$DATE= 1755529323
##$DBL= (0..7)
120 120 120 120 120 120 120 120 
##$DBP= (0..7)
150 150 150 150 150 150 150 150 
##$DBP07= 0
##$DBPNAM0= <>
##$DBPNAM1= <>
##$DBPNAM2= <>
##$DBPNAM3= <>
##$DBPNAM4= <>
##$DBPNAM5= <>
##$DBPNAM6= <>
##$DBPNAM7= <>
##$DBPOAL= (0..7)
0.5 0.5 0.5 0.5 0.5 0.5 0.5 0.5 
##$DBPOFFS= (0..7)
0 0 0 0 0 0 0 0 
##$DE= 6
##$DECBNUC= <off>
##$DECIM= 32
##$DECNUC= <off>
##$DECSTAT= 4
##$DIGMOD= 1
##$DIGTYP= 9
##$DL= (0..7)
0 120 120 120 120 120 120 120 
##$DP= (0..7)
150 150 150 150 150 150 150 150 
##$DP07= 0
##$DPNAME0= <>
$$ [...]
##$SUBNAM4= <"">
##$SUBNAM5= <"">
##$SUBNAM6= <"">
##$SUBNAM7= <"">
##$SUBNAM8= <"">
##$SUBNAM9= <"">
##$SW= 20.6817932712277
##$SWIBOX= (0..15)
0 0 3 0 0 0 0 0 0 0 0 0 0 0 0 0 
##$SW_h= 4139.07284768212
##$TD= 32768
##$TD0= 1
##$TE= 0
##$TE2= 300
##$TE3= 300
##$TEG= 300
##$TL= (0..7)
0 120 120 120 120 120 120 120 
##$TP= (0..7)
150 150 150 150 150 150 150 150 
##$TP07= 0
##$TPNAME0= <>
##$TPNAME1= <>
##$TPNAME2= <>
##$TPNAME3= <>
##$TPNAME4= <>
##$TPNAME5= <>
##$TPNAME6= <>
##$TPNAME7= <>
##$TPOAL= (0..7)
0.5 0.5 0.5 0.5 0.5 0.5 0.5 0.5 
##$TPOFFS= (0..7)
0 0 0 0 0 0 0 0 
##$TUNHIN= 0
##$TUNHOUT= 0
##$TUNXOUT= 0
##$USERA1= <user>
##$USERA2= <user>
##$USERA3= <user>
##$USERA4= <user>
##$USERA5= <user>
##$V9= 5
##$VALIST= <valist>
##$VCLIST= <CCCCCCCCCCCCCCC>
##$VD= 0
##$VDLIST= <DDDDDDDDDDDDDDD>
##$VPLIST= <PPPPPPPPPPPPPPP>
##$VTLIST= <TTTTTTTTTTTTTTT>
##$WBST= 1024
##$WBSW= 30
##$XGAIN= (0..3)
0 0 0 0 
##$XL= 0
##$YL= 0
##$YMAX_a= 46160
##$YMIN_a= -75324
##$ZGOPTNS= <>
##$ZL1= 120
##$ZL2= 120
##$ZL3= 120
##$ZL4= 120
##$ABSF1= 0
##$ABSF2= 0
##$ABSG= 0
##$ABSL= 0
##$ALPHA= 0
##$AQORDER= 0
##$ASSFAC= 0
##$ASSFACI= 0
##$ASSFACX= 0
##$ASSWID= 0
##$AUNMP= <proc_1d>
##$AZFE= 0.1
##$AZFW= 0.1
##$BCFW= 0
##$BC_mod= 2
##$BYTORDP= 0
##$COROFFS= 0
##$CY= 18.4799938201904
##$DATMOD= 1
##$DC= 0
##$DFILT= <>
##$DTYPP= 0
##$F1P= 9.9274215381318
##$F2P= -0.165520771350173
##$FCOR= 1
##$FTSIZE= 16384
##$FT_mod= 6
##$GAMMA= 0
##$GB= 0
##$INTBC= 1
##$INTSCL= 4.127829e-11
##$ISEN= 128
##$LB= 0.05
##$LEV0= 0
##$LPBIN= 0
##$MAXI= 10000
##$MC2= 0
##$MEAN= 0
##$ME_mod= 0
##$MI= 50
##$NCOEF= 0
##$NC_proc= -7
##$NLEV= 6
##$NOISF1= 3.799351
##$NOISF2= 2.8
##$NSP= 0
##$NTH_PI= 0
##$NZP= 0
##$OFFSET= 16.48848
##$PC= 4
##$PHC0= -195.2202
##$PHC1= 0.101552
##$PH_mod= 1
##$PKNL= yes
##$PPARMOD= 0
##$PSCAL= 4
##$PSIGN= 0
##$REVERSE= no
##$SF= 200.130005582386
##$SI= 16384
##$SIGF1= 3
##$SIGF2= 2
##$SINO= 400
##$SIOLD= 16384
##$SREGLST= <1H.CDCl3>
##$SSB= 0
##$STSI= 16384
##$STSR= 0
##$SW_p= 4139.07284768211
##$SYMM= 0
##$S_DEV= 0
##$TDeff= 32768
##$TDoff= 0
##$TI= <>
##$TILT= no
##$TM1= 0
##$TM2= 0
##$TOPLEV= 0
##$USERP1= <user>
##$USERP2= <user>
##$USERP3= <user>
##$USERP4= <user>
##$USERP5= <user>
##$WDW= 1
##$XDIM= 16384
##$YMAX_p= 336781152
##$YMIN_p= -506700
$$ End of Bruker specific parameters
$$ ---------------------------------
##NTUPLES= NMR SPECTRUM
##VAR_NAME=  FREQUENCY,     SPECTRUM/REAL,   SPECTRUM/IMAG
##SYMBOL=    X,             R,               I
##VAR_TYPE=  INDEPENDENT,   DEPENDENT,       DEPENDENT
##VAR_FORM=  AFFN,          ASDF,            ASDF
##VAR_DIM=   16384,         16384,           16384
##UNITS=     HZ,            ARBITRARY UNITS, ARBITRARY UNITS
##FACTOR=    0.252644378177508, 1,           1
##FIRST=     3299.83951724647, 0,            0
##LAST=      -839.233330435636, 0,           0
##MIN=       -839.233330435636, -506700,     0
##MAX=       3299.83951724647, 336781152,    0
$$ Real data points
##PAGE= N=1
##DATA TABLE= (X++(R..R)), XYDATA
$$ [...]
9723D0539l7169Q7077k9260L5739n0087p661K7911j3703r1974M3338K5295o5232
$$ 40539 3370 90447 61187 96926 46839 39178 67089 53386 -38588 4750 30045 -35187
9711c5187R9690q4576J30342j28205M0481R03k5805O997l2292J14400r2574l7935
$$ -35187 64503 -20073 110269 -17936 22545 23448 -2357 4640 -27652 86748 -5826 -43761
9699d3761J06851n2232J5461m0096J267j2889J14151p1855O8553m9958O5637r3892
$$ -43761 63090 10858 26319 -13777 -12510 -25399 88752 16897 85450 35492 101129 7237
9687G237n390l2293K6065m311N8613k8588L5346O1480o8964K8692k7959P9634
$$ 7237 1847 -30446 -4381 -8692 49921 21333 56679 118159 49195 77887 49928 129562
9675A29562j04928L3331n177J7580O4630l5846K9301M9800m7307o2906L6589L091
$$ 129562 24634 57965 52788 70368 134998 99152 128453 178253 130946 68040 104629 107720
9663A07720m4587Q1673k1220k584N5487n5466K8544m4618J4652R70O051P8202
$$ 107720 63133 144806 123586 121002 176489 121023 149567 104949 119601 120571 126622 204824
9651B04824q101k9311N4168j4834J8407L6864Q7501q0392J21122J7667J543n9814
$$ 204824 196723 167412 221580 206746 225153 262017 349518 269126 390248 407915 409458 349644
9639C49644M2136q5686R2285J3972L0700m2269j7721j5032n6264o2757M0148q1193
$$ 349644 391780 306094 398379 412351 443051 400782 383061 368029 311765 249008 289156 207963
9627B07963n450J8960n6992j100O6049q5092J1070l5954O1377k3462l984K0412
$$ 207963 202513 221473 164481 163381 229430 144338 155408 119454 180831 157369 153385 173797
9615A73797l0390m4610r177N7053o9845N8904l1423N5520k4286J8993N468K003
$$ 173797 143407 98797 89620 146673 76828 135732 104309 159829 135543 154536 160004 162007
9603A62007j00297N6042R1956q9658k0527j2064O8637o5445k6420J04965K3938
$$ 162007 61710 117752 209708 120050 99523 87459 156096 90651 64231 169196 193134
9592A93134o1322r627O6896o0768K0461l282M8408n6440n862k750M8240o9324
$$ 193134 131812 122185 189081 128313 148774 145492 193900 137460 131598 128848 177088 107764
9580A07764P0326k7279J7234N4997n2083K7283o665l2464N2322j4916M0115M200
$$ 107764 178090 150811 168045 223042 170959 198242 191577 159113 211435 196519 236634 240834
9568B40834J8926m61K4219Q4925k0565j8752P2671r548k0743q2536N0897q4437
$$ 240834 259760 259299 283518 368443 347878 329126 401797 392249 371506 288970 339867 255430
9556B55430l321l697n3687l6288O6418n8505N8009k6492j7787J6273J0200p66
$$ 255430 252109 248412 194725 158437 224855 166350 224359 197867 180080 196353 206553 205787
9544B05787n8215j185J18385r3063J1121J3719n331J05M7756k3786J8378O9909
$$ 205787 147572 146387 264772 171709 182830 196549 191218 191323 239079 215293 233671 303580
9532C03580j22990J3610J2672L1497p4082J09252r5264N9425j0632q8441P6413
$$ 303580 180590 194200 206872 238369 164287 273539 178275 237700 227068 138627 215040
9521B15040l4243Q8458l9462o6974P6495J3101k3130M3590j15058R4308j0253
$$ 215040 180797 269255 229793 162819 239314 252415 229285 272875 157817 252125 241872
9510B41872l2899M1362o5785N0818m8632J5957j8554L8771k0626k0492K6680j560
$$ 241872 208973 250335 184550 235368 186736 202693 184139 222910 202284 181792 208472 206912
9498B06912k555j2545K7956M8370o2960K7410l0790L5530J943N4019o2591J5323
$$ 206912 204357 191812 219768 268138 205178 232588 201798 237328 239271 293290 230699 246022
9486B46022J6433m7085K051J29974j5052k2469m8057m119L382O6586k8636n1469
$$ 246022 262455 215370 217421 347395 332343 309874 261817 257698 261080 327666 299030 247561
9474B47561L6906o962K4429m035J5460l7359Q1475n2389Q8106k1424P1737o8838
$$ 247561 284467 277505 301934 297899 313359 276000 357475 305086 393192 371768 443505 374667
9462C74667P3081M9156l3386J14446R5930J0398J2392l4959n5221o4976K7465
$$ 374667 447748 496904 463518 577964 673894 684292 696684 661725 606504 541528 568993
9451E68993k5678j15005Q3550r03o9547O7531j02189k8504J06953m6535r271k0497
$$ 568993 543315 428310 511860 510957 441410 508941 406752 378248 485201 438666 429395 408898
9439D08898L1484k3922J7923l7505L0267N4909k9330l1183L8396J7995J2030J7771
$$ 408898 440382 416460 434383 396878 427145 482054 452724 421541 459937 477932 489962 507733
9427E07733n4593N6824l6423N704J5358r338m5793Q6109P5175p7335k4102m707
$$ 507733 453140 509964 473541 479245 494603 485265 439472 525581 600756 523421 499319 494612
9415D94612L0564j738k7048P4143o5880k333l822L8422n8489M1827J1778L2453
$$ 494612 525176 523438 496390 570533 504653 502320 498498 536920 478431 520258 532036 564489
9403E64489k1904r610k3410P0640m5427N7637J8165P3553q7313j3277P4316k7917
$$ 564489 542585 532975 509565 580205 534778 592415 610580 684133 596820 583543 657859 629942
9391F29942k4603J2726r224k1138O1535l7897P7847J160L7203n4756K6533N515
$$ 629942 605339 618065 608841 587703 649238 611341 689188 690348 727551 672795 699328 704843
9379G04843j5613j0259M1428L4540K8763n3198K1888l0195j10484P8623J0026
$$ 704843 689230 678971 720399 754939 783702 730504 752392 722197 611713 690336 700362
9368G00362J04389j24847N4008o8572j0464P1478R4327n0357L0490K2072k2124
$$ 700362 804751 679904 733912 665340 654876 726354 820681 770324 800814 822886 800762
9357H00762O4586J4678M4500M2337k6389M1712M8065J5570m3794K1844o8321k7406
$$ 800762 865348 880026 924526 966863 940474 982186 1030251 1045821 1002027 1023871 955550 928144
9345I28144N7695M4093J9188k2338O0170k6517k0416J7578O144N8397m0331N7174
$$ 928144 985839 1029932 1049120 1026782 1086952 1060435 1040019 1057597 1063741 1122138 1081807 1138981
9333A138981K0060o8736J63790n6948M5323L1977M2916l2355n3696m4931J7581
$$ 1138981 1159041 1090305 1254095 1197147 1242470 1274447 1317363 1285008 1231312 1186381 1203962
9322A203962J03729J7923j11517K7781L1932M0684m608l82j2772M4416L2027k8255
$$ 1203962 1307691 1325614 1214097 1241878 1273810 1314494 1309886 1309504 1296732 1341148 1373175 1344920
9310A344920R4044m720M0863l5320J22838m9377J36818O3087P8769M2699J09741
$$ 1344920 1438964 1434244 1475107 1439787 1562625 1513248 1650066 1713153 1791922 1834621 1944362
9299A944362J42803O4139J83447K08552J70901R4295m4263k8100j46164j45843
$$ 1944362 2087165 2151304 2334751 2543303 2714204 2808499 2764236 2736136 2589972 2444129
9289B444129m9423m5300p6953k2771o9432l4513M2045K3811K4372K8362n4845
$$ 2444129 2394706 2349406 2272453 2249682 2180250 2145737 2187782 2211593 2235965 2264327 2209482
9278B209482j7130j28547l4808j5522L7100K8871N5543N5845J56936J80408O0065
$$ 2209482 2192352 2063805 2028997 2013475 2050575 2079446 2134989 2190834 2347770 2528178 2588243
9267B588243K43866J26023L37528L46057L86799L13682j7629j96622l49782l86766
$$ 2588243 2832109 2958132 3295660 3641717 4028516 4342198 4324569 4127947 3778165 3391399
9257C391399k55230l17748j10216k50476j46886k8797o7081j46895r415J13357
$$ 3391399 3136169 2818421 2708205 2457729 2310843 2282046 2214965 2068070 2058655 2172012
9247B172012j57595k7267m388j3016j1784m9399K5904M8997k9329j4180L0537
$$ 2172012 2014417 1987150 1982762 1969746 1957962 1908563 1934467 1983464 1954135 1939955 1970492
9236A970492N4433k2567R2420o3000k69J8134r22J16013L1331o695K0254K4729
$$ 1970492 2024925 2002358 2094778 2031778 2031509 2049643 2048721 2164734 2196065 2189370 2209624 2234353
9224B234353l7957J09940M9946J15312o0219J25994P7968J183J03948J52497R9848
$$ 2234353 2196396 2306336 2356282 2471594 2411375 2537369 2615337 2616520 2720468 2872965 2972813
9213B972813K00283K0238K96357K27406K37130K39700J75694J17964R7209P9853
$$ 2972813 3173096 3193334 3489691 3717097 3954227 4193927 4369621 4487585 4584794 4664647
9203D664647J20811J06806J36566N3823j6772m6874j73889r5367j53087j25991
$$ 4664647 4785458 4892264 5028830 5082653 5065881 5019007 4845118 4749751 4596664 4470673
9193D470673m1902k90m9278Q2907l4983J51408K3456Q3442J64065M4436K12617
$$ 4470673 4428771 4428481 4379203 4462110 4427127 4578535 4601991 4685433 4849498 4893934 5106551
9182E106551L01685k6895J82536K97296J18298K76780K52110K44861J69462K76038
$$ 5106551 5408236 5381341 5563877 5861173 5979471 6256251 6508361 6753222 6922684 7198722
9172G198722K21239K63705K20849J76261K50879L8071L5325j37212J22739O5570
$$ 7198722 7419961 7683666 7904515 8080776 8331655 8369726 8405051 8267839 8390578 8456148
9162H456148J31362R8192K65869J61434K72489L97506L19424M29019M50422N15809
$$ 8456148 8587510 8685702 8951571 9113005 9385494 9783000 10102424 10531443 10981865 11497674
9152A1497674P52735O78200P68755R19676Q80484R50349J106225J252371J467642
$$ 11497674 12250409 12928609 13697364 14617040 15497524 16447873 17554098 18806469 20274111
9143B0274111J583170J668052J106922J13737n15281q66599r23392r01492p39789
$$ 20274111 21857281 23525333 24632255 24745992 24230711 23364112 22440720 21539228 20799439
9134B0799439l58065k36828J0615J57699M27234O86382R51049J010949J463608
$$ 20799439 20441374 20204546 20215161 20372860 20800094 21486476 22437525 23448474 24912082
9125B4912082J674468J909732K111606J796381J128603N82470j70344r75421j408349
$$ 24912082 26586550 28496282 30607888 32404269 33532872 34115342 33944998 32969577 31561228
9116C1561228j909162k023534j905931j712141j403586j104078p79874n06034
$$ 31561228 29652066 27628532 25722601 24010460 22606874 21502796 20722922 20216888
9108B0216888j51156n8801r076J69756K87239M67911P59066Q27457O60228k85936
$$ 20216888 20065732 20006931 19997855 20167611 20454850 20922761 21681827 22509284 23169512 22883576
9098B2883576j225845j716687j818491j973212j815636j572670j258913j019427
$$ 22883576 21657731 19941044 18122553 16149341 14333705 12761035 11502122 10482695
9090A0482695r21125o18687n38049m20886k59563k95415l31441m46136l18038
$$ 10482695 9561570 8942883 8404834 7983948 7724385 7428970 7097529 6651393 6333355
9081F333355m27448k76785l69850k45009j52887j65703k43210j21113j83217l9505
$$ 6333355 5905907 5629122 5259272 5014263 4861376 4695673 4452463 4331350 4148133 4108628
9071D108628j24933j51172j22472j70956J7225j37758r6224j5641j61115q5166
$$ 4108628 3983695 3832523 3710051 3539095 3556320 3418562 3322338 3306697 3145582 3060416
9061C060416J5279j74423j7870K274j21872p2101q833l4924j18104Q805j46357
$$ 3060416 3075695 2901272 2883402 2885676 2763804 2691703 2682870 2647946 2529842 2538647 2392290
9050B392290L9138p357r072j04903P5116j40917K057l5376k2940m7238K4143m4843
$$ 2392290 2431428 2424071 2414999 2310096 2385212 2244295 2246352 2210976 2188036 2140798 2164941 2120098
9038B120098j6372n8259q7150J2299j49216p304r4011n5526k0072m7595L8714
$$ 2120098 2103726 2045467 1958317 1970616 1821400 1814096 1720085 1664559 1644487 1596892 1635606
9027A635606r0696Q599L3097n0987r4774K2071j0535k4949k4126O257l3962m0280
$$ 1635606 1544910 1553509 1586606 1535619 1440845 1462916 1452381 1427432 1403306 1409563 1375601 1335321
9015A335321k3840r1221j5121j4771k2829k1735o1027M6157j51311j3855J0709
$$ 1335321 1311481 1220260 1205139 1190368 1167539 1145804 1084777 1130934 979623 965768 976477
9004I76477r8536O1468o7530L3709J7219l8512n1661P1504q1142l3606M8744k7968
$$ 976477 877941 939409 871879 905588 922807 884295 832634 904138 822996 789390 838134 810166
8992H10166q6955m928k3317Q5699o568p009J6045p6747k4175M3418M7407j10896
$$ 810166 723211 718283 694966 780665 774097 767088 783133 706386 682211 725629 773036 662140
8980F62140P0095q3333K29O9731P455m6140m5151O5169k4504l4730p4973N3605
$$ 662140 732235 648902 649131 718862 726317 680177 635026 700195 675691 640961 565988 619593
8968F19593Q2083j27517L4689k7017Q1746l5742n7710P04N5732m3991N3651l3626
$$ 619593 701676 574159 608848 581831 663577 627835 570125 570829 626561 582570 636221 602595
8956F02595K2130k4596M2133K7174N4070j03698N6755k8180o613l6425N6659r6203
$$ 602595 624725 600129 642262 669436 723506 619808 676563 648383 641770 605345 662004 565801
8944E65801p5811N9164k6200K5524N6050r4558k0841K559Q461J2415K4875N8705
$$ 565801 489990 549154 522954 548478 604528 509970 489129 491688 500149 512564 537439 596144
8932E96144l6755M8566n7122k3817l2992N1335N2780k7496O3625K9186k0869l6439
$$ 596144 559389 607955 550833 527016 494024 545359 598139 570643 634268 663454 642585 606146
8920F06146M586q810p7098P8390j33568M896N164l3839Q9893q5391j4462N3776
$$ 606146 610732 601922 524824 603214 469646 474542 479706 445867 535760 450369 435907 489683
8908D89683L0011o6398J18983q1987M1722n213l9478L9512r0277P8948j9215O9040
$$ 489683 519694 453296 572279 490292 532014 526801 487323 526835 436558 515506 496291 565331
8896E65331q3395R789M5839j6274L1768m317j36069P9383n6914J01904p5497o8106
$$ 565331 481936 491725 537564 521290 553058 548741 412672 492055 435141 537045 461548 393442
8884C93442O7394M4263r2236P9756K5797k4216k2378J6579M5869n6100J7372j9731
$$ 393442 460836 505099 412863 492619 518416 494200 471822 488401 534270 478170 495542 475811
8872D75811l3161m415J2597k1446O3717M2633r4006N8413p6897J1801K3008J00689
$$ 475811 442650 438235 450832 429386 493103 535736 441730 500143 423246 435047 458055 558744
8860E58744j774j12828J7755N7648m1513L0754k75o519O7043r2672Q0355j4915
$$ 558744 556970 444142 461897 519545 478032 508786 508511 501992 569035 476363 556718 541803
8848E41803p7519P2192l6071M9219P0614m7985m321J322j1341k7937J05626o6962
$$ 541803 464284 536476 500405 549624 620238 572253 567932 569254 557913 529976 635602 568640
8836E68640n7669L9085l8491O4985O660p8407R7102q586J047M0890m3414J2961
$$ 568640 510971 550056 511565 576550 583210 504803 601905 593319 594366 635256 591842 604803
8824F04803J4686M1394L2651n3916L4700O4633o3611r773j3931L8489j17698M1047
$$ 604803 619489 660883 693534 639618 674318 738951 675340 665567 651636 690125 572427 613474
8812F13474L1550j0643Q513k9782M0861P5261Q284K9396p602J5679P7534L4677
$$ 613474 645024 634381 642894 613112 653973 729234 737518 766914 759312 774991 852525 887202
8800H87202o4047J0871J6101R4567n6099J9522m0314l4699K3163l6557m4633M8411
$$ 887202 823155 834026 850127 944694 888595 908117 867803 833104 856267 819710 775077 823488
8788H23488j06190M2092K90229k12757r8234l0025N3382l3927k0353J7562k0668
$$ 823488 717298 759390 1049619 836862 738628 708603 761985 728058 707705 725267 704599
8777G04599N918J0469J7377n0900P2145m990M7611p525M3897k6652K7007r971
$$ 704599 710517 720986 738363 687463 759608 754618 802229 794704 838601 811949 838956 828985
8765H28985L8003J2195M5851o1514J57518K7479n3133N974O0590J0926M6373N0914
$$ 828985 866988 879183 925034 863520 1021038 1048517 995384 1001358 1061948 1072874 1119247 1170161
8753A170161O5263j1248M1925l6050Q191l3979N628R0929J4296l6980R9973o5569
$$ 1170161 1235424 1224176 1266101 1230051 1238242 1204263 1209891 1300820 1315116 1278136 1378109 1312540
8741A312540K9835l667J96056M7266N082J8107J23850P0767O6785P4178Q6216
$$ 1312540 1342375 1338708 1534764 1582030 1587112 1605219 1729069 1799836 1866621 1940799 2027015
8730B027015M0534Q5500N4794M4359M6343P2889P1126J4090J05858m6529M5042
$$ 2027015 2067549 2153049 2207843 2252202 2298545 2371434 2442560 2456650 2562508 2515979 2561021
8719B561021j86645k3185N0373m6803r9887P4515J14418K1321J26670o464J52176
$$ 2561021 2374376 2351191 2401564 2354761 2254874 2329389 2443807 2465128 2591798 2585334 2737510
8708B737510J74498J50724J21136K27530K96778K90718M58056L45320L92719N00269
$$ 2737510 2912008 3062732 3183868 3411398 3708176 3998894 4456950 4802270 5194989 5695258
8698E695258N94897Q10884P13147O23919K66489j42672n89369p18505q43554p99981
$$ 5695258 6290155 7101039 7814186 8438105 8704594 8561922 7972553 7254048 6410494 5610513
8688E610513o43477o16031m19997l81972k62303k12179j74313j89113j65796n4588
$$ 5610513 4967036 4351005 3931008 3549036 3286733 3074554 2900241 2711128 2545332 2490744
8678B490744j50949m8497q9699Q239o0986j13633j3005n2159k0605o1297p7560
$$ 2490744 2339795 2291298 2201599 2209838 2148852 2035219 2022214 1970055 1949450 1888153 1810593
8667A810593p2536l7958r2452m1149J11218o2279J1695n0174n9788o54J1563K892
$$ 1810593 1738057 1700099 1607647 1566498 1677716 1615437 1627132 1576958 1517170 1516516 1528079 1530971
8655A530971k3184o777L8498L7570r4904J17706o8839J1420m9241L6434l4138
$$ 1530971 1507787 1501010 1539508 1577078 1482174 1599880 1531041 1542461 1493220 1529654 1495516
8644A495516J6757J3101k0380R3449j8577O2421o4564K3441O7497J07629o8899
$$ 1495516 1512273 1525374 1504994 1598443 1579866 1642287 1577723 1601164 1668661 1776290 1707391
8633A707391J4148K5569J1089R4119L325K7113o596J51985n8455L8442R614J52752
$$ 1707391 1721539 1747108 1758197 1852316 1855641 1882754 1876158 2028143 1969688 2008130 2017744 2170496
8621B170496p3531J6702N3291N1399j5446J10773j2809M1059N9196K1846J24429
$$ 2170496 2096965 2113667 2166958 2218357 2202911 2313684 2300875 2341934 2401130 2422976 2547405
8610B547405J14787R5445n0743O8390J61372L3134K9258J30735Q5548N0128P9877
$$ 2547405 2662192 2757637 2706894 2775284 2936656 2969790 2999048 3129783 3215331 3265459 3345336
8599C345336K01244R6709Q2334J42569K25762R6034K29117K08297J89363J08415
$$ 3345336 3546580 3643289 3725623 3868192 4093954 4189988 4419105 4627402 4816765 4925180
8589D925180L7415N3794P0607p8958k1750p7214J10432k5502O4226K2209J31612
$$ 4925180 4962595 5016389 5086996 5008038 4986288 4909074 5019506 4994004 5058230 5080439 5212051
8578E212051P974K61898M5324R1628K54468J07808L88221K04748K81123M20283
$$ 5212051 5220025 5481923 5527247 5618875 5873343 5981151 6369372 6574120 6855243 7275526
8568G275526L66900N22190L72513N36857N08152N83658N56866N95089M26988K14834
$$ 7275526 7642426 8164616 8537129 9073986 9582138 10165796 10722662 11317751 11744739 11959573
8558A1959573J65071n2620j44056j61395r1199j1224Q8773J89499J79597L08924
$$ 11959573 12124644 12072024 11927968 11766573 11675374 11664150 11752923 11942422 12122019 12430943
8548A2430943M41906M47090P14132Q65640Q65624J242700J038940L599430N14182
$$ 12430943 12872849 13319939 14034071 14899711 15765335 17008035 18046975 21646405 22160587
8539B2160587K458830K890138L500150M058947M793483M899251M422426L409014
$$ 22160587 24619417 27509555 31009705 35068652 39862135 44761386 49183812 52592826
8531E2592826J361096r23874k968701m341037n308522n257360m768771m096973
$$ 52592826 53953922 53030048 50061347 45720310 40411788 35154428 30385657 26288684
8523B6288684l408785k596760k259658j795908j657326j229377r92718j105134
$$ 26288684 22879899 20283139 18023481 16227573 14570247 13340870 12348152 11243018
8515A1243018q21409p88637o01267p81424l94801n34855m12403m93579k67114
$$ 11243018 10421609 9632972 9031705 8250281 7855480 7320625 6908222 6414643 6147529
8506F147529m08786k51407l21977k57838k65679j69488j84195j96460j66200k08405
$$ 6147529 5738743 5487336 5165359 4907521 4641842 4472354 4288159 4091699 3925499 3717094
8496C717094K4571k07299j30881o1758p3090q7131n4003o0157o1929j11549J15793
$$ 3717094 3741665 3534366 3403485 3341727 3268637 3181506 3127503 3067346 3005417 2893868 3009661
8485C009661j12012k2665J7740k6054j63767n4861O682j23411j18380K7380j12328
$$ 3009661 2897649 2874984 2892724 2866670 2702903 2648042 2654724 2531313 2412933 2440313 2327985
8474B327985o9935o552k4667j32346n1147P2263j45050J45571j63246P472K8949
$$ 2327985 2258050 2251498 2226831 2094485 2043338 2115601 1970551 2116122 1952876 1960348 1989297
8463A989297M0508j35379L2537m4105m2142R412k8302N2034n2123k3127j00887
$$ 1989297 2029805 1894426 1926963 1882858 1840716 1850128 1821826 1873860 1821737 1798610 1697723
8452A697723K2J7302n3970N0556Q6791l6102j158j611n9504p3820k6209k1750
$$ 1697723 1697745 1715047 1661077 1711633 1798424 1762322 1761164 1759553 1700049 1626229 1600020 1578270
8440A578270J28935m8029L5719p0835O4848m8363L4312n9793P4872m4176L1980
$$ 1578270 1707205 1659176 1694895 1624060 1688908 1640545 1674857 1615064 1689936 1645760 1677740
8429A677740r0574K5497k6303J30505k45328O7319R690L5748M5458l8915j5198
$$ 1677740 1587166 1612663 1586360 1716865 1471537 1538856 1548546 1584294 1629752 1590837 1575639
8418A575639L8670j7061p6041q092j7155n8797K6991q810k1757J6413o4151M9237
$$ 1575639 1614309 1597248 1521207 1513115 1495960 1437163 1464154 1455344 1433587 1450000 1385849 1435086
8406A435086L2059p2229K4495l3865K2205l6968j9479P2128m4296K9221k0756
$$ 1435086 1467145 1394916 1419411 1385546 1407751 1370783 1351304 1423432 1379136 1408357 1387601
8395A387601R5023j23700J15633O5737n2126K89920l50121J37348n3292K2858
$$ 1387601 1482624 1358924 1474557 1540294 1488168 1778088 1427967 1565315 1512023 1534881
8385A534881K9563r6728R0557l8723L7204k2699Q2882n100j6262J08101m8804
$$ 1534881 1564444 1467716 1558273 1519550 1556754 1534055 1616937 1611837 1595575 1703676 1654872
8374A654872J06882K970R9079R2027r2690j28049q0417n4204m2061j3595o974
$$ 1654872 1761754 1764724 1863803 1955830 1863140 1735091 1654674 1600470 1558409 1544814 1537840
8363A537840m2703p5582o0533j11445r647J0989q9301j9952o0399r48K0369k698
$$ 1537840 1495137 1419555 1359022 1247577 1237930 1248919 1159618 1139666 1079267 1078319 1098688 1095990
8351A095990M6821j44715K4922L9022K4541j1218M3423j11677p0179Q2270j5566
$$ 1095990 1142811 998096 1023018 1062040 1086581 1075363 1118786 1007109 936930 1019200 1003634
8340A003634j3597L4727r2786J03867j0965M8000m3566m2903l1729N396N5487
$$ 1003634 990037 1024764 931978 1035845 1024880 1072880 1029314 986411 954682 960078 1015565
8329A015565k1076J2070j8266J2990O8346p7937l0185Q0807p1666k4011J0221
$$ 1015565 994489 1006559 988293 1001283 1069629 991692 961507 1042314 970648 946637 956858
8318I56858j0089o4237P5985n6677M2151p8837R9337j9601j60744L0000j52732
$$ 956858 946769 882532 958517 901840 943991 865154 964491 944890 784146 814146 661414
8307F61414K18911q6679K5098l4637p5858O5925n5225p5492O4908r8098J40183
$$ 661414 880325 793646 818744 784107 708249 774174 718949 643457 708365 610267 750450
8296G50450L772k9126Q1117j30173m2670J1182K4633M1664O8755j48336j3274
$$ 750450 754222 725096 806213 676040 633370 644552 669185 710849 779604 631268 617994
8285F17994l8581J00230j18384M1170P464J2050R3204q2258o0347O2501J18067
$$ 617994 579413 679643 561259 602429 609893 621943 715147 632889 572542 635043 753110
8274G53110k12382J04778O1247r438Q926N7432J84474k67526J65033Q1234j28665
$$ 753110 540728 645506 706753 697315 706241 763673 948147 680621 845654 926888 798223
8263G98223R5272O6448j06669J4908n6435j40004Q3145K2015p6295N3916j06191
$$ 798223 893495 959943 853274 868182 811747 671743 754888 776903 700608 754524 648333
8252F48333R4411l2525k9183l2363q5940P7106j40544J23615j18771J80953j31574
$$ 648333 742744 710219 681036 648673 562733 639839 499295 622910 504139 685092 553518
8241E53518l1674J14964Q2723l20827J51447Q4932j39161R7978j43208K15545
$$ 553518 521844 636808 719531 398704 550151 635083 495922 593900 450692 666237
8231F66237K449j23467p3498J62094R8639r5811R7714j11042J05323J16209J8723
$$ 666237 668686 545219 471721 633815 732454 636643 734357 623315 728638 844847 863570
8220H63570j74217M4199J2359j24462j29813j3150P7607J17752j54879P5077k69901
$$ 863570 689353 733552 745911 621449 491636 478486 556093 673845 518966 594043 324142
8209C24142M74698l90392O6058J08522q1186L8711J05598j37922L1527r5198J89634
$$ 324142 798840 408448 474506 583028 501842 540553 646151 508229 539756 444558 634192
8198F34192k45573J40969P4118n6960J85286n53595J61332M46039m55758L93077
$$ 634192 388619 529588 603706 546746 732032 178437 339769 785808 330050 723127
8188G23127k25556O7455j72742L5301r5936j70510L09095J48643l64865L82965
$$ 723127 497571 565026 392284 427585 331649 161139 470234 618877 254012 636977
8178F36977J04435k97228J20070J59277j12248L7795j06985L20143l41626K63994
$$ 636977 741412 444184 564254 723531 611283 649078 542093 862236 520610 784604
8168G84604k53985J51888j28086q9279J02878J50882m4919p0438m781J1565r4762
$$ 784604 530619 682507 554421 465142 568020 718902 673983 603545 598764 610329 515567
8157E15567M3480l6195L139O3446k04782J99599o2913l5924J04046j08022O0379
$$ 515567 559047 522852 525991 589437 384655 584254 521341 485417 589463 481441 541820
8146E41820j01827n1969P7562k5665N737O9893n6315J22676O3943k04513J15242
$$ 541820 439993 388024 465586 439921 445658 515551 459236 581912 645855 441342 556584
8135E56584J5690Q070r3045J31601n0880M8395m8357j4018n7643L0057K1585K21330
$$ 556584 572274 580344 487299 618900 568020 616415 568058 554040 496397 526454 548039 769369
8123G69369k50738Q0137J515J4086R1092l8596n1028n5179J81326m9149j06314
$$ 769369 518631 598768 600283 614369 705461 666865 615837 560658 741984 692835 586521
8112E86521j073L7418j49314J21712q6958k1166R3293q750m0672M949k4517R4846
$$ 586521 585448 622866 473552 595264 508306 487140 580433 571683 531011 535960 511443 606289
8100F06289O528J6319P4299j40296J49003l7713J275L179j9680o1733J42792r9514
$$ 606289 612817 629136 703435 563139 712142 674429 675704 678883 659203 597470 740262 640748
8088F40748q4816K4798L0800L1045k8663J1205j03802J13311n6020l5015P2703
$$ 640748 555932 580730 611530 642575 613912 625117 521315 634626 578606 543591 616294
8077F16294j7627L676Q1575J2335n187j03696J01442k6398N6831j75679L8370
$$ 616294 598667 602343 683918 696253 691066 587370 688812 662414 719245 543566 581936
8066E81936O8625N3114j88895P6436Q3619j03538l3316J11735K3178J9703K7166
$$ 581936 650561 703675 514780 591216 674835 571297 537981 649716 672894 692597 719763
8055G19763l1534j5386Q910p234K1024j3467K6487o0296P883l8125R5945j29513
$$ 719763 688229 672843 681753 674519 695543 682076 708563 648267 656150 618025 713970 584457
8043E84457J46375l8701j949l0299M1388j1668P8064J420j29254K8866k6057k117
$$ 584457 730832 692131 690182 659883 701271 689603 767667 769087 639833 668699 642642 640525
8031F40525J8167N0028J8035L5979o3513l8274J9578Q5771p3694P5887p1130J01566
$$ 640525 658692 708720 726755 762734 699221 660947 680525 766296 692602 768489 697359 798925
8019G98925r2869J20549N550j073p2994L3689k0551n423K9068j41108J35514L506
$$ 798925 706056 826605 832155 831082 758088 791777 771226 765803 794871 653763 789277 792783
8007G92783m6190n467J01534K6591j04896K4465L4160j0205j5917j3787N9512
$$ 792783 746593 741126 842660 869251 764355 788820 822980 812775 796858 783071 842583
7996H42583k600N6439J9809j8075p9239P5727m9084j4309M318M8478j7188k6752
$$ 842583 839983 896422 916231 898156 818917 894644 845560 831251 835569 884047 866859 840107
7984H40107P0353N3412q9727N4065k7072J42589j56581J7102Q3148j5993J12269
$$ 840107 910460 963872 874145 928210 901138 1043727 887146 904248 987396 971403 1083672
7973A083672q5836p454M8803m6630K2305L2608N7836J7539n3687K00831j28366
$$ 1083672 997836 990382 1039185 992555 1014860 1047468 1105304 1122843 1069156 1269987 1141621
7962A141621j1905Q7306j5492K9829J13959l733j6914P1307k4533J37949k7521
$$ 1141621 1129716 1217022 1201530 1231359 1345318 1341585 1324671 1395978 1371445 1509394 1481873
7951A481873L81P7243N9167M4039Q3049M4424k695k149J33756n674K3714K7229
$$ 1481873 1482254 1559497 1618664 1662703 1745752 1790176 1787481 1785332 1919088 1913414 1937128 1964357
7939A964357Q1363N0681O2634Q0576J11154M4961J5929K54585R4219P5174R4160
$$ 1964357 2045720 2096401 2159035 2239611 2350765 2395726 2411655 2666240 2760459 2835633 2929793
7928B929793N6672O1623R0053K7262L1638J21256J6997J35742P9726J04478P0675
$$ 2929793 2986465 3048088 3138141 3165403 3197041 3318297 3335294 3471036 3550762 3655240 3725915
7917C725915J14513J09453J38529J20557J87078J72281K10216K37088J58607K78322
$$ 3725915 3840428 3949881 4088410 4208967 4396045 4568326 4778542 5015630 5174237 5452559
7907E452559J24687J62245J96575K22302K16785L31320L33156L16299K39941J00161
$$ 5452559 5577246 5739491 5936066 6158368 6375153 6706473 7039629 7355928 7595869 7696030
7897G696030Q1794K77529J69467L41444L46588M52411M58717K79340P6831K22937
$$ 7696030 7777824 8055353 8224820 8566264 8912852 9365263 9823980 10103320 10180151 10403088
7887A0403088J87119J59245L58964L11824N83939O77754P07241O41167J122375
$$ 10403088 10590207 10749452 11108416 11420240 12004179 12681933 13389174 14030341 15152716
7878A5152716R50238J107863J290708J461339J740477K073607J637641N54873
$$ 15152716 16102954 17210817 18501525 19962864 21703341 23776948 25414589 25969462
7870B5969462n04250q91292j116217j381994j128853q91514o54399l05035j82749
$$ 25969462 25465212 24573920 23457703 22075709 20946856 20055342 19400943 19095908 18913159
7861A8913159R5444M40534P01584R51781J130805J416707J790141J789915J618578
$$ 18913159 19008603 19449137 20150721 21102502 22233307 23650014 25440155 27230070 28848648
7852B8848648J274293R10751L0426p21548j642607k246195k445650k191792j939303
$$ 28848648 30122941 31033692 31064118 30342570 28699963 26453768 24008118 21816326 19877023
7843A9877023q00542k938366m46723l93765k05906j08218J26805J49152L81591
$$ 19877023 19076481 16138115 15691392 15297627 15091721 14983503 15110308 15259460 15641051
7834A5641051M71929Q17651R35014J001293R8785r65719j476674j637129j642037
$$ 15641051 16112980 16930631 17865645 18866938 18965723 18000004 16523330 14886201 13244164
7825A3244164j678777j470386j045629q75720q38128n56898m83389m86904l08486
$$ 13244164 11565387 10095001 9049372 8173652 7335524 6778626 6295237 5808333 5499847
7816E499847l89576l17170k06613k54905j59955k71691p7827j95101j10033k17405
$$ 5499847 5110271 4793101 4586488 4331583 4171628 3899937 3822110 3627009 3516976 3299571
7806C299571j15639p4758j52484o1048p0557j54657K7200r9411j4025j01961m7126
$$ 3299571 3183932 3109174 2956690 2895642 2825085 2670428 2697628 2598217 2584192 2482231 2435105
7795B435105j76289j7805l1656j3795N641j20419j570p1032j7436j7826j150j12585
$$ 2435105 2258816 2241011 2209355 2195560 2201201 2080782 2079212 2008180 1990744 1972918 1971768 1859183
7783A859183p1292K1027j02031K2776n1884l8746P309l2235n6268n4551k3018
$$ 1859183 1787891 1808918 1706887 1729663 1677779 1639033 1646342 1614107 1557839 1503288 1480270
7772A480270J31319j33054l6526P852o0799r36p1760K881R0405j21956M0526r8279
$$ 1480270 1611589 1478535 1442009 1449861 1389062 1388126 1316366 1319247 1409652 1287696 1328222 1229943
7760A229943O9035K488p3438M6029j7208l3245k7402L8122K5557o8698J8182l1443
$$ 1229943 1298978 1301466 1228028 1274057 1256849 1223604 1196202 1234324 1259881 1191183 1209365 1177922
7748A177922J18194q8555j16919N9590Q803r4027N8616p5102O6096m0763j9817
$$ 1177922 1296116 1207561 1090642 1150232 1159035 1065008 1123624 1048522 1114618 1073855 1054038
7737A054038k8006K6688O5082m2274j18022J06286l3242N9940m8954k6736m2957
$$ 1054038 1026032 1052720 1117802 1075528 957506 1063792 1030550 1090490 1041536 1014800 971843
7726I71843l8963K7798p604l7393N304n5451m355l4198o1953O3327j0771q372
$$ 971843 932880 960678 953074 915681 920985 865534 861179 826981 765028 828355 817584 809212
7714H09212p4711l5593Q5512p2112M6453o438r525o031k5029J0913j4860l3774
$$ 809212 734501 698908 784420 712308 758761 752323 742798 736767 711738 722651 707791 674017
7702F74017K7328L8732K5253r7320r516K5893n7248M892l4789J06150j15153M4227
$$ 674017 701345 740077 765330 668010 658494 684387 627139 632031 597242 703392 588239 632466
7690F32466P767m0951J21260j13474m361L5554o6521n397J4039N2796m1634k3948
$$ 632466 640233 599282 720542 607068 602707 638261 571740 566343 580382 633178 591544 567596
7678E67596p331j6900K3457J3497J7193J3626j6280j6253N0968j2123l9166L4089
$$ 567596 560265 543365 566822 580319 597512 611138 594858 578605 629573 617450 578284 612373
7666F12373k525J0589N6839p2567N367n70k4863p1895J11846k0596m2624q4427
$$ 612373 609848 620437 677276 604709 610076 609506 584643 512748 624594 603998 561374 476947
7654D76947M7626l1076k9004N3714L3766N823j5850m5565Q8099q1017j0998L2514
$$ 476947 524573 493497 464493 518207 551973 557796 541946 496381 584480 503463 492465 524979
7642E24979p927J3050p341l42K9593n9357K4209L1100L7525o4381J6973q921j6172
$$ 524979 517052 530102 522761 522419 552012 492655 516864 547964 585489 521108 538081 529160 512988
7629E12988L7037Q6034j14440O8477j1035j6388k4561P2030k7567K2850j08554
$$ 512988 550025 636059 521619 590096 579061 562673 538112 610142 582575 605425 496871
7618D96871P1572o441P908N0738o9776L7887r217M8739q8711L012K2601j0265
$$ 496871 568443 562002 569910 620648 550872 588759 579542 628281 539570 542582 565183 554918
7606E54918J10827k9927R74M8758o060O0374J80299K12344p90351K80167N0186
$$ 554918 665745 635818 636792 685550 679490 739864 920163 1132507 342156 622323 672509
7595F72509K0798O7236J6917O6424N2071j23269J21821q2941K6395Q924p1940
$$ 672509 693307 760543 777460 843884 895955 772686 894507 811566 837961 846885 774945
7584G74945q436p2773M8861K1200j02342j4880k3272M3413l6681m4236K473r1087
$$ 774945 766509 693736 742597 763797 661455 646575 623303 666716 630035 585799 588272 497185
7572D97185O7351n1415l8682L4932L2105l6379j2757J4552r89K3261k735l2654
$$ 497185 564536 513121 474439 509371 541476 505097 492340 506892 505903 529164 526429 493775
7560D93775K1382P2635j38686j7431K8945K4443K5484m0814J5748J5041n996M429
$$ 493775 515157 587792 449106 431675 460620 485063 510547 469733 485481 500522 494526 498955
7548D98955n7485J8589m1992J19167j16906J167N2573k1022p3719j4165L4807
$$ 498955 441470 460059 418067 537234 420328 421495 474068 453046 379327 365162 399969
7537C99969m5379m1112Q3030j4843l9190k992l9424R6574m6777L3432J024k2384
$$ 399969 354590 313478 396508 381665 342475 339483 300059 396633 349856 383288 384312 361928
7525C61928n5021P0780n7301L8137r915j9294L7699m1984r4578J40867L4282j17699
$$ 361928 306907 377687 320386 358523 348608 329314 367013 325029 230451 371318 405600 287901
7513B87901O3828Q711r8603O7453n6462M4282m8639n759j5336M7116n7508Q4679
$$ 287901 351729 360440 261837 329290 272828 317110 268471 262712 247376 294492 236984 321663
7501C21663l8785j6070L9791k1971j2470J5212K1090M9204n0684k0598L0011Q307
$$ 321663 282878 266808 306599 284628 272158 287370 308460 357664 306980 286382 316393 324700
7489C24700n6237K0581M2255L6405o0207k291j5189L2899j7266o6034Q3480K181
$$ 324700 268463 289044 331299 367704 307497 305206 290017 322916 305650 239616 323096 325277
7477C25277P904m3949M7292q9913L2973O2064j4651p0371M6220k6960L2966o227
$$ 325277 333181 289232 336524 246611 279584 341648 326997 256626 302846 275886 308852 302625
7465C02625j8336l5874K9839m0333O0194q7556K4514K808R1604o4960o6809K8067
$$ 302625 284289 248415 278254 237921 298115 210559 235073 237881 329485 264525 197716 225783
7453B25783j375M0873j0359P612L0442n1065n910Q717j3833O2041j49893Q4876
$$ 225783 224408 265281 254922 262534 292976 241911 236001 244718 230885 292926 143033 227909
7441B27909N2584k2318k2647j3614N7798j03932N9878M1614J3416m6718K3793
$$ 227909 280493 258175 235528 221914 279712 175780 235658 277272 290688 243970 267763
7430B67763m2277M497k1131J9073M2784o2497J42380j42158l955N9161k4815m2692
$$ 267763 225486 229983 208852 227925 270709 208212 350592 208434 204479 263640 238825 196133
7418A96133J06821k8771J7667R795j06375M6168J9705J710J9035j02243J06981
$$ 196133 302954 274183 291850 301645 195270 241438 261143 262853 281888 179645 286626
7407B86626k3317K0170r703K7456J438m7637P9546l5798l5969N0958n8882P2163
$$ 286626 263309 283479 273776 301232 302670 255033 334579 298781 262812 313770 254888 327051
7395C27051k3169K5218l2454L9685l4757N6992J4312p9769J4293M2541j7783k0630
$$ 327051 303882 329100 296646 336331 301574 358566 372878 293109 307402 349943 332160 311530
7383C11530Q2913n5711o0000L0238M9213j4503N986n9712K6398L789J154O4048
$$ 311530 394443 338732 278732 308970 358183 343680 349666 289954 316352 320141 321295 385343
7371C85343p2799k1667J20600m2178n0843M8535J5639k7169J4818L1105L0581
$$ 385343 312544 290877 411477 369299 318456 366991 382630 355461 370279 401384 431965
7360D31965j6127O85K998O2590j837k6901j7359k4147K628N1506n223K5070m8980
$$ 431965 415838 416523 419521 482111 480274 453373 436014 411867 414495 466001 460778 485848 436868
7347D36868L6586M1491m6552K2927r9755J22679p9471L0862J9608L227q7007J12622
$$ 436868 473454 514945 468393 491320 391565 514244 434773 465635 485243 488470 401463 514085
7335E14085J3474o1011M5574m7669O6042P8875m8918Q1240o8318M4803K2645M6499
$$ 514085 527559 466548 512122 464453 530495 609370 560452 641692 573374 618177 640822 687321
7323F87321j9454K3234o4578J17490Q924l5515O9637k8091r6N366N5980q4648
$$ 687321 667867 691101 626523 744013 752937 717422 787059 758968 758872 764238 820218 735570
7311G35570J0825L6610j00446M0205l9041J3721n0423l6686P0367q0483l8262
$$ 735570 746395 783005 682559 722764 683723 697444 647021 610335 680702 600219 561957
7300E61957R4593l0687j3827m0369l8464J20285m5809l7231O2579J3225p8680
$$ 561957 656550 625863 612036 571667 533203 653488 607679 570448 633027 646252 567572
7289E67572L7921J1431L7740M710l9010J4536M9471j8996K2732o6939O1166j2147
$$ 567572 605493 616924 654664 659374 620364 634900 684371 665375 688107 621168 682334 670187
7277F70187r234k9872K1999J05466n8154p1090K2492K2958m5897M5958o5254J6960
$$ 670187 660953 631081 653080 758546 700392 629302 651794 674752 628855 674813 609559 626519
7265F26519k7017M2990j27507N1007J11864q2017k9091Q9973K7909l9614L3581
$$ 626519 599502 642492 514985 565992 677856 595839 566748 656721 684630 645016 678597
7254F78597J9978K9728o415q9470M1847J9180l4836O3942k0222Q774N3633l6664
$$ 678597 698575 728303 721888 632418 674265 693445 658609 722551 702329 711103 764736 728072
7242G28072L3963n6427k0432k3950J05939l6426L9168n6144N5432R0530J6904
$$ 728072 762035 705608 685176 661226 767165 730739 769907 713763 769195 859725 876629
7231H76629P9590J8656R0856Q1915N6303J39941j11329j7312n2019k4710m1658
$$ 876629 956219 974875 1065731 1147646 1203949 1343890 1232561 1215249 1163230 1138520 1096862
7220A096862k7695k6704n9479j08610j9038J8574j1330K4833l2191k7947p2960
$$ 1096862 1069167 1042463 982984 874374 855336 873910 862580 887413 855222 827275 754315
7209G54315q544O207k2485j8877K6680M0533q8472j69632J74172n6225o209M8409
$$ 754315 745771 751978 729493 710616 737296 777829 689357 519725 693897 637672 631463 679872
7197F79872L2913Q7390k14754J16287l77M151J334o950J6878M450L3972m6387
$$ 679872 712785 800175 585421 701708 701331 705482 706816 699866 716744 721194 755166 708779
7185G08779M7039M795o1381O8259o6175O5216l8936N0783p3585R1406j5218j7590
$$ 708779 755818 760613 699232 767491 701316 766532 727596 778379 704794 796200 780982 763392
7173G63392o0275Q6904N217r0083J10632n0820J01538o7386M2409l3435K4344
$$ 763392 703117 790021 795238 705155 815787 764967 866505 799119 841528 808093 832437
7162H32437o1694J30147l8892K6257m6278Q9006n0392o607J00222j24795P5632
$$ 832437 770743 900890 861998 888255 841977 930983 880591 873984 974206 849411 925043
7151I25043j2618R8338j07953O0773M9018l9751j1016Q8016p1201O21k9885R767
$$ 925043 912425 1010763 902810 963583 1012601 972850 961834 1049850 978649 979270 949385 959152
7139I59152N2159j9940Q1427j047l5560J2067K8209q7296Q1146K143J7963N4319
$$ 959152 1011311 991371 1072798 1071751 1036191 1048258 1076467 989171 1070317 1072460 1090423 1144742
7127A144742m74K692m3163J1326j6085l1966N9476M7978N7765o1688m1903J21443
$$ 1144742 1144268 1146960 1103797 1115123 1099038 1067072 1126548 1174526 1232291 1170603 1128700 1250143
7115A250143n8193K9784L2931O4217r8369M3245K9403o6778p77l3867P6497P4052
$$ 1250143 1191950 1221734 1254665 1318882 1220513 1263758 1293161 1226383 1225606 1191739 1268236 1342288
7103A342288m6345O2272l5547L9669M1841L1536m4279n9449J26381K7280o458
$$ 1342288 1295943 1358215 1322668 1362337 1404178 1435714 1391435 1331986 1458367 1485647 1479189
7092A479189M4102k2608O9657r1185M555P9848J8978k6538L4146k2147J6247M9600
$$ 1479189 1523291 1500683 1570340 1479155 1483710 1563558 1582536 1555998 1590144 1567997 1584244 1633844
7080A633844j638M1135J0355j196m948N2876m98L8474n4941Q9571o355M3945K6798
$$ 1633844 1632206 1673341 1683696 1682500 1677552 1730428 1729930 1768404 1713463 1803034 1796679 1840624 1867422
7067A867422m5718P7991m897j847L9051Q0690N4895J9226L6035L0754l327q643
$$ 1867422 1821704 1899695 1894798 1892951 1932002 2012692 2067587 2086813 2122848 2153602 2150275 2141632
7055B141632Q9239j0547L4999P2876P1402r025R4740o9552O1992N814Q0060P0171
$$ 2141632 2230871 2220324 2255323 2328199 2399601 2390576 2485316 2415764 2477756 2483570 2563630 2633801
7043B633801M6848J4965P2154L9622N5121K3085R7316n3497R3047K1860J9529
$$ 2633801 2680649 2695614 2767768 2807390 2862511 2885596 2982912 2929415 3022462 3044322 3063851
7032C063851J42100P7385N941J00564L2225J25515l3065J15782N0852O3229N6755
$$ 3063851 3205951 3283336 3289277 3389841 3422066 3547581 3514516 3630298 3681150 3744379 3801134
7021C801134J6201J32052Q2596j0606K60435J5360Q7844L6024J05611J27799P6090
$$ 3801134 3817335 3949387 4031983 4021377 4281812 4297172 4385016 4421040 4526651 4654450 4730540
7010D730540M6293J21751J16369P5929J58569M5963O0685J79693J45873P4819
$$ 4730540 4776833 4898584 5014953 5090882 5249451 5295414 5356099 5535792 5681665 5756484
7000E756484J14765J88699Q1957J28305J54534J58133P0835J69168Q8839J43688
$$ 5756484 5871249 6059948 6141905 6270210 6424744 6582877 6653712 6822880 6911719 7055407
6990G055407J89013Q4426J64217J83205J70576J46754K22623J47224J93766K31610
$$ 7055407 7244420 7328846 7493063 7676268 7846844 7993598 8216221 8363445 8557211 8788821
6980H788821J91967K12300L23461K09187L49934K16785M21419L63898L18912L58050
$$ 8788821 8980788 9193088 9516549 9725736 10075670 10292455 10713874 11077772 11396684 11754734
6970A1754734K91501R5252R8824N6743L0954K697M1540R479J32308J51224J00005
$$ 11754734 12046235 12141487 12240311 12297054 12328008 12330705 12372245 12381724 12514032 12665256 12765261
6959A2765261K32035K04884L24754J76517K99967L58038L64786L70717K81198
$$ 12765261 12997296 13202180 13526934 13703451 14003418 14361456 14726242 15096959 15378157
6950A5378157J52652J66582P4493k65808k62326k63470k99839l62918l18832j92605
$$ 15378157 15530809 15697391 15771884 15506076 15243750 14980280 14680441 14317523 13998691 13806086
6940A3806086j99279k43435j30142j13005r8602o4446p1704p3279j33076O732
$$ 13806086 13606807 13363372 13233230 13120225 13021623 12957177 12885473 12812194 12679118 12685850
6930A2685850K6715o5695k18118k04442m25355m81880m53248l52231n43176k81680
$$ 12685850 12712565 12646870 12428752 12224310 11798955 11317075 10863827 10511596 9968420 9686740
6920I686740k40949k11700l39893j75717l47151j73470k58697q5019j39987k36248
$$ 9686740 9445791 9234091 8894198 8718481 8371330 8197860 7939163 7854144 7714157 7477909
6910G477909j35025k29474j47633j99285o6978j70473j20637j37360j57451q7650
$$ 7477909 7342884 7113410 6965777 6766492 6699514 6529041 6408404 6271044 6113593 6025943
6900F025943j29527q0055j16439j07152q6519j41749q0340j16915j06007k9642
$$ 6025943 5896416 5816361 5699922 5592770 5506251 5364502 5284162 5167247 5061240 5031598
6890E031598j50611j3341p2798q6932j8703j29284j3573k9391k2281q7448k4756
$$ 5031598 4880987 4867646 4794848 4707916 4689213 4559929 4546356 4516965 4494684 4407236 4382480
6879D382480p0727J8618r9799r5229n6423n051j47659N0589n447m1249r429r0025
$$ 4382480 4311753 4330371 4230572 4135343 4078920 4073869 3926210 3976799 3971352 3930103 3920674 3830649
6867C830649n2205O2226r1469R975k2856J1539q226Q2035p4948K4092J02783N6063
$$ 3830649 3778444 3840670 3749201 3759176 3736320 3747859 3739633 3821668 3746720 3770812 3873595 3929658
6855C929658J09781O8022J13052J61915J32155m351q6004j68568p5000j53521
$$ 3929658 4039439 4107461 4220513 4382428 4514583 4510232 4424228 4255660 4180660 4027139
6845D027139k44465j19904n3271r6369m5949r9160j35108q2303j5025l7403j0085
$$ 4027139 3782674 3662770 3609499 3513130 3467181 3368021 3232913 3150610 3135585 3098182 3088097
6834C088097k5929m1743k8422n1083k9454J01205q8833l4575o2526K7147M8811
$$ 3088097 3062168 3020425 2992003 2940920 2911466 3012671 2923838 2889263 2826737 2853884 2902695
6823B902695j4717K7276j4477m6107J8983L9450J0718N078m1445N785N0262o7615
$$ 2902695 2887978 2915254 2900777 2854670 2873653 2913103 2923821 2928899 2887454 2893239 2943501 2875886
6811B875886k8088k0031J9534K4193l95220L23804R471l4401o1326L5392N1131
$$ 2875886 2847798 2827767 2847301 2871494 2476274 2800078 2809549 2775148 2713822 2749214 2800345
6800B800345N550j06924K1661P5088p154m4902O9009o1551M4733M6623k0410M9630
$$ 2800345 2805895 2698971 2720632 2795720 2788566 2743664 2812673 2751122 2795855 2842478 2822068 2871698
6788B871698k6167K4617l3461K6128O961O4737M6968j06032J12690j01250O5027
$$ 2871698 2845531 2870148 2836687 2862815 2869776 2934513 2981481 2875449 2988139 2886889 2951916
6777B951916m181p203l2244R096K2195M9819L1971l3210N968J16753r6284J6290
$$ 2951916 2947735 2940532 2908288 2917384 2939579 2989398 3021369 2988159 2994127 3110880 3014596 3030886
6765C030886l2785L8839R950M2991j06508J17641L2293K0850r784Q0824p8726
$$ 3030886 2998101 3036940 3046890 3089881 2983373 3101014 3133307 3154157 3144373 3225197 3146471
6754C146471J01612P884J3777j6283n0625R6119q823K8139M4456l6614N7591j2857
$$ 3146471 3248083 3255967 3269744 3253461 3202836 3298955 3290132 3318271 3362727 3326113 3383704 3370847
6742C370847O7149r737P1098L2086M0723L0027K6594j0138J59059p5846K5454
$$ 3370847 3437996 3428259 3499357 3531443 3572166 3602193 3628787 3618649 3777708 3701862 3727316
6731C727316M2169O5484L6189q414J534M1917P0497Q4687J2264J0671M0384R1353
$$ 3727316 3769485 3834969 3871158 3862744 3864278 3906195 3976692 4061379 4073643 4084314 4124698 4216051
6719D216051N5851M0511J6246M7383Q9420N9967J4045N3755Q7996Q4443J00576
$$ 4216051 4271902 4312413 4328659 4376042 4465462 4525429 4539474 4593229 4681225 4765668 4866244
6708D866244L6200Q9568L193R4755Q4607J22809J00294N3749P5251J48440K03357
$$ 4866244 4902444 4992012 4995205 5089960 5174567 5297376 5397670 5451419 5526670 5675110 5878467
6697E878467O747R0518J40249O2255J44779J38637J49869J49911J66404J95517
$$ 5878467 5885214 5975732 6115981 6178236 6323015 6461652 6611521 6761432 6927836 7123353
6687G123353J34077J64165J93562J79299J62802K69164J97241L06550K94766L39517
$$ 7123353 7257430 7421595 7615157 7794456 7957258 8226422 8423663 8730213 9024979 9364496
6677I364496M53680K97120L52698L49788K74794M75174L90875N30747M43350N06680
$$ 9364496 9818176 10115296 10467994 10817782 11092576 11567750 11958625 12489372 12932722 13439402
6667A3439402O60474P36481P94166R42308J166942J478206J608625J059208L96536
$$ 13439402 14099876 14836357 15630523 16572831 17739773 19217979 20826604 21885812 22282348
6658B2282348J41561q11866p82098k11891m8254J76296J86346K82268L46589L24818
$$ 22282348 22423909 21612043 20829945 20618054 20569800 20746096 20932442 21214710 21561299 21886117
6648B1886117L08855M69148O53797O44615P92574Q14014J051066J254726J398378
$$ 21886117 22194972 22664120 23317917 23962532 24755106 25569120 26620186 27874912 29273290
6639B9273290J698414K096248K435794K267574K286731K601309K829474L333579
$$ 29273290 30971704 33067952 35503746 37771320 40058051 42659360 45488834 48822413
6631D8822413M121680N482557M091162j151245l101143k433694j271048k32110
$$ 48822413 52944093 58426650 62517812 61366567 58265424 55831730 54560682 54328572
6623E4328572j47329N27255R35669J180144J241543J734274K244748K960996L734275
$$ 54328572 54181243 54708498 55644167 56824311 58065854 59800128 62044876 65005872 68740147
6614F8740147M684677N864684O632691P859721R714706J1478223J2832566J5740867
$$ 68740147 73424824 79289508 85922199 93781920 103496626 114974849 127807415 143548282
6606A43548282K0042651K0501021K6052492M1349565N0801875L4485266k2556503
$$ 143548282 163590933 184091954 210144446 251494011 302295886 336781152 314224649
6599C14224649l8730203k9663326l3562471l7292246k7788730j8353160j4226730
$$ 314224649 275494446 245831120 212268649 174976403 147187673 128834513 114607783
6592A14607783j1351344r487539p618979o484816n949816n353902m664952m042396
$$ 114607783 103256439 93768900 86149921 79665105 73715289 68361387 63696435 59654039
6584E9654039l394035k808701k289545k071778j555808j154134q24159j009373
$$ 59654039 56260004 53451303 51161758 49089980 47534172 46380038 45555879 44546506
6576D4546506r68013k97325J22414L98165Q14417J317305J627364L073411N161960
$$ 44546506 43578493 43281168 43403582 43801747 44616164 45933469 47560833 50634244 55796204
6567E5796204N538415J093055n045409m742723m260038m972268m863491l284822
$$ 55796204 61334619 62427674 57382265 52639542 48379504 43407236 38543745 35258923
6559C5258923k415024j857019j597938j554708j073517j073476r76769q39100
$$ 35258923 32843899 30986880 29388942 27834234 26760717 25687241 24710472 23871372
6551B3871372q11890o48363l85873j60820j00870j18224L1902K95435L74459O08987
$$ 23871372 23059482 22411119 22025246 21864426 21763556 21645332 21677234 21972669 22347128 22956115
6541B2956115Q61754J107514J295575J410062J187570r5678r44691j519945j916771
$$ 22956115 23817869 24925383 26220958 27631020 28818590 28722912 27778221 26258276 24341505
6532B4341505k046862j952894j623797j356248r67344p85394n84503m42766m72564
$$ 24341505 22294643 20341749 18717952 17361704 16394360 15608966 15024463 14581697 14109133
6523A4109133l23132l91979n58936m79352n75471m68955n42295m60813m73051
$$ 14109133 13786001 13394022 12835086 12355734 11780263 11311308 10769013 10308200 9835149
6514I835149l20323l71792l52499k23660l29304j78534k18418k41907j65065j26808
$$ 9835149 9514826 9143034 8790535 8566875 8237571 8059037 7840619 7598712 7433647 7306839
6504G306839j49758j33390q3182j03395o2448P621n393p4857M0009j4339K6508
$$ 7306839 7157081 7023691 6940509 6837114 6774666 6782287 6776894 6702037 6742046 6727707 6754215
6493F754215K26602J54974R0515j61712k40430k76924l94693l66999l08878k51266
$$ 6754215 6980817 7135791 7226306 7064594 6824164 6547240 6152547 5785548 5476670 5225404
6483E225404k40496k01173j69520j12387j34322j79656r5771j37906q8100k0375
$$ 5225404 4984908 4783735 4614215 4501828 4367506 4187850 4092079 3954173 3866073 3845698
6473C845698j46009p3422j39040o6976o2967p5623o7581n2234q3066j6653j1504
$$ 3845698 3699689 3626267 3487227 3420251 3357284 3281661 3214080 3161846 3078780 3062127 3050623
6462C050623j25528q5979j5698J52r030p8634p241q868j56828J0098n2870n2774
$$ 3050623 2925095 2839116 2823418 2823570 2814540 2735906 2728665 2719797 2562969 2573067 2520197 2467423
6450B467423m4591j5164q8395N5964n663q5490m7750k9566M8235l8365L7262o1515
$$ 2467423 2422832 2407668 2319273 2375237 2369574 2284084 2236334 2206768 2255003 2216638 2253900 2192385
6438B192385P86l9551m1295O6981m6105p4322m4681J1713K4108k1238m1977N9411
$$ 2192385 2193171 2153620 2112325 2179306 2133201 2058879 2014198 2025911 2050019 2028781 1986804 2046215
6426B046215r453n4279L8664J0663P208O4494l728n5118K8547j5229K326j7941
$$ 2046215 2036762 1982483 2021147 2031810 2039018 2103512 2099784 2044666 2073213 2057984 2060310 2042369
6414B042369k7002n1630j2775M0663j3065J031Q0301q370p1681N5315k8257K9224
$$ 2042369 2015367 1963737 1950962 1991625 1978560 1979591 2059892 2051522 1979841 2035156 2006899 2036123
6402B036123J182J6629L9946K290P6340O1365K4458P4570R0373K0255M4012J53911
$$ 2036123 2037305 2053934 2093880 2096170 2172510 2233875 2258333 2332903 2423276 2443531 2487543 2641454
6390B641454m804Q2198K17102q3827J3148j1072p731n8083L7579R327O7R5818
$$ 2641454 2636650 2718848 2935950 2852123 2865271 2854199 2846468 2788385 2825964 2835291 2835358 2931176
6378B931176P0750L0863J55947o4133K48283P877J40327K25909K58970K85897
$$ 2931176 3001926 3032789 3188736 3124603 3372886 3380763 3521090 3746999 4005969 4291866
6368D291866L67458L60274M89252N91353O40625O84806O34968N62340K24385j36556
$$ 4291866 4659324 5019598 5508850 6100203 6740828 7425634 8060602 8622942 8847327 8710771
6358H710771l39424o20025o03318p32481n42318m36948l36620k47596k68466r7378
$$ 8710771 8371347 7751322 7148004 6415523 5873205 5436257 5099637 4852041 4583575 4486197
6348D486197k04187l01036l50057j84919l18938k15455k98890j10187j95255j40123
$$ 4486197 4282010 3980974 3630917 3445998 3127060 2911605 2612715 2502528 2307273 2167150
6338B167150j30911j9803j32615j28594l3178j3906r3643n3166k2230n3827j5212
$$ 2167150 2036239 2016436 1883821 1755227 1722049 1708143 1614500 1561334 1539104 1485277 1470065
6327A470065l7904l2673j07594P856K8103k180k2810j12383K7022N0517J408o656
$$ 1470065 1432161 1399488 1291894 1299750 1327853 1325673 1302863 1190480 1217502 1268019 1269427 1262771
6315A262771J8379r4111L3916r416o1345l3143J5757j6017m5574R58k0520K8570
$$ 1262771 1281150 1187039 1220955 1211539 1150194 1117051 1132808 1116791 1071217 1072175 1051655 1080225
6303A080225o5220M6921m0975l5188o289k3023n2645O1982l098Q5558j15500J5461
$$ 1080225 1015005 1061926 1020951 985763 979474 956451 903806 965788 962690 1048248 932748 948209
6291I48209L5352L764m8953N3664l9624l4561L8261m3687J6149j4321l3336j0750
$$ 948209 983561 987325 938372 992036 952412 917851 956112 912425 928574 914253 880917 870167
6279H70167k0438O8891j05817O2897N1167n3534j09668O9572M1472o1615J3850
$$ 870167 849729 918620 812803 875700 926867 873333 763665 833237 874709 813094 826944
6268H26944P5635n6332L6130k5297l6221K434O4776l0419L0317k7604l223o5804
$$ 826944 902579 846247 882377 857080 820859 823293 888069 857650 887967 860363 857140 791336
6256G91336O2796o8566J29453m4084n9844L5632K9094J322J8399k709L1482l6361
$$ 791336 854132 785566 915019 870935 811091 846723 875817 877139 895538 892829 924311 887950
6244H87950q4439J7099j2093N4838m566n9620K0477N7813L3464q965o3225k6456
$$ 887950 803511 820610 808517 863355 858789 799169 819646 877459 910923 901958 838733 812277
6232H12277M3178l002p233K0505Q198R568l622J7818J9678J1020L6011P1560l0615
$$ 812277 855455 852453 845220 865725 873923 883491 879869 897687 917365 928385 964396 1035956 1005341
6219A005341J9133M391k8567K7193q1105N312m4756J8165n0992M4012J8563k5341
$$ 1005341 1024474 1028865 1000298 1027491 946386 951698 906942 925107 874115 918127 936690 911349
6207I11349j8690M5040R443o3068P8083J7079l9874J0891P710n9957P317K3592
$$ 911349 892659 937699 947142 884074 962157 979236 939362 950253 957963 898006 905323 928915
6195I28915r8958R4828o389n9756K772l7730j9914p1044O483j1344L8261k1641
$$ 928915 829957 924785 918396 858640 861412 823682 803768 732724 739207 727863 766124 744483
6183G44483p786l1050n8109N7357K1931l3552m0301R9092k932j2156L5535l1737
$$ 744483 736697 705647 647538 704895 726826 693274 652973 752065 749133 736977 772512 740775
6171G40775K4320o2992l797N1914m7406j9998n3606N4346l7231q460J8067l6006
$$ 740775 765095 702103 698306 750220 702814 682816 629210 683556 646325 637865 655932 619926
6159F19926o0044L5482O5584j5704P517J8011l1418O1497k0097k3163Q2862j26498
$$ 619926 559882 595364 660948 645244 652761 670772 639354 700851 680754 657591 740453 613955
6147F13955l1755L11m3169p1403o7673K7627q7193O3042l1460p2239R0523m7782
$$ 613955 582200 582511 539342 467939 400266 427893 340700 403742 372282 300043 390566 342784
6135C42784n2135L778o9863P7233r373k9646k0338l8928M789K358l0222m4193
$$ 342784 290649 294427 224564 301797 292424 262778 242440 203512 208301 210659 180437 136244
6123A36244P0380l1206r026k1976k4579P3630p2524j8892P945N6348j10813L6405
$$ 136244 206624 175418 166392 144416 119837 193467 120943 102051 109996 166344 55531 91936
6111I1936L8581j9507n5097M390O991j3769J4720J8372o5613R915k9370R2338
$$ 91936 130517 111010 55913 60303 67294 53525 68245 86617 21004 30919 1549 93887
6099I3887m8055M6285j0766j8602m2761K8840k3436Q9519j9634M2719p9446l3433
$$ 93887 45832 92117 81351 62749 19988 48828 25392 114911 95277 137996 58550 25117
6087B5117J4091K0348l1948k4280j710M4681o8712M0963k7878L2442r470M0569
$$ 25117 39208 59556 27608 3328 1618 46299 -22413 18550 -9328 23114 13644 54213
6075E4213j7370n2779O6040n366k2443k0189N0194O6495j20414o646L9552l2906
$$ 54213 36843 -15936 50104 44738 22295 2106 52300 118795 -1619 -8265 31287 -1619
6063a619N4163J4875M309n5977O3211l2391L043n8255N2615k4789l1376L2431
$$ -1619 52544 67419 71728 15751 78962 46571 49614 -8641 43974 19185 -12191 20240
6051B0240J9247l7192k2659j7551R3178p432o67k0939Q88n6867q241K9469K753
$$ 20240 39487 2295 -20364 -37915 55263 47831 47164 26225 27113 -29754 -37995 -8526 -5773
6038e773k3890R3770p049j13567L1237M0254m8143j7808k929m8085P8782o7121
$$ -5773 -29663 64107 57058 -56509 -25272 14982 -33161 -50969 -53898 -101983 -23201 -90322
6026i0322K2677j8303R3333j41365N9371j3944N4933m7739k7409m3099M4418R3072
$$ -90322 -67645 -85948 7385 -133980 -74609 -88553 -33620 -81359 -108768 -151867 -107449 -14377
6014a4377l0413l9833J6839j4454K6774q227n6335L7954L3981K497p7312O9496
$$ -14377 -44790 -84623 -67784 -82238 -55464 -63691 -120026 -82072 -48091 -45594 -122906 -53410
6002e3410j3406o135J7784r1616R7658n9080O8149J91n1031N4419j4592k0476
$$ -53410 -66816 -72951 -55167 -146783 -49125 -108205 -40056 -39865 -90896 -36477 -51069 -71545
5990g1545N4131l0336N2512l5770n340j1641j5342M2069J5644k880j6986M773
$$ -71545 -17414 -47750 4762 -31008 -36348 -47989 -63331 -21262 -5618 -8498 -25484 -20711
5978b0711j4622k3390N0810q7682K861P0591J0004o5751Q9826n739j8641k3015
$$ -20711 -35333 -58723 -7913 -95595 -92734 -22143 -12139 -77890 11936 6197 -12444 -35459
5966c5459n3015R2174K8948j07838J16230k4118m6247n814J4575m3244O0527o1629
$$ -35459 -88474 3700 32648 -75190 41040 16922 -29325 -35139 -20564 -63808 -3281 -64910
5954f4910j0803Q6052J4327j0305l1817m9386J5888N8291K1595j6303p5181M8254
$$ -64910 -75713 10339 24666 14361 -17456 -66842 -50954 7337 28932 12629 -62552 -14298
5942a4298Q922r3356M6216O9702L476r1475P6674n5715L6591m9006J3524k5813
$$ -14298 -5376 -98732 -52516 17186 20662 -70813 5861 -49854 -13263 -62269 -48745 -74558
5930g4558k0127Q0293J6820p4096O797l1456M1348l0312P6315n0597k6205K0880
$$ -74558 -94685 -14392 2428 -71668 -64871 -96327 -54979 -85291 -8976 -59573 -85778 -64898
5918f4898L6281n9738M1790J5320k3072k7527J2180K5838M0311n7614J3495k3480
$$ -64898 -28617 -88355 -46565 -31245 -54317 -81844 -69664 -43826 -3515 -61129 -47634 -71114
5906g1114L4166n3419P0328N6376q4689Q031K6405p8462N6189o7557P1380j4271
$$ -71114 -36948 -90367 -20039 36337 -48352 -40321 -13916 -92378 -36189 -103746 -32366 -46637
5894d6637J5367j0514j0127k8970P3259k0254q808L2662k6118o7343j2472J22186
$$ -46637 -31270 -41784 -51911 -80881 -7622 -27876 -36684 -4022 -30140 -97483 -109955 12231
5882A2231m1221J3407K4017n4414m2626M338k1322R3113o3333Q757K9624m3787
$$ 12231 -28990 -15583 8434 -45980 -88606 -84268 -105590 -12477 -75810 -67053 -37429 -81216
5870h1216Q0213j11122N5529J9358O995L3219r3422j3590M1807r441K3810J5284
$$ -81216 -1003 -112125 -56596 -37238 -30243 2976 -90446 -104036 -62229 -71670 -47860 -32576
5858c2576n1190l0076J05680q3191J17826m0479o9412K4172K4979k755j3964M2548
$$ -32576 -83766 -113842 -8162 -91353 26473 -14006 -83418 -59246 -34267 -37022 -50986 -8438
5846h438l7055J4790k0051N1647k8713n5562M1910K597R424M0394l9102M3524
$$ -8438 -45493 -30703 -50754 893 -27820 -83382 -41472 -38875 -29451 10943 -28159 15365
5834A5365K0273p5661K7315J4070m2642K9178K1446o9916N496R991O8615o1388
$$ 15365 35638 -40023 -12708 1362 -41280 -12102 9344 -60572 -55076 -45085 23530 -37858
5822c7858O9174j7878N978k2084j8487P1187m671K2485n3789M825o328n1297R0822
$$ -37858 31316 13438 19416 -2668 -21155 50032 45361 67846 14057 18882 12554 -38743 52079
5809E2079o92k3238k011M419N3587k0797k0601k5285M4048j03821Q4980n668N4877
$$ 52079 51387 28149 26138 30557 84144 63347 42746 17461 61509 -42312 42668 37000 91877
5796I1877r8115k067O6689m1198J1731L8499j2384m0748K8406k1747J8120J5152
$$ 91877 -6238 -8305 58384 17186 28917 67416 55032 14284 42690 20943 39063 54215
5784E4215P3620k9706m696p124Q269R3963m5343o8731J764M4568M463J0639M532
$$ 54215 127835 98129 93433 86309 94578 188541 143198 74467 76231 120799 125262 135901 140433
5771A40433Q43j4674K7028O5638o083j6188L0836J2939m8115L8079J7252J6045
$$ 140433 141276 126602 153630 219268 213185 196997 227833 240772 192657 230736 247988 264033
5759B64033J9538J8316n658j5794J20159n9613j5821j5630O4265Q0002o9448k5804
$$ 264033 283571 301887 296229 280435 400594 340981 325160 309530 373795 453797 384349 358545
5747C58545N6916k6207O5937p623N8646r171L7584n7630J34556m1818L1464O4817
$$ 358545 415461 389254 455191 447568 506214 497043 534627 476997 611553 569735 601199 666016
5735F66016j0098J8671J52970n7172P0261P3095k0120N1182N3911L8028L0335
$$ 666016 655918 674589 827559 770387 840648 913743 893623 944805 998716 1036744 1067079
5724A067079o154M3601K6215N4235k0887J03275o8432J29623N6197o316K4370
$$ 1067079 1060925 1104526 1130741 1184976 1164089 1267364 1198932 1328555 1384752 1378436 1402806
5713A402806M1808P7178J10871J15796O6341J76895J51215J40115J95400K46978
$$ 1402806 1444614 1521792 1632663 1748459 1814800 1991695 2142910 2283025 2478425 2725403
5703B725403K39336K87570K59684M4919p0531p4819j88127k46242j72132q9672
$$ 2725403 2964739 3252309 3511993 3556912 3486381 3411562 3223435 2977193 2805061 2715389
5693B715389j53969L8662K0314n7792J03926J07617J41731J97701J83908K53996
$$ 2715389 2561420 2600082 2620396 2562604 2666530 2774147 2915878 3113579 3297487 3551483
5683C551483K32303K39105J60820J29079P5147j90756k52105k46990m18551k60018
$$ 3551483 3783786 4022891 4183711 4312790 4387937 4197181 3945076 3698086 3279535 3019517
5673C019517l56138k07281j99995r8063o7289L113J6608m970N9073q7645R7544
$$ 3019517 2663379 2456098 2256103 2158040 2090751 2093864 2110472 2105502 2164575 2076930 2174474
5662B174474J55394J92678J09381L8195j52607k28979l14868j49796k59141k42475
$$ 2174474 2329868 2522546 2631927 2670122 2517515 2288536 1973668 1823872 1564731 1322256
5652A322256j20998j53373n9873p9777p8371k1535r6520n2835k9215l8013k1801
$$ 1322256 1201258 1047885 988012 908235 829864 808329 711809 658974 629759 591746 569945
5641E69945n4986n4527N527l577p3697P831l0246m3698j5k1198r146K8567r0969
$$ 569945 514959 460432 465959 462382 388685 396516 366270 322572 322557 301359 292213 320780 229811
5628B29811J17014o2024O794r2387R4800j03471N9018o7349P1182j9686j12213
$$ 229811 346825 284801 291595 199208 294008 190537 249555 182206 253388 233702 121489
5617A21489N1527J6554P5064m0131m1939m7245M2700n9776O2681m8487N2935O320
$$ 121489 173016 189570 264634 224503 182564 135319 178019 118243 180924 132437 185372 191692
5605A91692o7530P0540o7786p037l5113K6671J2601L2826p457k7868L876k6127
$$ 191692 124162 194702 126916 119879 84766 111437 124038 156864 149407 121539 125415 99288
5593I9288J02478k2310j0157l3530L0812n0177J89J2524O5471n0120q74N1009
$$ 99288 201766 179456 169299 135769 166581 116404 116593 129117 194588 144468 143594 194603
5581A94603o036k1407p883L0780L143l9584k3602O2414N9873j36966Q5602J2811
$$ 194603 188567 167160 159277 190057 193200 153616 130014 192428 252301 115335 200937 213748
5569B13748K1660k7827J266J4702l6001R7978P55l3286M4545j1322J0600M3945
$$ 213748 235408 207581 208847 223549 187548 285526 286281 252995 297540 286218 296818 340763
5557C40763Q8315R030k4062O3733m0876r2257Q655k4735m3758M0689J9035n4752
$$ 340763 429078 438108 414046 477779 436903 344646 353301 328566 284808 325497 344532 289780
5545B89780L8203j4838J1170L0686p918L4710p8635J06116M147K3312j5538Q166
$$ 289780 327983 313145 324315 355001 347083 381793 303158 409274 413421 436733 421195 429361
5533D29361J11503L9348l9349O2116P1871P98J3101J89467J41045K4468p1160
$$ 429361 540864 580212 540863 602979 674850 675648 688749 878216 1019261 1043729 972569
5522I72569p0597n179j12702K891P5776k9923O102K1806j9046R4798K6108O0347
$$ 972569 901972 896793 784091 786982 862758 832835 838937 860743 841697 936495 962603 1022950
5510A022950O2803Q4137R5577O3864J91690P9292J22519K97171K26900N16315
$$ 1022950 1085753 1169890 1265467 1329331 1521021 1600313 1722832 2020003 2246903 2763218
5500B763218L82898N38246R61121J120768O35523r77058q33129n28578q17099
$$ 2763218 3146116 3684362 4645483 5766251 6401774 5424716 4591587 4063009 3245910
5491C245910o41451n21787l18600k50245j87184j48524j29602l4313p5130r5999
$$ 3245910 2604459 2082672 1764072 1513827 1326643 1178119 1048517 1014204 939074 843075
5481H43075n0588r8366o0622j07322Q83r7817k4896J9171o0188r2775m4878O0407
$$ 843075 792487 694121 633499 526177 527060 429243 404347 423518 363330 270555 225677 286084
5469B86084k7608n3856l7508k4601J1915k3958J6718j4738l5497o815K9495p4813
$$ 286084 258476 204620 167112 142511 154426 130468 147186 132448 96951 90136 119631 44818
5457D4818M1214L6981r4520M8291K6248m0579o0504K2295k5925M7353P6680j00355
$$ 44818 86032 123013 28493 76784 103032 62453 1949 24244 -1681 45672 122352 21997
5445B1997k8418M9233M5892p2711j4307j2426Q0197l4484J0874M4103p1450P9235
$$ 21997 -6421 42812 88704 15993 1686 -10740 69457 34973 45847 89950 18500 97735
5433I7735k6165m8089j024L3147j5719N1075l0817k3144N4152l5162r863K8414
$$ 97735 71570 23481 22457 55604 39885 90960 60143 36999 91151 55989 46126 74540
5421G4540j4505L9801j417q90j0477N097r589k4010l164J1498l1072n123M2887
$$ 74540 60035 99836 98419 97529 87052 92149 82560 58550 55386 66884 35812 30689 73576
5408G3576P85O6827n7847k6216j6023m7258M2009k871n1751N5639J1815j5710
$$ 73576 74361 141188 83341 57125 41102 -6156 35853 32982 -18769 36870 48685 32975
5396C2975n593k7361M9282Q877r6420O9252R5138p5991J0156o4177k3724K3908
$$ 32975 27382 21 49303 58180 -38240 31012 126150 50159 60315 -3862 -27586 -3678
5384c678n7438Q1388k924K4768l5317n4552M252R2935r4705J5646J1226l4272
$$ -3678 -61116 20272 17348 42116 6799 -47753 -43501 49434 -45271 -29625 -18399 -52671
5372e2671j5481m3021O7268O2167p2121m4781j7011R0065n6848L6934l9897l1609
$$ -52671 -68152 -111173 -43905 18262 -53859 -98640 -115651 -25586 -82434 -45500 -85397 -117006
5360a17006N1981o3116J836J7152J0679p4495P9296M5070n6126n0706N9213k81
$$ -117006 -65025 -128141 -126305 -109153 -98474 -172969 -93673 -48603 -104729 -155435 -96222 -96503
5348i6503O8735o1369m3148N1539k8480N2754l2567J5140K4638q2871N2451l1916
$$ -96503 -27768 -89137 -132285 -80746 -109226 -56472 -89039 -73899 -49261 -132132 -79681 -111597
5336a11597L6677n8066K9017o0786P6301l6845q176L8718j7486M3473j4215L2411
$$ -111597 -74920 -132986 -103969 -164755 -88454 -125299 -133475 -94757 -112243 -68770 -82985 -50574
5324e0574o7267P4605N5677j20900r847P2740q0508N7959L6736J0088k1161N9779
$$ -50574 -117841 -43236 12441 -108459 -118306 -45566 -126074 -68115 -31379 -21291 -42452 17327
5312A7327r1000L4035M7163L4388n9595j7530k0413N6786k8769l8398J0093r3973
$$ 17327 -73673 -39638 7525 41913 -17682 -35212 -55625 1161 -27608 -66006 -55913 -149886
5300a49886R6617M1272k4505J4670m4570L3926O9460l9795p7456M1019N7475j15172
$$ -149886 -53269 -11997 -36502 -21832 -66402 -32476 36984 -2811 -80267 -39248 18227 -96945
5288i6945K7960K2208n5007k7109Q0694j0428J4140K9312m2619q852k8914R1465
$$ -96945 -68985 -46777 -101784 -128893 -48199 -58627 -44487 -15175 -57794 -66646 -95560 -4095
5276d095m5714J2810q160J2653m6296l4106L0100P8846j26964M5769l048l1585
$$ -4095 -49809 -36999 -45159 -32506 -78802 -112908 -82808 -3962 -130926 -85157 -88205 -119790
5264a19790O5670M4606m8977K2132o009k3427J5534l7635j010j3720n5271R2015
$$ -119790 -54120 -9514 -58491 -36359 -42368 -65795 -50261 -87896 -88906 -102626 -157897 -65882
5252f5882R511n9863O2636n3327n1260J9347J4970N1548n809k2629L4308j0267
$$ -65882 -56371 -116234 -53598 -106925 -158185 -138838 -123868 -72320 -78129 -100758 -66450 -76717
5240g6717l6398l81O6930o1521L3046M9535l4122K230m4194L839m1811J0049O856
$$ -76717 -113115 -113496 -46566 -108087 -75041 -25506 -59628 -57398 -101592 -97753 -139564 -129515 -122659
5227a22659K3770n8391J2035j252O9115r209J2760j11356N5434j1075r163J02565
$$ -122659 -98889 -157280 -145245 -146497 -77382 -86591 -73831 -185187 -129753 -140828 -149991 -47426
5215d7426m8436l4031J094M7126m928j1503r3595M7252K2876p5165K9987J5071
$$ -47426 -95862 -129893 -128799 -81673 -86601 -98104 -191699 -144447 -121571 -196736 -166749 -151678
5203a51678j5261P8350K9285j03282Q8297N1252o6376o7143N9859O6q4408J01821
$$ -151678 -166939 -88589 -59304 -162586 -74289 -23037 -89413 -156556 -96697 -96631 -181039 -79218
5191g9218k0598l2092L6259k9367N7383n8168N2506J275l0054K8455L344k9473
$$ -79218 -99816 -131908 -95649 -125016 -67633 -125801 -73295 -72020 -102074 -73619 -70275 -99748
5179i9748J1367K7244j9862m6224n906M8101k4791K9915J3964k5413n9086Q6419
$$ -99748 -88381 -61137 -80999 -127223 -133129 -85028 -109819 -79904 -65940 -91353 -150439 -64020
5167f4020o1354J1909K3424L4334K5346p0440k2495O9382k9162k1050J5978M8768
$$ -64020 -125374 -113465 -90041 -55707 -30361 -100801 -123296 -53914 -83076 -104126 -88148 -39380
5155c9380l163M010n7518N0181o544J2750Q870j840j0389k2187M1713l4795L4716
$$ -39380 -42543 -38533 -96051 -45870 -52414 -39664 -30794 -32634 -43023 -65210 -23497 -58292 -23576
5142b3576K759J2305l5858K5589k4165M305k3929K3714k2804q134m041l1037O9583
$$ -23576 -20817 -8512 -44370 -18781 -42946 -38641 -62570 -38856 -61660 -69794 -73835 -104872 -35289
5129c5289l8973j7402R0049q5142M0094m9242O7713l7294j7211J1505M5413n6428
$$ -35289 -74262 -91664 -1615 -86757 -46663 -95905 -28192 -65486 -82697 -71192 -25779 -82207
5117h2207Q1653k9085p3581P1436k1154L6320q4038N4720O015N236j5671L9085
$$ -82207 -554 -29639 -103220 -31784 -52938 -16618 -100656 -45936 -39921 -34685 -50356 -11271
5105a1271n6439N2879l2489K8884j6082m3631P0978o3398K5112o7775N0512R3484
$$ -11271 -67710 -14831 -47320 -18436 -34518 -78149 -7171 -70569 -45457 -113232 -62720 30764
5093C0764r0516K6562m993L8761J7410o2707k1107J4535K4114o649J2461j8359
$$ 30764 -59752 -33190 -38183 578 17988 -44719 -65826 -51291 -27177 -33826 -21365 -39724
5081c9724n6929N4867r461n463O440k1069L1923k8321M7995K5375p9562Q411M6356
$$ -39724 -96653 -41786 -51247 -56710 -50270 -71339 -39416 -67737 -19742 5633 -73929 -65518 -19162
5068a9162J5968J9497n8875K6419k9753P2293p7063k3494M5479O8599L1619n999
$$ -19162 -3194 16303 -42572 -16153 -45906 26387 -50676 -74170 -28691 39908 71527 65528
5056F5528o8323L0274J1465j6561L5991p3912J8654K396l7232n948L678k3915
$$ 65528 -2795 27479 38944 22383 58374 -15538 3116 5512 -31720 -37668 -33990 -57905
5044e7905k944n50K2550J8505j257k0450j249j6580J4681N281p6622R7532l2170
$$ -57905 -60849 -61399 -38849 -20344 -21601 -42051 -43300 -59880 -45199 -39918 -116540 -19008 -51178
5031e1178l9640J6494k3954j7033O2806k2267j1180L2022M1192r7326j413K5553
$$ -51178 -90818 -74324 -98278 -115311 -52505 -74772 -85952 -53930 -12738 -110064 -111477 -85924
5019h5924M6211O597K1325l7569M9875K4552n3286m1182M8034n0310l9652J3726
$$ -85924 -39713 -33116 -11791 -49360 515 25067 -28219 -69401 -21367 -71677 -111329 -97603
5007i7603N1088n209k041K2177L6492k991l0594o5096N2855q406k4781Q9153j8212
$$ -97603 -46515 -51724 -53765 -31588 4904 1913 -28681 -93777 -40922 -49328 -74109 15044 -3168
4994c168o2025L0190j0959j4522N527J7251m669O8322r3622K7894K6728j4775
$$ -3168 -65193 -35003 -45962 -60484 -54957 -37706 -42375 25947 -67675 -39781 -13053 -27828
4982b7828k3105J19471m6894j6163R727k9946M4521o8799L5961O6571l8058L3520
$$ -27828 -50933 68538 21644 5481 15208 -14738 29783 -39016 -3055 63516 25458 58978
4970E8978r4705Q3846n5j4893n5464N8057l8811K2801N585m8076M0436k345K889
$$ 58978 -35727 48119 48064 33171 -22293 35764 -3047 19754 25339 -22737 17699 15354 18243
4957A8243L572K2799M3025r4668k4229M7740L0821k9134M5267k0581K2400o6315
$$ 18243 21815 44614 87639 -7029 -31258 16482 47303 18169 63436 42855 65255 -1060
4945a060P8819j31287Q3474J9530k9308L7281k3628o488L360j3190M871M8504
$$ -1060 77759 -53528 29946 49476 20168 57449 33821 27333 30693 17503 22374 70878
4933G0878p7030L2652k9519l6844O2662m7062Q3447M4460n8155m102j5500K7601
$$ 70878 -6152 26500 -3019 -39863 22799 -24263 59184 103644 45489 41387 25887 53488
4921E3488L2503J3641K7045k2360k3359O314j2421O2357q1843K2728j3437J8543
$$ 53488 85991 99632 126677 104317 80958 87272 74851 137208 55365 78093 64656 83199
4909H3199M5951r6778O027J9946j8587J5168P3433l337m4562J3155j9532J9761
$$ 83199 129150 32372 38399 58345 39758 54926 128359 125022 80460 93615 74083 93844
4897I3844N2483m8550K2012k9203K1257L4915k2779k3906N8664k0645N203m2389
$$ 93844 146327 97777 119789 90586 111843 146758 123979 100073 158737 138092 143295 100906
4885A00906M3145j491M775M0272j5809q98m0360N8775J4098L3142p8875N8523
$$ 100906 144051 142560 147335 187607 171798 170900 130540 189315 203413 236555 157680 216203
4873B16203m6438r999J542P0323L7199J8120k8473o3773Q4674K211K536j3047
$$ 216203 169765 159766 161308 231631 268830 286950 258477 194704 279378 281589 284125 271078
4861B71078k4323K0200J0961N155J02504r9342N8672k2806j6357M7826l222j4220
$$ 271078 246755 266955 277916 283071 385575 286233 344905 322099 305742 353568 350346 336126
4849C36126N2694n8436R6975m853M1307m6009J1005l2873K6223q064m0958K4638
$$ 336126 388820 330384 427359 422506 463813 417804 428809 395936 422159 414095 373137 397775
4837C97775P9422M262l7307J40761o6323Q7339q1969K8341R2010m8457K739j7750
$$ 397775 477197 481459 444152 584913 518590 605929 523960 552301 644311 595854 598593 580843
4825E80843N1886K9146n4368Q6416r657J8364o587P734J2446P8868K5485m442
$$ 580843 632729 661875 607507 693923 684266 702630 696043 703777 716223 795091 820576 816134
4813H16134K4800j7512L5539M5348L5922q3003N9975J1730j4268O7852m8918N4821
$$ 816134 840934 823422 858961 904309 940231 857228 917203 928933 914665 982517 933599 988420
4801I88420p633O1548Q8213j2517o1376O2168N0546k889J07287n1946M6925J6137
$$ 988420 980787 1042335 1130548 1118031 1056655 1118823 1169369 1166480 1273767 1221821 1268746 1284883
4789A284883m1613J28206r0398N0808j6485L7975K680J07649j02302K1182M5239
$$ 1284883 1243270 1371476 1281078 1331886 1315401 1353376 1356056 1463705 1361403 1382585 1427824
4778A427824O618K2990k4036n4336R635O1588n7670M9354p4198L1308k1148n3170
$$ 1427824 1434442 1457432 1433396 1379060 1388695 1450283 1392613 1441967 1367769 1399077 1377929 1324759
4766A324759N7084q4298o386j4384J9041J2910m4989L2536l5418q2560N0457q6793
$$ 1324759 1381843 1297545 1291159 1276775 1295816 1308726 1263737 1296273 1260855 1178295 1228752 1141959
4754A141959m4617N3224o4833k5572j1297p0751L370m5495K8921Q273l3942n4497
$$ 1141959 1097342 1150566 1085733 1060161 1048864 978113 981483 935988 964909 973182 939240 884743
4742H84743k1031K0518n4379K1764K3902o6498k9192o6349N0189L1379m1115l6907
$$ 884743 863712 884230 829851 851615 875517 809019 779827 713478 763667 795046 753931 717024
4730G17024j8604O97m4874q279L1564m1567l7465J3798K1784j22556r100R4672
$$ 717024 698420 699117 654243 645964 677528 635961 598496 612294 634078 511522 502422 597094
4718E97094r2122O8611l4502j8155L5401K1077n4596Q4722m7903r4419R205k3583
$$ 597094 504972 573583 539081 520926 556327 577404 522808 607530 559627 465208 474413 450830
4706D50830M5616p6892K5045j7304k4508n070J1113l9410k1761j1035N5739n0304
$$ 450830 496446 419554 444599 427295 402787 397717 408830 369420 347659 336624 392363 342059
4694C42059l4940Q1375k2052L391L9297N245k7304K2773J3786j02814K5053K4821
$$ 342059 307119 388494 366442 369833 409130 414375 387071 409844 423630 320816 345869 370690
4682C70690M9319m8153J03779j17766R293n3400L1298m4551j3874m325L003k6373
$$ 370690 420009 371856 475635 357869 367162 313762 345060 300509 286635 282310 285313 258940
4670B58940M4715n2630N8205m4387j7132L2350R4037q2972J7469q2449J5266o893
$$ 258940 303655 251025 309230 264843 247711 280061 374098 291126 308595 226146 241412 234519
4658B34519R2858n896M516l3253R216O481O263r855M3793j9555j4950J89k3581
$$ 234519 327377 321481 325997 292744 301960 308441 314704 304849 348642 329087 314137 314326 290745
4645B90745P1527j15146J6351J33400p6557l6091N5960m6162n0398N4288M0529
$$ 290745 362272 247126 263477 396877 320320 284229 340189 294027 243629 297917 338446
4634C38446K3881n1581p968k1177M5767k0159N3900o4970j8876K6379J1100N7846
$$ 338446 362327 310746 302778 281601 327368 307209 361109 296139 277263 303642 314742 372588
4622C72588q7378P2295l3804N5192k3211k2591n4194Q0965j5066N0669j03411
$$ 372588 285210 357505 323701 378893 355682 333091 278897 359862 344796 395465 292054
4611B92054M954j2286L7053N215l941j4019R204J3568Q535j5787l0015m4516O9539
$$ 292054 297008 284722 321775 326990 323049 309030 318234 331802 340337 324550 294535 250019 319558
4598C19558n9300k9404J44088r6115J5073l802N1134j31693P5035M1430L0727
$$ 319558 260258 230854 374942 278827 293900 290098 341232 209539 284574 326004 356731
4587C56731M142r3654j8169J1878K1684K9617J8846m1328j0482N0167n4210M1469
$$ 356731 360873 267219 249050 260928 282612 312229 331075 289747 279265 329432 275222 316691
4575C16691j0928J5674k9083j5990P7209Q3929n9564k5670k994O7090j9653M7950
$$ 316691 305763 321437 292354 276364 353573 437502 377938 352268 349274 416364 396711 444661
4563D44661m2296K9225o3287o94N3868q0746M3867j7955J275L8761j7005r05N6582
$$ 444661 402365 431590 368303 367609 421477 340731 384598 366643 367918 406679 389674 388769 445351
4550D45351J9228L8638k8176l9766J009J3618N4555l1928M5380r6929J08732K3536
$$ 445351 464579 503217 475041 435275 436284 449902 504457 472529 517909 420980 529712 553248
4538E53248p5351M7152L1596N596k0368N7256q894Q322J6316P9577O907K365L81
$$ 553248 477897 525049 556645 562241 541873 599129 590235 598557 614873 694450 701357 703722 704103
4525G04103j9938N1451j0651O4332o8699N1983N1370j7159J0674L6111L3552Q8885
$$ 704103 684165 735616 724965 789297 720598 772581 823951 806792 817466 853577 887129 976014
4513I76014k9358L6628M0568k172J46095p189M5106J02012R0153m0658M1198N316
$$ 976014 946656 983284 1023852 1021680 1167775 1160586 1205692 1307704 1397857 1357199 1398397 1403713
4501A403713P3177Q6109N7307O7430L5316J29893J4960K15620J15782J53848K27147
$$ 1403713 1476890 1562999 1620306 1687736 1723052 1852945 1867905 2083525 2199307 2353155 2580302
4490B580302K32590J32696q428L9791r6949j21197l033m0674R1455j5990N1630
$$ 2580302 2812892 2945588 2937160 2976951 2880002 2758805 2755772 2715098 2806553 2790563 2842193
4479B842193L4143O0782Q2799M1087J10453O5450Q5710Q4670J19469Q4744J54669
$$ 2842193 2876336 2937118 3019917 3061004 3171457 3236907 3322617 3407287 3526756 3611500 3766169
4468C766169K76929L42214K97471L54496L67959L84570L30080M29444M93188P24281
$$ 3766169 4043098 4385312 4682783 5037279 5405238 5789808 6119888 6549332 7042520 7766801
4458G766801Q96664P5601m99642k62491k40653r9537l2833O4426R5726K21437
$$ 7766801 8663465 8739066 8239424 7976933 7736280 7636743 7603910 7668336 7764062 7985499
4448G985499J75146J96734L36213L24092N75797N70140Q67292R87986J244022
$$ 7985499 8160645 8357379 8693592 9017684 9593481 10163621 11030913 12018899 13262921
4439A3262921J396488J720751J909140K334920K813723K568970L755882O352613
$$ 13262921 14659409 16380160 18289300 20624220 23437943 26006913 29762795 36115408
4431C6115408O849991N126967k909553n840219m584974m789827n292104l789460
$$ 36115408 42965399 48092366 45182813 39342594 34757620 29967793 24675689 20886229
4423B0886229k358157j923917j636422j429364j057440q92515q95237q24043o94581
$$ 20886229 18528072 16604155 14967733 13538369 12480929 11588414 10693177 9869134 9174553
4414I174553n66170n94806l97561m02743k56779k30308j90306j13500j23540j36501
$$ 9174553 8608383 8013577 7616016 7213273 6956494 6726186 6535880 6422380 6298840 6162339
4404F162339j9287n9215J03094J55454K19409J55854M89428P46087P24748K69537
$$ 6162339 6143052 6083837 6186931 6342385 6561794 6717648 7207076 7953163 8677911 8947448
4394H947448p02497p73502n98791p65704p29623l92974l54885k94308k50361j80220
$$ 8947448 8244951 7471449 6872658 6106954 5377331 4984357 4629472 4335164 4084803 3904583
4384C904583k60203r0146j94844j79300J4024j87169r544r171n544p9355R4095
$$ 3904583 3644380 3554234 3359390 3180090 3194114 3006945 2997401 2988230 2982686 2903331 2997426
4373B997426l3268J41231L4000J50217J76261J22615K04795J72831l5228j23296
$$ 2997426 2964158 3105389 3139389 3289606 3465867 3588482 3793277 3966108 3930880 3807584
4363C807584k36523k18568l52525l07640j74342j95867j93142j60198p4570j15774
$$ 3807584 3571061 3352493 2999968 2692328 2517986 2322119 2128977 1968779 1894209 1778435
4353A778435j23035K2384l5593j50004j2588q7219j2542O139q0149k1362q1383
$$ 1778435 1655400 1677784 1642191 1492187 1479599 1392380 1379838 1385977 1305828 1284466 1203083
4342A203083o1381l5757p4909L9503m8034o4170q606l4479k9526k2519m4419L60
$$ 1203083 1141702 1105945 1031036 1070539 1022505 958335 949729 915250 885724 863205 818786 819146
4330H19146P6025o4243M2405j11269J36173m8362M0311p5223O2125J4828J4624
$$ 819146 895171 830928 873333 762064 898237 849875 890186 814963 877088 891916 906540
4319I06540p1536L609o4177m4255n0268K4938o9071q9197j705n6184N4712n3716
$$ 906540 835004 838613 774436 730181 679913 704851 635780 546583 544878 488694 543406 489690
4307D89690l3733j1698n3522j1585k2615Q4751q4751k2063M9214j40570L6329
$$ 489690 455957 444259 390737 379152 356537 441288 356537 334474 383688 243118 279447
4296B79447Q3673n5372o5875J7178O2081o3477K4384j19645L1917L7096L0104
$$ 279447 363120 307748 241873 259051 321132 257655 282039 162394 194311 231407 261511
4285B61511j12122J2870K9397L8015o4797Q4882o0204k0039M3333l1759k7938
$$ 261511 149389 162259 191656 229671 164874 249756 189552 169513 212846 181087 153149
4274A53149N0827p455l8856K772m2351m1792Q7009q964k6337m4406j8770J5577
$$ 153149 203976 196521 157665 160437 118086 76294 163303 154339 128002 83596 64826 80403
4262H0403M1804L1589J023p7007j8879K1123k1601o856O177j3623m609q686K1349
$$ 80403 122207 153796 154819 77812 58933 80056 58455 51599 57776 44153 39544 30858 52207
4249E2207j1166l5030N0907l3717O985k3471M0939O156k6208l9759O2297M501
$$ 52207 41041 6011 56918 23201 30186 6715 47654 53810 27602 -12157 50140 54641
4237E4641l6720N3424p7363P7021o9409L4063n595K2428J5483k4318p0917M8399
$$ 54641 17921 71345 -6018 71003 1594 35657 30062 52490 67973 43655 -27262 21137
4225B1137L140j6362K8207o4166M2428J9483n6704L7743j3653k196P6890o4031
$$ 21137 24277 7915 36122 -28044 14384 33867 -22837 14906 1253 -943 75947 11916
4213A1916k0455K125O2027j27485Q8185J114k2297J3232J3297J7038R477j721
$$ 11916 -8539 -6414 55613 -71872 16313 17427 -4870 8362 21659 38697 48174 46453
4201D6453l9912m0065n324Q2125p3775O124P1100m1886o57j096K1122k3200P7366
$$ 46453 6541 -33524 -38848 43277 -30498 -24374 46726 4840 4183 3087 24209 1009 78375
4188G8375r3124L1717K787J1784L5895J7887l7154Q8254K6756n6543R3381q3987
$$ 78375 -14749 16968 19755 31539 67434 85321 48167 136421 163177 106634 200015 116028
4176A16028O8192j08134L3736k9768k0817o4117P1110n1310j9739L2105k5177
$$ 116028 184220 76086 109822 80054 59237 -4880 66230 14920 -4819 27286 2109
4165B109N730P537p5046N2146J0841q5213J6456N3227n794O970J061l670M491
$$ 2109 7839 15376 -59670 -7524 3317 -81896 -65440 -12213 -18007 -11037 -9976 -13646 -9155
4152i155Q2343q9165P5801J1050j5101O199l2371O1134m2613n002p2073J09270
$$ -9155 73188 -15977 59824 70874 55773 61972 29601 90735 48122 43120 -28953 80317
4140H0317q6622k0908M3338k1871J8548R15L0765q472k7483j6441L2218K443o1319
$$ 80317 -6305 -27213 16125 -5746 12802 13717 44482 36010 8527 -7914 24304 26747 -34572
4127c4572J2380M1786k0724n5304P3875K8991m6613K4398N1877n344l7697k8307
$$ -34572 -22192 19594 -1130 -56434 17441 46432 -181 24217 76094 70750 33053 4746
4115D746j609m7979m7103R982N7540l8190K2674l3285N0535k1054k364K5147m7463
$$ 4746 3137 -44842 -91945 -81963 -24423 -62613 -39939 -73224 -22689 -43743 -46107 -20960 -68423
4102f8423Q745J3260p1045J01065j6273o6470L0695K784L5269n5234L7790K5468
$$ -68423 -59678 -46418 -117463 -16398 -32671 -99141 -68446 -65662 -30393 -85627 -47837 -22369
4090b2369o2243j0301l2556P5595o1482R351Q1691j17147N7863j8849Q7526o8810
$$ -22369 -84612 -94913 -127469 -51874 -113356 -104005 -22314 -139461 -81598 -100447 -12921 -81731
4078h1731L1270l0615K1343K2961p2171k8918N5369K4575L7279o2286P0727p6208
$$ -81731 -50461 -81076 -59733 -36772 -108943 -137861 -82492 -57917 -20638 -82924 -12197 -88405
4066h8405P2875K0759q4843j7738J6632K5879N3162l383L5822o9889M5576L0648
$$ -88405 -15530 5229 -79614 -97352 -80720 -54841 -1679 -5062 30760 -39129 6447 37095
4054C7095o8259M1513J01109j26799j0452K7231N0438p6355J21693r5743P7417
$$ 37095 -31164 10349 111458 -15341 -25793 1438 51876 -24479 97214 1471 78888
4043G8888n8503m5J7585l4175Q5119p7678p766P025j7394L1741q496K3611o3081
$$ 78888 20385 20340 37925 3750 88869 11191 3425 10450 -6944 24797 16301 39912 -23169
4030b3169k9416N4520j3502j4038q326L541K2024p7123P2167Q799L372o1624J1330
$$ -23169 -52585 1935 -11567 -25605 -33931 -30390 -8366 -85489 -13322 -4523 -1151 -62775 -51445
4017e1445J08173o2629j9646K3395M6770n4257j4917L1702r5624J27475o9712
$$ -51445 56728 -5901 -25547 -2152 44618 -9639 -24556 7146 -88478 38997 -30715
4006c0715N8264r8795N7229q704J3351n8160q370J12693k9412m6075n3706M2883
$$ -30715 27549 -71246 -14017 -22721 -9370 -67530 -75900 36793 7381 -38694 -92400 -49517
3994d9517m3194K6239Q1694r3486J3779k0295J9718M919o2337J12070j433K3895
$$ -49517 -92711 -66472 15222 -78264 -64485 -84780 -65062 -60143 -122480 -10410 -11843 12052
3982A2052n5180L7102j25035Q4560k7056m4872L7815j3050Q699K8536J9286o2189
$$ 12052 -43128 -6026 -131061 -46501 -73557 -118429 -80614 -93664 -84965 -56429 -37143 -99332
3970i9332l0808j02861J62524j3000o9872J17905j49430M4729j333j359L3886
$$ -99332 -130140 -233001 -70477 -83477 -153349 -35444 -184874 -140145 -141478 -142837 -108951
3959a08951k1844l3013K581J9896J568l8469N3071l4700J3653J781k3676L0763
$$ -108951 -130795 -163808 -161227 -141331 -139763 -178232 -125161 -159861 -146208 -144427 -168103 -137340
3947a37340q219q270N3067q8526O1906n2618O208J2160M9042j9143l1425K2400
$$ -137340 -145559 -153829 -100762 -189288 -127382 -180000 -173792 -161632 -112590 -131733 -163158 -140758
3935a40758J98n5728J4797M5325m0001K8750l6855O8544j3936K2602L2423r1900
$$ -140758 -140560 -196288 -181491 -136166 -176167 -147417 -184272 -115728 -129664 -107062 -74639 -166539
3923a66539N3240l9846l9866j7099L2354N5384m9182J02079o0667o8577J01169
$$ -166539 -113299 -153145 -193011 -210110 -177756 -122372 -171554 -69475 -130142 -198719 -97550
3912i7550n6610J7482j3453J2085M948p911K5632m6336R8729p6620L0938k6281
$$ -97550 -154160 -136678 -150131 -138046 -133098 -141009 -115377 -161713 -62984 -139604 -108666 -134947
3900a34947J6744J7876k6423J7269J7251m9333q342M8734q3608M4487O6025q4648
$$ -134947 -118203 -100327 -126750 -109481 -92230 -141563 -149905 -101171 -184779 -140292 -74267 -158915
3888a58915O9419O0582j08319k4249k9126O0919p5459P7408M6551o0604K2048
$$ -158915 -89496 -28914 -137233 -161482 -190608 -129689 -205148 -127740 -81189 -141793 -119745
3877a19745m6650K2195j9274O2577j6956n8257N1451j2361l3986Q890J565M3381
$$ -119745 -166395 -144200 -163474 -100897 -117853 -176110 -124659 -137020 -171006 -162116 -160551 -117170
3865a17170j3434r711O476o1185P4014p8519K2321j9381O394N1871l7682N9988
$$ -117170 -130604 -140315 -133839 -195024 -121010 -199529 -177208 -196589 -190195 -138324 -176006 -116018
3853a16018k3172L3090j23862J28845p1541j7565j8171K4574N1838r2038O5841
$$ -116018 -139190 -106100 -229962 -101117 -172658 -190223 -208394 -183820 -131982 -224020 -158179
3842a58179j3033K8787K9500p4842J02359m6810l558m219L8253l5600M3660l5989
$$ -158179 -171212 -142425 -112925 -187767 -85408 -132218 -135776 -139995 -101742 -137342 -93682 -129671
3830a29671K0010m5237o825K333l7075J11710K3817j38973P2036r608m4539Q0128
$$ -129671 -109661 -154898 -161723 -159390 -196465 -84755 -60938 -199911 -127875 -137483 -182022 -101894
3818a01894o2264j5529K9336k1206M6236J419L0007r3494N1821K8516m0597L5970
$$ -101894 -164158 -179687 -150351 -171557 -125321 -123902 -93895 -187389 -135568 -107052 -147649 -111679
3806a11679m6397J454O0260r0909M8282m2337k365K6980r783j2014j7164J2663
$$ -111679 -158076 -156622 -96362 -187271 -138989 -181326 -183691 -156711 -166494 -178508 -195672 -183009
3794a83009k6872Q9567L561n6527m778L6996N63o340j9521L0110n0505K4000m371
$$ -183009 -209881 -120314 -116753 -173280 -178058 -141062 -140499 -146839 -166360 -136250 -186755 -162755 -167126
3781a67126K0729m8900M5308j8045K382L9407j7696K7458m7331o916N9179j4355
$$ -167126 -146397 -195297 -149989 -168034 -165652 -126245 -143941 -116483 -163814 -170730 -111551 -125906
3769a25906k6663j0205K3665K7113j5002m6634J8983O8609l6560n0146M3576k6637
$$ -125906 -152569 -162774 -139109 -111996 -126998 -173632 -154649 -86040 -122600 -172746 -129170 -155807
3757a55807r364M3336j0925l4873m0600L8795M9526l5752P709q86m9594Q1614
$$ -155807 -165171 -121835 -132760 -167633 -208233 -169438 -119912 -155664 -147955 -148841 -198435 -116821
3745a16821j4122q6716J03941p6448L162j0308P6429m0796J7158N8791l1358n4896
$$ -116821 -130943 -217659 -113718 -190166 -187004 -197312 -120883 -161679 -144521 -85730 -117088 -171984
3733a71984L0784m0059L6721k4953P3003n6961N3127L7622l1840p5416K1551l0374
$$ -171984 -141200 -181259 -144538 -169491 -96488 -153449 -100322 -62700 -94540 -169956 -148405 -178779
3721a78779J0615M6475K4404l4174K2942k2325l6707K2849j3813K7763j272k1071
$$ -178779 -168164 -121689 -97285 -131459 -108517 -130842 -167549 -144700 -158513 -130750 -132022 -153093
3709a53093n716J6130M5768q3035k248L7358j4859L7867j1033j8136r5268J61198
$$ -153093 -158809 -142679 -96911 -179946 -182194 -144836 -159695 -121828 -132861 -150997 -246265 -85067
3697h5067r8525J6934N0071J539n9159O9502m8951P6644k3459l0422R045r188
$$ -85067 -183592 -166658 -116587 -115048 -174207 -104705 -153656 -77012 -100471 -130893 -121848 -131036
3685a31036o1054Q4165q8221N0521p198M46j181l9996J109J2618L8432j077k5561
$$ -131036 -192090 -107925 -196146 -145625 -152823 -152377 -153558 -193554 -192445 -179827 -141395 -142472 -168033
3672a68033m9890P5852J2254k1243Q473k9294K8604J7442k3158m276O3379K8157
$$ -168033 -217923 -142071 -129817 -151060 -142587 -171881 -143277 -125835 -148993 -153269 -89890 -61733
3660f1733o7596j1194J7105k7556L5957n2870N2437k1423m845L8316l7969j1032
$$ -61733 -129329 -140523 -123418 -150974 -115017 -167887 -115450 -136873 -141718 -103402 -141371 -152403
3648a52403J1531n9008P9647q7396j502P2151q4012j0469N9076r315j2827p883
$$ -152403 -140872 -199880 -120233 -207629 -209131 -136980 -220992 -231461 -172385 -181700 -194527 -202410
3636b02410J5132P2668j0536J8612q2645k568O2715k7059M7171j00679J4844O1473
$$ -202410 -187278 -114610 -125146 -106534 -189179 -191747 -129032 -156091 -108920 -209599 -194755 -133282
3624a33282J1940K3390l1888k2778o419K4117k4937O1211n2476q118N8315k9074
$$ -133282 -121342 -97952 -129840 -152618 -159037 -134920 -159857 -98646 -151122 -159240 -100925 -129999
3612a29999N075p9902N8105O3829l4755k5012l7740K6622J4801L2652J4277k9003
$$ -129999 -124924 -204826 -146721 -82892 -117647 -142659 -180399 -153777 -138976 -106324 -92047 -121050
3600a21050N857l1543j5780K2955m7549L3611R5997p4120K7666m0425N4056p3382
$$ -121050 -115193 -146736 -162516 -139561 -187110 -153499 -57502 -131622 -103956 -144381 -90325 -163707
3588a63707P0974j0128m823K3249k7779L6685p9541J2882Q1091m9118j5499q033
$$ -163707 -92733 -102861 -107684 -84435 -112214 -75529 -155070 -142188 -61097 -110215 -125714 -133747
3576a33747n768m7874N5040j1354k628J3478N492L7101J7554n0625l6690Q7860
$$ -133747 -139515 -187389 -132349 -143703 -146331 -132853 -127361 -90260 -72706 -123331 -160021 -72161
3564g2161k3631p939J3123l5687j3094K4471j819J8103O383o5248K1125L3967
$$ -72161 -95792 -103731 -90608 -126295 -139389 -114918 -116737 -98634 -92251 -157499 -136374 -102407
3552a02407m8380O7053k1128K5880l8309l7546K2283J9572j0830K8519n6597L2208
$$ -102407 -150787 -83734 -104862 -78982 -117291 -154837 -132554 -112982 -123812 -95293 -151890 -119682
3540a19682o776K4821N0083q1572M398m4823P9703n1003J8400J2913l262r7651
$$ -119682 -126458 -101637 -51554 -133126 -128728 -173551 -93848 -144851 -126451 -113538 -116800 -214451
3528b14451O6271M3630M5721k3334o2647j7964K4276o0331N5341M6329n8946M1103
$$ -214451 -148180 -104550 -58829 -82163 -144810 -162774 -138498 -198829 -143488 -97159 -156105 -115002
3516a15002K511L462l9626l4921N9217k7615o2252P8031N4421q3121K3510k3165
$$ -115002 -112491 -109029 -148655 -183576 -124359 -151974 -214226 -136195 -81774 -164895 -141385 -164550
3504a64550K2225L4715n5863L0477p6555R9922q981M129o9763M1316j9460k61
$$ -164550 -142325 -107610 -163473 -132996 -209551 -109629 -118610 -114481 -184244 -142928 -162388 -162649
3492a62649K2064m2455L1631k247p086k0424k0867N8197p3983N1766k8415O7053
$$ -162649 -140585 -183040 -151409 -153656 -160742 -181166 -202033 -143836 -217819 -166053 -194468 -127415
3480a27415m2399L3719n1113o611K545M3214m2739O673M582k9792J09278p1686
$$ -127415 -169814 -136095 -187208 -193819 -191274 -148060 -190799 -184126 -179544 -209336 -100058 -171744
3468a71744K9673l3625p603L7476n1750M9031J5302l2368p3850P7193l6686N979
$$ -171744 -142071 -175696 -183299 -145823 -197573 -148542 -133240 -165608 -239458 -162265 -198951 -192972
3456a92972J2144K9279o8480P3078k6508J9784m5785N1883K0792R961k4549N2815
$$ -192972 -180828 -151549 -220029 -146951 -173459 -153675 -199460 -147577 -126785 -116824 -141373 -88558
3444h8558m4603O1507m3096j9906N0767r5911K2590M5531o3038J0476M1561j8043
$$ -88558 -133161 -71654 -114750 -134656 -83889 -179800 -157210 -111679 -174717 -164241 -122680 -140723
3432a40723N065L0487l5059J6824K4722k573l2387k2604P3903O8899j2751j2782
$$ -140723 -135658 -105171 -140230 -123406 -98684 -101257 -133644 -156248 -82345 -13446 -26197 -38979
3420c8979l7405J5039q7313P2391l9941J7544p841P1695n4078J3949Q786L6038
$$ -38979 -76384 -61345 -148658 -76267 -116208 -98664 -106505 -34810 -88888 -74939 -66153 -30115
3408c0115l7947k0743n8338n972N7400K0963M925r079n978K9376j8347N3521p6731
$$ -30115 -68062 -88805 -147143 -153115 -95715 -74752 -69827 -78906 -84884 -55508 -73855 -20334 -97065
3395i7065K8620q7760J06749o6189L3933l4297O770k4925N0883o2848J41717k2559
$$ -97065 -68445 -156205 -49456 -115645 -81712 -116009 -109239 -134164 -83281 -146129 -4412 -26971
3383b6971p9323R3932O375o5312M8449m4138p7695j3332R3028p6169M0258k5466
$$ -26971 -106294 -12362 -5987 -71299 -22850 -66988 -144683 -158015 -64987 -141156 -100898 -126364
3371a26364M8674o128j3554l3910k226p964N7049N603j7136N9506p1248K5505
$$ -126364 -77690 -83818 -97372 -131282 -133508 -141472 -84423 -78820 -95956 -36450 -107698 -82193
3359h2193M6000M617R646J3989j7142L7040K768R550q0133L1145K1473r2395M3500
$$ -82193 -36193 -31576 -21930 -7941 -25083 11957 14725 24275 -55858 -24713 -3240 -95635 -52135
3346e2135j9695J8416R219O0421m3714N5910m2835m9354P0833O425l79N1538J9887
$$ -52135 -71830 -53414 -44195 16226 -27488 28422 -14413 -63767 7066 13491 13112 64650 84537
3333H4537M908L9438Q0451P8696J0316R0760K00661J76829R8856k66645m8108
$$ 84537 89445 128883 209334 288030 298346 389106 589767 766596 865452 598807 550699
3322E50699p5448j32688j01135q3174j5050j7454r2254N2391j32262M5612M0858
$$ 550699 475251 342563 241428 158254 143204 125750 33496 85887 -46375 -763 40095
3311D0095K609r886n3220J7356m2146l923K1124l0429L6348l9424k4558l0622
$$ 40095 42704 32818 -20402 -3046 -45192 -49115 -27991 -58420 -22072 -61496 -86054 -116676
3299a16676J0899M0108m1293J7508N3784p9769n64K0062j6417k0624K3831P1819
$$ -116676 -105777 -65669 -106962 -89454 -35670 -115439 -116003 -95941 -112358 -132982 -109151 -37332
$$ [...]
##END NTUPLES=NMR SPECTRUM
##END=
