##TITLE=abcd
##JCAMPDX= 6.0         $$ Bruker NMR JCAMP-DX V2.0
##DATA TYPE= NMR FID
##DATA CLASS= NTUPLES
##ORIGIN= UXNMR, Bruker Analytische Messtechnik GmbH
##OWNER= root
$$ XWIN-NMR		Version 3.5
$$ Thu Oct 23 19:09:42 2025 Russian Standard Time (UT+4h)  servis@DPX200
##.OBSERVE FREQUENCY= 200.131235884673
##.OBSERVE NUCLEUS= ^1H
##.DELAY= (6, 6)
##.ACQUISITION MODE= SIMULTANEOUS
##.ACQUISITION SCHEME= undefined
##.AVERAGES= 32
##.DIGITISER RES= 18
##SPECTROMETER/DATA SYSTEM= spect
##.PULSE SEQUENCE= zg
##.SOLVENT NAME= CDCl3
##.SHIFT REFERENCE= (INTERNAL, CDCl3, 0, 16.5164)
##AUDIT TRAIL= $$ (NUMBER, WHEN, WHO, WHERE, WHAT)
$$ ##TITLE= Audit trail, XWIN-NMR		Version 3.5
$$ ##JCAMPDX= 5.01
$$ ##ORIGIN= Bruker BioSpin GmbH
$$ ##OWNER= servis
$$ F:\spectra/data/av/nmr/H1/1/audita.txt
$$ ##AUDIT TRAIL=  $$ (NUMBER, WHEN, WHO, WHERE, WHAT)
(   1,<2025-10-23 19:06:46.50 +0400>,<servis>,<DPX200>,
      <created by zg, POWCHK disabled, PULCHK disabled
       configuration hash MD5:
       00 E9 B6 7A A2 85 ED C7 34 08 36 98 17 FE 4E 26
       data hash MD5: 32K
       EA 8F A3 01 56 DD 8F AD 65 59 1B 64 01 DA 56 45>)
$$ ##END=
$$ 
$$ hash MD5
$$ 5B 23 D9 C9 52 09 89 46 85 E9 1E 73 1C 9F AF 2F
##$RELAX= 
##$RELAX= 
##$RELAX= 
##$RELAX= 
##$RELAX= 
##$RELAX= 
##$RELAX= 
##$RELAX= 
$$ Bruker specific parameters
$$ --------------------------
##$DU= <F:\spectra>
##$EXPNO= 1
##$NAME= <H1>
##$PROCNO= 1
##$TYPE= <nmr>
##$USER= <av>
##$AMP= (0..31)
100 100 100 100 100 100 100 100 100 100 100 100 100 100 100 100 100 100 
100 100 100 100 100 100 100 100 100 100 100 100 100 100 
##$AQSEQ= 0
##$AQ_mod= 1
##$AUNM= <au_zg>
##$AUTOPOS= <>
##$BF1= 200.13
##$BF2= 200.13
##$BF3= 200.13
##$BF4= 200.13
##$BF5= 500.13
##$BF6= 500.13
##$BF7= 500.13
##$BF8= 500.13
##$BYTORDA= 1
##$CFDGTYP= 0
##$CFRGTYP= 5
##$CHEMSTR= <none>
##$CNST= (0..31)
1 1 145 1 1 1 1 1 1 1 1 1 1 1 1 1 1 1 1 1 1 1 1 1 1 1 1 1 1 1 1 1 
##$CPDPRG= <>
##$CPDPRG1= <>
##$CPDPRG2= <>
##$CPDPRG3= <>
##$CPDPRG4= <mlev>
##$CPDPRG5= <mlev>
##$CPDPRG6= <mlev>
##$CPDPRG7= <mlev>
##$CPDPRG8= <mlev>
##$CPDPRGB= <>
##$CPDPRGT= <>
##$D= (0..31)
0 2 0 0 0 0 0 0 0 0.06 0 0 0 0 0 0 0.0002 0 0 0 0 0 0 0 0 0 0 0 0 0 0 
0 
##$DATE= 1761232006
##$DBL= (0..7)
120 120 120 120 120 120 120 120 
##$DBP= (0..7)
150 150 150 150 150 150 150 150 
##$DBP07= 0
##$DBPNAM0= <>
##$DBPNAM1= <>
##$DBPNAM2= <>
##$DBPNAM3= <>
##$DBPNAM4= <>
##$DBPNAM5= <>
##$DBPNAM6= <>
##$DBPNAM7= <>
##$DBPOAL= (0..7)
0.5 0.5 0.5 0.5 0.5 0.5 0.5 0.5 
##$DBPOFFS= (0..7)
0 0 0 0 0 0 0 0 
##$DE= 6
##$DECBNUC= <off>
##$DECIM= 32
##$DECNUC= <off>
##$DECSTAT= 4
##$DIGMOD= 1
##$DIGTYP= 9
##$DL= (0..7)
0 120 120 120 120 120 120 120 
##$DP= (0..7)
150 150 150 150 150 150 150 150 
##$DP07= 0
##$DPNAME0= <>
##$DPNAME1= <>
##$DPNAME2= <>
##$DPNAME3= <>
##$DPNAME4= <>
##$DPNAME5= <>
##$DPNAME6= <>
##$DPNAME7= <>
##$DPOAL= (0..7)
0.5 0.5 0.5 0.5 0.5 0.5 0.5 0.5 
##$DPOFFS= (0..7)
0 0 0 0 0 0 0 0 
##$DQDMODE= 0
##$DR= 18
##$DS= 0
##$DSLIST= <SSSSSSSSSSSSSSS>
##$DSPFIRM= 0
$$ [...]
##$SUBNAM0= <"">
##$SUBNAM1= <"">
##$SUBNAM2= <"">
##$SUBNAM3= <"">
##$SUBNAM4= <"">
##$SUBNAM5= <"">
##$SUBNAM6= <"">
##$SUBNAM7= <"">
##$SUBNAM8= <"">
##$SUBNAM9= <"">
##$SW= 20.6817932712277
##$SWIBOX= (0..15)
0 0 3 0 0 0 0 0 0 0 0 0 0 0 0 0 
##$SW_h= 4139.07284768212
##$TD= 32768
##$TD0= 1
##$TE= 0
##$TE2= 300
##$TE3= 300
##$TEG= 300
##$TL= (0..7)
0 120 120 120 120 120 120 120 
##$TP= (0..7)
150 150 150 150 150 150 150 150 
##$TP07= 0
##$TPNAME0= <>
##$TPNAME1= <>
##$TPNAME2= <>
##$TPNAME3= <>
##$TPNAME4= <>
##$TPNAME5= <>
##$TPNAME6= <>
##$TPNAME7= <>
##$TPOAL= (0..7)
0.5 0.5 0.5 0.5 0.5 0.5 0.5 0.5 
##$TPOFFS= (0..7)
0 0 0 0 0 0 0 0 
##$TUNHIN= 0
##$TUNHOUT= 0
##$TUNXOUT= 0
##$USERA1= <user>
##$USERA2= <user>
##$USERA3= <user>
##$USERA4= <user>
##$USERA5= <user>
##$V9= 5
##$VALIST= <valist>
##$VCLIST= <CCCCCCCCCCCCCCC>
##$VD= 0
##$VDLIST= <DDDDDDDDDDDDDDD>
##$VPLIST= <PPPPPPPPPPPPPPP>
##$VTLIST= <TTTTTTTTTTTTTTT>
##$WBST= 1024
##$WBSW= 30
##$XGAIN= (0..3)
0 0 0 0 
##$XL= 0
##$YL= 0
##$YMAX_a= 806790
##$YMIN_a= -587303
##$ZGOPTNS= <>
##$ZL1= 120
##$ZL2= 120
##$ZL3= 120
##$ZL4= 120
##$ABSF1= 10
##$ABSF2= 0
##$ABSG= 5
##$ABSL= 3
##$ALPHA= 0
##$AQORDER= 0
##$ASSFAC= 0
##$ASSFACI= 0
##$ASSFACX= 0
##$ASSWID= 0
##$AUNMP= <proc_1d>
##$AZFE= 0.1
##$AZFW= 0.1
##$BCFW= 1
##$BC_mod= 2
##$BYTORDP= 0
##$COROFFS= 0
##$CY= 19
##$DATMOD= 1
##$DC= 2
##$DFILT= <>
##$DTYPP= 0
##$F1P= 11.0000007629395
##$F2P= -0.999999237060547
##$FCOR= 0.5
##$FTSIZE= 0
##$FT_mod= 4
##$GAMMA= 1
##$GB= 1
##$INTBC= 1
##$INTSCL= 1
##$ISEN= 128
##$LB= 0.05
##$LEV0= 0
##$LPBIN= 0
##$MAXI= 10000
##$MC2= 0
##$MEAN= 0
##$ME_mod= 0
##$MI= 0
##$NCOEF= 0
##$NC_proc= 0
##$NLEV= 6
##$NOISF1= 0
##$NOISF2= 0
##$NSP= 1
##$NTH_PI= 0
##$NZP= 0
##$OFFSET= 16.51637
##$PC= 1
##$PHC0= -269.1076
##$PHC1= 6.501565
##$PH_mod= 0
##$PKNL= yes
##$PPARMOD= 0
##$PSCAL= 4
##$PSIGN= 0
##$REVERSE= no
##$SF= 200.13
##$SI= 16384
##$SIGF1= 0
##$SIGF2= 0
##$SINO= 400
##$SIOLD= 16384
##$SREGLST= <1H.CDCl3>
##$SSB= 0
##$STSI= 0
##$STSR= 0
##$SW_p= 4139.07284768211
##$SYMM= 0
##$S_DEV= 0
##$TDeff= 0
##$TDoff= 0
##$TI= <>
##$TILT= no
##$TM1= 0
##$TM2= 0
##$TOPLEV= 0
##$USERP1= <user>
##$USERP2= <user>
##$USERP3= <user>
##$USERP4= <user>
##$USERP5= <user>
##$WDW= 1
##$XDIM= 8192
##$YMAX_p= 0
##$YMIN_p= 0
$$ End of Bruker specific parameters
$$ ---------------------------------
##NTUPLES= NMR FID
##VAR_NAME=  TIME,          FID/REAL,        FID/IMAG
##SYMBOL=    X,             R,               I
##VAR_TYPE=  INDEPENDENT,   DEPENDENT,       DEPENDENT
##VAR_FORM=  AFFN,          ASDF,            ASDF
##VAR_DIM=   16384,         16384,           16384
##UNITS=     SECONDS,       ARBITRARY UNITS, ARBITRARY UNITS
##FACTOR=    0.0002416,     1,               1
##FIRST=     0,             0,               0
##LAST=      3.9581328,     0,               0
##MIN=       0,             -587303,         0
##MAX=       3.9581328,     806790,          0
$$ Real data points
##PAGE= N=1
##DATA TABLE= (X++(R..R)), XYDATA
0@%%%%%%%%%%%%%%%%%%%%%%%j4M6o4O4o4O4o4P3j05J28j28J39j71J92k08K40k66
$$ 0 0 0 0 0 0 0 0 0 0 0 0 0 0 0 0 0 0 0 0 0 0 0 0 -14 32 -32 32 -32 32 -32 41 -64 64 -64 75 -96 96 -112 128 -138
40a38K97l31L65m08M51n01N53o05O69p40Q14q97R88j089J199j321J462j623J806
$$ -138 159 -172 193 -215 236 -265 288 -317 352 -388 426 -471 517 -572 627 -694 768 -855 951
59I51k011K249k534K875l292L813m484N369o500P494o25L14893j1398n20239l73864
$$ 951 -1060 1189 -1345 1530 -1762 2051 -2433 2936 -3564 3930 3305 318198 306800 -213439 -587303
74e87303R2066L57611J95715r690j7127R0627P0367k8288n0314M0686P3091k0180
$$ -587303 -495237 -137626 58089 48399 31272 121899 192266 163978 113664 154350 227441 207261
86B07261j38774j35516n4463k8047r8051j16842K3769K26258K61950Q2065j13904
$$ 207261 68487 -67029 -121492 -149539 -247590 -364432 -340663 -114405 147545 229610 115706
97A15706j12095L9116J26466N4631n7743r6795r7051j20853r8573N0111K18543
$$ 115706 3611 42727 169193 223824 166081 69286 -27765 -148618 -247191 -197080 21463
108B1463J94615l4708k23240j70665K4260J23312O5290l639J6451N3987K1954
$$ 21463 216078 181370 -41870 -212535 -188275 -64963 327 -3312 13139 67126 89080
119H9080l2129j6846M0658L6375m1111q5784l8241K0103q602p6133m4379R6141
$$ 89080 56951 40105 80763 117138 76027 -9757 -47998 -27895 -36497 -112630 -157009 -60868
131f0868J67140L2699j79747k04242J6414K28779J89176j9658j12581J298J11037
$$ -60868 106272 138971 -40776 -245018 -228604 175 189351 169693 57112 58410 169447
142A69447K5918j44312j57855K835J08056J0254j50840j46494L2476J76957J43552
$$ 169447 195365 51053 -106802 -103967 4089 14343 -136497 -282991 -250515 -73558 69994
153F9994J8569l3724J0529M3177P696k6113N725M5509q99j07565j46528o6660
$$ 69994 88563 54839 65368 108545 116241 90128 95853 141362 140463 32898 -113630 -180290
165a80290K6842K3446l2881j5043Q6789J39059O6433l2309k1127P0077Q6780k2475
$$ -180290 -153448 -130002 -162883 -177926 -91137 47922 114355 82046 60919 130996 217776 195301
177A95301j32242j18161k4730K0015j2060l0537R929M6146J4604m0624l0577M5188
$$ 195301 63059 -55102 -79832 -59817 -71877 -102414 -92485 -46339 -31735 -72359 -102936 -57748
189e7748R7232P1160J0830j4914n915j0269l7681m8137k4686q745l5367o5990
$$ -57748 39484 110644 121474 106560 100645 90376 52695 4558 -20128 -28873 -64240 -130230
201a30230l0802O0047J08861N9128k0911l0440K1959L4218l0619q0468k7019P1806
$$ -130230 -161032 -100985 7876 67004 46093 15653 37612 71830 41211 -39257 -66276 5530
213E530Q3290j2125q7243m4488N0708O4532j8601q5009n4525K0200M1725N947
$$ 5530 88820 76695 -10548 -55036 -4328 60204 41603 -43406 -97931 -77731 -36006 -30059
225c0059j0531K5773O0181L7778j6284l9182j9808k4m37L595K4721K6731k3087
$$ -30059 -40590 -14817 45364 83142 66858 27676 7868 7844 7407 11002 35723 62454 39367
238C9367q2888p3695J1343P8816M8956l8154p0120m517Q0772R3107L7115j0654
$$ 39367 -43521 -117216 -105873 -27057 21899 -16255 -86375 -90892 -10120 82987 120102 109448
250A09448j3992j0951l6797o3409m7468k255J8360l007k4589j0380K1176K9419
$$ 109448 95456 84505 47708 -15701 -63169 -65424 -47064 -50071 -74660 -85040 -63864 -34445
262c4445J6690K0401M8415N8470J8929l8948n7225k5242R960P954j9327l7795
$$ -34445 -17755 2646 51061 109531 128460 89512 32287 7045 17005 24959 5632 -32163
274c2163m0151l8322k6447J6482P5642R6036M6939k9505n4422q910M4934M2594
$$ -32163 -72314 -110636 -137083 -120601 -44959 51077 98016 68511 14089 5179 50113 92707
286I2707q189m4199l7525j8498k2631l5840k1157K0257M6716L0586m662j7736
$$ 92707 84518 40319 2794 -15704 -38335 -74175 -95332 -75075 -28359 2227 -2435 -20171
298b0171j356K0850L2336L5668K9958K022m3981p1690m8084R747M5533K7381j5543
$$ -20171 -21527 -677 31659 67327 97285 99307 55326 -16364 -64448 -54701 -9168 18213 2670
311B670l5713k0762L19Q845J6223L2561M0216J6043k5649m1981j2638L0430M1256
$$ 2670 -33043 -53805 -53486 -44641 -28418 4143 44359 60402 34753 -7228 -19866 10564 51820
324E1820J2625k1612l2702k7851k3432j7999O41K6471L2914Q363k3350k8038j059
$$ 51820 64445 42833 10131 -17720 -41152 -59151 -58510 -32039 875 9238 -14112 -42150 -43209
337d3209L0281M2371L5855J8999o171l4104m5269k4593J2613K8016L228l5521
$$ -43209 -12928 29443 65298 84297 78126 44022 -1247 -25840 -13227 14789 18017 -17504
349a7504m8677k5073Q590K7357L1568L3906L3225J8606n906j9396p796J4121J8381
$$ -17504 -66181 -91254 -82664 -55307 -23739 10167 43392 61998 56092 36696 28900 43021 61402
362F1402l025l2456m7513m2778k6014l135K1834L8808L3650R318j1543n631K0512
$$ 61402 58377 25921 -21592 -64370 -90384 -93519 -71685 -32877 773 10091 -1452 -7083 13429
375A3429L8340L0716N535j8135l1548l6495l3489j8152L339J3109K203j5377j6846
$$ 13429 51769 82485 88020 69885 38337 1842 -31647 -49799 -46460 -33351 -31148 -46525 -63371
388f3371L103K8235M0398L6273K3985P721j0977k7614k9670j4690M613R047n586
$$ -63371 -60268 -32033 8365 44638 68623 76344 65367 37753 8083 -6607 -1994 7053 1467
401A467k3409k6559j1487R584K2152K3352J5596L534p291p229N689K0978K3091
$$ 1467 -21942 -48501 -59988 -50404 -28252 -4900 10696 14230 6939 -290 5399 26377 49468
414D9468P666j3703k5257k4365j7746j0621j195R428J2623M607p782j1117j47
$$ 49468 57134 43431 18174 -6191 -23937 -34558 -35753 -26325 -13702 -9095 -16877 -27994 -28141
427b8141J5690K3668J6948L523p058q639j338Q549J3547N992j3048l2531l9026
$$ -28141 -12451 11217 28165 31688 24630 15991 14653 23202 36749 42741 29693 -2838 -41864
440d1864k7001k871J7439K5473K0954J2724N391L721P861J5433J6728M997j5566
$$ -41864 -68865 -71736 -54297 -28824 -7870 4854 10245 13966 21827 37260 53988 58985 43419
453D3419k9705k6576r540M038L936m901j1953j1830n594K326J2355K3900L2348
$$ 43419 13714 -12862 -22402 -18364 -14428 -19329 -31282 -43112 -48706 -46380 -34025 -10125 22223
466B2223L0737J6802l005j8490k2197j6692q312n144r241j8042k2818j4743P261
$$ 22223 52960 69762 66757 48267 26070 9378 1066 -4078 -13319 -31361 -54179 -68922 -61661
479f1661L1774M0207K4845m152k2794j5972Q799K9728K7842M841k2553l5419k9633
$$ -61661 -29887 10320 35165 31013 8219 -7753 1046 30774 58616 63457 40904 5485 -24148
492b4148j3618K44M607L011J836K921N843Q487J1497J4089J4530J0613J342j0058
$$ -24148 -37766 -37522 -32915 -29904 -28068 -25147 -19304 -10817 680 14769 29299 39912 41254 31196
506C1196j8471j8773q610Q747K0680J3484j2649l9031m0831j1462K8458M5910
$$ 31196 12725 -6048 -14658 -5911 14769 28253 15604 -23427 -64258 -75720 -47262 -1352
518a352K9283k472j9460r306J1790K1473J2803k259j2822j7114j9623j7301n411
$$ -1352 27931 25459 5999 -3307 8483 29956 42759 40500 27678 10564 -9059 -26360 -31771
531c1771J1041J7603O166j3557k3153j4200M286J9527K7379L0180K6313J1191
$$ -31771 -20730 -3127 3039 -10518 -33671 -47871 -43585 -24058 3321 33501 59814 71005
543G1005j2151k8126k5019p930L710l458k0922k8807j7297N240K2873K9338K7624
$$ 71005 58854 30728 5709 -2221 1489 -1969 -22891 -51698 -68995 -63755 -40882 -11544 16080
556A6080J9945N490j2001k0169q783J5350K8909J5784j6247m1974m2529k0132
$$ 16080 36025 41515 29514 9345 562 15912 44821 60605 44358 2384 -40145 -60277
568f0277N301J6990J2676L579k93L836J2938K1593K5226J9093K076j8084k8678
$$ -60277 -54976 -37986 -25310 -21731 -22024 -18188 -5250 16343 41569 60662 62738 44654 15976
581A5976k3678r864j568j838k450K940Q926L798j1396j8041l16L1526M5213K2079
$$ 15976 -7702 -17566 -19134 -20972 -23422 -20482 -11556 -7758 -19154 -37195 -37511 -5985 39228 61307
595F1307j8833l9328k1315J3439K8351J2146j6222k8641k0733m928P119J3702
$$ 61307 42474 3146 -18169 -4730 23621 35767 19545 -9096 -29829 -34757 -27638 -13936
607a3936J6144R837o290j9786j5100N354K3085K1704P823q02P51J886p480k0578
$$ -13936 2208 12045 5755 -14031 -29131 -23777 -692 21012 28835 28033 28784 30670 23190 2612
621B612j9855l343J0442N948j1560k0294p362J5841K7877K0182L029p415q307
$$ 2612 -17243 -20586 -10144 -4196 -15756 -36050 -43412 -27571 306 20488 23517 16102 7795
634G795l872K336R546J4176R328o913k4539k9868j9224j628Q881P815K579K719
$$ 7795 3923 6259 15805 29981 39309 32396 7857 -22011 -41235 -42863 -33982 -26167 -23588 -20869
648b0869Q929J5260J6895J4423J0897M556p329k1822k8330j8709M57J2364O594
$$ -20869 -11940 3320 20215 34638 45535 50091 42762 20940 -7390 -26099 -25642 -13278 -6684
661f684q894j5726n681J1468J7159J1115M518P556J4198J0716m310j6535j3588
$$ -6684 -15578 -31304 -36985 -25517 -8358 2757 7275 14831 29029 39745 35435 18900 5312
674E312j273L992o108j9740k1191o888J1284K0113J8271J0853K126n677q360j635
$$ 5312 4039 8031 1923 -17817 -39008 -45896 -34612 -14499 3772 14625 16751 11074 2714 1079
688A079J0207J4276L490j3355k0356j0968L958Q877N80q846q212J34O920O945
$$ 1079 11286 25562 29052 15697 -4659 -15627 -11669 -2792 -2212 -11058 -19270 -19136 -12216 -5271
702e271M254M543P357O703Q46o138r584o633o49M891O946L917l924j1620j3050
$$ -5271 -1017 3526 10883 17586 18432 12294 2710 -3923 -4572 319 7265 11182 7258 -4362 -17412
717a7412m328P374J2483O273n876j1059l657J0977J9753J5225Q24j1914j4268
$$ -17412 -21740 -14366 -1883 4390 -1486 -12545 -16202 -5225 14528 29753 30577 18663 4395
730D395p839l90J344j779l667k962k242k962l010J522Q938J4318J1685L162l417
$$ 4395 -3444 -3834 -2490 -4269 -7936 -10898 -13140 -16102 -19112 -17590 -8652 5666 17351 20513 17096
745A7096m582j022J786P32l195q113j2398j2879q751Q36J1153J5300J0801K351
$$ 17096 12514 11492 13278 14010 10815 2702 -9696 -22575 -31326 -30490 -19337 -4037 6764 9115
759I115l383k630K738P558Q023L524m323j2318j5077j0573k013M532N189R26l417
$$ 9115 5732 3102 5840 13398 21421 24945 20622 8304 -6773 -17346 -19359 -14827 -9638 -8712 -12129
774a2129l316J647Q066J2685J2445P635n49q974j2744j0172k816L785M444m59
$$ -12129 -15445 -13798 -5732 6953 19398 27033 26484 17510 4766 -5406 -8222 -4437 7 -452
788d52o406q012m055K379Q373J0610P429J749l790n175k251L240O845N448j055
$$ -452 -6858 -14870 -18925 -16546 -8173 2437 9866 11615 7825 2650 399 3639 10484 15932 14877
803A4877q890j3234j0034j424O476R296N475j098n327m229M68N477Q353P186K509
$$ 14877 5987 -7247 -17281 -18705 -12229 -2933 2542 1444 -3883 -8112 -7644 -2167 6186 13372 15881
818A5881l255p407o901k032L443N431J807n170j0525r528k466N932J0795R364
$$ 15881 12626 5219 -1682 -3714 -271 5160 6967 1797 -8728 -18256 -20722 -14790 -3995 5369
832E369L483k427m066j154L191O018M740K65n173r264r818o222m30M498M916K219
$$ 5369 8852 6425 2359 1205 4396 10414 15154 15419 10246 982 -8836 -15058 -15488 -10990 -6074 -3855
848c855j871k645K71N864J0035R242L969k980p701q621n192j032J476Q25k231
$$ -3855 -5726 -8371 -8100 -2236 7799 17041 21010 18030 10329 1708 -3484 -4516 -3040 -2215 -4446
863d446n253n576j850L696Q688R636O169Q24k467k655k71K081J771j150n192p928
$$ -4446 -9699 -15275 -17125 -13429 -4741 4895 11064 11888 9421 6766 6495 8576 10347 9197 4005 -3923
879c923p846m773J20M545O588N282J850n11m85J849M240M380K000k256n469o476
$$ -3923 -11769 -16542 -16422 -11877 -5289 -7 1843 1332 847 2696 6936 11316 13316 11060 5591 -885
895h85m576j078J521K016J68j718l004j795J295M622O070M991J742j568k823j659
$$ -885 -5461 -6539 -5018 -3002 -2834 -4552 -7556 -9351 -8056 -3434 2636 7627 9369 7801 4978 3319
911C319N20J396K88k520m886n024k880m64K135L598L373K212M44j080J56J487
$$ 3319 3839 5235 5523 3003 -1883 -6907 -9787 -10251 -8116 -4518 -1145 1067 1511 431 587 2074
927B074L083L068J045k071m098l849j874M9O22p05k444l172k152Q65M111N847
$$ 2074 5157 8225 9270 7199 3101 -748 -2622 -2573 -1951 -2656 -5100 -8272 -10424 -9559 -5448 399
943C99N275L012P50j119j741j706j101r33j326k916l913l435j401J352L381L495
$$ 399 5674 8686 9436 8317 6576 4870 3769 2836 1510 -1406 -5319 -8754 -10155 -8803 -5422 -1927
959a927K309P33n8o5J594L661L389J484k162n100n746l916j386M25P12J25j27
$$ -1927 382 1115 1057 992 2586 6247 9636 11120 8958 3858 -1888 -5804 -7190 -6765 -6053 -5928 -6055
976f055k52J399L137M934M407K118o98k822l089j983o10K92J26j297l316l956
$$ -6055 -6307 -4908 -1771 3163 7570 9688 8990 6168 3079 1096 486 778 904 -393 -3709 -7665
992g665k362Q68L698M648L367J514r5n04J66J007J617P42j390m370n159l632Q4
$$ -7665 -10027 -9159 -5461 -813 2554 4068 3973 3469 3635 4642 6259 7001 5611 1241 -3918 -7550 -7466
1009g466K482K896J265q52j947j017J244L699M890L345L25k756l741k576l78O48
$$ -7466 -4984 -2088 -823 -1675 -3622 -4639 -3395 304 5194 8539 8864 6108 2367 -209 -587 61
1025F1M1j310k229k447j374K69K700M157L632J155j094k109j015R11K444K687
$$ 61 102 -1208 -3437 -5884 -7258 -6989 -4289 -132 3500 4655 3561 1452 437 1348 3792 6479
1041F479O80k639n330n306k131J473L152K105j54j046o85J233L132M072L035O65
$$ 6479 7159 4520 -810 -6116 -8247 -6774 -3622 -1517 -1671 -2717 -3402 -2169 963 5035 8070 8735
1057H735k691m448l519m87J629J372l51k010k386j851q89Q11L313M610L430K87
$$ 8735 6044 1596 -1923 -2410 -781 591 240 -1770 -4156 -6007 -6896 -6085 -2772 1838 5268 5555
1073E555j978j656O16J582J091r94k657l507l505k098J43K847L981K294p18k424
$$ 5555 3577 1921 2537 4119 5210 4216 1559 -1948 -5453 -7551 -7408 -4561 -580 1714 996 -1428
1089a428j109J635L691L279J377j082k713l327k408m55Q24P51r13k180k049M1
$$ -1428 -2537 -902 2789 6068 7445 6363 3650 323 -2085 -2540 -1716 -965 -1878 -4058 -6107 -6066
1105f066K209L591L349J747P8j215j347p21P6K55J14m98j318k708l200j492J183
$$ -6066 -3857 -266 3083 4830 4908 3693 2346 1625 1701 1956 2070 1572 254 -2454 -5654 -7146 -5963
1122e963L598L212P83j410p80J051K536K315P02q90k239l166k899r70J433J995
$$ -5963 -2365 847 1630 220 -560 491 3027 5342 6044 5154 2915 -251 -3150 -4120 -2687 -692
1138f92M03k097k203j51J990K486J314J215J591J407l90k213j997j76Q11l44k537
$$ -692 -289 -2386 -4589 -4740 -2750 -264 1050 2265 3856 5263 4873 2660 663 487 1298 954 -1583
1155a583l061j161N70J949J884K052J508N30j074j230J36K053J921j31k093k602
$$ -1583 -4644 -5805 -5235 -3286 -1402 650 2158 2688 1614 384 520 2573 4494 4363 2270 -332
1171c32j396k81j77k26l10n6m5j15N77J968K511K195O10p20j716j688q34j17M21
$$ -332 -1728 -2009 -2186 -2412 -2722 -2778 -2823 -2938 -2361 -393 2118 4313 4923 4203 2487 799 -35 -152 269
1190B69j69j373j534q38K36R40Q14J175J165Q08n3l00L54J484J248l62k043k527
$$ 269 100 -1273 -2807 -3645 -3409 -2469 -1655 -480 685 1493 1440 1140 1494 2978 4226 3864 1821 -706
1208g06j511m90j78K36M32R76K16r09n88J360K985K327K9j710j075J62M02n09
$$ -706 -2217 -2707 -2885 -2649 -2217 -1241 -1025 -1934 -2522 -1162 1823 4150 4179 2469 1394 1556 1958 1449
1226A449j264j100p37j150j610n20J361K702K000N59m9K49L03K67j80j22L36n04
$$ 1449 185 -915 -1652 -2802 -4412 -4932 -3571 -869 1131 1690 1641 1890 2193 2460 2280 2158 2494 1990
1244A990j870k535j350N94J580P00n36q71j27Q43J543K234J812Q19q99j863j667
$$ 1990 120 -2415 -3765 -3171 -1591 -891 -1427 -2298 -2425 -1582 -39 2195 4007 4826 3927 2064 397
1261C97o01O5l37o13r15p38o96k07R25K241J984R67l52o86m11M48N78K27r7n68
$$ 397 -204 -139 -476 -1089 -2004 -2742 -3438 -3645 -2720 -479 1505 2472 2120 1434 1023 1471 2049 2276 2179 1611
1281A611j920k205j378M89J519J379Q3p49j01O05J086Q48J269J105Oj442k107
$$ 1611 -309 -2514 -3892 -3403 -1884 -505 -422 -1171 -1272 -667 419 1267 2536 3641 3647 2205 98
1298I8j264L50J028r5j086j318q28J8M04J345J899J986N21j113j390k8J022Q49
$$ 98 -1166 -816 212 117 -969 -2287 -3115 -3097 -2693 -1348 551 2537 3058 1945 555 527 1549 2398
1316B398l50j038j225j185j254n12N99J235J266j56o85l91R59J591J463O98J31
$$ 2398 2048 1010 -215 -1400 -2654 -3166 -2567 -1332 -66 -222 -907 -1298 -339 1252 2715 3413 3544
1333C544p34j651j911j125L03Q88j15r51j069N0O97J282J309J356Q19P3j143r97
$$ 3544 2810 1159 -752 -1877 -1574 -686 -801 -1752 -2821 -2771 -2074 -792 517 1873 2692 2765 1622 625
1351F25pN76O04o44j325j458r90n93M85R62J344R25j07l43j8J026J279M68k27
$$ 625 618 1194 1798 1154 -171 -1629 -2619 -3212 -2727 -1765 -421 504 397 54 36 1062 2341 2809 2582
1370B582p35j142j220j217m09O64Q69j10o71o62K68J259J219P58P56J20l93j020
$$ 2582 1847 705 -515 -1732 -2141 -1477 -608 -718 -1389 -2051 -1783 -524 695 1453 2209 2329 1936 916
1388I16q30P4N38K68o69j515j031k91N62N45Q49Q67M23j08l23L12Q13J002k6p31
$$ 916 86 160 698 966 297 -1218 -2249 -2540 -1978 -1433 -584 283 706 598 275 587 1400 2402 2376 1645
1408A645j237r42o35l54K6K46M43r4m94n1M35J373J060M98m4k36m84n43k51p0
$$ 1645 408 -534 -1169 -1523 -1497 -1251 -808 -902 -1396 -1447 -1012 361 1421 1919 1875 1639 1155 612 361 291
1428B91K01l13j070j123m92L36J042O87N95L97J30J17J1M70O51J40n61j211j099
$$ 291 492 179 -891 -2014 -2506 -2170 -1128 -441 154 551 681 798 809 1279 1930 2070 1509 298 -801
1447h01m40k18N6J39P9K23Q3j22L79J060J177L23r7o99k87l52k54Mj60j81p47
$$ -801 -1241 -1459 -1403 -1264 -1185 -962 -879 -1001 -622 438 1615 1938 1841 1142 855 503 249 253 93 -88 -835
1468h35r05n00K00J000R60N70O2J53J3J63N10K47lm20r59j117n72m4M13N66o7
$$ -835 -1740 -2240 -2040 -1040 -80 490 552 705 718 881 1391 1638 1635 1215 256 -861 -1433 -1477 -1064 -498 -565
1489e65j62k88R9M29N85J069N72J63n40p29m10J24M1k74m18p43o16l63J90Q39
$$ -565 -727 -1015 -916 -487 98 1167 1739 1902 1362 633 223 347 388 114 -304 -1047 -1663 -2026 -1836 -997
1509i97R99Q61l0j98k70K9L81M72J70k79o28r89o35k78L91L55J94j81m31l3M10
$$ -997 2 863 833 635 365 394 775 1247 1417 1138 510 -479 -1114 -1392 -1001 -646 -452 -633 -1064 -1097 -687
1530f87Q61Q74O03J06m85o86o19mR7J24Kn84o98n21J5N37P86Q76J05k14k04j53
$$ -687 174 1048 1651 1757 1272 586 -33 -37 60 184 186 -398 -1096 -1617 -1602 -1065 -279 597 702 488 284 131
1552A31M38M99L11j4o71j076n76m40K47N61K87pk71l50J82N61P82O56K62k03m95
$$ 131 569 1068 1379 1365 694 -382 -958 -1398 -1151 -590 -303 -310 -581 -931 -749 -188 594 1250 1512 1309 814
1573H14p83j77OL66J6k90p59o83j04M84Q45P70J56k8j33l83N9M44L22J68k99p57
$$ 814 31 -146 -140 226 242 -48 -807 -1490 -1594 -1110 -265 505 661 633 500 117 176 620 942 1110 811 54
1595E4o41m55l1N13J90K15l49ok36L78P15P15K54O4p21o68k33p8M26M0q3p06l07
$$ 54 -587 -1042 -1073 -560 -370 -155 -504 -510 -746 -368 347 1062 1316 1380 659 -9 -242 -320 106 146 63 -643 -950
1618i50j95J22M97O74L82K5k10l44J13J92N90j7k66o16n88k70j2L58K70O5J51
$$ -950 -1145 -1023 -526 148 530 555 345 1 114 306 896 879 613 -3 -591 -861 -873 -515 -245 -180 -29
1639b9j35j67J25K94M94L09ml92l77k37n0K01L1k9l01k53k24j27M89M68M32k7
$$ -29 -164 -331 -206 88 582 891 887 495 118 -119 -169 32 63 34 -267 -520 -744 -871 -382 86 518 491
1661D91p9m20l6M01J04J77j15m34l87j29m3jK31K66j35j11k96J34M16M36K40j56
$$ 491 412 -8 -44 357 461 638 523 89 -298 -427 -470 -471 -240 26 -109 -220 -516 -382 34 470 710 554
1683E54p8k92j89m0K8o9J12j79k73k94J22K00L68L63k1k86p1J46L46J25l5j03
$$ 554 476 184 -5 -45 -17 -86 26 -153 -426 -720 -598 -398 -30 333 312 26 -45 101 447 572 537 434
1705D34k91k10n90LJ54M79R9j56j51j89K67M44L92j41p7j26k97l11J43J70K67
$$ 434 143 -67 -657 -654 -500 -21 78 -78 -229 -418 -151 293 685 544 467 341 44 -267 -124 46 313
1726C13j49k92m51k65K36M14L34K00J9o6j31k21J63K79K40p5n26n18j95J72L36
$$ 313 164 -128 -579 -844 -608 -194 140 340 359 293 162 -59 104 383 623 548 22 -496 -691 -519 -183
1747a83K30K02k00l13j68J77K75L83L98k25k61m89k18K40J17K52J22m87l53k63
$$ -183 47 249 49 -264 -432 -255 20 403 801 576 315 -174 -392 -152 -35 217 339 -148 -501 -764
1767g64PM73L75K90J77k71m93p5K04M38M06r7l22o02m37P7L04K27L13q3k46l14
$$ -764 -757 -284 91 381 558 287 -206 -281 -77 361 767 670 348 -254 -691 -614 -310 -83 230 147 -99 -413
1789d13k46M39O28L71Nl48o08j79J09K07K16J5k6m45l58k88J09Q39M51N2l91k41
$$ -413 -659 -220 408 779 784 436 -172 -351 -242 -35 181 196 170 -275 -633 -921 -812 27 478 530 139 -102
1811a02j45L06K58K37O3j33m72n90k80K45M94L17Nk43l30k0J99L60M00Q7J20n84
$$ -102 -247 59 317 554 617 484 12 -578 -858 -613 -119 198 203 -40 -370 -390 -191 169 569 656 776 192
1833A92m03j87J54M17J51pm00n06k11J94M14M66K97m3m80j79j6K89L32M1p8l50
$$ 192 -211 -398 -244 173 324 317 -83 -589 -800 -606 -192 274 571 528 48 -131 -147 142 474 515 437 87
1855H7m20l93L6M26M74J19j40m75P6o9K39K79K44L5k05m08k03K0J58L22R8k50
$$ 87 -333 -726 -690 -264 210 329 189 -286 -210 -279 -40 239 483 518 313 -95 -298 -278 -120 202 300 50
1877E0l15k96J14J14L74K22J47j90l03j55J48N47o9j37j32l10j67K8k3L27J08
$$ 50 -265 -561 -447 -333 41 263 410 220 -83 -238 -90 457 388 251 119 -191 -358 -330 -353 -26 82
1898H2O0j02k42J0J84K01K63j63m0j45j75j51K06O1M8j25k16p2J28l0L88J01P3
$$ 82 142 40 -202 -192 -8 193 456 293 253 108 -67 -218 -12 49 97 -28 -244 -316 -188 -218 170 271 344
1921C44j91o3j3r5J17J46l2j40k97n3o3M4K71O0J4m7j17j9J25J90J31o9j04j46
$$ 344 153 90 77 -18 99 245 213 73 -224 -277 -340 -296 -25 35 49 2 -115 -134 -9 181 312 243 139 -7
1945gj02P9qJ6N3qj53j10p6K10K53K9lj58j5L5m0m6J74J42j25k57k68J13K77M6
$$ -7 -109 -30 -38 -22 31 23 -130 -240 -316 -106 147 176 173 15 0 35 -5 -51 123 265 140 -117 -385 -272 5 51
1971E1J06r9j1j01j10O7K04J32Q5k16k40P0N4J1J4m2m5Lk50n3J76K51J36m2m5
$$ 51 157 58 47 -54 -164 -97 107 239 324 108 -132 -62 -8 3 17 -25 -70 -67 -317 -370 -194 57 193 151 106
1996A06j31l8J21P0R7J4o4k92k01J8K2L58K0n6j48O5j54P6K59L2J52k63O5k77
$$ 106 -25 -63 58 128 225 239 175 -117 -318 -300 -278 80 100 44 -104 -39 -193 -117 142 174 326 63 128 -149
2020a49q3K02R1M0k23n7p9MJ29M6K23J10j45j98J0mJ77j0Q4n8m5k8l25J51N0J74
$$ -149 -232 -30 61 101 -122 -179 -258 -254 -125 -79 144 254 109 -89 -79 -83 94 84 168 110 65 37 -288 -137 -87 87
2046H7o3j17Kj12O7J71J09J8Qk87J44j79J98l9Q9P6j27j60j8j29J27J12Q9J26
$$ 87 24 -93 -91 -203 -136 35 144 162 170 -117 27 -152 46 7 96 172 45 -115 -133 -262 -135 -23 66 192
2070A92k70r8O0J07K08O1j67j8Kj44r7J13RL7M7j57k2o3K38j12J68M4P1k20N9
$$ 192 -78 -176 -116 -9 199 260 93 75 77 -67 -164 -51 -42 -5 42 -115 -137 -200 38 -74 94 138 209 -11 48
2095D8n5P0O8lo2j9j13L2j54K48o2p2K9nL4P2J78j06M5o5q5J3j09N7J23j15mj94
$$ 48 -7 63 131 128 66 47 -66 -34 -188 60 -2 -74 -45 -50 -16 56 234 128 173 108 23 36 -73 -16 107 -8 -12 -206
2123b06OJ03p9K62Op3mR7p7K0P8P5q5K9r2j54m4m9R7K8o6n0P9j20J61L9O8K30
$$ -206 -200 -97 -176 86 92 19 15 112 35 55 133 208 123 152 60 -94 -138 -187 -90 -62 -128 -178 -99 -219 -58 -19 49 279
2151B79j80q1J33m1O2o1j26k3m1l4j73NJ52lM3J10J14N0m0l1L7Qq8J54j57j59
$$ 279 99 18 151 110 172 111 -15 -38 -79 -113 -286 -281 -129 -132 -89 21 135 185 145 114 151 159 71 225 68 -91
2177i1LJ2j83m3O8k6J32J13O5P3P7J08j36R3J8k2j46q0o3p8L0j43k6O9L6P9O2
$$ -91 -88 -76 -259 -302 -234 -260 -128 -15 50 123 200 308 172 265 283 261 115 35 -28 -106 -76 -219 -245 -176 -140 -61 1
2204AN8J85j21J15r5J5o2m7L9%m9j98K4j07j0m7J79KK35J1N9r5N8J15q6N4j12
$$ 1 59 244 123 238 143 158 96 49 88 88 39 -159 -135 -242 -252 -299 -120 -118 117 128 187 92 150 265 179 233 121
2231A21j17k1q0m3j33Q2Q7q6J66l4J16J41J4P0m4l6n7J1k43J93j59J1q9j64n5
$$ 121 4 -17 -97 -140 -273 -191 -104 -190 -24 -58 58 199 213 283 239 203 146 157 -86 107 -52 -41 -130 -294 -349
2256c49Q1R0J74M6K10j9j91J80r7J05o4l6o2j72j13j09J72j88K35L9L9m5P6J93
$$ -349 -268 -178 -4 42 252 233 42 222 125 230 166 130 68 -104 -217 -326 -154 -342 -107 -68 -29 -74 2 195
2280A95R8J24q5j28j96O8M6m1j14j13j06pj38k5K44K38P7J71p1q1RM8R7K0p9r3
$$ 195 293 417 332 204 8 76 122 81 -33 -146 -252 -259 -397 -422 -178 60 137 308 237 156 165 213 310 330 251 158
2306A58l05j33L7q8R7K26L4N1k07PK30J34K01m0j59r5n5k80J36l8L7r3%j35nR2
$$ 158 -147 -280 -243 -331 -234 -8 26 77 -130 -123 107 241 442 402 243 148 93 -187 -51 -89 -52 -145 -145 -280 -285 -193
2332a93K42J27K30j31k3o3q1m3N7O7j40j61j56k4N9O2m5J83N0p1K3L2K52J53J35
$$ -193 49 176 406 275 252 189 108 65 122 189 49 -112 -268 -292 -233 -171 -216 -33 17 -54 -31 1 253 406 541
2357E41j90j55k62j03kJ7J29n8o8j55n8N2J23L88M9O8nj7j84l8l2N3j22k21qj62
$$ 541 351 196 -66 -169 -171 -154 -25 -83 -151 -306 -364 -312 -189 199 248 316 311 294 110 72 40 93 -29 -250 -258 -420
2383d20q9K33J64J27K5n5J08k7Q3J85O2j23r6j36j65j3k1m1L1j0j53K1J79J15
$$ -420 -509 -276 -112 15 40 -15 93 66 149 334 396 273 177 41 -124 -137 -158 -199 -168 -178 -331 -310 -131 -16
2407a6L07rL4J81k64j27L8j44Q9l1k63r7rm1J10K20K9m0P4N7N2L7K08pK1k37j34
$$ -16 291 282 316 497 233 106 144 0 89 58 -205 -302 -311 -352 -242 -22 7 -33 41 98 150 187 395 388 409 172 38
2434C8l25LJ9P5r2N9J5JR8K6L21j9J40j8k67oP0Mk6m3m13lj02O4P4K14J49qq8
$$ 38 -287 -284 -265 -190 -282 -223 -208 -207 -109 -83 238 219 359 341 74 68 138 142 116 73 -340 -343 -445 -381 -307 -93 56 48 -40
2463d0J25PJ96K2l3o5n3j45j92r8J9R4j9kj25P7J19J78J72Q2J42n5k70n3j17P3
$$ -40 85 92 288 310 277 212 159 14 -178 -276 -257 -163 -182 -184 -309 -232 -113 65 237 319 461 406 136 83 -34 39
2489C9P1j28j13k12o0K6M6K66J96M8l6j16J72L7N1J14m6k69q3k16l4q7J31K8o
$$ 39 110 -18 -131 -343 -403 -377 -331 -65 131 179 143 27 199 236 287 401 355 86 3 -213 -247 -334 -203 -175 -181
2514a81Rk4MJ96J47K78N5j34k21N9r8l9k4P1k98k31n9J05O7K76J47R5nj8n9P1
$$ -181 -172 -196 -192 4 151 429 484 350 129 188 90 51 27 98 -200 -431 -490 -385 -318 -42 105 200 195 177 118 189
2540A89J83M0o1j78j86k60j40J15K5N1nj6K8N4J90J61J92Q8K3j8k20l01k3L4L0
$$ 189 372 412 351 173 -13 -273 -413 -298 -273 -222 -227 -243 -215 -161 29 190 382 470 493 475 255 -46 -69 -35 -5
2565ek12L2r9j18nL00R9K39R4n5o0o6P9M1L8%l61j85j09j28M4K94k6Q2j7M7j6
$$ -5 -217 -185 -284 -402 -407 -107 -8 231 325 270 210 144 223 264 302 302 -59 -244 -353 -481 -437 -143 -169 -87 -104 -57 -73
2592g3L38J35J31j7k39k32m3o2j13R5j45r0n7j35J03K18L58M3N3MJ2Ln6o7K8P8
$$ -73 265 400 531 514 275 43 0 -62 -175 -80 -225 -315 -372 -507 -404 -186 172 215 268 272 284 287 231 164 192 270
2618B70j51k30k28j44J82M3J15J73L3o0N5J11J08P2J47j66j77k65k5N9J11j5k64
$$ 270 119 -111 -339 -483 -301 -258 -143 30 63 3 58 169 277 349 496 330 153 -112 -137 -78 33 18 -246
2641b46ko8j42K53K21N9P8J27k7kJ34o8j93r0j72m8l5j63N7J11Q9P2P8j73M11
$$ -246 -248 -316 -458 -205 16 75 153 280 253 251 385 317 124 34 -138 -186 -221 -384 -327 -216 -127 -55 23 -150 261
2666B61j9m7J47O7r6j68j40o6n0r9p4J04j08q4OK18J56K30j4J95o3p0j34K9j18
$$ 261 242 195 342 409 313 145 5 -61 -111 -210 -284 -180 -288 -372 -366 -148 8 238 224 419 356 286 152 181 63
2691F3O0j81j82o1m7Q6M4J22K4J5P3R3J49L7J38j70J06l13o5j30j26J60m3Qp7
$$ 63 123 -58 -240 -301 -348 -262 -218 -96 -72 -57 16 109 258 295 433 263 369 56 -9 -139 -265 -105 -148 -140 -217
2716b17m0n9L78N2P8J00j15J08j56r0O2j3l0k10j83n3r3J23J26J68PK6J12%l1
$$ -217 -257 -316 62 114 192 292 177 285 129 39 101 88 58 -152 -335 -388 -481 -358 -232 -64 -57 -31 81 81 50
2741E0K28M7J24j80k34j54r4K7J14k6J8j74J4K3J09J29K19O5P4j41j9k8M7j09
$$ 50 278 325 449 269 35 -119 -213 -186 -72 -98 -80 -254 -240 -217 -108 21 240 305 379 238 219 191 238 129
2765A29n4Km18p4l4L8J58K42J66j35Q8l8R4P0J32R0r6l17k17p4l1l6Q7L3k3r6
$$ 129 75 77 -341 -415 -449 -411 -253 -11 155 20 108 70 164 234 366 456 360 43 -174 -248 -279 -315 -228 -195 -218 -314
2791c14l4K18K23K77K29pj70j40k45m5L0L8q2j06l73J3j21M39J90J08J60o0j19
$$ -314 -348 -130 93 370 599 592 422 282 37 -8 22 60 -22 -128 -501 -488 -609 -170 20 128 288 228 109
2814A09J37k5J60O7l1l39l51j23n9K00J04L7k0m6P0j0K02K41J78R3k17k74j55
$$ 109 246 221 381 448 417 78 -273 -396 -455 -255 -151 -114 -134 -180 -110 -120 82 323 501 594 377 103 -52
2837e2j50L00Pk78o5j69j45P6O3L75K06J54O4q9k57K08M6J56k12k8k30k54k41
$$ -52 -202 98 105 -173 -238 -407 -552 -476 -413 -38 168 322 386 297 40 248 294 450 238 210 -20 -274 -515
2860e15J35J34O7kJ19j19n4K36K28L28j2K7k72k55j62M2p9J61j80k53j83R1Q0
$$ -515 -380 -246 -179 -181 -62 -181 -235 1 229 557 545 572 300 45 -117 -75 -154 7 -173 -426 -609 -518 -438
2883d38K28K01K69J13P7k72J02R2J8j12j24j64k58k48j3lL02J51R5o8q8P2L99
$$ -438 -210 -9 260 373 450 178 280 372 390 278 154 -10 -268 -516 -529 -532 -230 -79 16 -52 -140 -68 331
2906C31J39K36k43j84j76j94j20K6k9j6p3r4j24K53J95K58J91n4O9k56J32j62
$$ 331 470 706 463 279 103 -91 -211 -185 -214 -230 -303 -397 -521 -268 -73 185 376 322 391 135 267 105
2928A05J66j26j6j88k98j03M7M7K45m6O7J95j5j6R8M15j74J04k78j76k13p3P3
$$ 105 271 145 129 -59 -357 -460 -413 -366 -121 -167 -100 95 80 64 162 577 403 507 229 53 -160 -233 -160
2951a60J14j16j07n6j45L3K01L25K36P2n9j91J72j61J43j1p4l27k18j09lN0J22
$$ -160 -46 -162 -269 -325 -470 -437 -236 89 325 397 338 147 319 158 301 290 216 -111 -329 -438 -441 -391 -269
2974b69J30J69q8R2j17L42J76Q2K6q9m50j81j7k8N5j51K4j43o5k8M07L60L19q6
$$ -269 -139 30 -58 34 -83 259 435 517 543 454 4 -177 -194 -222 -167 -318 -294 -437 -502 -530 -123 237 556 470
2998D70j02j26m8J4q7N5o8k75j29k37j40K33K59O3K67j26l1R0J61J98K19q6j94
$$ 470 368 242 194 208 121 176 108 -167 -296 -533 -673 -440 -181 -118 149 23 -8 82 243 441 660 574 380
3021C80m08l31m3J01M8J67n3j30k21J48J24L29L17Q1p3j72k28p2P4J68j03j63
$$ 380 -28 -359 -402 -301 -253 -86 -139 -269 -490 -342 -218 111 428 509 436 264 36 -36 38 206 103 -60
3043f0k14k05j74K25K18K69K08j12j49o9K04J60K07r6l5k13l23k12l4J18J62M8
$$ -60 -274 -479 -653 -428 -210 59 267 155 6 -63 141 301 508 412 377 164 -159 -371 -405 -287 -125 -77
3065g7j75j78J0K36J88K92K89O9k77l56j21K1K45L1j13k41l47j09M8J95K85K19
$$ -77 -252 -430 -420 -184 4 296 585 654 377 21 -100 -79 166 197 84 -157 -504 -613 -565 -370 -85 134
3087A34J68j27q7j39K35K54R8j46k84j99k39j92P8K55R4J60k95l5n2K63J93L72
$$ 134 302 175 88 -51 184 438 536 390 106 -93 -332 -524 -446 -191 -97 63 -232 -267 -319 -56 137 509
3109E09L5L8l40k40j40J14j6Oj26k89r3j79L59K15K08K31Q9j80j65J48J22J27
$$ 509 544 582 242 2 -138 -24 -40 -34 -160 -449 -542 -721 -362 -147 61 292 381 201 36 184 306 433
3131D33q0j11m17j73oq0j6K39K94l42J20K8M8L27K57j0q7k15m6k53p6O9j8mk36
$$ 433 353 242 -175 -348 -354 -434 -450 -211 83 -259 -139 -111 -63 264 521 511 424 209 163 -90 -166 -97 -115 -119 -355
3156c55k97J66R8K37J97J14K11l2n9j87JK39p1j00k30k37j27r2R2K10K1J85q0
$$ -355 -652 -486 -388 -151 46 160 371 339 280 93 94 333 262 162 -68 -305 -432 -524 -432 -222 -201 -16 -96
3179i6o9J62K83K30J24j10k49k80l9j4j5j10j32l0n4pJ57L37Q2K01j0j82n2l2
$$ -96 -165 -3 280 510 634 524 275 -5 -44 -58 -73 -183 -315 -345 -399 -406 -249 88 170 371 361 179 127 95
3203I5k3JK21n5l66k22j66J33J22J42j54K43M2r1R4J69K55Q5K5m55q1k18J28J5
$$ 95 72 73 294 239 -127 -349 -515 -382 -260 -118 -272 -29 13 -78 16 185 440 525 550 95 14 -204 -76 -61
3227f1K5j17n1k50q8K1J64N20K37l9j96J03l0JO1Q4k02l02j91l31mK62K42J06
$$ -61 -36 -153 -204 -454 -542 -521 -357 163 400 361 165 268 238 239 300 384 182 -120 -311 -642 -646 -384 -142 -36
3251c6K1k07K5Q6L01K38J21L1k51l00r7j71L3J35J9l72o9l7J07K57L30L67K3j39
$$ -36 -15 -222 -197 -111 190 428 549 580 329 29 -68 -239 -206 -71 -52 -424 -493 -530 -423 -166 164 531 554 415
3275D15j45q3k1J22O9j17k13l33j72r1O0J93L20K3nl7P7P5J82K32n8Mm67l01j09
$$ 415 270 187 166 288 357 240 27 -306 -478 -569 -509 -316 4 27 22 -15 62 137 319 551 493 497 30 -271 -380
3300c80J13J05J51K8k76o3j72K85K25L70R7J08k39j67j32M6K48j80j63k89j99
$$ -380 -267 -162 -11 17 -259 -322 -494 -209 16 386 483 591 352 185 53 99 347 167 4 -285 -484
3321d84q8J40J74J21L84j70j01o0M1K73K08K4Lj61l94j48j56J72m2O7o8J3k17
$$ -484 -572 -432 -258 -137 247 77 -24 -84 -43 230 438 462 465 304 -90 -238 -394 -222 -264 -197 -265 -252 -469
3344d69K09J97K91K40R4q7l33l8l4P8O5j64j35l41o1k5O6K18J63L37j05j00m5
$$ -469 -260 -63 228 468 562 475 142 104 70 148 213 49 -86 -427 -488 -513 -447 -229 -66 271 166 66 21
3367B1J53K63J54k18l23j80k37j01R8R4J84m6r8j26J99R1L47K29P2L1k39k48j54
$$ 21 174 437 591 373 50 -130 -367 -468 -370 -276 -92 -138 -236 -362 -163 -72 275 504 576 607 368 120 -34
3390c4k4Q7j01j61j79o6m7J97J57L02J84rk27K0l8O4J36O0j84j96j52J8r3J33
$$ -34 -58 29 -72 -233 -412 -478 -525 -328 -171 131 315 306 79 99 61 125 261 321 137 -59 -211 -193 -286 -153
3414a53n3J22j58P3M5O5L23K12q6j26j9k37j47R5J00J19j62l20j41qR2J20K49
$$ -153 -206 -84 -242 -169 -124 -59 264 476 390 264 245 8 -139 -44 56 175 13 -307 -448 -456 -364 -244 5
3437EN2O1J71k40R8J77R3K6j98j57m50N0J7K8N7J3N9j20m2K70N1L96K4P2j56k65
$$ 5 57 118 289 49 147 324 417 443 245 88 -362 -312 -295 -267 -210 -197 -138 -258 -300 -30 21 417 441 513 357 92
3463I2k7j30m6L4r0j15r1k51K63L64J47J31J01p9J7p8M5R1p2k30o2l11j57j00
$$ 92 65 -65 -111 -77 -167 -282 -373 -624 -361 3 150 281 382 303 320 242 287 378 306 76 14 -297 -454 -554
3487e54J85R6K58j23M8k2K44P1M12j05M2l61j48k88R6m2L6P5j54q2JO7K91L02
$$ -554 -369 -273 -15 -138 -90 -112 132 203 615 510 552 191 43 -245 -149 -191 -155 -80 -234 -316 -315 -248 43 345
3511C45L8q6j16o4j61O6O6R0k6j83k69j90M4K28J67K02o7j25l8K3L3L54JJ46k33
$$ 345 383 297 181 117 -44 22 88 178 152 -31 -300 -490 -446 -218 -51 151 84 -41 -79 -56 -23 331 332 478 245
3536B45j41l24k6L7J92p6q9j01j64Q0J14M00J44K04k0l02k21J65J42m4m2O2m93
$$ 245 104 -220 -246 -209 -17 -93 -182 -283 -447 -367 -253 147 291 495 475 173 -48 117 259 215 173 235 -258
3559b58k48q1J10J86K59J11k5m7k0J38K77J58M7k02j85l66j60j12J10K24j26n0
$$ -258 -506 -587 -477 -291 -32 79 54 7 -13 125 402 560 607 405 220 -146 -306 -418 -308 -84 -210 -260
3581b60j30j34K84L51K91J33Mk36r1j69P5j49L0j30k31j60N2J6J18M06J55N7j6
$$ -260 -390 -524 -240 111 402 535 539 303 212 43 118 -31 -1 -131 -362 -522 -470 -454 -336 70 225 282 266
3604B66j38p2J72J19K24k58j56l77j44j30J02K89n3P0M8j90J60J28K55Q6Q7l05
$$ 266 128 56 228 347 571 313 157 -220 -364 -494 -392 -103 -156 -86 -38 -228 -68 60 315 401 488 183
3626A83j18r9r7R6Q6J34l78j11j79O5M3L23K95L1J25j78k14J03L0N1Q0j85j73
$$ 183 65 -34 -131 -35 51 185 -193 -304 -483 -418 -375 -52 243 274 399 221 7 110 140 191 271 86 -87
3649h7k45M5O8O1K6K3j20Q2n9K04J82J50J01M6k58r6j13k6p9L7j88Jk7r1J08J89
$$ -87 -332 -287 -219 -158 -132 -109 -229 -147 -206 -2 180 330 431 477 219 123 10 -16 -95 -58 -246 -245 -272 -363 -255 -66
3675f6J99J63M1j90j0K9J41j6kn0l08k63j13j09J74J30K01L7PJ40M9J24N5O0l2
$$ -66 133 296 337 147 137 166 307 291 289 239 -69 -332 -445 -554 -380 -250 -49 -12 -5 135 184 308 363 423 391
3700C91l33j89j5k3R6Q3k29j11J5J0Q0J55K35J21J44j81m3J7j8j59L4o7l26M7
$$ 391 58 -131 -146 -169 -73 10 -219 -330 -315 -305 -225 -70 165 286 430 249 206 223 205 46 80 13 -313 -266
3724b66p5k1J08K40R6J13k25R3j1QK44Q7J1k22k97k0j42Q4M3J01k7q1p3J97M0
$$ -266 -341 -362 -254 -14 82 195 -30 63 52 60 304 391 402 180 -117 -137 -279 -195 -152 -51 -78 -159 -232 -35 5
3749EK71o0J68j81q3q1k8O2J19r9j09k22k15k8P9L39J67l5Q4M7j65J47J53M2q8
$$ 5 276 216 384 203 120 39 11 73 192 93 -16 -238 -453 -481 -402 -63 104 69 153 200 35 182 335 377 289
3774B89j72k51j84k15K71J61rN9p8j85nK33J48L32M4q9j20k77R2J9M6k02j21r1
$$ 289 117 -134 -318 -533 -262 -101 -110 -51 -129 -314 -319 -86 62 394 438 349 229 -48 44 63 109 -93 -214 -305
3798c05m5q8J47K96K53j8K0k0m9m4J5J01Q7p6k70j89j95M9N8J56O8R1lk30K27
$$ -305 -350 -438 -291 5 258 240 260 240 191 147 162 263 350 274 4 -185 -380 -331 -273 -117 -49 42 39 -191 36
3823C6j1L50O7o7j99j75j17l2J05j58J19o9j08r7QJ91J55K62Q9m6j74j63J91J0
$$ 36 25 375 442 375 176 1 -116 -148 -43 -201 -82 -151 -259 -356 -348 -157 -2 260 349 303 129 -34 157 167
3847A67P3j00k05l46L7J19m7L73j29K33j21r5l8J90O2J49K0Qj78l86mo3J11n2
$$ 167 240 140 -65 -411 -374 -255 -302 71 -58 175 54 -41 -79 111 173 322 342 350 172 -214 -218 -281 -170 -222
3871b22O0p3o3m7K08K62J99R0j00j15k1j1j18LN0o5j25k63p2n3J91K32mK00J3
$$ -222 -162 -235 -298 -345 -137 125 324 414 314 199 178 167 49 52 102 37 -88 -351 -423 -476 -285 -53 -57 143 156
3896A56P6j21K57j45J07j53j36k77j16J4J4J70J49j61l3M4L8J40J11K44n8n2j81
$$ 156 232 111 368 223 330 177 41 -236 -352 -338 -324 -154 -5 -166 -199 -155 -117 23 134 378 320 268 87
3919H7Klj43j11J33j75k4j69L3J30K15J24M9j0o7K19k23N1J10k9k70l0j50m2R4
$$ 87 89 86 -57 -168 -35 -210 -234 -403 -370 -240 -25 99 148 138 71 290 67 118 228 199 -71 -101 -251 -293 -199
3944a99N1K3n4J2J21R4J80J43O4j22k5j27k22j6L6Q1j11k03j4lP3L5J68K34P7
$$ -199 -148 -125 -179 -167 -46 48 228 371 435 313 288 161 -61 -77 -41 40 -71 -274 -288 -291 -218 -183 -15 219 296
3969B96N3k65R7n2J66j8j41j97k86N3L8n5K15P5p8N3r2R3J67K28J12o4j90j18
$$ 296 349 84 181 129 295 277 136 -61 -347 -294 -256 -311 -96 -21 -99 -46 -138 -45 122 350 462 398 208 90
3993I0j57J04j75J8N8k05K3j25K25NK29J65P0o5Ok08n0P7J05P3j50k41k15j01
$$ 90 -67 37 -138 -120 -62 -267 -244 -369 -144 -139 90 255 325 260 266 58 8 85 190 263 113 -128 -343 -444
4017d44J55J69J74jj35K6J08l5J94K74r4j59j07k78j26k7Q5K26j31k5j36P7j2
$$ -444 -289 -120 54 53 -82 -56 52 17 211 485 391 232 125 -153 -279 -306 -221 5 -126 -151 -287 -210 -222
4040b22J73K98K12j00K9k28j53l5J09J20k29j83k16j01K64L2J66K87q0o5m7l8
$$ -222 -49 249 461 361 390 162 9 -26 83 203 -26 -209 -425 -526 -262 -230 -64 223 143 78 31 -7
4062gL53K0M3r8k26j46j29j77QK81j25m3n0J46K5J33K56K78K3j18l38j58P3Oj27
$$ -7 346 366 409 311 85 -61 -190 -367 -359 -78 -203 -246 -296 -150 -125 8 264 542 565 447 109 -49 24 30 -97
4087i7M3j65Jj89k2J93P1K56J54Q0j21Oj20J76j1M2j85k94j27o6L4R7J03N2l5
$$ -97 -54 -219 -218 -407 -429 -236 -165 91 245 325 204 210 90 266 255 297 112 -182 -309 -375 -341 -244 -141 -89 -124
4112a24RK6O8K24K09K0o8j46k00m2j29J51m0j10r2p0m9J30M2K36K31j3m0j04k5
$$ -124 -115 -89 -21 203 412 432 364 218 18 -24 -153 -2 -42 -152 -244 -314 -363 -233 -191 45 276 263 223 119 94
4137I4J40R0m9j34k09j54j54q2R4J76KR7o1J83n7K52J26J45p9j19j16k22j13J16
$$ 94 234 324 275 141 -68 -222 -376 -458 -364 -188 -186 -89 -150 33 -24 228 354 499 420 301 185 -37 -150 -34
4161c4m7j79k6o0q2J40J23K14J80P5J2j24R5j35P5j39qk03j22j68J4M4K08J22
$$ -34 -81 -260 -286 -346 -428 -288 -165 49 229 304 316 192 287 152 227 88 80 -123 -245 -413 -399 -355 -147 -25
4185b5k1%J24J13J57kJ00M8k99k27j25Rk39J78p1R6j60J9J98J54J38M0K35p0n5
$$ -25 -46 -46 78 191 348 346 446 494 195 -32 -157 -148 -387 -209 -280 -184 -344 -325 -127 27 165 205 440 370 315
4210C15j61n2n9Q9j08k15n1k36J00K4K28J93l7R4n4P2P1J80j00J5k28k8j01j6
$$ 315 154 102 43 132 24 -191 -242 -478 -378 -354 -126 67 30 124 70 142 213 393 293 308 80 52 -49 -65
4234f5j84J93m8o7l7r5Q6J60K53J92K2k39O6r9o4r0K11q7j56l38j31Q2Q7J64K83
$$ -65 -249 -56 -104 -171 -208 -303 -217 -57 196 388 410 171 237 138 74 -16 195 108 -48 -386 -517 -435 -348 -184 99
4259I9Qn8P3r7J72P8K4J61j94k47k54j21Q5n7KJ33o3M8lJ46K32L29j17k1j38j44
$$ 99 107 49 122 25 197 275 299 460 266 19 -235 -356 -271 -328 -326 -193 -256 -208 -211 -65 167 496 379 358 220 76
4285G6j12%N9lj55j64j43j03J23L21J73J93Q8l4o7m8q7J56k3pk55k92p4q7K50
$$ 76 -36 -36 23 20 -135 -299 -442 -545 -422 -101 72 265 353 319 252 204 117 273 250 243 -12 -304 -378 -465 -215
4310b15J46k5N0j27J30n0J60L86P2j04j28j18j81l7j57R8q8j92P4p5K14kJ43K31
$$ -215 -69 -94 -44 -171 -41 -91 69 455 527 423 295 177 -4 -41 -198 -100 -188 -380 -306 -381 -167 -169 -26 205
4334B05J23r9j13J36j33P7R4j21j12l31j43m1K5K25P5m7k2J86P1Q6J94L0m8P0
$$ 205 328 229 116 252 119 196 290 169 57 -274 -417 -458 -433 -208 -133 -180 -202 -16 55 141 335 365 317 387
4358C87k55q5j80j54N6J5k7j0j56O1M3K42L57K0O4n5NK1j20l4j45n1k59j02j25
$$ 387 132 47 -133 -287 -231 -216 -243 -253 -409 -348 -305 -63 294 314 378 323 328 349 229 195 50 -1 -260 -362 -487
4383d87J2J13L13J73M2r9J2N3J43K35k0o2j98k89j35Qk14J16L3j36J87j01J90
$$ -487 -475 -362 -49 124 166 67 79 132 275 510 490 428 230 -59 -194 -186 -400 -284 -251 -387 -200 -301 -111
4406a11J73J85P0J40j39r3j80Q8r8Rr8j97m6j03p5J43J31J66K3J30R3R1l8R0J3
$$ -111 62 247 317 457 318 225 45 133 35 44 -54 -251 -297 -400 -475 -332 -201 -35 -12 118 211 302 264 354 367
4431C67l6k51j44k37m9K3Q7j9J63o0L6K6J47K12L37j43j30m4p4j49J64k83q3j31
$$ 367 331 80 -64 -301 -350 -327 -240 -259 -96 -156 -120 -94 53 265 602 459 329 285 211 62 226 -57 -140 -271
4455b71jj16l8J76J66K52nj8m5J43N1P3j05J40l05j08k67o3j21J96k8n6J78K4
$$ -271 -272 -388 -426 -250 -84 168 163 145 100 243 294 367 262 402 97 -11 -278 -341 -462 -266 -294 -350 -172 -148
4479a48O7K23K19J12j0j5k51n4p6n8q6p7j11j29j16M0K01Q5L03J78q1j9K9J10
$$ -148 -81 142 361 473 463 448 197 143 67 9 -77 -154 -265 -394 -510 -470 -269 -184 119 297 216 197 226 336
4503C36k8M9k70K4k77k13m3K5R0J36l5R6Q0K2J14K46J60j3r1j94q3j71o6J5p6
$$ 336 308 357 87 111 -166 -379 -422 -397 -307 -171 -206 -110 -30 -8 106 352 512 499 408 214 131 -40 -106 -91 -167
4528a67P8k85n1Q9J00K13J66jK80j85jm8L0J0n6m1l11j22k19L8LL54K8M9j4O0
$$ -167 -89 -374 -425 -336 -236 -23 143 142 422 237 236 188 218 228 172 131 -180 -302 -521 -483 -480 -126 -98 -49 -63 -3
4554cJ33J1K65J2p8q2k44j8j98j07K21j45n2l1j51P8K61K96J07J19J05j77j08
$$ -3 130 141 406 418 340 258 14 -4 -202 -309 -88 -233 -285 -316 -467 -389 -128 168 275 394 499 322 214
4577B14l4p1J52j79k10k25p9q9J13K38P9K68q7r4J53o8L40L1o1o2k53l09j10J9
$$ 214 180 109 261 82 -128 -353 -432 -521 -408 -170 -91 177 90 -4 149 81 421 452 391 329 76 -233 -343 -324
4601c24N0j33L6K8J17J02J01J54K27O9n0m9j27j01r1M9q1j15j00q7p2Q9R9J96
$$ -324 -274 -407 -371 -343 -226 -124 -23 131 358 427 377 328 201 100 9 58 -23 -138 -238 -325 -397 -308 -209 -13
4625a3K5K05q9QJ09Q5k4J15k36j23j91k1k12p5J45L4J36j67J20L2J80K98J20J3
$$ -13 12 217 128 136 245 330 306 421 185 62 -129 -150 -362 -437 -292 -258 -122 -289 -169 -137 43 341 461 474
4649D74o2k69Q9k39o9%q0j94L6p2O7J57J75M0J50m3Q8l1p4J09r4J02k40j84j55
$$ 474 412 143 232 -7 -76 -76 -156 -350 -314 -386 -319 -162 13 53 203 160 248 217 143 252 158 260 20 -164 -319
4674c19q6l8J64MJ75j11J3K64O6K11j6O1k6k08j27J9Pj58l8q8j47Q6j1J31N3K09
$$ -319 -405 -443 -279 -275 -100 -211 -198 66 132 343 327 388 362 154 27 46 53 -105 -143 -231 -378 -292 -303 -172 -119 90
4700I0J66m3q8J26j49J46j7pl14oj55j18Q1l7J79j17P2P2K59p0K56R4j20M1p5
$$ 90 256 213 125 251 102 248 231 224 -90 -96 -251 -369 -288 -325 -146 -263 -191 -119 140 70 326 420 300 341 266
4725B66j93j43K0q0J4j13j13N4j9L8K07K19M5K4Q8j21N2j8K3j61j23j64l8j9q2
$$ 266 73 -70 -50 -130 -116 -229 -342 -288 -307 -269 -62 157 202 226 314 193 245 227 250 89 -34 -198 -236 -255 -337
4750c37J65K9K1K2J18O7O1R9J26o5k3o5k43j17l5J29k40J11k67O8J73L5P5L58
$$ -337 -172 -143 -122 -100 18 85 146 245 371 306 283 218 -25 -142 -177 -48 -288 -177 -444 -376 -203 -168 -93 265
4774B65Q2k5n3j15J5r4J7j73r4j4j01K2k36K98J48J38Ql4J63Ml8Q8J50k36o9j72
$$ 265 347 322 269 154 169 75 92 -81 -175 -189 -290 -268 -504 -206 -58 80 88 54 217 221 183 271 421 185 116 -56
4800e6j07j50J32j09J27L1J27j75O3J84J02J53j38J54j05j7j54j52K64j54j84
$$ -56 -163 -313 -181 -290 -163 -132 -5 -180 -117 67 169 322 184 338 233 216 62 -90 174 20 -164
4821a64k3j73N5J9K12jK19J7P6j10P8J21m6j17J12k62j84j28l3J15O0m2J1m4J62
$$ -164 -187 -360 -305 -286 -74 -75 144 161 237 127 205 326 280 163 275 13 -171 -299 -332 -217 -157 -199 -188 -232 -70
4846g0J79k4J87M2j1Nk90R9j07n9j15j01J03j63m4J43KK44M4J30K3n9O7O4j06
$$ -70 109 85 272 314 303 308 18 117 10 -49 -164 -265 -162 -325 -369 -226 -224 20 64 194 217 158 225 289 183
4871A83M5j01j41j75j52M1P1o5J01J03pj7J53J41K08J6r6o8j98J4q2N9j65p1Q8
$$ 183 228 127 -14 -189 -341 -300 -229 -294 -193 -90 -97 -114 39 180 388 404 308 240 42 56 -26 33 -132 -203 -115
4896a15j16n7K44n8J38J04Q0o0Ol0O1k9m7j21p3k4k30J33l6oJ37M6M0J1J38j06
$$ -115 -231 -288 -44 -102 36 140 220 160 166 136 197 168 121 0 -73 -97 -327 -194 -230 -236 -99 -53 -13 -2 136 30
4922C0J56J30P8k18l5r2j14m0k3k4j12m9J56kJ41N3J09J00m5K8n2k3j0K7j86O
$$ 30 186 316 394 176 141 49 -65 -105 -128 -152 -264 -313 -157 -159 -18 35 144 244 199 227 175 152 142 169 -17 -11
4948a1j77m4p2M8M7Q8L4J04Q6M8Q8ro2R2J02l10j50K8rq8M3q7j38J59m0J68Q1
$$ -11 -188 -232 -304 -256 -209 -121 -87 17 103 151 239 230 168 260 362 52 -98 -70 -79 -167 -124 -211 -349 -190 -230 -62 19
4975A9L1J70Q0q4M1j81J60j95R9j63j82P3j79J63N4p6J29n8J09P3J64l5K4M2p0
$$ 19 50 220 300 216 257 76 236 41 140 -23 -205 -132 -311 -148 -94 -170 -41 -99 10 83 247 212 236 278 208
5000B08r9k8k87L6O4J0j08m1J51JJ9J30L0O2P2r3J1J2j17J15j36j13M4j75o0J4
$$ 208 109 81 -206 -170 -106 -96 -204 -245 -94 -93 -74 56 86 148 220 127 138 150 33 148 12 -101 -57 -232 -292 -278
5026b78J44J16o7J84k7j7R4J66l1p7o0n2j08j15n5JL5N4o1n2K10j51J38K04P0
$$ -278 -134 -18 -85 99 72 55 149 315 284 207 147 95 -13 -128 -183 -182 -147 -93 -154 -206 4 -147 -9 195 265
5051B65j17k6P2j33K4k8j88p4P9j71K1J6J22J6K16K1l3O3l3N0K9K4j0k75R4j85
$$ 265 148 122 194 61 85 57 -131 -205 -126 -297 -276 -260 -138 -122 94 115 82 145 112 162 191 215 205 -70 24 -161
5077a61j7rO3j2Q4q0m7J42R2J91p4LJ68k17K1j51j18J14q5p1j7k9Q1o0J33N1P2
$$ -161 -178 -187 -124 -136 -52 -132 -179 -37 55 246 172 175 343 126 147 -4 -122 -8 -93 -164 -181 -210 -129 -189 -56 -5 67
5104F7M7O3j19Q0j8L4o5Kj31j97J42o0N0l6j3L8Q3P2K9O5R9J4Jq8p1o4J0j1j21
$$ 67 114 177 58 138 120 154 89 91 -40 -237 -95 -155 -105 -141 -154 -116 -33 39 68 133 232 246 247 159 88 24 34 23 -98
5133i8m6N4Qj68J10N9J24P4Q3l8l9M7jN6o4j95p4r3j2M7K6K5M3J4M2N0N9K8R5
$$ -98 -144 -90 -82 -250 -140 -81 43 117 200 162 123 170 169 225 161 -34 -108 -201 -213 -166 -140 -115 -72 -58 -16 34 93 121 216
5162B16m3m6O4j59j19J00o9n8L3P2j40l3%K29M9j61L34m9l3j82K53j88p7Nn6q7
$$ 216 173 127 191 32 -87 13 -56 -114 -81 -9 -149 -182 -182 47 96 -65 269 220 187 5 258 70 -7 -2 -58 -145
5188a45j16J34m4L0P9RnJ48N5P8O4j05K3o8pj68n7N2r3k3j12l5O7J61R7P2pJ21
$$ -145 -261 -127 -171 -141 -62 -53 -58 90 145 223 287 182 205 137 130 -38 -95 -43 -136 -159 -271 -306 -239 -78 19 91 84 205
5216B05k3Q8k16J9O5j03j64p8J22o6j02OJ51M8nP8O3J56o7K6m4l2M8j50r4oj34
$$ 205 182 270 54 73 138 35 -129 -207 -85 -151 -253 -247 -96 -48 -53 25 88 244 177 203 159 127 175 25 -69 -75 -209
5243b09oPLR8jK7R6J51j50J49j2%L4j85J10q8L1k08J6q1j5J07L1N1l3J05l9J02
$$ -209 -215 -208 -205 -107 -108 -81 15 166 16 165 153 153 187 2 112 24 55 -153 -137 -218 -233 -126 -95 -44 -77 28 -11 91
5271I1J6Q9m1P5j68k1J3l30J83Jl9j3k1J04q8J58P4Q5O3j3J8j01j38Q6n1q2r1
$$ 91 107 196 155 230 62 41 54 -276 -93 -92 -131 -144 -165 -61 -149 9 83 168 231 218 236 135 -3 83 32 -50 -141
5298a41mo9O8J5M0J12l8k1J97o4K2M7N7p7r7j61Q4J0j26j5p3P4j9J33m1P1JJ22
$$ -141 -145 -214 -146 -131 -91 21 -17 -38 159 95 117 164 221 144 47 -114 -30 -20 -146 -161 -234 -160 -179 -46 -87 -16 -15 107
5326A07Q2K4l7j61N6r3l3N8j35M4k15J13J02J35J7M6NO3j01P4K05j39lrk15m2
$$ 107 189 213 176 15 71 -22 -55 3 -132 -88 -303 -190 -88 47 64 110 115 178 77 151 356 217 214 205 -10 -52
5352e2j04m1O1m0%L6N5P0L7J46j4n3J55j70l5km4J81k28p9k4j14M0R9NO1J70J94
$$ -52 -156 -197 -136 -176 -176 -140 -85 -15 22 168 154 101 256 86 51 49 5 186 -42 -121 -145 -259 -219 -120 -115 -54 116 310
5380C10j99Oq2Q4J89k26n8j1j25k7o8J5l8J63pN0J39nJ72k85J11Q6n8j10r1R9
$$ 310 111 117 35 119 308 82 24 13 -112 -139 -207 -192 -230 -67 -74 -24 115 110 282 -3 108 194 136 26 -65 34
5406C4j05m8j60K06j34rL0P8J71j5J04J1M7o1n2j10qN6j84J31j71j10J17O2J08
$$ 34 -71 -119 -279 -73 -207 -216 -186 -108 63 48 152 163 210 149 97 -13 -21 35 -149 -18 -189 -299 -182 -120 -12
5431a2j39n0K62n1L0N2L0O3n4j39n9m6O3p2k1n3P1O8pM9rR4J5J18j07Q3n8j5o5
$$ -12 -151 -201 61 10 40 92 122 185 131 -8 -67 -113 -50 -122 -143 -196 -125 -57 -64 -15 -24 70 85 203 96 179 121 106 41
5460D1r9rL2j87K2M6J10M4o0J00j1J41k0oN1M2p9j08n3k9j21pP1l2K9J8N1m6O1
$$ 41 -58 -67 -35 -222 -200 -154 -44 0 -60 40 29 170 150 144 195 237 158 50 -3 -32 -153 -160 -89 -121 -92 -74 -23 -69 -8
5489hJ64N3q5J4rj09R4l6k1j03k01J39ML7r8LN5Q2Q4K5K8O7j9o6N9n7j76M8j27
$$ -8 156 209 124 138 129 20 114 78 57 -46 -247 -108 -104 -67 -165 -162 -107 -25 59 84 112 179 160 94 153 96 -80 -32 -159
5518a59j3j8L4o3P2Q3N8J14o3J11J46j65K5q3r7k0l2j2n6J05k10K5J01n7K37m3
$$ -159 -172 -190 -156 -219 -147 -64 -6 108 45 156 302 137 162 79 -18 -38 -70 -82 -138 -33 -243 -218 -117 -174 63 20
5544B0J7R8q7L3P3O6r6q2p7kj50Q3r1Q9O3L3M8p4J10K6J22q8K0O1l0j29j10Jj1
$$ 20 37 135 48 81 154 220 124 42 -35 -37 -187 -104 -195 -106 -43 -10 38 -36 74 100 222 134 154 215 185 56 -54 -53 -64
5573f4j47N5J54j68K11n1kJ31q3R1l1LJ07r6p1J21l11o1K9P7o9J66o9j7L3R8K0
$$ -64 -211 -156 -2 -170 41 -10 -12 119 36 127 96 99 206 110 39 160 -151 -212 -183 -106 -175 -9 -78 -95 -62 36 56
5600E6J39K3o9J6j05Nj8n1L4k15J09p0L6m4Q8LK37j0n7Pj02P8Q9J4j51Lj02J7
$$ 56 195 218 149 165 60 65 47 -4 30 -185 -76 -146 -110 -154 -66 -63 174 164 107 114 12 90 179 193 42 45 -57 -40
5628d0j18m7J32L5kr2K11q0K3O4PJ16j01R4j68K4k15J00o2o4M4N5p5R2O9k3J76
$$ -40 -158 -205 -73 -38 -40 -132 79 -1 22 86 93 209 108 202 34 58 -157 -57 -119 -183 -139 -84 -159 -67 2 -21 155
5655A55L8j38M7K9J9r4L9l7j33o8k3L9L1k4N6m7J46RRR1P8j26O4j4j98N4lj81
$$ 155 193 55 102 131 150 56 95 58 -75 -143 -166 -127 -96 -120 -64 -111 35 44 53 144 222 96 160 146 -52 2 -1 -182
5683a82N8J6N9j24k8J45o5K21L0l8p2J65n2o4J19p7p2n4j32K6j01J6K30k00O4
$$ -182 -124 -108 -49 -173 -201 -56 -121 100 130 92 20 185 133 69 188 111 39 -15 -147 -121 -222 -206 24 -176 -112
5708a12M9J47L7r1J30N3O8j75m0j63M5m5M1P7o4j95J17j8P0N1N2L7OO1j20p2J89
$$ -112 -63 84 121 30 160 213 281 106 66 -97 -52 -97 -56 21 -43 -238 -121 -139 -69 -18 34 71 77 138 18 -54 135
5735A35Jj15J02k76pl6%J24j01J79J05k22J57MK5Q6L1j09J00k59J13Kj13m4L7
$$ 135 136 21 123 -153 -160 -196 -196 -72 -173 6 111 -111 46 50 75 161 192 83 183 -76 37 39 -74 -118 -81
5760h1j42J29J03l4P7K6N6o7R4L1p2m9m2M7j49m2Qj05J30o6M3Q3j28mK04j0Q7
$$ -81 -223 -94 9 -25 52 78 134 67 161 192 120 71 29 76 -73 -115 -107 -212 -82 -148 -105 -22 -150 -154 50 40 127
5787A27O1K4j5j55l7j36J2J62j41L8j2j33J41M3N2J60k6p5O3j27O1q5J40q0j07
$$ 127 188 212 197 42 5 -131 -119 43 -98 -60 -72 -205 -64 -21 31 191 165 90 153 26 87 2 142 62 -45
5812d5n4J11j13j1J09p4J4J46r2MJ01L2K0L3n6j14l2j04j4O2q8nM9P8o5J40j07
$$ -45 -99 12 -101 -112 -3 -77 -63 83 -9 -5 96 128 148 181 125 11 -21 -125 -139 -77 -165 -170 -121 -43 -108 32 -75
5839g5K02P9r4l5j7k2%O6j24K1j23R1j62J4m5J41M4J41n7R9k9K4q8J01Nj13l6
$$ -75 127 206 112 77 60 38 38 104 -20 1 -122 -31 -193 -179 -224 -83 -39 102 45 144 115 139 51 152 157 44 8
5866Hj76m4qJ48p9J9M5n1P8O6J45nJn0k4l3p9M5J3O6j20k05R6p7J53kq8K77j39
$$ 8 -168 -212 -220 -72 -151 -132 -87 -138 -60 6 151 146 147 97 73 40 -39 6 19 85 -35 -240 -144 -221 -68 -70 -158 119 -20
5895b0K80j76J22n8K9r3k2o1lj89L9L5j42J70J1N7K0J07M2K4J16j15r3L9K6n1
$$ -20 260 84 206 148 177 84 62 1 -2 -191 -152 -117 -259 -89 -78 -21 -1 106 148 172 288 173 80 119 145 94
5921I4j74n9p9N9o5N7k4J95n0J21m6P1nJ18n8j7q5o8N4j69n5L2N4n7P5K3p1O0
$$ 94 -80 -139 -218 -159 -224 -167 -191 4 -46 75 29 100 95 213 155 138 53 -15 39 -130 -185 -153 -99 -156 -81 -58 -129 -69
5949f9J23m1J81po1ro7J9j04J09j21j18J0pP5m7J18%M1J41j31J70M5j50J30j37
$$ -69 54 13 194 187 126 117 50 69 -35 74 -47 -165 -155 -162 -87 -134 -16 -16 25 166 35 205 250 100 230 93
5975I3o3p1p0R5j40N9k9k2R6o8J57Q9L9p9J19k9k6k58J69%n9j43J8J8q1P3q7J53
$$ 93 30 -41 -111 -16 -156 -97 -126 -148 -52 -120 37 126 165 86 205 176 150 -108 61 61 2 -141 -123 -105 -186 -113 -200 -47
6003d7J41lK17k09j2rO1J32j03q1j03j17l7n5K13j91J60mk1J39q8J30J6O8M2r8
$$ -47 94 91 308 99 87 78 139 271 168 87 -16 -133 -170 -225 -12 -203 -43 -47 -68 71 -17 113 129 197 239 141
6029A41N1j42l7o9J06j97Q1n6m4Q7R2l1J00Q2m1J75k45P0o3Kp8l3j75N1k4J16
$$ 141 192 50 13 -56 50 -147 -66 -122 -166 -79 13 -18 82 164 123 298 53 123 60 62 -16 -49 -224 -173 -197 -81
6055h1j11J25J4N2Q6j45K56r1J10j00j6K2j23o8l6RN0p7j4k0K8K3J61K8O9Ml2
$$ -81 -192 -67 -53 -1 85 -60 196 105 215 115 99 121 -2 -70 -106 -97 -47 -124 -138 -158 -130 -107 54 82 151 155 123
6082A23l9l6M4l5N7k40J8j16J7J28j11J53O9p7J51l1Q6M7n0j5J14j76o9q3r8L7
$$ 123 84 48 92 57 114 -126 -108 -224 -207 -79 -190 -37 32 -45 106 75 161 208 158 143 257 81 12 -71 -169 -132
6108a32k5N6K0j31J48J5O0K6J18N4j39M5q0L8j05P6r4n2n0l4N8R4k6mJ57o2O9
$$ -132 -157 -101 -81 -212 -64 -49 11 37 155 209 70 115 35 73 -32 44 -50 -102 -152 -186 -128 -34 -60 -64 93 31 100
6135A00J23j46K29j53q4p1o9r2K4O3j17M0l3J33j5L7N5O0k8J46j3K0j57J9l5Q8
$$ 100 223 77 306 153 69 -2 -71 -163 -139 -76 -193 -153 -186 -53 -68 -31 24 84 56 202 189 209 52 71 36 124
6161A24m8n9j68m7jJ29L0N2J47k4k9M8J32j17M6j42j13P7l6j44o2L6K8q0Q4PJ33
$$ 124 76 17 -151 -198 -199 -70 -40 12 159 135 106 154 286 169 215 73 -40 37 1 -143 -205 -169 -141 -221 -137 -130 3
6188CR8L9J7O0j22jP7k07n7k0K40k51k7J3r1J11J37Qr1oK04j16J26Qkj2J1k89
$$ 3 101 140 157 217 95 94 171 -36 -93 -113 127 -124 -151 -138 -229 -118 19 27 -64 -70 134 18 144 152 150 138 149 -140
6216a40j09%J28j4J29Jp9Q9P7l0P7J61j29j28M5o2j43J7K08k01O3j82qP5P2PJ19
$$ -140 -249 -249 -121 -135 -6 -5 -84 5 82 52 129 290 161 33 78 16 -127 -110 98 -103 -40 -222 -230 -155 -83 -76 43
6243D3O7N5K8j59N4nJr0Qj91M0Q6n0qm6Q6j8R8o6J48OL3k3K49k08p5k0m9n2k4
$$ 43 110 165 193 34 88 83 84 -6 2 -189 -149 -63 -113 -121 -167 -81 -99 -1 -67 81 87 120 97 346 138 63 43 -6 -58 -82
6273h2n2k6M2n6J77j1j5K03R9j98K3j61J50p4O7j62N4m2q9njJ81p7L3o4N5R8L
$$ -82 -134 -160 -118 -174 3 -8 -23 180 279 81 104 -57 93 19 86 -76 -22 -64 -153 -158 -159 22 -55 -22 -86 -31 67 70
6301G0J8J37j16j81J64j39j5m8J8Q5j32Q2j45J57k4N6J18K5n8M2p3O1k2j09O6
$$ 70 88 225 109 -72 92 -47 -62 -110 -92 -7 -139 -57 -202 -45 -69 -13 105 130 72 114 41 102 80 -29 37
6326C7j85O1Pl2MJ07o2J47J0N1j54M1Q9Q9j20J1q9j03N6K3q3J08l9j37m1R5K2
$$ 37 -148 -87 -80 -112 -108 -1 -63 84 94 145 -9 32 121 210 90 101 12 -91 -35 -12 -95 13 -26 -163 -204 -109 -87
6353h7J28K8L9L4m1K2j84J35l1j60P1p2R4n1r7J78m8P8N9k1P1N4m0j1l3p3l3j23
$$ -87 41 69 108 142 101 123 -61 74 43 -117 -46 -118 -24 -75 -172 6 -42 36 95 74 145 199 159 148 115 42 9 -114
6381a14j7k5l9J36j1nJ3J27j41J89j0o9J76k15K00j55p0k1q4j1R4r2R6K8P4q3
$$ -114 -131 -156 -195 -59 -70 -75 -62 65 -76 113 103 34 210 -5 195 40 -30 -51 -135 -146 -52 -144 -48 -20 54 -29
6407b9K0P9L4J4j52J24P1q3K6q7q4M0j95K00J4J3j54J03l3L1Q0J01M6j04j5n5
$$ -29 -9 70 104 118 -34 90 161 78 104 17 -67 -27 -222 -22 -8 5 -149 -46 -79 -48 32 133 179 75 60 5
6433Er2J63k4o9L8j28N4oM9j4O8Op3L1m3R9p3L9J2j12p5Q6M3r0N1M8J7Q6K2m6
$$ 5 -87 76 52 -17 21 -107 -53 -59 -10 -24 44 50 -23 8 -35 64 -9 30 42 -70 -145 -59 -16 -106 -55 -7 10 96 118 72
6463G2Q1m7J04n6l4k3Mpj16m7K02j68N5j7m6n9M9R1o3J62K5r2P8k3j12J96l41
$$ 72 153 106 210 154 120 97 101 94 -22 -69 133 -35 20 3 -43 -102 -53 38 -25 137 162 70 148 125 13 209 -132
6490a32J09N2k06J38Q1j65m6K7J00J11N7j6k3O8j35lK02k08j81M8j4N7no3R6j54
$$ -132 -23 29 -177 -39 42 -123 -169 -142 -42 69 126 110 87 155 20 17 219 11 -170 -122 -136 -79 -84 -147 -51 -205
6516b05K07M4J65p8M9q5j35M7P5m5M1m2m8l2j90O8J85M1np1Q3n9J28P8n2pn2p6
$$ -205 2 46 211 133 182 97 -38 9 84 39 80 38 -10 -42 -232 -164 21 62 57 -14 69 10 138 216 164 157 105 29
6544B9n9n7lj4Q0p8R6q3J23M7O0j43J40P7j42J5q7O4o5m5P8j11K8l1j51K12n7
$$ 29 -30 -87 -90 -104 -24 -102 -6 -89 34 81 141 -2 138 215 73 88 1 65 0 -45 33 -78 -50 -81 -232 -20 -77
6571g7P2J14l5k0N4o0O5q0L4k9j39o5J04j1J5o2J48k4m5Q8j70L30o1K0n8n5J5
$$ -77 -5 109 74 54 108 48 113 33 67 38 -101 -166 -62 -73 -58 -120 28 4 -41 47 -123 207 146 166 108 53 68
6598F8j86J39j06N3j4l8K5j1O8qM0l6J71m6n6R1j25K3N2j23m1O3J6j2l4m1R3q0
$$ 68 -118 21 -85 -32 -46 -84 -59 -70 -2 -10 30 -6 165 119 63 154 29 52 104 -19 -60 3 19 7 -27 -68 25 -55
6626e5J11k8R2o8K1J21m3j02L0j12r3N6J44j03j60R2P1N4r2Q0j0J40j2j06n2O8
$$ -55 56 28 120 52 73 194 151 49 79 -33 -126 -70 74 -29 -189 -97 -26 28 -64 16 6 146 134 28 -24 44
6652D4M8K3Lj41j24J23m2K3K5P4l7JL5m7J72j80P4J31k34j9r0R4l7O9j1j3j9J27
$$ 44 92 115 118 -23 -147 -24 -66 -43 -18 56 19 20 55 8 180 0 74 205 -29 -48 -138 -44 -81 -12 -23 -36 -55 72
6680G2j88J31K2qL1P7j30jJ27o5q5j61J67j65N6J06k0p6J88j1n5Q5l9J4J45j83
$$ 72 -116 15 37 29 60 137 7 6 133 68 -17 -178 -11 -176 -120 -14 -34 -110 78 67 12 97 58 72 217 34
6706C4lJ7j54J26K3j27j8Q2J4k4L3j16J75o7J08k9o3rKL1n4o6m1J01j2l8k8l8
$$ 34 31 48 -106 20 43 -84 -102 -20 -6 -30 3 -113 62 -5 103 74 11 2 4 35 -19 -85 -126 -25 -37 -75 -103 -141
6734a41P3J14N1n4NqQjJ11k8j52k3L9o2P3j13J42k7pL2K0k8L8m8R5ln7J3l6j56
$$ -141 -68 46 97 43 48 40 48 47 158 130 -22 -45 -6 -68 5 -108 34 7 0 32 52 24 62 14 109 106 49 62 26 -130
6764a30J50q1N1O0j32K6J5pJ22m3P1o7J12j28Om7k7Q9l7k5O2j05n0j2K6K04j00
$$ -130 20 -61 -10 50 -82 -56 -41 -48 74 31 102 35 147 19 25 -22 -49 40 3 -22 40 -65 -115 -127 -101 103 3
6791Cj7%J41j08K33j95J02n8j93K7r3P5L4M8O0p4m5Q9O6n4K0oPk6J5N6lm8r5P6
$$ 3 -14 -14 127 19 252 57 159 101 -92 -65 -158 -83 -49 -1 59 -15 -60 29 95 41 61 55 62 36 51 107 104 56 -39 37
6821C7j49K4J39j13J6LJ16J15j72J09m4N9P0j16j5l9j74L7N4M8j49R1Q9q6k5k
$$ 37 -112 -88 51 -62 -46 -43 73 188 16 125 81 140 210 94 79 40 -134 -97 -43 5 -144 -53 36 -50 -75 -77
6847g7K69j85O8R0j28Pl6p5P1j03J72j20q5L6J50j79J96N%L6k8M3m7j5j12O5o4
$$ -77 192 7 75 165 37 44 8 -67 4 -99 73 -47 -132 -96 54 -125 71 76 76 112 84 127 80 65 -47 18 -46
6874d6o8Q9j54R9r9K05k4M0m2J10L2j0J0j07o5KJ17j89n3J14q0N3j40o6L25j8
$$ -46 -114 -25 -179 -80 -179 26 2 42 0 110 142 132 142 35 -30 -28 89 -100 -153 -39 -119 -66 -206 -272 53 35
6900C5l7j3MJ14K7j74J10k7J00j24l1n3q0J3J18L9Lm5J02Llm3j4j51L41j45r8
$$ 35 -2 -15 -11 103 130 -44 66 39 139 15 -16 -69 -149 -136 -18 21 24 -21 81 84 81 38 24 -127 214 69 -29
6927b9Q2p2j0O9J9j01k8mo0J42P0jL6l6j1j25M3L2O9Mj46J2r2pK33k11J15J2K9
$$ -29 53 -19 -29 40 59 -42 -70 -74 -134 8 78 77 113 77 66 -59 -16 16 85 89 -57 -45 -137 -144 89 -122 -7 5 34
6956C4Kq2M8J69j31Q1k8ol5o8m5nk7oo3J83j7n9J62r1M8L6o9R3p3n3P3m7L8p5
$$ 34 36 -46 2 171 40 121 93 87 52 -16 -61 -66 -93 -99 -162 21 4 -55 107 16 64 100 31 124 51 -2 71 24 62 -13
6986a3j27Q1j12L2J39l0j0j3K11o5K2N6j90k4Q8p6o1jK9j0j5N3Po6J31K7n6P2
$$ -13 -140 -59 -171 -139 0 -30 -40 -53 158 93 115 171 -19 -43 45 -31 -92 -93 -64 -74 -89 -36 -29 -95 36 63 7 79
7014G9J7l6O6j53j23J54m0J2lj69J46p6J46O9n8n6J01P3k52J82Rrj16R6k0q6J
$$ 79 96 60 126 -27 -150 4 -36 -24 -27 -196 -50 -126 20 89 31 -25 76 149 -103 79 88 79 -37 59 39 -47 -46
7041d6k2m8l1J26n4J8J25Jk7J40j35m4K8J07j05k2o0J4m3n4O0j70J75P6J8K6J28
$$ -46 -68 -116 -147 -21 -75 -57 68 69 42 182 47 3 31 138 33 11 -49 -35 -78 -132 -72 -242 -67 9 27 53 181
7068A81j25k6J9O1o2P0J8q5j06Q2m9np5Q2q0J61K2mJ7oJ14k06K3l5m1K3R5r7p7
$$ 181 56 30 49 110 48 118 136 51 -55 27 -22 -27 -102 -20 -100 61 83 79 96 90 204 -2 21 -14 -55 -32 63 -34 -111
7097a11R7j73J64q7M5J89k8O8r5k3J47j57K6M5j88J64p0j92J45L7o5O7O6p9j0
$$ -111 -14 -187 -23 -110 -65 124 96 164 69 46 193 36 62 107 -81 83 13 -179 -34 3 -62 5 71 -8 -18
7122a8J68l5M2j40P4q1L0k0%Lj08O6k1O1m6n2k2J97o2J14o9p7L1K8J0j00Nr4P8
$$ -18 150 115 157 17 91 10 40 20 20 23 -85 -19 -40 21 -25 -77 -99 98 36 150 81 4 35 63 73 -27 -22 -116 -38
7151c8l9N8l5O9q9J50kj27lJ61q5L3m3j5M2R6j75o3J3k9R5l5o2M0L8Q0P7m8j9
$$ -38 -77 -19 -54 15 -74 76 74 -53 -56 105 20 53 10 -5 37 133 -42 -105 -92 -121 -26 -61 -123 -83 -45 35 112 64 45
7180D5R2n7k9L9p6O3l4nj67Q9j9J58j19p9Q7K0R9l2k3O8p9l7P3j98O0j4K2jL5
$$ 45 137 80 51 90 14 77 43 38 -129 -40 -59 99 -20 -99 -12 8 107 75 52 120 41 4 77 -121 -61 -75 -53 -54 -19
7209a9L0qM9M1o5O8J04r1k9k8L4l8l5q4lk6J05j39P8K6N6j1j0M9k2M7J20q4p9
$$ -19 11 3 52 93 28 96 200 109 80 52 86 48 13 -71 -74 -100 5 -134 -56 -30 26 15 5 54 32 79 199 115 36
7238C6q5K1oj41J79qM5o5j5L6k8k8M7J50n7J9n6J4p6L1R3jj41n9M0q2M3K5Q4J06
$$ 36 -49 -28 -34 -175 4 -4 41 -24 -39 -3 -31 -59 -12 138 81 100 44 58 -18 13 106 105 -36 -95 -55 -137 -94 -69 15 121
7268A21k65K39L8l3L3j51R4lk22J83k13J58J6m9Pp8PR1L7K54l02M5K6pk0P0lp3
$$ 121 -144 95 133 100 133 -18 76 73 -149 34 -179 -21 -5 -54 -47 -125 -118 -27 10 264 -38 7 33 26 6 76 73 0
7296@o1J08n9J7L3o2P2o7M4M8l6l1l2m1J11l1J5k07J16j2k8LJ29m4Qm8M8Ql7J62
$$ 0 -61 47 -12 5 38 -24 48 -19 25 73 37 6 -26 -67 44 13 28 -179 -63 -75 -103 -100 29 -15 -7 -55 -7 1 -36 126
7326A26jj02j3jMj03J50j30N8m1k0k5O2J00k7l3kL4P8RN0j65m9N4M0j37K1J14
$$ 126 125 23 10 9 13 -90 60 -70 -12 -53 -73 -98 -36 64 37 4 2 36 114 123 173 8 -41 13 53 -84 -63 51
7354E1q7J9n6R1N4oO1j5j5%m5lM0Kq4pl8m3l1R1J00j32M4M2K1J5N4j7o7o1P4O8
$$ 51 -36 -17 -73 18 72 66 127 112 97 97 52 49 89 91 7 0 -38 -81 -112 -21 79 -53 -9 33 54 69 123 106 39 -22 52 120
7386A20j25k5k2j8P5r7L4R1Qj8qj7J1p2P7oO2l4n8N8Pn4J09l5q7p4O1P3m8k1Q1
$$ 120 -5 -30 -52 -70 5 -92 -58 33 41 23 15 -2 9 -63 14 8 70 36 -22 36 43 -11 98 63 -24 -98 -37 36 -12 -33 48
7417D8J6o0P2j12J21j18j0L7mLj90J70J8Q2J9j05J42j62J12j15J22j03M4l7K6
$$ 48 64 4 76 -36 85 -33 -43 -6 -10 -7 -197 -27 -9 73 92 -13 129 -33 79 -36 86 -17 27 -10 16
7442A6RkJ9K8j06j5J36m4k1Q8o2K4J8k3j14J87q4Lr4R5j92J6P0l9J11j91K04o3
$$ 16 25 23 42 70 -36 -51 85 41 20 108 46 70 88 65 -49 138 54 57 -37 58 -134 -118 -48 -87 24 -167 37 -26
7470b6J5O9P2k5p0K4q6J7m3KJ30q2j76O0Q6R6l6l0M4p9P5K8O7q0N4j07p6J02n
$$ -26 -11 58 130 105 35 59 -27 -10 -53 -51 79 -3 -179 -119 -33 63 27 -3 41 -38 37 65 132 52 106 -1 -77 25 20
7499B0n5J23k49J61K6N3p4oK3L5Mj9R9j18J7J2l6l6N1n4l1p0K24j66J26Lr5M2
$$ 20 -35 88 -161 0 26 79 5 -1 22 57 61 42 141 23 40 52 16 -20 31 -23 -54 -124 100 -66 60 63 -32 10
7527A0N3k3J11j08j02k2J06m6j02R2j91K31r7J18n3l0J77O1p5p2m2j6J31l6j94
$$ 10 63 40 151 43 -59 -81 25 -21 -123 -31 -222 9 -88 30 -23 -53 124 185 110 38 -4 -20 111 75 -119
7552a19J40m0k0rQN1o9J09p4J2J01n3k2J67j75P9l4j31n1L6M3K8N0l8p0N5n2L4
$$ -119 21 -19 -39 -48 -40 11 -58 51 -23 -11 90 37 15 182 7 86 52 -79 -130 -94 -51 -23 27 -11 -81 -26 -78 -44
7580d4N9o0K21p0q3p2K0Q8j09l6Lo0J37o5m4K2J88r6P9J2n3l7k7m1R4m3j24Q9
$$ -44 15 -45 176 106 23 -49 -29 59 -50 -86 -83 -143 -6 -71 -115 -93 95 -1 78 90 37 0 -27 -68 26 -17 -141 -52
7608e2J25j71J90j00m3N3N0N5j54J87oq9l3J6n0J39j47o7j1j0J65j12N4r6Q3L6
$$ -52 73 -98 92 -8 -51 2 52 107 -47 140 134 45 12 28 -22 117 -30 -97 -108 -118 47 -65 -11 -107 -24 12
7634A2M7J7j50J02mm0O7j6o1N2l2o1L6nm5J81r4Q7j26P2J08k91K40K0j4o1j71
$$ 12 59 76 -74 28 24 -16 51 35 -26 26 -6 -67 -31 -36 -81 100 6 93 -33 39 147 -144 96 116 102 41 -130
7661a30R2J6O2j56Oj9Q7pN0L2Pj0m4M2J19rj85L9q5L7J21j02m6O8Nm8O1M6Lr6
$$ -130 -38 -22 40 -116 -110 -129 -42 -49 1 33 40 30 -14 28 147 138 -47 -8 -93 -56 65 -37 -83 -15 -10 -58 3 49 52 -44
7691d4j8J19K9l1p7J30j16k7m7oP9j01J00l3M6M2J03l2j40J42q1k1l7J55j09j23
$$ -44 -62 57 86 55 -22 108 -8 -35 -82 -88 -9 -110 -10 -43 3 45 148 116 -24 118 37 16 -21 134 25 -98
7717i8J5J2qM0r5J58Mp5M9L5J57k14L1k3R3k0q9r5J0J51j41k5Q7l2O1N0J1j5l
$$ -98 -83 -71 -79 -39 -134 24 28 -47 2 37 194 -20 11 -12 81 61 -28 -123 -113 38 -103 -128 -41 -73 -12 38 49 34 31
7746C1l4J09j28M6P4j99J9J12j06O3o0j01M1j1J42K1q6K4K09m2j4j0m7Mk9j15
$$ 31 -3 106 -22 24 98 -101 -82 30 -76 -13 -73 -174 -133 -144 -2 19 -67 -43 166 124 110 100 53 57 28 -87
7772h7M2%O9L6o6N8r7N8J27j61k0K1R8l8m4R8j45N7o7r2J98k2q1L4J06J3p2P0
$$ -87 -45 -45 24 60 -6 52 -45 13 140 -21 -41 -20 78 40 -4 94 -51 6 -61 -153 45 23 -58 -24 82 95 23 93
7800I3j91J10M8j36M3J45m3p9o1J5j93M1K08j27J37l8L8k2P4k2m2J01j06L9r2
$$ 93 -98 12 60 -76 -33 112 69 -10 -71 -56 -249 -208 0 -127 10 -28 10 -12 62 40 -2 99 -7 32 -60
7825f0J20p5q3j1P4m4j05L01k58K12nj58K33p1M7j0n5j01J07%l8k6L7o9l6O7P8
$$ -60 60 -15 -98 -109 -35 -79 -184 117 -141 71 66 -92 141 70 117 107 52 -49 58 58 20 -6 31 -38 -74 -7 71
7852G1o8Q6mr8M9k9j3L7lR5j98l0O7k2Nj9o0J04J8K6k4l4Q7o8J0m2rJ38q2M1m4
$$ 71 3 89 85 -13 36 7 -6 31 28 123 -75 -105 -38 -60 -55 -74 -134 -30 -12 14 -10 -44 43 -25 -15 -57 -66 72 -10 31 -13
7883a3r1L3n0J21L2j01KL8r2J18M2K8J15k02O1l8J00j70K2M6o9M5j28J37l4jK9
$$ -13 -104 -71 -121 0 32 -69 -67 -29 -121 -3 39 67 182 -20 41 3 103 -67 -45 1 -68 -23 -151 -14 -48 -49 -20
7910b0L4JJ14k56J61M6N6j70p8O6o0P0L2j00K16j27Jn3J79l3l9P4n1m1rL8n5n6
$$ -20 14 15 129 -127 34 80 136 -34 -112 -46 -106 -36 -4 -104 112 -15 -14 -67 112 79 40 114 63 22 13 51 -4 -60
7938f0K8k5Q8j03r6J34J20l7J2l4o6k1P0P8k2l8n6J17p2m3NR0om5k6O1m4M5l2
$$ -60 -32 -57 31 -72 -168 -34 86 49 61 27 -39 -60 10 88 66 28 -28 89 17 -26 -21 69 63 18 -8 53 9 54 22
7967B2N0k4M9k8o6p9J9Mk0Q5J4Nm1j02J6K7K15q3p8J14j8q9J14j54J27o1n6N2
$$ 22 72 48 97 69 3 -76 -57 -53 -73 12 26 31 -10 -112 -96 -69 146 63 -15 99 81 -8 106 -48 79 18 -38 14
7995A4n2r8J96p9RRlr2R9M4M0K6j78LJ69j93J51o5Nj63J24o2N1K6l2R3p7J63j06
$$ 14 -38 -136 60 -19 -10 -1 -4 -96 3 47 87 113 -65 -62 107 -86 65 0 5 -158 -34 -96 -45 -19 -51 42 -35 128 22
8024B2r7K8L8m4j1r6J47l5L4mJ25j96J20LP8p3o5R8K8L9m5O6k24j1J15n3O4m3
$$ 22 -75 -47 -9 -53 -64 -160 -13 -48 -14 -18 107 -89 31 34 112 39 -26 72 100 139 94 160 -64 -75 40 -13 51 8
8052HK4j37K9O4J6N0j27P2p2M9j5N1J04q2p2P3j09Pj3J3L4Q7K9j21M5Q0o9J64
$$ 8 32 -105 -76 -12 4 54 -73 -1 -73 -24 -39 12 116 34 -38 35 -74 -67 -80 -67 -33 54 83 -38 7 87 18 182
8080A82q8l4k8k9q1J11m0qj20M0J15n3J6m9J47l1L9Jp0O2j4O0j09l8n3N1j43P3
$$ 182 94 60 32 3 -78 33 -7 -15 -135 -95 20 -33 -17 -66 81 50 89 90 20 82 68 128 19 -19 -72 -21 -164 -91
8108i1J16J04P1j99P6k26R9Q2K6j99J20R5j6j40J26j17P4jo9n0J82o0M5qJ56l08
$$ -91 25 129 200 1 77 -149 -50 32 58 -141 -21 74 58 -82 44 -73 1 0 -69 -119 63 3 48 40 196 -112
8134a12K84p4p6O6q5NJ81j16j92M5l1O2K5j91K08M4k0PJ66k26R6j00j4J18K0L6
$$ -112 172 98 22 88 3 8 189 73 -119 -74 -105 -43 -18 -209 -1 43 23 30 196 -30 66 -34 -48 70 90 126
8160A26j37o1j33K40k0oj45Q9m0Q0R7p4nJ13p8Rj36Q4o7J0j0MJ9K0J4RK1r5J45
$$ 126 -11 -72 -205 35 15 9 -136 -47 -87 -7 90 16 11 124 46 55 -81 3 -64 -54 -64 -60 -41 -21 -7 2 23 -72 73
8189G3mj36J29J37j90M5k4j37J04j25P2L0j4k3J4KQ3o5R3j3%j18j9J17p1J90j06
$$ 73 69 -67 62 199 9 54 30 -107 -3 -128 -56 -26 -40 -63 -49 -47 36 -29 64 51 51 -67 -86 31 -40 150 44
8216D4n1j82J68Om3N9RJ33j13j39O7Q9J2O4J8k39J09n5k0lJ15j95J77m6q4K7O2
$$ 44 -7 -189 -21 -15 -58 1 10 143 30 -109 -42 47 59 123 141 -98 11 -44 -64 -67 48 -147 30 -16 -100 -73 -11
8243a1k4M3J71q0r0J66k16K3L5K1j61J06M9jp8L1l1m7NM2R7P0j40M2k7O7L9j41
$$ -11 -35 8 179 99 9 175 -41 -18 17 38 -123 -17 32 31 -47 -16 -47 -94 -89 -47 50 120 -20 22 -5 62 101 -40
8271d0kj12K26j48R6J0k9O6L4n7R3m0k17J95m2M2j02J0L7n7J2k6o2k4J16J12J0
$$ -40 -42 -154 72 -76 20 30 1 67 101 44 137 97 -120 75 33 75 -27 -17 20 -37 -25 -51 -113 -137 -21 91 101
8298A01q0OL2j0K5J2j54Q1j02J15j03K22j44r3O3RJ0NlN6o7O1N9j5n0J03q6K6
$$ 101 21 27 59 49 74 86 -68 13 -89 26 -77 145 1 -92 -29 -20 -10 -5 -8 48 -19 42 101 86 36 139 53 79
8326G9Kj13j07k5J06o2P2O4n7lQ2r6M5N8L0P6l3o6j38J69o7j0o5M8m8K3J27n4
$$ 79 81 -32 -139 -164 -58 -120 -48 16 -41 -44 38 -58 -13 45 75 151 118 52 -86 83 16 6 -59 -11 -59 -36 91 37
8354C7p4L2R4k1p0J3o8J58j79J02k4j1Qj12PJ48n2O3K8j29K37j52K8p9M7o7j0
$$ 37 -37 -5 89 68 -2 11 -57 101 -78 24 0 -11 -3 -115 -108 40 -12 51 79 -50 187 35 63 -16 31 -36 -46
8381d6Jl0m9oJ25j0L7P1l3Q7k45K09l1j6j6o2P0k8q3O1l8K0M8j42N3J3P7m5Q1
$$ -46 -45 -75 -124 -130 -5 -15 22 93 60 147 -98 111 80 64 48 -14 56 28 -55 6 -32 -12 36 -106 -53 -40 37 -8 73
8410G3j07Q4j2L6r1o4J69j17n8O1m4O4j8j00J46l5K2N6q2J2kN6q0QO8J13p9j28
$$ 73 -34 50 38 74 -17 -81 88 -29 -87 -26 -70 -6 -24 -124 22 -13 9 65 -17 -5 -7 49 -31 -23 45 158 79 -49
8438d9m4l2J10k1O5m0mL7N5k7%n7P6l9pj4n8P6j25P5o7L3m1M4JJ21J09k36J32
$$ -49 -93 -125 -15 -36 29 -11 -15 22 77 50 50 -7 69 30 23 9 -49 27 -98 -23 -90 -57 -98 -54 -53 68 177 -59 73
8467G3P1k3j34P3O1j73J8O7j11oM0l6l5K3N7K3R5l3J1l5L8j2o9l2R8k7j72P2r5
$$ 73 144 121 -13 60 121 -52 -34 33 -78 -84 -44 -80 -115 -92 -35 -12 83 50 61 26 64 52 -17 -49 49 22 -150 -78 -173
8496a73N1R8Q7p7N0kL8r6R4j1M4j21k5J4p4K10oj86jJ00K2k6j40J38M7K5p6k2
$$ -173 -122 -24 63 -14 36 34 72 -24 70 59 103 -18 -43 -29 -103 107 101 -85 -86 14 36 10 -130 8 55 80 4 -18
8524a8J8Q4l8q8j10Q0K4kq4R3Q8j7m0nJ2M0J7J19qr2j23J40j55NP2p9k4J1NJ8
$$ -18 0 84 46 -42 -152 -72 -48 -50 -134 -41 47 30 -10 -15 -3 37 54 173 165 73 -50 90 -65 -60 12 -67 -91 -80 -75 -57
8554e7k1K01j58j3P4Q6k09J62j01P3JJ4k5r6L0j1m8LP3L1J27j97P8N5l3o7LK2
$$ -57 -78 123 -35 -48 26 112 -97 65 -36 37 38 52 27 -69 -39 -50 -98 -95 -22 9 136 -61 17 72 39 -28 -25 -3
8582cJ23j92Q1p4J26Nj15K5k9n4J52j9PJ05j39K6m3P5o5l2%j65R5J66j0j65Q0
$$ -3 120 -72 9 -65 61 66 -49 -24 -53 -107 45 26 33 138 -1 25 -18 57 -8 -40 -40 -205 -110 56 46 -119 -39
8609c9N3K6Mn5j2J32n4r9N8k25K74j17j5M2L0rrjj21J40M4k4n4M5O9K4j80J22
$$ -39 14 40 44 -11 -23 109 55 -44 14 -211 63 -54 -69 -27 3 -6 -15 -16 -137 3 47 23 -31 14 83 107 -73 49
8637D9J30j73n1J00j57R4J9o6O7J29j62M9m7n9J98L9j21O9j12J3oj39o4Q5qJ6
$$ 49 179 6 -45 55 -102 -8 11 -55 12 141 -21 28 -19 -78 120 159 38 107 -5 8 2 -137 -201 -116 -124 -108
8663a08nP7j2J52j36Q8L1J6l1m1j5q4O9j22J01N7n9q2j4Q8K1L0J62j32j9l6O1
$$ -108 -113 -36 -48 104 -32 56 87 103 72 31 16 -68 1 -121 -20 37 -22 -104 -118 -30 -9 21 183 51 32 -4 57
8690E7P0j14J40j10O2j33p9L8mN0J7l4N3q6J35j48J32o0J21j31L6l7m8O7k8L1
$$ 57 127 13 153 43 105 -28 -107 -69 -73 -23 -6 -40 13 -73 62 -86 46 -14 107 -24 12 -25 -73 -6 -34 -3
8716cl3M4j6l6Q7N0j75J43j09J77o1P1j48qj1q7L1P1n9l9J50j4O1k7nR1l9o3J9
$$ -3 -36 8 -8 -44 43 93 -82 61 -48 129 68 139 -9 -17 -28 -115 -84 -13 -72 -111 39 25 86 59 54 145 106 43 62
8745F2K2j39O3n1l1rQ6p4J48j46L7j09J58M8m7P9j40j2R3J07p0n4K4j59K31r9
$$ 62 84 -55 8 -43 -74 -83 3 -71 77 -69 -32 -141 17 65 18 97 -43 -55 38 145 75 21 45 -114 117 18
8771A8L7j85J20n9J41M1j09j14J77R0k5j76R3m1k6J15j17N6m2j0L7m0mP8q0J9
$$ 18 55 -130 -10 -69 72 113 4 -110 67 157 132 -44 49 8 -18 97 -20 36 -6 -16 21 -19 -23 55 -25 -6
8797fJ12j91J30k12P7P5J0k3Q0m3l0k3R0M2r9J02o4L8kj12O1N1j22P4r5J8j10
$$ -6 106 -85 45 -167 -90 -15 -5 -28 52 9 -21 -44 46 88 -11 91 27 65 63 -49 12 63 -59 15 -80 -62 -172
8824a72J67l3n3K8O5q2N0N8L9M0j8r7P7Rq4j5K6q3m3J11k2q6J39nMj44R2K6J0
$$ -172 -5 -38 -91 -63 2 -80 -30 28 67 107 89 -8 69 78 -6 -21 5 -78 -121 -10 -32 -118 21 16 20 -124 -32 -6 4
8853DJ0K0k7K2n8Q5q7m2J8o3R2J23j32R5k4q7R1p6%M3o0Q0o8lN9j10J03m6JK3
$$ 4 14 34 7 29 -29 56 -31 -73 -55 -118 -26 97 -35 60 36 -51 40 -36 -36 7 -53 27 -41 -44 15 -95 8 -38 -37 -14
8883a4n9J32p0J00J8j07P4o7K45j79j06N3k4Q4j04k0l1R1j4n6O3L7P3j09O3j38
$$ -14 -73 59 -11 89 107 0 74 7 252 73 -33 20 -4 80 -24 -44 -75 16 2 -54 9 46 119 10 73 -65
8909f5P1J6o6j8P1jq3J27p4K4m7P3r0P7J57o0j01L6p2ML5j34J32j74J25o0J06
$$ -65 6 22 -44 -62 9 8 -75 52 -22 2 -45 28 -62 15 172 112 11 47 -25 -21 14 -120 12 -162 -37 -97 9
8936Ij0J5j5nK0p1K8n8Q5N4j78J29K8r3L0l9J26Jl2L4K3j86K15j44N8Pp6P7Nr1
$$ 9 -1 14 -1 -6 14 -57 -29 -87 -2 52 -126 3 31 -62 -32 -71 55 56 24 58 81 -105 110 -34 24 31 -45 32 37 -54
8966e4J3J8J01j47R1j1p5o0O7J78k6r8J28k3jj5n5j32J34n7N0o8J7J0o6J57j16
$$ -54 -41 -23 78 -69 22 11 -64 -124 -57 121 95 -3 125 102 101 86 31 -101 33 -24 26 -42 -25 -15 -81 76 -40
8993d0k9J94o4r1J00J9l2j12L3Q5p2Nj52K49k36P2O5j53J16o8J58K3J0j05J9o
$$ -40 -69 125 61 -30 70 89 57 -55 -22 63 -9 -4 -156 93 -143 -71 -6 -159 -43 -111 47 70 80 -25 -6 -12
9019a2mJ53j85l6jR9n6qK1L5J20o7n4K8j4j35K60m0M0k31R3Q4o1q8M0K2k45K78
$$ -12 -16 137 -48 -84 -85 14 -42 -50 -29 6 126 59 5 33 19 -116 144 104 144 -87 6 90 29 -59 -19 3 -242 36
9047C6j8j50J85m0L9j01O7L4Nj9k8K8j64J02n6J91j98K15k07O0k1J05o2K7Q3j50
$$ 36 18 -132 53 13 52 -49 18 52 57 38 10 38 -126 -24 -80 111 -87 128 -79 -19 -40 65 3 30 113 -37
9073c7k4J10j56K8J73j74K4M4m8J13Mm9K2n6K05j30l7k0P6K6p3j01K4n3J4J31
$$ -37 -61 49 -107 -79 94 -80 -56 -12 -60 53 57 8 30 -26 179 49 12 -8 68 94 21 -80 -56 -109 -95 36
9099C6o2J50j27n0Q9R0j05m7P2J6J49k71RMnr6J21K5j19O5K%J5J18r2j9N4l4L9
$$ 36 -26 124 -3 -53 36 126 21 -26 46 62 211 -60 -51 -47 -52 -148 -27 -2 -121 -56 -54 -54 -39 79 -13 -32 22 -12 27
9128B7K6k00J22R2k02J21m8k8J40p0k0J7j9R7o4jK4l3M8p7J5j0j3J5qK9p4Q5O6
$$ 27 53 -147 -25 67 -135 -14 -62 -90 50 -20 -40 -23 -42 55 -9 -10 14 -19 29 -48 -33 -43 -56 -41 -49 -20 -94 -9 57
9157E7j44J08Q4j06J6n6N7Q7r7K5q4k9L1j4n1O1J59p2m0P9L4J04k04PP2j40j36
$$ 57 -87 21 105 -1 15 -41 16 103 6 31 -53 -82 -51 -65 -116 -55 104 32 -8 71 105 209 5 12 84 -56 -192
9184a92J76l2J7Q3k2r8l4J00o0K1Q5r3J13r9O8rJ6k4M6n1o5p4L9R6j03P3qO4L2
$$ -192 -16 -48 -31 52 30 -68 -102 -2 -62 -41 44 -49 64 -35 33 24 40 16 62 11 -54 -128 -89 7 -96 -23 -31 33 65
9213F5j35J00QP8p6j24J68q3J4P6j52M8J2p9l3N6O8j1P0r7J41j43PJ8N8j13J22
$$ 65 -70 30 38 116 40 -84 84 1 15 91 -61 -13 -1 -80 -113 -57 11 0 70 -27 114 -29 -22 -4 54 -59 63
9240F3j47Q6l2j12J50j54RO4K03j51K2O1r7R1O3j40O6j27R7jo7n7K6L0k5O3L9
$$ 63 -84 2 -30 -142 8 -146 -137 -73 130 -21 1 62 -35 56 119 -21 45 -82 15 14 -53 -110 -84 -54 -79 -16 23
9267B3l1P0q1N6n4J07K0j09N7j22K1r5K57k02M6l8J38p4K2q5J07J6k0J27r0l8
$$ 23 -8 62 -19 37 -17 90 110 1 58 -64 -43 -138 119 -83 -37 -75 63 -11 11 -74 33 49 29 156 66 28
9293B8j3j31O1N2Q2j14O9p9R5k2M6n5O4J6o9Q2p4m3o7PK0p8J03J34k0k45O6J47
$$ 28 15 -116 -55 -3 79 -35 34 -45 50 28 74 19 83 99 30 112 38 -5 -72 -65 -45 -123 -20 114 94 -151 -85 62
9321F2O8k74K55L2j20J6j4j37J57j03m3L6o9J41j63M6O2K5L4m5P4l0Q2j09N3L1
$$ 62 130 -144 111 143 23 39 25 -112 45 -58 -101 -65 -134 7 -156 -110 -48 -23 11 -34 40 10 92 -17 36 67
9347F7j55N0N4o6l7Q8m3J7K4L4n3K5j3Q1Qo0O1j4n7m6J33j35N6r1O8L3n9l8O2
$$ 67 -88 -38 16 -50 -87 1 -42 -25 -1 33 -20 5 -8 73 81 21 82 68 11 -35 98 -37 19 -72 -4 29 -30 -68 -6
9376fm8N1N4l1k4J18j30K1r4Q3k4J12j13M5JN1o7n4J26k4l7q6n5Q5J20j08J02
$$ -6 -54 -3 51 20 -4 114 -16 5 -89 -6 -30 82 -31 14 15 66 -1 -55 71 47 10 -76 -131 -46 74 -34 68
9403F8l0o8J7J7k11K80k9J1k7J9j30J12k6J00K3j0j36J02q6j73Q7K6n6J29m8k4
$$ 68 38 -30 -13 4 -207 73 44 55 28 47 -83 29 3 103 126 116 -20 82 -4 -177 -90 -64 -120 9 -39 -63
9429f3JR5j00J47j06J27j6o3L0j53J13j03J15o3n3%J89j4j87O1k5J50q3m6J14
$$ -63 -62 33 -67 80 -26 101 85 22 52 -101 12 -91 24 -39 -92 -92 97 83 -104 -43 -68 82 -1 -47 67
9454F7Ro4N5p6O1k01P4J48j77R6JJ98j99Lo1J99j62J07j54K12j20m6m0N9L1n2
$$ 67 76 12 67 -9 52 -149 -75 73 -104 -8 -7 191 -8 -5 -66 133 -29 78 -76 136 16 -30 -70 -11 20 -32
9480c2r7J3J04n8kL9Q3p9P0m8O6j02R6l2nlj3l0o0L0j2O1L5K9L0q5k3l3J63m1
$$ -32 -129 -116 -12 -70 -72 -33 50 -29 41 -7 59 -43 53 21 16 13 0 -30 -90 -60 -72 -11 24 53 83 -2 -25 -58 105 64
9510F4p6NKQN5r0m5R9p3J50j42O0p9KJ21o0N0m9j37R5M5K0lj43J31m1J7r1l0J47
$$ 64 -12 -7 -5 3 58 -32 -77 22 -51 99 -43 17 -62 -60 61 1 51 2 -135 -40 5 25 22 -121 10 -31 -14 -105 -135 12
9540A2l9QQ5j47R7J3R9q1n4MQ3r4n5J7%L8Kk3J08Mp4r0m8J18K8r2J29J9j50J36
$$ 12 -27 -19 66 -81 16 29 128 47 -7 -3 80 -14 -69 -52 -52 -14 -12 -35 73 77 3 -87 -135 -17 11 -81 48 67 -83 53
9570E3l9j72P3J3N6N8j43J25n4j3p3J66l4jj8R0j0j43J55o0j10J78n4K7k01j5
$$ 53 14 -158 -85 -72 -16 42 -101 24 -30 -43 -116 50 16 15 -3 87 77 -66 89 29 -81 97 43 70 -131 -146
9596a46P2J09n4Q1J4j9rj47J76j18QJ45j43L2j72R6J08j17LO3KM8l3J23j04j76
$$ -146 -74 35 -19 62 76 57 48 -99 77 -41 -33 112 -31 1 -171 -75 33 -84 -81 -18 -16 32 -1 122 18 -158
9622a58R7J19p2l8Q6J4j40l5J73j2o3l5J38j36R7J5N0j75M5kl8J8j6k4K22n6p0
$$ -158 -61 58 -14 -52 34 48 -92 -127 46 34 -29 -64 74 -62 35 50 100 -75 -30 -32 -70 -52 -68 -92 130 74 4
9649Dq5j8Q6lk2O4K8k4q9L7J36j11j2o1L7j03K2R1j9L7Nj1M1L9o4M1p3ON3J3j20
$$ 4 -81 -99 -13 -16 -38 26 54 30 -59 -22 114 3 -9 -70 -33 -136 -114 -23 -42 -5 0 -11 30 69 5 46 -27 -21 32 45 -75
9680g5K5L4J07j55k9N0j10R6Q6OJ18j47LN7j76J01K5k6k1j3q0l2pJ58o7J49j84
$$ -75 -50 -16 91 -64 -93 -43 -153 -57 29 35 153 6 9 66 -110 -9 16 -10 -31 -44 -124 -156 -163 -5 -72 77 -107
9707a07JJ69j7O1j04Q4o9k1p7Q4R9j90k3J47j1J0l7O1q6Q1j27Q0j07J79o0o3J57
$$ -107 -106 63 46 107 3 87 18 -3 -80 4 103 -87 -110 37 26 36 -1 60 -26 55 -72 8 -99 80 20 -43 114
9734A14k8j08P1o6J2j9m1R6nJ60k22l0J27l6M2j6j2k6J7l5j4Oo8O0n1J49q4R9
$$ 114 86 -22 49 -17 -5 -24 -65 31 26 186 -36 -66 61 25 67 51 39 13 30 -5 -19 -13 -81 -21 -72 77 -7 92
9762I2n7q5m9rm9K69k1o0m8R2o9n8l3J56p1O2R0r8n2q2O4k9K4P8M4r4Q9j16l3
$$ 92 35 -50 -99 -108 -157 112 91 31 -17 75 6 -52 -85 71 0 62 152 54 2 -80 -16 -45 -21 57 101 7 96 -20 -53
9791e3K4j5O0n7N4r1M6L3R3q3r6J81j02L3j64J03N5q6N0p0O2j5QP1j21J10Lm8
$$ -53 -29 -44 16 -41 13 -78 -32 1 94 11 -85 96 -6 27 -137 -34 21 -65 -15 -85 -23 -38 -30 41 -80 30 33 -15
9819a5j5P7Q1j7m0j34Q0p2J2L3N4j0m5mm8J29j04o5Q6Q8j15J26r1L7J8j05pl8
$$ -15 -30 47 128 111 71 -63 17 -55 -43 -10 44 34 -11 -15 -63 66 -38 -103 -17 71 -44 82 -9 28 46 -59 -66 -104
9847a04Q4Pl2K8R5r4N2J27j55N2j01J16j32M6q7O5J29Kj67R4j1o5n9Q0O2r8J56
$$ -104 -20 -13 -45 -17 78 -16 36 163 8 60 -41 75 -57 -11 -98 -33 96 98 -69 25 14 -51 -110 -30 32 -66 90
9874I0J0l8K3n0N2p5m5J1J11l9oj04j1O0l7K2l4J4N5P7q3j9nK8j4J0l5M4j17J00
$$ 90 100 62 85 35 87 12 -33 -22 89 50 44 -60 -71 -11 -48 -26 -60 -46 9 86 3 -16 -21 7 -7 3 -32 12 -105 -5
9904eM4k5m4l1J50p8k9Pj3j4j07J30m2J08M6j04l9P3M1q0J6Q1K0n1O2r7L7L2j03
$$ -5 39 14 -30 -61 89 11 -18 -11 -24 -38 -145 -15 -57 51 97 -7 -46 27 68 -12 4 85 105 54 116 19 56 88 -15
9933a5N4n3j2N3Lk4M4n3q2J72q9j7J24n5q5K01k27K5N6Q0j50J56k58lJ88k8rj05
$$ -15 39 -14 -26 27 30 6 50 -3 -85 87 -2 -19 105 50 -35 166 -61 -36 20 100 -50 106 -152 -155 33 5 -4 -109
9961a09R6l7J30r9k7P4K9j8l5OP1k4m0j56l0R8M8k3M1L7J33j05j25M1O7k3K1l0
$$ -109 -13 -50 80 -19 -46 28 57 39 4 10 81 57 17 -139 -169 -71 -23 -46 -5 32 165 60 -65 -24 43 20 41 11
9989A1j4j59K15j20J45j63R0R3j71J31J0j3j29J79p5o6J19j60Q3p9K2J8J0Q3N
$$ 11 -3 -162 53 -67 78 -85 5 98 -73 58 68 55 -74 105 30 -36 83 -77 6 -73 -51 -33 -23 60 65
10014F5J7j28Q4m2O4Nj32J83k4o6L8m4p6m4Q4j63J69J14j05J05r4LK3j9k9l4J50
$$ 65 82 -46 38 -4 60 65 -67 116 92 26 64 20 -56 -100 -16 -179 -10 104 -1 104 10 13 36 17 -12 -46 104
10041A04%l7r2j2K7%ol0J01n9L6K7n4j9P0k4N6l6j16J43q5M8r1M5J8O2j35Q4j57
$$ 104 104 67 -25 -37 -10 -10 -16 -46 55 -4 32 59 5 -14 56 32 88 52 -64 79 -6 42 -49 -4 14 76 -59 25 -132
10070a32J17K8K6j67J16Jj06O4J43q8J4O3o5j08N8K8m1K0N3J5r1Q7j7o4K5P6n2
$$ -132 -15 13 39 -128 -12 -11 -117 -53 90 2 16 79 14 -94 -36 -8 -49 -29 24 39 -52 35 18 -46 -21 55 3
10097CJ03p3J2m4m7J09j09j2M6j2R9j35J85n1p3O5mn5QJ1L9q9l5M3m5r3J43LM1
$$ 3 106 33 45 1 -46 63 -46 -58 -12 -24 75 -60 125 74 1 66 62 7 15 26 65 -24 -59 -16 -61 -154 -11 -8 33
10126C3q0J01j1mRo7j6J6K3o9J36j38M9p9Q1q6M8RJ3J16j76J43M1l1L7l8O2r2
$$ 33 -47 54 43 39 48 -19 -35 -19 4 -65 71 -67 -18 -97 -16 -102 -54 -45 -32 84 -92 51 92 61 98 60 122 30
10154C0r1J4n9J16k4p2M%N7P4q3R0J3r9L7q5O4J18j66J19j03N1j00J61j20O6j34
$$ 30 -61 -47 -106 10 -14 -86 -82 -82 -25 49 -34 56 69 -30 7 -78 -14 104 -62 57 -46 5 -95 66 -54 12 -122
10181a22Q3mOO0O2j41N3%m0l3J25l4o3rN7r2L6J8j1P8P2K1r4j26K06l6r1L0k7
$$ -122 -39 -43 -37 23 85 -56 -3 -3 -43 -76 49 15 -48 -57 0 -92 -56 -38 -49 29 101 122 28 -98 108 72 -19 11 -16
10210a6j35J67l1Q8J6n6j15K38j98J66j05q4J24j03J50O4j23m0j7L0j04PM9qj25
$$ -16 -151 16 -15 73 89 33 -82 156 -42 124 19 -65 59 -44 106 170 47 7 -10 20 -84 -77 -28 -36 -161
10235a61L1J42n0J79Pj49J13r9R0J5k64J07n3K4N3n3J39k9J6p8m7J16O9j86P3
$$ -161 -130 12 -38 141 148 -1 112 13 103 118 -146 -39 -92 -68 -15 -68 71 42 58 -20 -67 49 118 -68 5
10260EN1j7J08Mm8j47R9p1J33j64L0r5J39jm9n0O1J07j52k5O9P5q1j56J13N8J2
$$ 5 56 39 147 151 103 -44 55 -16 117 -47 -17 -112 27 26 -23 -73 -12 95 -57 -82 -13 62 -19 -175 -62 -4 8
10287Hj09J25j28j6J25r4J35M4K9j01r5J40n7k1L1o4o0JJ00J8Q2Nj6o0j6L0m5
$$ 8 -101 24 -104 -120 5 -89 46 90 119 18 -77 63 6 -15 16 -48 -108 -107 -7 11 93 98 82 22 6 36 -9
10314in0J82j36M1j3J14j15j27j0Q0K0o8k3J14L2J07r3NJ04n3M8M9j79m6P0j70
$$ -9 -59 123 -13 28 15 129 14 -113 -123 -43 -23 -91 -114 0 32 139 46 51 155 102 150 199 20 -26 44 -126
10340a26J35j43P2O2m6J62j58Q7M3op1M0k9Q1j23p1M2n5M2o7Q0J05o0K3m5M8n7
$$ -126 9 -134 -62 0 -46 116 -42 45 88 82 11 51 22 103 -20 -91 -49 -104 -62 -129 -49 56 -4 19 -26 22 -35
10367c5R2J4MQ3j16L0p3lk0r6N8K0PK2o5J7m1O0N3M7p6N6on2J47p7O0j49R3J3
$$ -35 57 71 75 158 42 72 -1 -4 -24 -120 -62 -42 -35 -13 -78 -61 -102 -42 11 58 -18 38 32 -20 127 50 110 -39 54 67
10397F7j22M9O5j05J27m4m0O2K3j0K1k2Ml9j94J04P0ko7P5N6j96J12O1k2N5j21
$$ 67 -55 -6 59 -46 81 37 -3 59 82 72 93 71 75 36 -158 -54 16 14 -53 22 78 -118 -6 55 33 88 -33
10424c3J39q6M4l2Ml9k3k3ok4k9n5N5Q7oJ6J56k7m8q3N4O5j03%L1j1j67J10q0
$$ -33 106 20 64 32 36 -3 -26 -49 -55 -79 -108 -163 -108 -21 -27 -11 145 118 70 -13 41 106 3 3 34 23 -144 -34 -114
10453a14N2R8j17j9J54j2k6O3nj12P0j36J49m1k8Q7m7l3rq2l6K05q8R1mM8q9r
$$ -114 -62 36 -81 -100 54 42 16 79 74 -38 32 -104 45 4 -24 63 16 -17 -26 -108 -144 61 -27 64 60 108 19 10
10481A0q7J86q2m1O4Ok18J23J1j3P5o2M9k2O3q1N8mJ46k25J27p4M0q0N5k4j22
$$ 10 -77 109 27 -14 50 56 -162 -39 -28 -41 34 -28 21 -1 62 -19 39 35 181 -44 83 9 49 -31 24 0 -122
10508a22J13K1l4j5N9P8m0r3J77p4p1n8N3O4j32l2RJ68j42J27r0J49j86Q8L6L1
$$ -122 -9 12 -22 -37 22 100 60 -33 144 70 -1 -59 -6 58 -74 -106 -97 71 -71 56 -34 115 -71 17 53 84
10534H4j2m6J08j59O2j3o2O2J8n1j12r3K39j47K7N3J7L6J39j5j44J85k36K3M2
$$ 84 72 26 134 -25 37 24 -38 24 42 -9 -121 -214 25 -122 -95 -42 -25 11 150 135 -9 176 -60 -37 5
10559Ek5M4q8K5m9k4J4J34q8J38J8r8J22j36k6J24K3Lk00o7J40j4L4q3P3j76J83
$$ 5 -20 24 -64 -39 -88 -112 -98 36 -52 86 104 6 128 -8 -34 90 113 116 -84 -151 -11 -25 9 -74 -1 -177 6
10586FJ39n5J14j05l2p6N8k6j00Q6J2j36j06J65j2J36l5j1J63kj87J8M9j18O2
$$ 6 145 90 204 99 67 -9 49 23 -77 9 21 -115 -221 -56 -68 68 33 22 185 183 -4 14 63 -55 7
10611Gk0J25o8k9l3p1P3n3Lj1K01j49Q9o5J40j01Q1p7n4P1K9k29O1O3k4jj6m5
$$ 7 -13 112 44 15 -18 -89 -16 -69 -66 -77 124 -25 64 -1 139 38 119 42 -12 59 88 -141 -80 -17 -41 -42 -58 -103
10639a03R7m7nO0J03l9M7o5p2O9n9qJ35k28J05qp6R2m9J69j24M5r6R0j3J07j36
$$ -103 -6 -53 -58 2 105 66 113 48 -24 45 -14 -22 113 -115 -10 -18 -94 -2 -51 118 -6 39 -57 33 20 127 -9
10666iP4K2j67J04M8l7q4J8j6k2l1K15k5nm2ORk4M2j1jr0K5M7j17j3J2J12Q8j55
$$ -9 65 87 -80 24 72 35 -49 -31 -47 -69 -100 115 90 85 43 49 58 34 76 65 64 -26 -1 46 -71 -84 -72 40 128 -27
10696b7N4m2k8J70n6j07J45o1m7k1M9q4J0l5P8M1j23J25n4M4m5p6J45O7qJ0m3
$$ -27 27 -15 -43 127 71 -36 109 48 1 -20 29 -55 -45 -80 -2 39 -84 41 -13 31 -14 -90 55 122 114 124 81
10723H1L3r9j19M6L0rP5l3k9J1L5J0K7J51j43j55K28j03k7p7J09o4m5nm4K58k33
$$ 81 114 15 -104 -58 -28 -37 38 5 -24 -13 22 32 59 210 67 -88 140 37 10 -67 42 -22 -67 -72 -116 142 -91
10750i1J27k5O8j20J06K4k3J9K3q6mp0N9j23N4J3l1J07k2n7N4Q3j9J10j02l5O7
$$ -91 36 11 79 -41 65 89 66 85 108 22 18 -52 7 -116 -62 -49 -80 27 5 -52 2 85 66 176 74 39 106
10777A06p4K0k3PK2q8J1j3j9O3n6J28po3M0K9j34J11j53L5O5pQk3k6J8k3J21j37
$$ 106 32 52 29 36 58 -30 -19 -32 -51 12 -44 84 77 14 54 83 -51 60 -93 -58 7 0 8 -15 -41 -23 -46 75 -62
10806f2O4O0p7Q8j05M7Pk03R4J00j05N5J7l5l0K5n2P7J32n3p6J67l4j62P0Q0j26
$$ -62 2 62 -15 73 -32 15 22 -181 -87 13 -92 -37 -20 -55 -85 -60 -112 -35 97 44 -32 135 101 -61 9 89 -37
10833c7K9j0Q1j44O9N7q0J16j63J18n4J7o1J74q0O3j6o1m7n0J03p8k3M6J8mL1
$$ -37 -8 -18 63 -81 -12 45 -35 81 -82 36 -18 -1 -62 112 32 95 79 18 -29 -79 24 -54 -77 -31 -13 -17 14
10860A4o7K1J33p4N8n4j7L2m3J0l3j23J9J71l0l4J1JJ38o0L9j47J18k9P4q1rl
$$ 14 -53 -32 101 27 85 31 14 46 3 13 -20 -143 -124 47 17 -17 -6 -5 133 73 112 -35 83 54 128 47 38 35
10888C5n0P5m5Jq7J71k25J35Q4j47J28o8K37j47j17O9o0j1l1J66j66M6N6o7m5
$$ 35 -15 60 15 16 -71 100 -125 10 94 -53 75 7 244 97 -20 49 -11 -22 -53 113 -53 -7 49 -18 -63
10913f3l8J06O8j48Q2n4J58j50J06o6j25M4J12n1l4N0mO1j27O2L9l4j22K69k7
$$ -63 -101 5 73 -75 7 -47 111 -39 67 1 -124 -80 32 -19 -53 -3 -7 54 -73 -11 28 -6 -128 141 114
10938A14J6p8Qp8m4N8N9O3q5L8k1j67J00m9QJ56j03J5M2p7L2p4J13q9o4J39J2
$$ 114 130 52 60 -18 -62 -4 55 118 33 71 50 -117 -17 -66 -58 98 -5 10 52 -25 7 -67 46 -43 -107 32 44
10965D4O9j30m2R1J18l8p4o4j0J83j19lr3J45m6l7J00j20q5K9J69j51J10k5j49
$$ 44 113 -17 -59 32 150 112 38 -26 -36 147 28 25 -68 77 31 -6 94 -26 -111 -82 87 -64 46 21 -128
10990a28J09P3q5L4M8j8p7O8n1L0q3j4j0J68k7m7oP3o5J7j8k2P2J19k67J59m7
$$ -128 -19 54 -31 3 51 33 -44 24 -27 3 -80 -94 -104 64 37 -10 -16 57 -8 9 -9 -31 41 160 -107 52 5
11017Em7Q6JM2k47J11k9Q3rn2J4j8J97j36O1LJ0jj43J91j61K8m3J13j6m0lK3K
$$ 5 -42 44 45 87 -160 -49 -78 5 -4 -56 -42 -60 137 1 62 65 75 74 -69 122 -39 -11 -54 59 43 3 0 23 25
11046B5p8J59l7o1M2Qk8o0NK7K2K2o2j5K4K1K8P3l1j56K08l5M3j58J45j29n8j18
$$ 25 -53 106 69 8 50 58 30 -30 -25 2 24 46 -16 -31 -7 14 42 115 84 -72 136 101 144 -14 131 2 -56 -174
11074a74J06M3k9m5K4L3j2R2J02k14J76j1r4nn8k4P3mJ9r8L7R9j19Q6N4k02J20
$$ -174 -68 -25 -54 -99 -75 -42 -54 38 140 -74 102 91 -3 -8 -66 -90 -17 -21 -2 -100 -63 36 -83 3 57 -145 -25
11101b5Q8j5q6J58j54l2L1m2Qm9O5J8J9N0J0n4Mk0O2M6k2J7q2K6k4J7K5r5O9O7
$$ -25 63 48 -38 120 -34 -66 -35 -77 -69 -118 -53 -35 -16 34 44 -10 -6 -26 36 82 60 77 -5 21 -3 14 39 -56 13 80
11131H0j13M8l3k0P8k2M3j03O0m0R2p5J31j81n6jn0N4J8P1Lj1k5M9rL4n9K1j8
$$ 80 -33 15 -18 -38 40 18 61 -42 18 -22 70 -5 126 -55 -111 -112 -162 -108 -90 -19 -16 -27 -52 -3 -12 22 -37 -16 -34
11160c4J1K0m7L5O5j04L0n1J49j86J63j1J01p9K2n6M7J4j25P9M1j1j49J10k13
$$ -34 -23 -3 -50 -15 50 -54 -24 -75 74 -112 51 40 141 62 84 28 75 89 -36 43 84 73 -76 34 -179
11185a79K00j14P7j7j6p2P0J05KoKj39J02p5J36n5O4l5o0n9J06r1R4p1J26j16
$$ -179 21 -93 -16 -33 -49 -121 -51 54 56 50 52 -87 15 -60 76 21 85 50 -10 -69 37 -54 40 -31 95 -21
11211b1J28p4l0K3JmJ0l0J7k7j16N4M1N1j39J83j04M0Pk1J11j15qlJ6O8j42M2
$$ -21 107 33 3 26 27 23 33 3 20 -7 -123 -69 -28 23 -116 67 -37 3 10 -11 100 -15 -23 -26 -10 58 -84 -42
11239d2k1n1M8K7L5J7r4O6J12j35r9K31j10qM6lK4k5m6L0J18j36N1k6K9p9K26
$$ -42 -63 -114 -66 -39 -4 13 -81 -15 97 -38 -137 94 -16 -24 22 19 43 18 -28 2 120 -16 35 9 38 -41 185
11266A85j61M0J1j1o7o7M4L6p1K6R6m7q2j3J14p8N3PJ8m4M9RKj7q2Lk8m7L4p3
$$ 185 24 64 75 64 -3 -70 -26 10 -61 -35 61 14 -68 -81 33 -45 8 15 33 -11 38 47 49 32 -50 -47 -75 -122 -88 -161
11296a61J71N8P5mq4k4j6j15J34K5n8L2l8L9j51J44o7j6Jm5m9k4J94oj7P9j1K7
$$ -161 10 68 143 139 55 31 15 -100 34 59 1 33 -5 34 -117 27 -40 -56 -55 -100 -149 -173 21 15 -2 77 66 93
11324I3r2mo8M5Q2p5l2l9O0K25l09M3J51q8l7J30j46J58J32k30M4j36j6P6K3j18
$$ 93 1 -3 -71 -26 56 -19 -51 -90 -30 195 -114 -71 80 -8 -45 85 -61 97 229 -1 43 -93 -109 -33 -10 -128
11350a28J30K0o3J51j6M4j17O9k1j24P7n8oL3o6J35l5m2j00L6N3l4N5k6N9n3P7
$$ -128 2 22 -41 110 94 138 21 90 69 -55 22 -36 -42 -9 -75 60 25 -17 -117 -81 -28 -62 -7 -33 26 -27 50
11377E0j10L8O4n4R2n1j01R1Pj53R2Mn0P9p7J6Q6n0J12M8j05pk9o2M0J4L0p9K
$$ 50 -60 -22 42 -12 80 29 -72 19 26 -127 -35 -31 -81 -2 -79 -63 23 -27 85 133 28 21 -8 -70 -30 -16 14 -65 -63
11406f3J41o1P6p9o9qJ53O3j54N4k6oM1m8n0k0R9k1Qo2J09nj89J59o7qN3K9J5
$$ -63 78 17 93 14 -55 -63 90 153 -1 53 27 21 62 14 -36 -56 43 22 30 -32 77 72 -117 42 -25 -33 20 49 64
11435F4k8L9j10pl3QQ7Mq1PK7j35J58R3n0r0J43K1j48l3J13n0r4N4N7M9l2p9l8
$$ 64 36 75 -35 -42 -75 -67 20 24 -57 -50 -23 -158 0 93 43 -47 96 117 -31 -64 49 -1 -95 -41 16 65 33 -46 -84
11464h4J17j70K27j23J41q9k4N0j15J4N4O1n3q9P4j14RL8O7kN6J6l3k7J4o5O7
$$ -84 33 -137 90 -33 108 19 -5 45 -70 -56 -2 59 6 -83 -9 -123 -114 -76 -9 -11 45 61 28 1 15 -50 17
11491A7J4j04J08q3Kj4R2k8k0J5l4K5j6L8n8L9J08j21Pk6M6k1n1QK0R2m7k3P2
$$ 17 31 -73 35 -48 -46 -60 32 4 -16 -1 -35 -10 -26 12 -46 -7 101 -20 -13 -39 7 -14 -65 -57 -37 55 8 -15 57
11520E7P8j35N6o1J27j68m0K7J93j55lp1R0j02NP5J44j94l2J81o6o6J04K1p8J21
$$ 57 135 0 56 -5 122 -46 -86 -59 134 -21 -24 -95 -5 -107 -102 -27 117 -77 -109 72 6 -60 44 65 -13 108
11546A08j29J12m3k6k01K32j07M6nj6o2J91L4j70K05m2k47J86j81K41j07l3k7
$$ 108 -21 91 48 22 -179 53 -54 -8 -13 -29 -91 100 134 -36 169 127 -120 66 -115 126 19 -14 -41
11569d1j68J49P9mM1jj4l7L5m1O0L6o6nk8qj23Q1J1R9k23J69l0l2R4KR3p9P8p9
$$ -41 -209 -60 19 15 56 55 41 4 39 -2 58 94 28 23 -5 -13 -136 -55 -44 55 -168 1 -29 -61 33 35 128 49 127 48
11599D8l9K2m9j3m2L7o5L3l1K0J5J06j70J83j15N5J7k1o0J43m0j45J1j0P9m4J2
$$ 48 9 31 -18 -31 -73 -36 -101 -68 -99 -79 -64 42 -128 55 -60 -5 12 -9 -69 74 34 -111 -100 -110 -31 -75 -63
11626f3o6O9O1k6N4jj38J07P5j2j06J10l7jn8n8%R9r1QJ16K8j54K32k17J70o4
$$ -63 -129 -60 1 -25 29 28 -110 -3 72 60 -46 64 27 26 -32 -90 -90 9 -82 -74 42 70 -84 148 -69 101 37
11653C7J5j8k9n4J49p3N3j29M3nl6L5m7R1Q%k43K44J2N5k9J8j09P0n3j81N8N4
$$ 37 52 34 5 -49 100 27 80 -49 -6 -11 -47 -12 -59 32 40 40 -203 41 53 108 79 97 -12 58 5 -176 -118 -64
11681f4J20q2o9P0j0qJ09j2Q4j33RM5l2L7jj00RK7KL5j23J2K18l48L24q4Pq0R9
$$ -64 56 -26 -95 -25 -35 -43 66 54 138 5 14 59 27 64 63 -37 -28 -1 1 36 -87 -75 143 -205 119 35 42 -38 61
11710F1l1l6q4R5J0j7j6p1M4J6J7J5J5L3m6n8Q7K3L6m4J1Nj48q2K18r6J0Lp1J13
$$ 61 30 -6 -90 5 15 -2 -18 -89 -45 -29 -12 3 18 51 5 -53 34 57 93 49 60 65 -83 -165 53 -43 -33 -30 -101 12
11740A2K1l9m4J06J55j77k2N1Km3j58J29nq0j5L3p%Q3P3p4m2J63j71P6N1j55L4
$$ 12 33 -6 -50 56 211 34 12 63 65 22 -136 -7 -12 -92 -107 -74 -81 -81 2 75 1 -41 122 -49 27 78 -77 -43
11768d3l9K6J20k21K32q2q3K21j25j30P7L5Q7r3l5J04J47l43J63Kr0kJ26j63J03
$$ -43 -82 -56 64 -157 75 -7 -90 131 6 -124 -47 -12 75 -18 -53 51 198 -145 18 20 -70 -72 54 -109 -6
11793fp4MR7L3o8J07r6J47l55J36l2J62j18M7r0K8MJ03O7k08Q2n6J64r9J6O9k7
$$ -6 -80 -76 21 54 -14 93 -3 144 -211 -75 -107 55 -63 -16 -106 -78 -74 29 96 -112 -30 -86 78 -21 -5 64 37
11820C7Q4K7j28n3J03j20J53j18j11J07RO3j55Q4k7k7L8L5j6P0n1L3Q2j27J0m5
$$ 37 121 148 20 -33 70 -50 103 -15 -126 -19 -10 53 -102 -18 -45 -72 -34 1 -15 55 4 37 119 -8 2 -43
11846d3O4J1L3k9l7K4o7Q8m7l9%Q5Jl7j06J3R9j07J9J2K6nJ00o7O3l6o6J12j32
$$ -43 21 32 65 36 -1 23 -44 44 -3 -42 -42 43 44 7 -99 -86 13 -94 -75 -63 -37 -42 58 -9 54 18 -48 64 -68
11875f8Q5n6K4N4o1n0J55lj26J11m5k6k5O5o7OL0n9R3j21J14k2j33L07l27J90
$$ -68 17 -39 -15 39 -22 -72 83 80 -46 65 20 -6 -31 34 -33 -27 3 -56 37 -84 30 8 -125 182 -145 45
11901D5J11k03lO1n2J29m3L1l9r8J6o9O9J0m4J32j10P9j02J61j7p9J35j60O8m6
$$ 45 156 -47 -50 11 -41 88 45 76 37 -61 -45 -114 -45 -35 -79 53 -57 22 -80 81 64 -15 120 -40 28 -18
11927a8J51L7j43Rj7kj9p2P9L0o6m7J29j21N3J0K0l2L7J6o0L8l0K2l1J06j04n
$$ -18 133 170 27 36 19 17 -2 -74 5 35 -31 -78 51 -70 -17 -7 13 -19 18 34 -26 12 -18 4 -27 79 -25 -30
11955c0J27k7n5m0J9m2P7l4K0K9J3l1J65j66R2j2j19l1j00J79J21j53rq6N0P1
$$ -30 97 70 15 -25 -6 -48 29 -5 15 44 57 26 191 25 117 105 -14 -45 -145 34 155 2 -7 -93 -43 28
11981B8%kK3nj56L0J76j42J8L3R7p6o5p4QR2p5R6K4r6L7m1P1q5K01j59pJ46j49
$$ 28 28 26 49 44 -112 -82 94 -48 -30 3 100 24 -41 -115 -107 -15 -90 6 30 -66 -29 -70 1 -84 117 -42 -49 97 -52
12010e2P3m8l9M2m7N1p9R9j1J38j11QJ7m3K7OJ00j71K1k7J05j41J39qKn8J05k8
$$ -52 21 -27 -66 -24 -71 -20 -99 0 -11 127 16 24 41 -2 25 31 131 -40 -19 -46 59 -82 57 49 51 -7 98 70
12038G0j86L5P6q5p0K10pm7M2KqK6r2RQ7j08jL0m2J07m5J3Kp4pQ5j49L6J18l0
$$ 70 -116 -81 -5 -90 -160 50 43 -4 38 40 32 58 -34 -25 62 -46 -47 -17 -59 48 3 16 18 -56 -63 22 -127 -91 27 -3
12068cp8J2P9j79J97q0J42r2J49k21j5J62k1qp4J19j45J05Nj3r6O3l0K3M0M1q3
$$ -3 -81 -69 10 -169 28 -52 90 -2 147 -74 -89 73 52 44 -30 89 -56 49 54 41 -55 8 -22 1 41 82 -1
12095an9N2Q0%k7l4l0n0Jn2rJ84n0n5O7n4n0J39N0j33J8m6Q3l8L9r8J44j14R7
$$ -1 -60 -8 72 72 45 11 -19 -69 -68 -120 -129 55 5 -50 17 -37 -87 52 102 -31 -13 -59 24 -14 25 -73 71 -43 54
12124E4%l3r2j35K37q9O6K5nn8Rj3RJ7L8j18L0K9l4qP1rl0J38N5k94J36j16R4
$$ 54 54 21 -71 -206 31 -58 8 33 28 -30 -21 -34 -25 -8 30 -88 -58 -29 -63 -71 0 -9 -39 99 154 -140 -4 -120 -26
12153b6J02j86P8K7r7N6m1P4j28J10K10j24j49mM6j9JJ50j29K1m9J18o9Q9R9j82
$$ -26 76 -110 -32 -5 -102 -46 -87 -13 -141 -31 179 55 -94 -98 -52 -71 -70 80 -49 -28 -77 41 -28 61 160 -22
12179b2l6L0L6JR7k10l0L8J18%l9O0p5L6j7o5R6j7J9j57J9Q7on1P1K5Lk6Q1p3
$$ -22 -58 -28 8 9 106 -104 -134 -96 22 22 -17 43 -32 4 -13 -78 18 1 20 -137 -118 -31 -37 -88 -17 8 11 -15 66 -7
12209go8M6j10Q8R9j13n5L0J25K8K5j45K1q2J33k7J4P9j34J23j9j1n7kK9r2O2
$$ -7 -75 -29 -139 -51 48 -65 -120 -90 35 63 88 -57 -36 -118 15 -12 2 81 -53 70 51 40 -17 -19 10 -82 -20
12236b0M5j5j3l9RO4j20J88j76J31M2r2j0OK8R1j16q1R2L6k0O6p0j57K52l6j06
$$ -20 25 10 -3 -42 -33 31 -89 99 -77 54 96 4 -6 0 28 119 3 -78 14 50 30 96 26 -131 121 85 -21
12263b1l6N0L1M0k6j63R1J49k6rj14q0K25j08K2m4l6JR9kj6J6j06N9j22J14m4
$$ -21 -57 -7 24 64 38 -125 -34 115 89 80 -34 -114 111 3 25 -19 -55 -54 45 43 27 43 -63 -4 -126 -12 -56
12290e6J49n1m4J30j91J1J2J07p6K2q9K15j01O8j56O6j8J9L1j32J00o2PpJ33n4
$$ -56 93 42 -2 128 -63 -52 -40 67 -9 13 -76 139 38 106 -50 16 -2 17 48 -84 16 -46 -39 -46 87 33
12316C3J1n7L4J2j9N0j21L6m2J11n7m3L1P7r0K4k9J08r4jk6K3O2K2J8r3J06j09
$$ 33 44 -13 21 33 14 64 -57 -21 -63 48 -9 -52 -21 56 -34 -10 -39 69 -25 -26 -52 -29 33 55 73 -20 86 -23
12344b3J3J69j68Q1l6k9K7p4M5q6J12o4k9J44j03K3J6Lm5J18p9JPL4q3L5J76j80
$$ -23 -10 159 -9 72 36 7 34 -40 5 -81 31 -33 -62 82 -21 2 18 21 -24 94 15 16 23 57 -26 9 185 5
12372EJ6J65k06J35j09L3k0q0K33j47k4o1ON9j09K04j44q5K81j58k1J13j19N6
$$ 5 21 186 -20 115 6 39 19 -61 172 25 1 -60 -54 5 -104 100 -44 -129 152 -6 -27 86 -33 23
12396B3nJ5q7K7J33j09r2J70m3p1k6J03j3l6O8m3N8k9L1K6j03M6K0j90J72J6m
$$ 23 18 33 -54 -27 106 -3 -95 75 32 -39 -65 38 25 -11 57 14 72 43 74 100 -3 43 63 -127 45 61 57
12423E7o6M3p1J9K0L8k0J2k2K2P6oj32L1q4J02M6j85j3J57o8NJ24j78K17j68N7
$$ 57 -9 34 -37 -18 2 40 20 32 10 32 108 102 -30 1 -83 19 65 -120 -133 24 -44 -39 85 -93 124 -44 13
12450A3j9K7L3J45k15m6M5Q8q2q6l6P5N3N7j09N1O9J9r0k7n5O4q9L0J78q4LjL4
$$ 13 -6 21 54 199 -16 -62 -17 71 -11 -97 -133 -58 -5 52 -57 -6 63 82 -8 -35 -90 -26 -115 -85 93 9 12 11 45
12479D5k9j01J03N8q3J03m8l3rn5l3N6K1j0j4O8rj04R5p2R1Nm2j02J22L7j21O9
$$ 45 16 -85 18 76 -7 96 48 15 6 -49 -82 -26 -5 -15 -29 39 30 -74 21 -51 40 45 3 -99 23 60 -61 8
12507Hq0M1N5J2L0q7P8j36J3K19k25J69m3j00M9K6N1j11R5L3j70O1J03r8L7K9
$$ 8 -72 -31 24 36 66 -21 57 -79 -66 153 -72 97 54 -46 3 29 80 -31 64 97 -73 -12 91 -7 30 59
12533E9K9o9n4O2L1RK7m9q1K7J11k7k36J64q2N1J60j51ML5r6N3Q9KL0r1J01p0
$$ 59 88 19 -35 27 58 67 94 45 -36 -9 102 75 -161 3 -79 -28 132 -19 -15 20 -76 -23 66 68 98 7 108 38
12561C8M1l0j37J87k6j43P6%k5J3Q3q6O3k2j06J42r8J60j49J20Kj28k5K9Jm4M4
$$ 38 79 49 -88 99 73 -70 6 6 -19 -6 77 -9 54 32 -74 68 -30 130 -19 101 103 -25 -50 -21 -20 -64 -20
12588b0q1K3N0J3J6k9o9M2J35j38Q9l6N8m1j21J38p7p8N4N6K4K1m5N1o4o9K01
$$ -20 -101 -78 -28 -15 1 -28 -97 -55 80 -58 31 -5 53 12 -109 29 -48 -126 -72 -16 8 29 -16 35 -29 -98 103
12615A03K2r6O6j42l3m4R8J9n6K8q6J51K6j7L5r2j5J8J91j98J56j50j4J0k0k2
$$ 103 125 29 95 -47 -80 -124 -26 -7 -63 -35 -121 30 56 39 74 -18 -33 -15 176 -22 134 -16 -30 -20 -40 -62
12641f2M8M3q3O6J2p3J23l7N8j33M4J07J2j51r4J03QP1j1p7pm9J37k2q7o7J13
$$ -62 -14 29 -54 12 24 -49 74 37 95 -38 6 113 125 -26 -120 -17 -9 62 51 -26 -33 -82 55 33 -54 -121 -8
12668hJ06n0nl0j6J3k2m4J89k04J06j05Q7k9q6K42j47K5r8N6M2J3j50J2J73J4
$$ -8 98 48 43 13 -3 10 -12 -56 133 -71 35 -70 17 -12 -98 144 -3 22 -76 -20 22 35 -115 -103 70 84
12694H4r4K0K6o8O8o3l4m3PQ2K9j59K21j01L8j52P6J8l2RJ42o4K8K5j21J34m9
$$ 84 -10 10 36 -32 36 -27 -61 -104 -97 -15 14 -145 76 -25 13 -139 -63 -45 -77 -68 74 10 38 63 -58 76 27
12721B7l6qQN4j81J12J51j46l3J16j12lN5P9Nj50K7N4k0N6j7j08M6O3p8M0nP3
$$ 27 -9 -17 -9 45 -136 -24 127 -19 -52 64 -48 -51 4 83 88 -62 -35 19 -1 55 38 -70 -24 39 -39 1 -4 69
12749F9l7L9j46P6j01J10L4r1K1j5j6J02m1J10q2j06J11n6N9q9J4m2J67n5L7k7
$$ 69 32 71 -75 1 -100 10 44 -47 -26 -41 -57 45 4 114 32 -74 37 -19 40 -49 -35 -77 90 35 72 45
12775D5k7m3P1m5J0J5o6J48p0L2o2N0q8J03o2k3J0p8R8l3J57p7n2j05J04p9J19
$$ 45 18 -25 46 1 11 26 -40 108 38 70 8 58 -30 73 11 -12 -2 -80 18 -15 142 65 13 -92 12 -67 52
12802E2q1O4L7j01K3j9Q7j52O0J3P6pO3q3r5Q8kj55J05n2J29l9m8K6K4N5m3PN1
$$ 52 -29 35 72 -29 -6 -25 62 -90 -30 -17 59 52 115 32 -63 25 23 -132 -27 -79 50 11 -37 -11 13 68 25 32 83
12831H3j14J03q8RJ5ol0q5Q3J6J32k8n6O3j95J42j58L0R8K9n0P4j12K00j94Jl9
$$ 83 -31 72 -16 -7 8 2 -28 -113 -30 -14 118 90 34 97 -98 44 -114 -84 14 43 -7 67 -45 155 -39 -38 -77
12858g7M8j7m5J22M5K7j41m2j1J88r3o1P0N1m7Mk3rj9P6q6j5N4k9j02J55m3Q0
$$ -77 -29 -46 -91 31 76 103 -38 -80 -91 97 4 -57 13 64 17 21 -2 -11 -30 46 -40 -55 -1 -30 -132 23 -20 60
12886F0q9m5N9N3k1qO9p2J3J05p2l5n7%R0m1O9o2mj11K02q1m7M7j2O3o3r4M8%
$$ 60 -29 -74 -15 38 17 9 78 6 19 124 52 17 -40 -40 50 9 78 16 12 -99 103 22 -25 22 10 73 10 -84 -36 -36
12916c6J1k7j7Q6J5m9jM4N4r5l9J74L7k04L3M3p4J07o8J11j76K24k43q5J27J31
$$ -36 -25 -52 -69 17 32 -17 -18 26 80 -15 -54 120 157 -47 -14 29 -45 62 -6 105 -71 153 -90 -175 -48 83
12942H3j35J2M4l3J07p9K3p4n1P8J3l8r1J99j7j89J25q0J30j4l1J5k5ON0o3l2
$$ 83 -52 -40 4 -29 78 -1 22 -52 -103 -25 -12 -50 -141 58 41 -148 -23 -103 27 13 -18 -3 -28 -22 28 -35 -67
12969f7K3O3n0Q6K2n3k1q3j3J63j39Lk4J16P7l0p4M5q7P1j6J04j24j1N9l4j39
$$ -67 -44 19 -31 55 77 24 3 -80 -93 70 -69 -66 -90 26 103 73 -1 44 -43 28 12 116 -8 -19 40 6 -133
12996a33J87q4nN9J5j18J20L6j38MJ17k9K4R2p8j24OP5j12N8r7J41J0m6N2k8K8
$$ -133 54 -30 -35 24 39 -79 41 77 -61 -57 60 31 55 147 69 -55 -49 26 -86 -28 -125 16 26 -20 32 4 32
13023C2l3O7j8l8O6j61J58m8J9j4L3m8j24J01n8J36l6j23J88o3mJ4OJ8j08Q5r2
$$ 32 -1 66 48 10 76 -85 73 25 44 30 63 15 -109 -8 -66 70 34 -89 99 36 32 46 52 70 -38 47 -45
$$ [...]
16383F0
##END NTUPLES=NMR FID
##END=
