##TITLE=abcd
##JCAMPDX= 6.0         $$ Bruker NMR JCAMP-DX V2.0
##DATA TYPE= NMR FID
##DATA CLASS= NTUPLES
##ORIGIN= UXNMR, Bruker Analytische Messtechnik GmbH
##OWNER= root
$$ XWIN-NMR		Version 3.5
$$ Mon Jun 23 18:25:48 2025 Russian Standard Time (UT+4h)  servis@DPX200
##.OBSERVE FREQUENCY= 200.131235884673
##.OBSERVE NUCLEUS= ^1H
##.DELAY= (6, 6)
##.ACQUISITION MODE= SIMULTANEOUS
##.ACQUISITION SCHEME= undefined
##.AVERAGES= 32
##.DIGITISER RES= 18
##SPECTROMETER/DATA SYSTEM= spect
##.PULSE SEQUENCE= zg
##.SOLVENT NAME= CDCl3
##.SHIFT REFERENCE= (INTERNAL, CDCl3, 0, 16.5164)
##AUDIT TRAIL= $$ (NUMBER, WHEN, WHO, WHERE, WHAT)
$$ ##TITLE= Audit trail, XWIN-NMR		Version 3.5
$$ ##JCAMPDX= 5.01
$$ ##ORIGIN= Bruker BioSpin GmbH
$$ ##OWNER= servis
$$ F:\spectra/data/av/nmr/H1/1/audita.txt
$$ ##AUDIT TRAIL=  $$ (NUMBER, WHEN, WHO, WHERE, WHAT)
(   1,<2025-06-23 18:20:48.32 +0400>,<servis>,<DPX200>,
      <created by zg, POWCHK disabled, PULCHK disabled
       configuration hash MD5:
       00 E9 B6 7A A2 85 ED C7 34 08 36 98 17 FE 4E 26
       data hash MD5: 32K
       94 81 B9 6F 41 72 93 96 34 88 6F 96 DF A1 6A 52>)
$$ ##END=
$$ 
$$ hash MD5
$$ AD EB D8 28 84 FC C5 1C 6B 04 3B EC F9 CE 2B D5
##$RELAX= 
##$RELAX= 
##$RELAX= 
##$RELAX= 
##$RELAX= 
##$RELAX= 
##$RELAX= 
##$RELAX= 
$$ Bruker specific parameters
$$ --------------------------
##$DU= <F:\spectra>
##$EXPNO= 1
##$NAME= <H1>
##$PROCNO= 1
##$TYPE= <nmr>
##$USER= <av>
##$AMP= (0..31)
100 100 100 100 100 100 100 100 100 100 100 100 100 100 100 100 100 100 
100 100 100 100 100 100 100 100 100 100 100 100 100 100 
##$AQSEQ= 0
##$AQ_mod= 1
##$AUNM= <au_zg>
##$AUTOPOS= <>
##$BF1= 200.13
##$BF2= 200.13
##$BF3= 200.13
##$BF4= 200.13
##$BF5= 500.13
##$BF6= 500.13
##$BF7= 500.13
##$BF8= 500.13
##$BYTORDA= 1
##$CFDGTYP= 0
##$CFRGTYP= 5
##$CHEMSTR= <none>
##$CNST= (0..31)
1 1 145 1 1 1 1 1 1 1 1 1 1 1 1 1 1 1 1 1 1 1 1 1 1 1 1 1 1 1 1 1 
##$CPDPRG= <>
##$CPDPRG1= <>
##$CPDPRG2= <>
##$CPDPRG3= <>
##$CPDPRG4= <mlev>
##$CPDPRG5= <mlev>
##$CPDPRG6= <mlev>
##$CPDPRG7= <mlev>
##$CPDPRG8= <mlev>
##$CPDPRGB= <>
##$CPDPRGT= <>
##$D= (0..31)
0 2 0 0 0 0 0 0 0 0.06 0 0 0 0 0 0 0.0002 0 0 0 0 0 0 0 0 0 0 0 0 0 0 
0 
##$DATE= 1750688447
##$DBL= (0..7)
120 120 120 120 120 120 120 120 
##$DBP= (0..7)
150 150 150 150 150 150 150 150 
##$DBP07= 0
##$DBPNAM0= <>
##$DBPNAM1= <>
##$DBPNAM2= <>
##$DBPNAM3= <>
##$DBPNAM4= <>
##$DBPNAM5= <>
##$DBPNAM6= <>
##$DBPNAM7= <>
##$DBPOAL= (0..7)
0.5 0.5 0.5 0.5 0.5 0.5 0.5 0.5 
##$DBPOFFS= (0..7)
0 0 0 0 0 0 0 0 
##$DE= 6
##$DECBNUC= <off>
##$DECIM= 32
##$DECNUC= <off>
##$DECSTAT= 4
##$DIGMOD= 1
##$DIGTYP= 9
##$DL= (0..7)
0 120 120 120 120 120 120 120 
##$DP= (0..7)
150 150 150 150 150 150 150 150 
##$DP07= 0
##$DPNAME0= <>
##$DPNAME1= <>
##$DPNAME2= <>
##$DPNAME3= <>
##$DPNAME4= <>
##$DPNAME5= <>
##$DPNAME6= <>
##$DPNAME7= <>
##$DPOAL= (0..7)
0.5 0.5 0.5 0.5 0.5 0.5 0.5 0.5 
##$DPOFFS= (0..7)
0 0 0 0 0 0 0 0 
##$DQDMODE= 0
##$DR= 18
##$DS= 0
##$DSLIST= <SSSSSSSSSSSSSSS>
##$DSPFIRM= 0
$$ [...]
##$SUBNAM0= <"">
##$SUBNAM1= <"">
##$SUBNAM2= <"">
##$SUBNAM3= <"">
##$SUBNAM4= <"">
##$SUBNAM5= <"">
##$SUBNAM6= <"">
##$SUBNAM7= <"">
##$SUBNAM8= <"">
##$SUBNAM9= <"">
##$SW= 20.6817932712277
##$SWIBOX= (0..15)
0 0 3 0 0 0 0 0 0 0 0 0 0 0 0 0 
##$SW_h= 4139.07284768212
##$TD= 32768
##$TD0= 1
##$TE= 0
##$TE2= 300
##$TE3= 300
##$TEG= 300
##$TL= (0..7)
0 120 120 120 120 120 120 120 
##$TP= (0..7)
150 150 150 150 150 150 150 150 
##$TP07= 0
##$TPNAME0= <>
##$TPNAME1= <>
##$TPNAME2= <>
##$TPNAME3= <>
##$TPNAME4= <>
##$TPNAME5= <>
##$TPNAME6= <>
##$TPNAME7= <>
##$TPOAL= (0..7)
0.5 0.5 0.5 0.5 0.5 0.5 0.5 0.5 
##$TPOFFS= (0..7)
0 0 0 0 0 0 0 0 
##$TUNHIN= 0
##$TUNHOUT= 0
##$TUNXOUT= 0
##$USERA1= <user>
##$USERA2= <user>
##$USERA3= <user>
##$USERA4= <user>
##$USERA5= <user>
##$V9= 5
##$VALIST= <valist>
##$VCLIST= <CCCCCCCCCCCCCCC>
##$VD= 0
##$VDLIST= <DDDDDDDDDDDDDDD>
##$VPLIST= <PPPPPPPPPPPPPPP>
##$VTLIST= <TTTTTTTTTTTTTTT>
##$WBST= 1024
##$WBSW= 30
##$XGAIN= (0..3)
0 0 0 0 
##$XL= 0
##$YL= 0
##$YMAX_a= 524905
##$YMIN_a= -513720
##$ZGOPTNS= <>
##$ZL1= 120
##$ZL2= 120
##$ZL3= 120
##$ZL4= 120
##$ABSF1= 10
##$ABSF2= 0
##$ABSG= 5
##$ABSL= 3
##$ALPHA= 0
##$AQORDER= 0
##$ASSFAC= 0
##$ASSFACI= 0
##$ASSFACX= 0
##$ASSWID= 0
##$AUNMP= <proc_1d>
##$AZFE= 0.1
##$AZFW= 0.1
##$BCFW= 1
##$BC_mod= 2
##$BYTORDP= 0
##$COROFFS= 0
##$CY= 19
##$DATMOD= 1
##$DC= 2
##$DFILT= <>
##$DTYPP= 0
##$F1P= 11.0000007629395
##$F2P= -0.999999237060547
##$FCOR= 0.5
##$FTSIZE= 0
##$FT_mod= 4
##$GAMMA= 1
##$GB= 1
##$INTBC= 1
##$INTSCL= 1
##$ISEN= 128
##$LB= 0.05
##$LEV0= 0
##$LPBIN= 0
##$MAXI= 10000
##$MC2= 0
##$MEAN= 0
##$ME_mod= 0
##$MI= 0
##$NCOEF= 0
##$NC_proc= 0
##$NLEV= 6
##$NOISF1= 0
##$NOISF2= 0
##$NSP= 1
##$NTH_PI= 0
##$NZP= 0
##$OFFSET= 16.51637
##$PC= 1
##$PHC0= -271.2557
##$PHC1= 1.101538
##$PH_mod= 0
##$PKNL= yes
##$PPARMOD= 0
##$PSCAL= 4
##$PSIGN= 0
##$REVERSE= no
##$SF= 200.13
##$SI= 16384
##$SIGF1= 0
##$SIGF2= 0
##$SINO= 400
##$SIOLD= 16384
##$SREGLST= <1H.CDCl3>
##$SSB= 0
##$STSI= 0
##$STSR= 0
##$SW_p= 4139.07284768211
##$SYMM= 0
##$S_DEV= 0
##$TDeff= 0
##$TDoff= 0
##$TI= <>
##$TILT= no
##$TM1= 0
##$TM2= 0
##$TOPLEV= 0
##$USERP1= <user>
##$USERP2= <user>
##$USERP3= <user>
##$USERP4= <user>
##$USERP5= <user>
##$WDW= 1
##$XDIM= 8192
##$YMAX_p= 0
##$YMIN_p= 0
$$ End of Bruker specific parameters
$$ ---------------------------------
##NTUPLES= NMR FID
##VAR_NAME=  TIME,          FID/REAL,        FID/IMAG
##SYMBOL=    X,             R,               I
##VAR_TYPE=  INDEPENDENT,   DEPENDENT,       DEPENDENT
##VAR_FORM=  AFFN,          ASDF,            ASDF
##VAR_DIM=   16384,         16384,           16384
##UNITS=     SECONDS,       ARBITRARY UNITS, ARBITRARY UNITS
##FACTOR=    0.0002416,     1,               1
##FIRST=     0,             0,               0
##LAST=      3.9581328,     0,               0
##MIN=       0,             -513720,         0
##MAX=       3.9581328,     524905,          0
$$ Real data points
##PAGE= N=1
##DATA TABLE= (X++(R..R)), XYDATA
$$ [...]
4358 -43 -132 90 219 -166 -312 -46 152 -20 -207 84 132 116 -238 -71 146 65 -95 -106 200 67 -52 -189
4380 -189 122 175 -41 -254 -30 261 131 -195 12 275 30 -180 -190 272 68 -93 -153 184 223 -123 -246
4401 -246 65 261 -35 -206 -16 81 69 -181 -44 238 75 -192 -134 218 228 -129 -255 41 388 -24 -185
4422 -185 -13 191 -50 -206 -28 263 176 -147 -59 131 156 -215 -210 183 164 -44 -53 60 263 23 -266 21 212
4445 212 72 -125 5 269 49 -65 -169 103 116 -240 -63 270 177 -59 -55 76 185 -19 -182 -143 153 69
4467 69 -253 -70 218 119 -125 -143 164 125 -81 -154 81 303 -174 -149 -23 339 -121 -179 10 171 98 -159 -95
4490 -95 182 192 -110 -159 137 188 -120 -195 -12 255 -11 -362 46 263 -22 -215 -185 256 94 -232 -144 82
4512 82 253 -94 -159 52 323 -59 -191 -139 234 -111 -303 -121 171 83 -262 -199 161 218 -216 -121 150 276
4534 276 -184 -356 81 269 0 -209 11 102 95 -315 -123 191 144 -224 -38 151 157 -274 -87 251 217 -76
4556 -76 -159 -24 213 -36 -266 -93 273 11 -177 -72 210 156 -55 -178 189 195 -148 -114 182 267 -33 -123 -28
4579 -28 299 -25 -102 -40 335 116 -187 -142 333 87 -220 -107 156 232 -68 -149 49 139 -43 -330 102 213
4601 213 -28 -201 -74 190 188 -171 -153 138 118 -105 -169 157 163 -40 -202 176 168 -27 -170 -31 336 -32 -213
4624 -213 -36 257 36 -131 -59 22 101 -150 -174 20 199 -58 -268 102 249 26 -141 68 213 80 -193
4645 -193 -31 139 88 -235 -219 31 239 -115 -268 43 224 11 -142 79 260 82 -133 -153 196 50 -118
4666 -118 -109 39 123 -179 -188 109 113 -41 -87 36 163 92 -136 11 160 121 -82 -116 162 9 -1 -236 127 266
4690 266 4 -41 -123 150 -41 -130 14 163 -17 -182 -62 121 254 -165 -45 62 50 -22 -171 79 164 -136
4712 -136 -188 89 232 47 -111 77 247 153 -84 -14 244 101 -2 -156 44 257 64 -134 67 291 -43
4733 -43 -167 32 87 122 -183 -133 197 5 -166 -49 118 191 -200 -180 92 200 4 -184 72 281 12 -114
4755 -114 33 208 -46 -222 -110 238 66 -95 -169 98 187 -122 -107 215 287 -56 -281 182 234 32 -186 -44
4777 -44 242 65 -177 -31 248 110 -160 -22 194 155 -35 -143 66 115 -132 -161 -31 194 -51 -179 1
4798 1 377 94 -329 -105 73 131 -67 -142 91 206 -128 -163 58 179 106 -157 67 255 33 -193 -21 219
4820 219 170 -211 -28 228 154 -221 -8 59 132 -141 -294 35 223 41 -216 -82 392 37 -187 -2 318
4841 318 141 -194 -136 124 217 12 -270 28 184 -113 -245 -24 215 -116 -266 -13 135 167 -109 124 196
4862 196 188 -184 -204 166 159 -116 -318 110 226 -38 -338 70 166 34 -238 43 179 53 -169 -124 180 146 -55
4885 -55 -202 33 307 -119 -315 -2 146 58 -128 -54 177 147 -119 -115 162 187 -153 -90 133 192 -73 -203 38
4908 38 111 -70 -185 -45 128 159 -103 41 195 153 -104 -103 226 274 -192 -233 153 32 39 -165 13 295 150
4931 150 -198 13 196 96 -63 -138 127 166 -206 -165 56 165 -30 -77 108 205 -1 -177 -116 186 29 -119
4953 -119 -84 156 135 -172 -192 170 87 -92 -240 35 132 -41 -241 -23 206 -4 -193 -52 237 203 -191 -150
4975 -150 155 136 -220 -208 45 295 -101 -275 -7 163 -54 -127 -26 157 93 -130 -72 175 142 -212 -242 193
4997 193 99 -191 -183 119 249 3 -183 68 286 23 -277 12 170 118 -106 -84 177 184 -152 -172 85 137 -106
5020 -106 -115 177 264 108 -153 90 216 108 -187 -198 263 89 -144 -101 24 236 -76 -153 31 177 -80 -153
5042 -153 -16 275 -114 -104 -48 138 49 -73 -110 57 35 -153 -79 78 28 9 -155 8 198 68 -125 36 185
5065 185 50 -51 0 202 -108 -218 -65 213 81 -149 -91 145 -14 -115 -93 120 175 -42 -129 -43 159 13
5087 13 -262 27 97 -87 -126 -190 60 46 -12 -197 79 187 -1 -270 124 211 15 -204 -98 189 72 -101
5109 -101 -45 36 59 -147 -170 66 133 30 -144 76 178 -81 -203 27 36 -50 -198 -72 155 -93 -187 -196 192 174
5133 174 -177 -170 11 242 -36 -86 30 186 -21 -165 -1 103 0 -224 -140 135 79 -246 -42 156 159 -22
5155 -22 -288 45 178 74 -151 -63 133 58 -261 -139 191 193 -268 -119 316 96 9 -135 89 226 -58 -99
5177 -99 93 197 126 -284 4 225 30 -214 -99 205 224 -243 -127 88 232 -141 -117 18 267 -87 -293
5198 -293 -49 279 64 -229 -209 191 113 -197 -14 313 160 -162 -74 160 226 -103 -270 23 167 7 -228
5219 -228 31 369 12 -167 -70 232 179 -118 -82 136 220 -131 -276 108 227 -53 -252 58 219 31 -339
5240 -339 -7 242 62 -218 -88 225 282 -181 -137 184 222 -128 -346 85 308 -14 -323 -51 220 192 -186
5261 -186 -183 265 55 -55 -54 255 263 -75 -116 146 290 -12 -243 -125 192 -36 -243 -112 261 135 -140 -114 276
5284 276 267 -183 -162 190 236 -108 -162 -14 246 -1 -284 -41 193 70 -132 -97 83 114 -166 -111 63 141 -67
5307 -67 -162 186 241 -5 -225 -48 249 -21 -199 107 337 119 -28 -150 132 297 -135 -178 10 166 -7
5328 -7 -169 56 4 156 -172 -31 229 83 -83 -112 92 129 -38 -133 1 167 -45 -118 105 223 64 -266
5350 -266 22 307 4 -56 -61 303 141 -155 -95 80 129 -92 -79 -5 275 -89 -218 98 376 50 -168 -58
5372 -58 321 71 -261 -140 77 85 -174 -191 129 219 -25 -302 56 213 -132 -195 104 139 48 -162 -64 111 54
5395 54 -108 -92 256 199 -206 -236 137 136 -55 -219 69 313 61 -170 -1 143 30 -100 -138 217 147 -94 -191
5418 -191 185 265 -163 -182 166 202 -166 -249 1 229 65 -185 -161 110 163 -160 -104 138 124 -145 -118 144 122
5441 122 -60 -131 -18 261 66 -149 19 310 201 -215 -23 270 -7 -118 -115 156 -16 -143 -65 62 187
5462 187 14 -150 72 245 50 -271 -17 235 -13 -168 -64 129 -109 -213 -173 60 142 -116 -136 33 249
5483 249 -72 -238 -42 163 -5 -251 -72 227 50 -160 -182 117 132 -53 -277 -55 103 -92 -144 117 212
5504 212 -68 -145 75 255 99 -172 -119 154 66 -149 -202 112 176 -106 -141 104 107 -98 -143 14 128 49 -197
5527 -197 -81 227 -43 -32 -117 156 103 -260 -149 145 54 -150 -202 60 352 -39 -191 8 189 8 -320 -202
5549 -202 200 202 -100 -127 160 215 5 -171 106 139 -147 -200 -61 196 -41 -220 -44 178 -49 -165 -4 128
5571 128 136 -70 -204 179 251 -8 -210 66 229 -65 -271 -129 223 107 -225 -154 145 -19 -54 -114 142 168
5593 168 -171 -142 78 319 -105 -148 132 192 -23 -239 -36 182 123 -123 -98 8 57 -168 -303 124 294 -78
5615 -78 -303 -2 121 25 -232 -138 119 -118 -189 -94 165 232 -181 -145 188 229 -169 -105 125 177 -72 -347 -19
5638 -19 195 18 -192 -109 241 -38 -176 -166 234 124 -181 -92 206 354 -12 -111 66 199 -36 -152 -64 186
5660 186 55 -111 -67 158 195 -105 -126 203 234 -96 -255 115 121 -62 -197 41 229 -119 -191 -103 132 35 -237
5683 -237 -82 78 103 -206 -101 174 132 -153 -242 -65 311 13 -204 -39 103 71 -204 49 100 15 -157 -92
5705 -92 177 199 -79 -104 91 124 -101 -137 80 105 142 -305 -69 66 65 -117 -81 117 74 -193 -100 126 173 -39
5729 -39 -38 28 63 -26 -276 50 182 -30 -221 -180 103 36 -60 2 20 250 -19 -123 -4 112 -48 -176 -13 153
5753 153 -17 -221 -85 136 28 -73 -35 86 165 -69 -256 57 137 -49 -189 -4 233 -36 -241 -147 94
5774 94 -8 -205 -11 177 49 -145 -249 179 191 79 -208 193 189 -129 -314 -53 257 87 -141 -44 89 130
5796 130 -109 -177 56 156 -18 -327 26 166 -9 -235 3 148 -1 -257 -97 88 62 -142 -211 103 183
5817 183 -179 -208 71 147 -79 -141 65 153 -89 -107 -102 118 144 -196 -39 190 89 -139 -157 101 212 -87 -158
5840 -158 4 65 -47 -69 5 203 -39 -235 -119 224 97 -275 -25 163 95 -115 -55 107 101 -109 -218 34
5862 34 212 -181 -93 62 229 73 -271 23 343 -53 -132 -95 82 97 -154 -208 12 80 -136 -52 48 150 -124
5885 -124 -170 104 157 153 -220 18 93 73 -132 -61 81 147 -198 -17 45 123 -115 -197 148 145 70 -162 82 -12 47
5910 47 -200 -46 60 129 -198 -112 -35 -13 -17 -18 124 159 -137 -41 62 62 48 -155 -31 86 53 -90 32 105 46 -286
5936 -286 -38 224 105 -89 -3 50 140 50 -124 14 90 -22 -95 -69 32 66 -115 -62 83 -6 -108 -65 -4 20
5960 20 -73 -251 123 148 38 -108 -122 100 -116 -194 -101 64 -2 -63 10 198 125 -6 -53 113 193 -6 -219 50
5984 50 208 -96 -129 26 76 57 -211 1 198 165 1 -81 179 198 -39 -113 68 21 35 -203 27 56 -72 -85
6008 -85 16 72 99 -130 -148 170 42 -156 -271 42 125 -74 -69 0 221 -41 -163 41 95 23 -89 -80 16 114 -246
6033 -246 -197 24 227 -127 -141 117 160 43 -222 8 169 78 -139 -100 186 18 -143 -88 168 184 -88 -143 122
6056 122 111 3 -226 98 96 35 -179 -109 92 -72 -114 -67 259 81 -331 -152 201 104 -97 -191 71 150 -37
6079 -37 -157 -37 208 68 -47 2 113 28 -45 -78 259 95 -196 -57 81 181 -11 -269 23 195 70 -156
6101 -156 81 258 19 -169 -186 244 102 -119 -110 202 196 -110 -260 -27 122 -87 -194 109 158 48 -170 -28
6123 -28 216 122 -128 -218 119 129 24 -205 8 121 -148 -183 10 169 -71 -158 -82 89 88 -80 -67 94 136 -71
6147 -71 -120 147 281 10 -109 -30 217 -86 -244 -3 220 -21 -144 -87 233 91 -210 -81 28 238 -11
6168 -11 -69 110 141 -124 -254 -161 92 -116 -106 49 206 102 -106 -8 196 143 -86 -20 18 80 -161 -165 54 92
6192 92 -53 -149 -52 133 71 -97 -195 115 95 -139 -80 52 93 -116 -278 80 80 -131 -222 -64 115 22 -94 40
6216 40 267 -46 -148 -96 150 184 -185 -82 24 86 -9 -226 9 174 -62 -196 -97 137 -51 -120 0 -9 110
6239 110 -37 -80 43 118 -52 -164 -11 103 -128 -118 -60 260 -76 -88 76 226 -16 -227 29 -55 -10 -82 -118
6262 -118 40 165 -57 -216 -13 130 -44 -57 28 79 -162 -124 34 96 20 -68 -13 8 10 -82 -203 86 219 -78
6286 -78 -110 50 57 6 -99 135 152 57 -20 -115 93 -10 -93 -135 120 144 -177 -2 140 -2 -51 -92 65 12 44
6311 44 -161 5 122 -7 -222 -165 84 33 -74 -134 168 -19 -39 -65 -3 95 -43 -2 39 231 -10 -144 -25
6334 -25 204 -107 -189 20 124 28 -45 -58 -151 144 32 -156 94 154 -116 -38 -18 -2 -22 -83 48 235 6 -237
6358 -237 2 66 126 -101 -78 138 103 -131 -130 136 140 -26 -174 56 152 -57 -207 -67 121 -4 0 -113 158 51
6382 51 -134 -67 37 116 -155 -167 38 174 103 -93 -10 78 -10 -186 10 120 91 -184 -112 27 113 -32 -169 81
6406 81 129 11 -258 -157 106 105 -115 -96 50 154 -74 -83 226 183 -113 -40 -34 258 -25 -63 -16 74 21 -186 -17
6431 -17 78 78 -206 -153 154 110 -82 -82 76 29 37 -196 -1 23 115 -135 -64 83 89 -221 -133 153 -38 -91 11 76
6457 76 118 -106 -171 -176 130 49 -269 12 36 -6 -125 -81 186 89 -226 -84 167 189 -66 -104 19 125 -84 -248
6481 -248 49 143 -56 -138 8 178 -19 -143 -40 152 60 -98 -98 48 142 -67 -115 30 156 -64 -87 13 183
6504 183 2 -191 -74 121 51 -164 -67 114 135 29 -176 78 113 -245 -181 -115 138 -53 -135 -45 83 32 -36
6527 -36 20 62 160 -140 -83 72 40 -197 -154 -32 20 -59 -39 138 143 56 -120 -34 130 48 -29 -104 160 35 -106 -111
6553 -111 37 79 -68 -157 23 65 -25 -22 -44 87 -3 -113 39 42 75 -132 -42 34 222 -128 -47 87 114 12 -68
6578 -68 22 99 -79 -68 12 -9 43 -6 -10 2 -51 -84 83 3 39 -138 -78 12 5 93 -26 -11 84 -50 -94 -8 96 -3
6606 -3 -149 72 -7 -44 -7 -251 66 78 -188 -89 78 54 -108 -109 23 102 77 -46 -36 30 63 -65 -85 42 89 -104
6632 -104 -131 144 -45 -120 -30 -32 133 26 -141 -15 80 -52 -64 -3 -26 -17 -78 -50 -16 44 5 -137 69 54 -17 31
6658 31 50 181 -39 -136 -18 51 116 -123 -199 64 -4 -80 -25 68 63 18 22 20 79 120 -108 -291 80 -58 -77 -33 226
6685 226 86 -67 -62 15 12 -57 -116 19 19 -3 -110 -4 90 63 -65 -5 51 -75 -116 -23 38 29 -55 -130 71 82 -9 -265
6713 -265 -43 115 31 5 -130 17 -43 -29 52 106 71 -127 -104 -8 -44 -40 -30 18 117 34 -2 25 -83 58 -177 49
6739 49 -72 -48 18 -21 139 131 -66 -89 45 117 -53 -9 183 80 7 -103 18 144 -20 -49 -36 54 -28 -56 18
6764 18 28 76 -119 16 199 42 16 -173 26 43 7 -3 49 31 -43 -22 -93 92 131 -211 -39 85 4 -132 -22
6789 -22 22 22 -19 -124 78 13 -54 -54 -24 35 -25 -52 -17 48 42 -62 -134 169 -29 3 -112 27 112 -28 20 -94 189
6816 189 45 -121 -140 64 -5 -111 -1 139 117 -60 2 32 135 101 -89 34 -37 86 -76 -81 91 7 111
6839 111 -1 -14 71 60 -143 10 -18 -56 -75 -48 -33 13 -81 -55 38 -8 -51 -28 69 -20 29 -22 30 90 -10 -116 86
6866 86 103 22 -101 -3 74 11 -82 -81 138 -62 -134 -8 17 134 -111 -37 20 10 -29 -166 -47 98 -5 -134 -43
6891 -43 -78 -58 -40 -22 85 70 -127 32 221 23 -8 -17 46 -35 -20 -98 -126 197 60 -126 -25 170 -65 -107 164
6916 164 -47 23 -147 -91 74 -8 45 52 82 -41 -124 46 -83 60 -48 -74 77 79 69 -55 -122 -47 66 -160 -102
6941 -102 -122 37 2 -84 -133 142 -103 -32 43 68 -7 -74 -111 167 -18 -143 -77 102 139 -17 5 -15 226 -45 -83
6966 -83 101 115 27 -44 -49 150 12 -89 -32 25 91 -36 -18 -25 145 -116 -132 80 -100 -60 -38 -6 84 40 12 94 113
6993 113 -166 -4 -212 -50 32 -62 -148 -20 144 -95 -80 173 124 -148 -5 85 86 -44 -65 -28 63 17 -90 13
7017 13 -6 68 -10 -153 36 54 -115 -56 -8 104 52 -69 10 23 114 -20 -72 -34 15 -43 35 -33 11 -48 2 -26 -39
7044 -39 -97 -86 -48 55 82 -79 -29 -44 62 -89 -52 20 -20 -118 -1 -69 21 -77 66 52 42 -53 -48 39 103 -39 52
7071 52 152 64 -7 -101 -10 16 172 123 58 13 91 -17 -68 19 84 65 -54 68 2 71 -18 -89 -21 80 -84 -17 -5
7098 -5 101 -39 -107 63 -9 131 -144 -39 96 42 -106 -108 -50 58 -103 134 48 -110 -24 21 -38 16 -6 -37 -17
7123 -17 -61 -8 -57 50 24 38 -23 -48 23 -54 -28 -178 73 -120 -22 -7 29 70 -109 -57 -133 94 105 -57 93 -34
7149 -34 46 -111 33 48 6 34 -145 50 70 19 -51 5 15 -144 -92 -56 115 25 -59 -37 -139 91 24 27 149 -53
7175 -53 -94 91 -3 106 31 -70 -3 78 0 -77 -59 72 15 9 9 57 124 -40 -74 23 61 -95 -40 143 220 58 -72
7202 -72 -44 34 -4 2 83 89 -26 -21 -121 29 57 -85 -16 1 -3 -35 -89 39 64 3 10 15 62 24 -74 90 66 46 68 -45
7232 -45 19 78 -111 -74 17 -76 12 -106 6 -54 -59 67 -47 29 108 69 -79 105 37 -6 -103 -7 90 -210 -15 16
7258 16 52 126 -135 101 132 41 -236 -21 53 93 50 16 14 -18 -31 -163 90 39 -57 -41 77 37 3 -88 -39 83 19
7285 19 19 -67 -42 -16 -105 -72 96 32 -94 -62 -1 132 -109 -11 -27 45 -84 -111 36 112 91 100 -129 48 17 18 -48 -25
7313 -25 -46 19 -100 60 23 42 -11 -36 -45 -44 5 -148 46 -92 -88 -5 98 85 -94 -1 30 -35 -143 -62 20 71 -81
7340 -81 -74 -99 54 14 8 -60 53 6 -36 -48 -12 97 29 90 -49 130 24 65 30 -3 -1 16 -29 51 17 -42 -60 86
7368 86 -1 -22 49 -38 70 -7 -77 -4 150 -90 -106 19 42 -25 2 -93 14 -114 -75 -79 -2 97 -24 51 -56 -42 -9
7395 -9 -33 65 72 60 -17 20 -115 70 -19 -136 72 -1 -47 -154 -112 46 -53 16 51 97 68 -61 -145 88 -14 -175
7421 -175 -136 135 30 -24 -10 -50 0 80 -187 111 -22 -1 53 -72 32 62 -91 52 68 -2 -12 6 28 -89 7
7446 7 72 110 61 -11 -122 77 -4 26 -44 20 14 -20 -5 -20 -4 -18 -7 -46 -192 46 8 66 9 -77 72 -86 -23 46
7474 46 69 -121 -40 52 -11 -26 -102 -15 65 -12 39 46 26 -107 -56 53 33 17 -45 -5 130 -30 -128 84 -54 71 -47
7501 -47 63 47 17 -63 -24 70 -24 -25 -30 44 -107 -5 -74 -60 -26 -44 42 29 -15 -54 1 -7 -5 -1 -37 -72 -83 70 -3 -125
7531 -125 126 62 58 -20 -2 151 60 55 60 8 -94 31 13 87 19 -50 6 -83 141 106 -14 102 170 -65 104 15 100
7558 100 172 11 -112 19 19 121 -7 40 132 -16 -87 -104 82 53 22 -83 31 67 11 -37 15 94 -5 -33 -25 -29 -24
7585 -24 -43 49 154 45 25 -97 47 95 -103 63 49 38 24 55 -100 47 -24 42 3 -6 -30 -79 -8 -49 39 126 -30
7612 -30 67 9 12 -45 39 129 -106 -79 -169 121 -42 51 -93 21 28 -35 -33 103 18 -13 166 92 136 -64 -102 25 54
7639 54 -21 -21 58 2 -7 -92 189 35 9 -6 51 92 175 -97 -44 -14 80 84 -43 16 45 70 -156 55 94 171 -138 126
7667 126 -8 52 15 -48 124 -14 -86 29 -43 -47 67 -73 3 -52 22 9 -125 83 69 51 -55 5 12 -76 -16 52
7693 52 11 -10 -39 35 -31 -8 -66 64 116 20 13 -44 -12 14 -65 24 49 51 -11 -28 31 117 -29 -35 43 -12 27 -57 53 58 -6
7724 -6 -8 -12 -29 58 102 -126 -32 47 -44 1 -76 -54 37 -122 103 -8 -17 121 33 -67 -25 -23 -18 73 -40 -48 -1 42 105 -36
7754 -36 45 -67 -107 80 97 13 59 -40 -74 -65 37 63 -37 -3 -38 23 -97 -22 -23 -31 -61 -31 50 130 -61 -52 -54 9 46 -20
7784 -20 -16 -2 61 35 -47 -65 26 50 8 107 55 48 -34 -90 101 -6 -69 -66 44 -6 -103 -31 -83 63 44 -5 -97 25 42
7813 42 -51 -25 55 1 -53 -97 -68 75 -10 106 8 -110 -26 -1 -33 -5 -83 -146 62 5 14 34 72 84 7 -45 -148 11
7841 11 48 -73 -18 122 -21 41 -70 -41 -33 -52 -38 86 -18 -72 90 1 -20 72 -4 -95 -46 -54 -54 -76 47 -86 -89 85
7869 85 19 51 -80 28 -10 133 183 83 -10 37 39 -59 24 -37 188 65 -118 124 93 78 -79 10 55 -52 119
7894 119 -29 87 103 14 -82 -81 -55 1 -37 -20 23 56 -12 86 -65 92 -79 -25 8 33 -5 55 -75 29 79 47 -50
7921 -50 -100 64 32 99 -12 -48 70 7 82 26 -8 -6 -7 -45 -11 -46 20 -111 9 57 84 -136 -7 29 42 25 -33 -40
7949 -40 51 19 -65 -8 -47 15 0 -60 32 -65 99 5 -64 21 -25 92 -56 21 92 94 79 36 -74 -24 -117 9 -2 168
7977 168 131 -45 79 1 -31 -38 -109 31 -107 58 8 -3 6 -85 8 107 33 -92 -9 83 116 15 49 81 -16 29 -10
8004 -10 -11 -94 -44 -57 -38 -17 11 -188 109 -56 -123 25 20 103 22 53 -12 -29 32 -46 79 -55 2 16 -35 76 66 39
8032 39 10 -26 -39 145 72 15 47 -31 -44 28 26 -48 -9 -21 -11 -43 -39 9 30 8 -126 18 -28 26 -47 -29 31 -40 126
8061 126 -96 8 102 51 -19 -10 6 161 -80 155 71 79 -224 -139 -10 -74 -41 -38 -92 64 -16 12 -26 0 161 11
8087 11 -11 14 116 37 54 -69 -34 58 -76 -129 -30 100 41 -18 67 33 135 -50 84 -4 -4 14 -63 -59 -6 -2 -28 -91
8115 -91 -40 -94 -33 148 27 81 -10 32 -10 46 -43 -55 -25 -62 -67 44 -42 -81 20 17 36 32 7 41 81 93 98 -59 -11 4
8145 4 59 34 52 -173 -44 -81 -64 -27 17 -1 -44 -44 -79 -68 -8 -13 93 26 -65 72 79 -33 -47 4 26 61 -29 17 50 38
8175 38 45 -37 49 67 21 5 89 62 20 -112 -132 -40 -83 40 -78 111 77 -70 -6 -14 -59 -77 -79 -92 2 -22 -20 15 69 -35
8205 -35 7 -21 -2 -87 25 76 -64 -30 -172 -8 18 -108 27 14 -42 -1 59 -45 -8 40 8 -104 -121 109 10 -54
8231 -54 95 22 -25 -140 -125 56 -36 -32 -115 109 19 132 11 36 79 -21 11 22 63 -23 -60 -37 -39 -90 -70 138 0
8258 0 -1 -28 -7 -28 -4 -40 54 92 -47 16 -96 -33 130 65 54 -33 -30 -27 48 -49 -32 -39 -38 124 32 111 -31 -12 -9 135 9
8289 9 14 -29 75 -1 35 -82 -30 128 -55 79 -9 -80 -47 -36 87 -1 72 -32 15 59 108 11 -8 103 -89 13
8315 13 152 -84 59 -17 -1 3 65 6 99 1 123 10 -35 -43 46 -11 -78 34 25 -118 -12 86 43 13 -66 -122 68
8342 68 -58 -7 -83 -104 46 6 -32 34 -81 24 66 -14 -5 125 -65 -64 -10 -80 37 -79 -23 146 -27 89 27 -37
8368 -37 -11 72 -37 103 122 52 59 35 120 91 20 13 -7 29 17 -23 42 133 -77 4 18 9 127 -24 23 52 1 45 55
8397 55 -79 0 6 -38 27 26 0 -12 31 103 -137 -68 103 67 36 -61 63 -63 13 -12 22 -6 -64 -97 29 46 127 -21
8425 -21 -20 -39 93 39 -22 18 19 82 5 -33 90 -18 -4 65 72 -16 64 30 85 10 -38 -30 8 129 107 1 -43 142 -48
8454 -48 -53 -79 -37 -15 12 17 -153 -8 2 -18 38 137 -136 17 114 48 -55 40 123 63 68 -33 -27 94 -83 -157 -56 138
8482 138 41 -10 100 18 46 -78 53 57 23 -23 -92 -111 -111 43 -44 41 92 -21 59 -41 42 -73 -208 147 130 -1
8508 -1 -13 -22 -31 71 59 17 6 157 -47 12 -13 -61 -20 14 66 30 -32 53 -57 103 -61 -36 6 33 26 122 30 -26 -129
8537 -129 -108 108 42 -14 -18 -48 -96 68 83 -74 9 -1 -106 -94 -194 -10 62 4 -45 -46 111 19 51 -30 -11 84 4
8564 4 -60 108 71 -14 -3 -25 142 81 -1 -44 9 -20 85 -100 -21 -17 73 -11 69 -46 -153 -30 42 79 -32 59 105
8591 105 62 -27 -24 23 75 -122 -7 20 -7 -25 -49 -79 115 69 -92 -34 -89 61 60 -31 -43 49 67 -34 -11 85 114 -154
8619 -154 54 -26 36 43 -61 -149 110 -40 8 -73 -99 -45 74 10 57 -34 -26 88 155 127 -48 -9 -35 171 110 79 50
8646 50 28 -34 -97 9 42 -3 -128 -62 -18 -44 -77 14 -8 -1 18 32 26 86 132 126 41 28 34 -52 -32 15 -96 77 52 21
8676 21 27 -63 -35 -22 -12 16 -20 110 84 5 -42 48 -13 -130 -52 -81 45 34 10 -5 -14 24 -33 78 -36 -61 -27 -16 -21
8705 -21 -15 2 -142 -49 -2 91 5 69 89 -6 -45 -128 26 150 15 103 -80 -26 6 86 112 -11 50 113 53 -33 -120 57
8733 57 -32 115 124 -21 -54 -21 -41 1 45 59 2 57 -111 55 -100 -22 -106 47 87 3 -169 46 -31 4 -5 37 129
8760 129 -37 -7 -51 3 133 9 -58 11 78 67 52 -83 143 -33 -59 27 51 38 24 41 -8 -8 74 -78 12 48 -54
8787 -54 20 -5 59 -2 13 82 -29 82 -53 -111 -33 57 4 -88 -87 92 -36 -157 43 44 148 11 23 98 82 -23
8813 -23 59 143 98 -93 -1 72 -93 -12 53 45 58 10 -32 10 28 18 19 197 111 119 -75 4 96 16 12 115 20 143 -50
8842 -50 -177 -73 10 17 16 18 -27 6 0 -72 87 56 -37 -74 -103 70 -9 -53 -52 135 23 -37 108 47 -15 -53 17 19 -18 85
8872 85 8 -50 6 -84 -63 101 42 17 -15 -38 -20 24 -128 -64 113 158 26 -34 70 -41 3 26 -58 -23 25 6 35
8899 35 -38 74 42 26 86 -79 -106 -13 20 18 48 -18 -97 9 55 -94 81 273 75 100 44 -61 -41 -75 3 -11 -30
8926 -30 8 62 -5 -57 121 -103 0 52 -124 108 35 81 21 43 54 89 85 14 -35 46 -49 60 -124 -20 46 -220
8952 -220 71 87 97 -56 -7 -32 40 49 44 42 78 29 61 12 98 -1 -53 187 71 -19 59 -31 36 -70 42 -14 -43 58
8980 58 -38 -97 -46 146 -154 1 17 92 -19 -102 94 45 1 95 50 -74 43 -50 -58 12 -3 78 -5 -49 -86 38 -22
9007 -22 99 -112 108 97 0 -56 2 40 10 -15 -12 80 54 26 -14 55 -10 -47 -120 -13 40 6 100 130 43 -86 -4 -53
9035 -53 -35 -6 70 -67 -3 -59 -12 59 81 52 -10 32 38 27 -45 -101 -73 25 28 -16 -9 -54 37 -2 125 15 1 9 87 -19
9065 -19 55 -110 -51 49 -100 169 138 57 -52 -87 -99 118 -5 -76 -108 57 1 -19 73 -35 44 17 -63 23 -34 -120
9091 -120 7 -88 -88 28 -40 39 66 36 27 -42 24 145 -26 3 -63 -4 -113 -51 -29 -47 -70 -20 71 -1 110 18 26 -62
9119 -62 -13 -57 22 135 137 -26 -63 -26 -2 -53 -22 3 -77 48 106 151 -29 -91 -35 -12 -12 -77 20 -56 2 -69 -68 26 96 115
9149 115 43 -23 62 75 14 6 16 44 40 56 -36 130 28 -17 22 8 100 -95 -1 -56 26 -22 -32 83 -17 11 73 -10
9177 -10 -26 -109 11 -36 -10 129 -78 -3 -29 -30 6 15 63 -86 -36 53 10 -45 7 -2 -34 44 46 -37 46 41 -6 25 90 97 -183
9208 -183 94 -46 -9 116 -5 -4 27 111 -87 -1 74 10 -9 -64 18 188 -37 6 -103 -112 100 -38 43 -6 -8 -65
9234 -65 -40 12 117 -16 -98 140 -4 24 -123 -18 -123 18 51 -5 132 12 13 -46 -93 -61 90 -20 104 -7
9258 -7 -1 -19 62 74 95 10 2 51 155 -26 28 -71 4 -28 3 107 -24 -20 92 -14 41 -29 1 -103 -11 72 -37 77
9286 77 49 86 -65 32 -71 -33 -87 -50 -56 -88 79 -77 6 -2 52 27 -20 44 67 36 60 83 56 -48 122 -117 87
9313 87 -5 -125 -97 62 84 13 -11 88 72 -98 -91 62 11 37 25 3 60 167 34 -65 9 -88 -85 -41 -35 -186 -9 -22
9341 -22 -8 -103 -19 8 -110 81 -10 10 -81 54 -32 35 13 -1 17 5 -43 -38 26 71 64 8 -27 -33 -81 50 25 -70 -87 -4
9371 -4 -77 11 -65 -21 -47 39 58 57 18 -45 110 38 -2 33 -25 32 13 -4 -103 41 103 0 -3 -38 44 3 2 -83 -10 29 -65
9402 -65 2 -32 112 123 25 83 -56 27 34 83 -30 -22 -4 63 -12 -31 -62 20 38 -62 -64 73 -106 29 -112 -18 47 -69
9430 -69 41 28 -83 -63 5 -3 -72 -55 -109 35 7 -15 38 3 103 -55 80 69 16 -55 -37 -7 -65 -51 -71 69 -64
9457 -64 -54 -116 -119 -18 43 35 -20 -31 -111 -7 -26 9 4 40 -41 29 -42 -22 -10 33 14 -25 79 -44 -2 50 -141 41 83
9486 83 137 3 -70 -21 136 25 -5 164 -128 60 -144 23 39 -19 -51 137 -42 -15 1 50 -71 -9 -12 -54 24
9511 24 38 8 -95 5 -112 7 47 101 98 -125 -36 -107 17 35 46 52 55 18 47 -78 22 17 24 59 68 19 30 44 -136
9540 -136 37 -11 -28 14 52 -41 122 45 -38 -53 48 -9 76 16 -13 23 101 -28 33 -20 -25 -24 -45 -25 -49 111 22 -45
9568 -45 -1 -24 93 -78 -47 -7 4 82 -79 9 62 94 17 -71 -116 175 64 27 38 -56 100 10 69 27 35 -24 6 -10
9596 -10 18 -22 -12 110 129 29 45 -40 -67 61 40 79 31 8 -78 -91 -5 -51 46 27 -135 -25 -144 -3 -69 105
9622 105 -58 87 -20 -21 30 30 -26 -111 38 29 24 -104 7 96 -36 53 28 45 -52 59 16 -179 -21 -110 -73 35
9648 35 14 26 -103 -17 39 36 79 120 -20 105 -89 -14 35 71 -68 103 1 31 -60 -40 -53 -92 54 4 18 76 37
9675 37 40 50 35 -97 48 139 28 5 11 -34 7 -19 38 -31 -125 -39 -105 -1 176 -96 -53 70 132 49 -42 -94 13
9702 13 -46 105 -22 49 39 -29 57 49 -2 -17 -82 -12 11 -41 -73 -40 31 -27 -40 -57 65 -27 106 -11 15 20 -12 -55 -8
9731 -8 -56 -57 -28 -83 2 -52 -114 48 63 74 -41 -56 62 -79 149 41 -32 -24 47 31 -49 -128 6 2 -108 -59 -7 95
9759 95 12 -19 48 -45 -47 72 -46 25 -73 -18 82 6 -87 4 27 -119 1 -25 84 -40 -123 117 -35 113 -29
9784 -29 44 20 98 -11 -9 30 -8 53 48 159 -109 -58 16 27 -33 48 -20 -24 48 -25 -30 13 15 24 -95 -71 64 -42 -15 -65
9814 -65 9 -79 -32 -4 -56 30 -1 -31 -57 -8 -15 -62 17 35 71 87 -2 25 -94 57 74 -32 41 30 6 -2 0 -159 -26
9843 -26 19 -52 -40 -28 -24 64 70 35 31 9 -16 -3 -117 -108 -98 17 88 6 -84 101 18 -54 -66 31 -70 -5 79 26 -53 -127
9873 -127 57 -99 -118 -127 -37 111 39 21 -93 87 139 -122 25 67 45 -139 64 48 -25 112 69 35 14 -101 22
9898 22 31 122 11 54 37 77 52 75 -109 -44 -78 -88 -88 -8 -59 -101 -19 13 67 -2 -12 -114 72 -103 31 -33 29 -44
9926 -44 5 -7 -24 -25 -38 61 118 170 7 0 19 -34 25 -87 -76 68 18 14 31 -27 -118 63 -104 -19 53 1 28 -32 7
9955 7 39 -7 -48 -20 -22 56 51 -26 76 -91 50 54 46 -37 -99 55 4 -123 7 -5 -32 -47 -42 151 107 -15 7 82 9
9984 9 -33 -63 66 -27 11 -11 22 -107 20 26 10 91 -12 -59 64 5 -54 13 -187 41 -5 4 -44 58 28 -2 -25 117
10012 117 42 46 -12 11 65 58 -45 0 -11 51 39 63 59 -35 45 -8 -107 47 -91 -40 -32 75 -11 -81 -23 90 89 -2 -8 -22
10042 -22 69 -11 -51 44 -49 132 -38 -127 -89 -44 2 7 37 -9 61 -77 -78 -65 -30 -2 -74 -99 25 -112 32 12 55 -14
10070 -14 21 -71 -26 28 80 44 -12 3 -15 71 -8 -9 -25 -79 -39 -4 -58 -25 -36 64 -28 -2 120 82 -76 -39 34 -18 12
10099 12 55 -17 -34 39 -140 52 -41 -6 -122 -61 42 32 11 -67 -25 -10 86 28 28 133 -134 -11 65 137 107 -12
10125 -12 -10 -108 43 122 -136 10 11 -37 -78 73 84 -5 45 113 24 -20 33 -42 21 33 78 51 16 -53 -35 -57 97 89 -34
10154 -34 -47 -12 75 1 60 48 111 -4 -15 -27 43 23 -46 122 55 -71 -94 -47 86 -77 46 15 8 70 -25 7 -95
10181 -95 -44 -18 -18 -38 -18 -62 -86 -18 98 64 69 -74 -13 28 22 -26 11 43 -16 -76 -118 5 39 -66 1 -40 -67 61 -68
10210 -68 12 52 -59 -92 118 -69 19 -95 129 -32 75 -76 116 2 -97 -143 -80 -110 142 36 -5 -7 -67 -76 -34
10235 -34 -3 30 95 5 -12 -145 67 -48 -26 -87 -90 -23 -98 -37 -42 18 51 68 4 42 -53 26 -28 -66 -50 -80 -11 8 -42
10264 -42 101 31 -57 68 95 -43 110 -60 -11 -23 77 52 -18 -53 82 -49 -112 53 -31 107 -62 83 10 125
10288 125 -30 -29 29 22 -58 -54 -47 20 -47 21 -31 -84 -106 33 5 63 87 33 -84 -55 -39 -65 93 -21 45 -125 35 -75
10316 -75 13 -72 45 -81 -28 62 56 -72 80 111 134 -78 -10 31 -91 -93 110 117 12 -96 84 31 105 -31 33 171
10342 171 40 87 -25 -88 -48 -111 17 -13 -73 -55 -87 22 43 -126 -28 60 -1 -69 -43 122 -74 -31 26 -10 102
10367 102 145 15 -142 103 120 117 -87 -53 13 42 -121 34 -15 31 12 45 79 -23 -6 65 80 -134 -81 80 -94
10392 -94 -83 25 -51 18 -36 33 25 -53 -2 37 -53 -81 150 -11 35 24 36 59 -46 66 15 6 93 -38 100 3 22
10419 22 67 -73 8 -38 55 -83 -10 -150 55 53 82 2 -99 112 -47 6 -64 37 -121 -34 149 35 41 -69 -122
10444 -122 -109 55 -39 1 -91 22 -81 59 56 -44 5 97 -20 120 34 36 -57 34 0 -12 -55 21 12 12 19 56 14 -22
10472 -22 29 36 -69 -25 0 96 20 -61 -7 5 14 -30 28 -41 -5 88 -82 53 19 18 -8 26 35 -72 -55 -70 -36 50 -55
10501 -55 -46 -9 -25 27 -7 15 -37 -101 18 9 -53 32 14 51 -119 -59 27 34 -28 20 -50 -29 65 -60 -52 8 4 -39 37 -94
10531 -94 -72 68 -58 -9 52 118 -9 -66 -68 -90 9 19 -96 11 -53 -25 -22 46 87 -21 -17 90 -65 -82 -84 -55 -117 48
10559 48 57 -147 58 17 -60 24 -111 46 49 50 -46 -29 -70 3 -36 -11 -130 54 77 -121 60 -41 71 -117 -42 -67
10585 -67 56 -30 28 16 70 -12 33 32 -81 -21 96 -63 -35 25 -147 72 15 -14 -108 -103 -39 89 10 -61 67 -136
10611 -136 15 45 82 -4 -4 -35 23 14 -4 58 -64 -70 -10 -59 115 61 8 -33 -50 -55 94 -123 86 -70 -14 81 -26
10638 -26 -98 -78 -17 -148 48 -69 -114 128 -131 -11 -35 -31 -74 -81 52 -41 -18 21 79 60 63 42 -140 -87 -23 -111 -45
10665 -45 -31 -69 4 -70 -3 105 131 79 44 64 32 -62 6 -35 -75 -148 -44 29 -17 21 44 41 87 13 -3 26 -65 -27 103
10694 103 -84 -107 -5 -21 56 -100 -21 47 -66 -12 68 -2 -92 -44 30 95 -11 65 46 -98 -37 -106 -39 -47 -35 -45 -20
10721 -20 -2 74 50 1 57 24 42 30 117 -8 -121 32 -53 47 -6 72 14 46 -181 -73 -165 55 -34 -5 -16 13
10747 13 -25 63 97 -26 -13 -12 7 -31 72 -40 0 -15 -9 -80 114 81 -26 -22 67 41 -64 19 115 -2 -66 -7 -36 6
10775 6 -55 -168 55 2 30 60 -130 38 32 -43 -45 42 39 -55 49 37 -152 -32 33 16 -8 -42 14 -26 47 27 -126 126
10803 126 8 -129 -68 120 179 72 -117 -21 68 -27 42 -29 -47 -4 -133 82 55 42 -35 108 -11 6 69 -61
10827 -61 -21 11 -14 38 111 -55 -87 -20 -47 -24 7 -10 67 96 -127 17 -8 55 -123 76 -11 -72 100 112 58 -6 131
10854 131 -16 38 -5 44 99 -113 -124 40 -39 -34 16 -3 39 32 -81 99 7 37 -10 -23 -28 44 27 136 141 -58 27 98
10882 98 59 -8 -22 2 22 -44 47 -8 -68 -27 -1 57 55 146 1 26 -14 -36 61 -98 -17 -35 -17 23 46 9 59 -29 56
10911 56 119 123 50 -58 18 -37 -106 -34 -22 -26 116 -116 58 5 -39 -27 -22 28 -45 -59 68 62 0 46 113 18 -20 55 40
10940 40 18 -62 26 -111 25 27 -72 -28 1 49 -46 31 2 55 20 14 -32 -61 34 59 -46 -86 -184 -10 40 -62 -48 15
10968 15 -28 -54 77 23 -22 78 -19 -56 52 -13 -127 52 70 -53 -48 19 -39 -56 -32 46 -83 16 -65 22 -52 -30 -18
10995 -18 63 -137 -56 -83 55 105 -43 -24 -68 2 -20 -185 74 133 45 62 -32 -7 -27 93 12 -4 78 1 -2 -15 -13 7
11023 7 -82 19 -4 -92 -124 63 32 -56 68 -52 118 -27 -19 74 55 -67 -120 -59 -41 -25 34 -12 91 25 -1 -5 102
11050 102 -57 -24 7 31 10 15 5 -67 -86 6 -75 -49 -63 54 86 -109 6 63 29 1 14 -46 86 -71 44 51 -50
11077 -50 -52 80 29 113 55 0 64 -85 -7 -31 -44 -54 83 131 -42 -75 77 -82 -7 -71 -29 -37 152 -74 117 -86
11103 -86 -88 -59 11 -109 34 -19 -17 -65 52 -166 75 -8 25 57 -85 130 100 54 88 34 -23 25 42 102 -59 -2 -76
11130 -76 118 -9 2 71 -112 -14 41 -140 19 -39 -33 -60 -104 -25 -67 -96 15 48 7 -17 -8 5 -27 31 -34 -129 -49 -73
11158 -73 -15 5 -72 6 38 -6 -57 2 19 34 -61 32 15 83 27 27 7 -42 26 -32 -56 22 54 69 20 -54 50 -28 -5 -65
11188 -65 65 -137 -33 -56 -62 -14 -12 -28 -23 -25 -101 -92 60 -4 67 25 29 -124 -81 64 -19 -59 -63 95 -22 23 -73 138 72
11217 72 -68 -59 22 60 -49 -38 -10 -27 -123 -47 -90 -53 -15 -45 0 -13 5 81 -43 -4 3 -68 61 -192 -113 -114 15 -53
11245 -53 46 -20 -36 -80 4 80 -45 30 18 80 16 13 -101 -61 -124 -45 48 71 -65 50 76 32 12 -8 84 28 6 4 80
11274 80 22 22 -34 -78 -2 45 28 -61 102 -44 -9 2 41 81 14 90 112 3 8 -35 32 -16 -74 131 -14 -81 -134 -9
11302 -9 -54 -1 -30 -47 52 -7 42 31 -29 5 -65 -67 -30 110 -11 40 -37 28 -22 -38 -48 -3 69 -9 -80 -241 -59 -26 -48
11331 -48 48 1 41 -64 3 -25 10 -87 -10 93 -4 2 60 17 -5 51 14 -87 90 20 -39 3 16 -96 16 -32 -33 -29
11359 -29 28 105 96 -110 -103 53 -33 -9 44 123 48 -41 -51 27 -85 -79 15 -30 -64 18 -71 5 20 81 -11 -2 -37 -103 9 -66
11389 -66 84 -89 84 38 50 -6 -51 -37 16 1 26 -13 -95 67 -53 -45 109 34 -38 1 12 4 50 -33 -118 -2 -18
11416 -18 7 -80 158 -7 89 -10 -10 11 -24 33 -137 -65 -23 -68 18 -75 -4 10 -32 13 0 -9 -142 122 89 -57 -41 69
11444 69 59 39 -45 -58 -47 124 -37 140 47 -1 20 1 -28 -79 15 -85 76 -19 103 21 -46 54 -27 -11 -50 127
11470 127 97 17 43 -39 -6 -58 -74 -84 -30 1 49 81 1 -40 42 4 31 121 101 9 -102 -59 -35 36 77 69 -48 78
11498 78 -50 -32 -147 -12 -36 72 11 76 -65 27 -24 69 6 -84 -109 42 16 40 -1 47 -18 -70 -88 -8 -78 5 -31
11525 -31 -20 -21 -71 -5 -20 46 85 86 -49 92 -84 -56 -13 38 18 -44 5 30 3 -8 48 16 21 88 81 119 24 100 70 -39
11555 -39 26 -16 -23 141 -61 120 -7 93 28 -11 35 -3 -124 -96 14 32 35 -111 56 10 -5 1 -76 -85 4 -24 -27 -31
11583 -31 -12 108 -46 187 32 29 40 51 -77 -14 92 138 20 -33 -25 -43 59 49 33 -25 -61 53 -24 -21 42 0 -66
11610 -66 21 91 -136 -114 6 16 3 33 -27 -61 -102 47 52 24 -64 13 -60 23 2 163 19 -52 38 58 56 -45 -33 10
11638 10 47 82 39 -50 -30 9 -50 -34 49 -126 -105 -33 20 -59 91 -52 27 90 -12 -51 -115 15 -39 20 157 -136
11664 -136 67 24 42 155 35 -22 -24 48 41 55 75 57 -1 -38 36 -40 37 -11 -34 128 73 11 -35 -33 -131 -57 27 -15 37
11693 37 -75 19 -12 39 26 -166 55 61 -25 -114 6 -65 -58 -56 14 32 49 -88 -89 10 -121 52 34 -34 -161 71 74 79
11721 79 120 129 -100 -192 0 103 -100 -45 74 14 17 -207 66 25 -25 -13 -28 -2 139 -76 115 -126 27 6 -54
11746 -54 7 4 7 150 46 68 104 -6 181 -94 -8 -14 43 45 -3 23 9 13 90 -12 27 129 -55 31 27 -62 -40 -51 91
11775 91 -94 -27 -94 -22 -61 73 14 159 76 -55 -67 -6 74 65 104 -87 -43 86 -28 81 110 -3 -51 -65 -72 -37
11801 -37 118 -50 71 42 -5 131 -56 138 -95 50 -42 -25 87 -58 -76 125 -4 -8 56 18 -19 -70 58 125
11825 125 58 70 -7 -27 25 124 40 0 103 7 41 80 -60 42 9 41 29 -65 1 77 66 109 -34 -1 2 -60 75
11852 75 -62 60 129 -31 96 -46 -24 22 -63 -74 -24 -73 123 -25 71 13 -59 98 -62 19 128 84 -40 -34 36
11877 36 22 -67 -24 45 -109 61 70 5 38 75 109 97 0 -17 24 85 74 -42 -117 -42 -14 69 -36 14 69 -77 -38 4
11905 4 -33 -49 -56 80 -97 10 -32 -69 -141 -65 -59 122 -94 94 42 -50 31 -80 0 140 108 -9 -83 -66 99 -21
11931 -21 103 26 -68 46 29 -21 21 -145 -5 -80 28 46 34 -91 1 62 101 -2 -4 -34 -30 62 34 8 -65 -38 -15
11958 -15 -36 -43 -73 68 12 46 -15 -30 -91 26 82 -44 -13 -38 -51 -85 -15 89 62 -14 32 54 1 35 -63 -60 58 -76
11986 -76 46 -32 -48 63 67 -18 51 7 50 51 90 -61 -125 -22 7 126 54 81 60 46 -127 -5 -1 57 -80 -56 51
12013 51 -99 -7 62 -77 -8 -98 61 17 -62 -111 121 -100 -91 40 35 43 -65 -57 -18 8 -57 -63 3 -47 2 107 -35 30
12041 30 51 51 -20 10 15 17 -85 -18 -90 -91 48 69 33 93 18 76 -90 52 -40 -2 12 -64 3 11 36 -94 45 -45 -14
12070 -14 5 -87 -78 -4 -8 -5 115 187 -35 121 -98 12 -37 15 10 -68 -6 -86 -31 2 115 -114 21 15 44 27 97 107
12098 107 35 19 17 -19 -34 -52 -29 -45 115 -37 22 2 -40 -53 -48 -14 28 -47 -71 -46 -59 12 10 -31 -4 -2 -86 -28 36 -33
12128 -33 108 15 -119 -53 73 -50 19 19 144 -33 -65 -47 -40 14 48 -20 74 -37 -18 -6 -24 -54 -76 -134 9 28 -158
12155 -158 -94 -48 82 15 -79 3 47 -77 -36 -112 -1 -80 36 -48 -82 -123 25 15 1 -31 58 43 -18 17 -9 -26 39
12182 39 81 -58 11 -20 31 89 -15 -137 68 76 30 -92 32 -62 58 -99 38 50 -159 -34 -43 -61 52 3 13
12207 13 51 62 42 -32 -4 -101 -123 -36 23 -61 7 -8 79 -80 30 47 -50 38 -3 74 6 -45 -68 49 60 15 106 45
12235 45 -34 7 -77 75 134 -16 -60 9 48 31 19 50 -37 38 2 -62 8 5 68 59 61 -54 -81 -25 -100 -94 -38 -97 5 -98
12265 -98 -52 19 -32 -96 47 25 67 42 28 37 129 32 103 24 -41 21 70 -52 -3 -31 4 26 13 -96 -75 39 -86 35
12293 35 25 -28 -35 2 -93 60 -17 -26 159 -19 -12 -29 78 -54 -21 55 -18 48 -98 17 -66 53 -149 -41 -77 26
12319 26 -73 49 -102 66 -14 23 10 11 -31 -180 28 86 -1 -63 -6 35 58 -17 108 -14 99 3 -40 35 -28 52
12345 52 -53 -44 20 -49 5 -26 76 38 26 -24 26 0 117 -98 120 46 -67 27 -95 -99 -60 -121 -2 45 -15 25 26
12372 26 9 -187 -5 -23 -65 -86 88 93 66 -94 52 35 3 -81 82 78 103 -121 -15 -43 -37 -66 -81 -80 8 -9 20 15
12400 15 -16 -31 108 -81 -63 30 88 86 9 -59 -10 8 38 -22 21 169 -54 8 -36 -39 34 59 -48 -19 61 -76 -62 -12
12428 -12 50 74 3 7 69 135 0 -8 33 28 8 20 -32 58 -30 50 -76 72 -150 25 5 -100 8 23 61 -26 -78 -50
12456 -50 52 100 16 55 85 -11 -35 -25 106 -9 42 15 -27 16 -43 -64 69 45 96 12 -52 1 17 -31 31 -31 87
12483 87 31 23 -35 -40 -65 -24 17 39 18 92 69 17 -22 46 11 49 -84 -53 57 -43 -9 -4 -55 -42 54 -30 72 26 -62
12512 -62 119 -41 70 33 21 -57 0 85 25 32 -57 -47 58 48 27 11 40 -42 36 -37 -40 -19 -29 -119 -72 47 -26 -68
12540 -68 17 113 31 -18 -34 63 -40 -38 -21 -12 0 -75 42 27 -28 -52 -34 36 -64 -97 -47 16 48 -96 -52 121 11 28
12568 28 -96 -9 20 -73 -1 -70 80 -36 -81 35 27 -106 -18 27 -29 25 -113 -18 -50 66 34 -19 45 -22 -49 66
12594 66 80 10 -72 -35 -19 18 -69 58 -21 -14 -71 14 36 -6 -15 12 22 135 1 -116 69 -10 44 -71 17 -27 -32 28
12622 28 3 -149 27 5 39 51 44 -107 -10 -123 21 0 -21 -2 3 43 8 15 77 -120 83 7 -38 -24 23 -74 29
12649 29 -73 -19 48 7 59 -6 89 -14 -1 -46 8 -34 -16 77 36 -23 96 79 171 25 -105 71 -38 -208 -27
12674 -27 -46 27 25 21 -33 25 -63 53 -26 80 79 -51 74 -80 31 -97 -59 -25 77 42 33 -7 34 26 -54 -21 -114 -49
12702 -49 -44 22 44 -27 -77 50 70 -53 19 41 -54 24 -32 -31 152 58 -9 -16 59 -26 -94 29 7 97 60 6 17 87 52
12731 52 35 -40 68 -130 -83 43 -50 -19 -79 23 -6 -53 -1 -50 -103 -57 -92 -46 -53 -81 -61 -29 44 88 32 121 -2 -38
12759 -38 -48 -58 -93 54 3 -15 -10 -147 -7 -44 -21 71 69 -62 -11 15 -37 -26 14 2 -60 47 -82 -46 17 -14 -7 103
12787 103 98 -131 -35 -109 -16 -114 20 -28 79 57 0 57 45 -17 -19 -46 76 12 105 83 -26 -158 -57 91 87 121 100
12814 100 -37 -33 65 28 -13 -21 31 0 -46 7 35 47 5 -128 53 76 -50 25 -19 -83 -122 12 -55 115 224 -68
12840 -68 -32 -29 15 -12 -88 -179 117 -56 39 36 -118 -24 -54 -43 29 48 -53 64 52 -46 -6 -2 2 91 9 -10 -57 127 56
12869 56 -33 64 -32 -122 43 -81 36 2 -123 50 -42 -72 -42 -49 32 -30 5 -48 84 47 -2 130 -11 -10 6 2 -35
12896 -35 -66 -90 18 -32 55 1 -37 59 86 97 37 -53 -131 38 -21 -29 -37 -97 -3 -35 -10 -5 6 -8 -147 6 -24 30 -7
12925 -7 80 39 83 17 -143 15 56 -37 -53 12 58 -70 -115 -102 -49 -4 -131 -53 -16 13 -121 11 42 -55 -8 30 13
12952 13 -36 -151 76 -79 -13 -89 -83 115 4 28 23 -171 -109 -60 -58 3 -15 81 -61 23 21 43 -165 84 110 80 47
12979 47 6 56 -105 -40 20 -83 70 22 -56 70 -60 13 19 89 -61 -15 71 -41 32 -57 -78 139 67 -25 -155 9
13005 9 55 -33 -75 -60 53 50 -48 38 114 -14 77 -8 -76 -99 -20 40 -15 32 -34 26 -3 19 -81 15 -111 -9 -8 -26 170
13034 170 -21 -56 -18 90 38 -44 -131 -19 10 -54 46 37 15 -12 -25 -57 6 103 138 41 41 -89 -6 -63 68 -77 -14
13061 -14 -20 -13 -7 -52 108 8 -10 -90 27 56 -81 -76 95 -36 4 70 -86 -17 -9 109 49 -35 -37 109 47 61 18 66
13089 66 -41 38 -149 -7 -16 -69 -52 -43 -102 -88 -74 77 -81 -3 48 65 21 -109 21 36 -72 58 88 -25 -9 85
13115 85 -70 -57 74 -86 10 55 -52 5 53 23 95 -133 80 -24 -34 20 5 -65 -57 75 -84 -161 -125 64 43
13140 43 -64 40 64 8 80 -83 -76 84 71 -11 -125 -131 -26 -61 101 -3 159 19 3 39 -38 3 -20 18 82 -143
13166 -143 90 74 -5 45 -29 6 -21 11 -19 12 23 -13 -36 -43 -116 14 -31 29 -34 111 -48 10 26 -19 124 -40 61
13193 61 -6 -17 19 -75 110 92 12 21 19 -54 27 72 81 179 50 39 60 -31 -32 -53 -10 -16 66 -39 78 -72 -68 -16 -27 117
13223 117 37 15 54 32 -15 -51 -31 -101 34 12 -98 81 68 -72 6 -25 54 -64 27 -134 109 -100 -56 48 2
13248 2 123 -43 -29 82 57 -37 148 38 -20 -62 -64 -66 -23 66 -108 46 -51 -11 46 -13 17 20 62 20 -22 33 -63 76
13276 76 -63 -15 25 -52 130 142 -37 -121 28 -38 36 -22 116 30 -13 88 -3 -67 -92 -55 -81 7 -106 -29 36 -107
13302 -107 11 -22 -86 57 0 -100 1 -45 -41 -55 26 -4 24 -64 -77 -3 -32 -31 30 63 -21 -38 -64 73 -63 -1 -36
13329 -36 -99 29 112 94 29 84 4 -97 22 18 30 -97 11 -6 -116 68 -38 -64 15 59 -38 35 47 161 44
13354 44 80 -11 -1 75 5 -57 -78 83 -33 -66 -42 29 32 78 -61 13 85 -97 5 -6 -5 40 -7 58 -69 63 19
13381 19 -73 80 20 24 68 -54 66 -6 -88 34 -32 -12 -3 28 -7 14 -82 63 -61 38 11 -129 -24 60 9 116
13407 116 -22 -5 15 -101 -39 -26 18 104 -4 93 64 43 81 33 -101 -8 8 -47 -123 -77 55 -20 -48 86 39 -19
13433 -19 -1 56 30 53 68 -7 48 21 74 -26 -2 -20 86 -21 88 2 69 32 16 -53 95 -23 83 -66 -1 44
13459 44 21 11 77 9 6 -2 -55 77 69 -35 -93 37 70 -12 -43 85 58 -94 -76 12 -54 -30 -51 48 -23 126 84 62
13487 62 31 13 13 10 66 60 2 -27 -23 78 25 -125 139 27 10 -62 143 -93 104 42 -26 -70 -101 26 89 -63 -6
13514 -6 -12 35 90 -31 40 2 -62 -121 -27 25 32 178 -41 67 -30 -97 -30 -31 -30 48 -100 22 22 -48 -3 18 2 91 -60
13543 -60 -37 106 -79 10 48 -53 -41 37 -120 -145 -109 79 -9 5 -43 -35 -154 79 -24 -130 51 -148 29 -58
13567 -58 32 -52 -11 56 -63 -80 78 -103 14 -102 -98 -71 -17 127 -43 -6 -77 168 -50 -97 -84 88 -71 -61 -120
13592 -120 -50 23 73 16 -28 128 -4 59 -8 -20 24 21 -27 -11 -6 -54 -11 18 15 53 -9 7 -93 17 61 -73 26 -25
13620 -25 -25 9 62 -21 29 -144 -116 41 -25 -99 12 -84 25 -161 20 -29 18 -94 -26 -109 54 -108 -20 59 -102
13645 -102 -54 -73 134 -86 -61 -89 -92 -54 8 -62 14 -8 41 67 79 17 -138 -61 -43 89 17 -74 53 28 -33 41 -49
13672 -49 -12 -196 33 59 -50 29 188 -15 92 87 123 -43 -40 89 55 6 13 78 52 74 -90 18 -53 -19 50 8
13698 8 -78 3 59 104 46 -55 121 70 -23 68 24 -21 -170 -39 -177 -84 -110 -75 16 -22 -70 -1 23 4 85 -65 17
13725 17 -51 -36 5 -186 109 31 -21 -86 -13 -99 -102 36 60 79 189 23 90 -35 31 6 -18 111 -6 106 8 -64
13751 -64 73 103 48 -9 97 -48 -33 -35 -11 -15 -98 97 -79 0 12 30 69 -141 -85 122 84 78 31 -34 -69 4 -108
13778 -108 68 -69 8 98 59 34 59 54 -36 6 42 22 21 -45 -84 -32 -109 -42 49 -101 -35 35 107 61 -20 39 -82 -58
13806 -58 -37 21 8 7 -7 28 -28 -83 -6 -141 53 133 -39 39 -72 20 -54 14 33 23 12 55 8 -61 83 85 -47 -30
13834 -30 -7 -52 -110 12 10 -14 97 -46 -51 22 -49 43 -31 -113 54 45 21 -3 -11 2 -3 -82 -55 -9 -7 69 -160 -6 17 -15
13864 -15 0 -100 72 -11 -48 -27 -12 -30 44 -72 -66 11 -49 68 36 -37 -30 -56 61 -31 -47 27 58 59 3 -10 -28 2 12
13893 12 -48 -89 -22 53 -50 5 -54 23 86 61 -20 -17 -79 -81 -49 -75 -68 -49 30 -43 7 7 33 -39 28 -29 -113 -22 -40 85 92
13924 92 13 -13 -45 2 101 -12 88 69 25 -2 42 -2 40 -18 -58 114 -1 9 73 -62 -68 148 31 -7 3 -109
13950 -109 5 -20 7 -121 -27 -45 -100 -26 -128 -105 -25 -39 33 -56 12 158 -89 7 -51 -150 -47 -33 57 6 17 52
13976 52 1 -48 -13 4 -13 59 -74 -36 -55 94 43 16 -8 -37 23 -80 42 55 3 -138 -12 -114 32 -56 12 -67
14002 -67 160 16 -21 23 -34 -73 -40 -31 -83 -19 -26 100 -96 -103 -78 -64 54 -50 -51 -45 -91 -10 29 -100 -19 4 -2 3 -71 -18
14032 -18 -30 15 -21 -118 -17 5 -36 -72 -48 -11 28 -147 -31 -116 -13 -32 -35 -2 29 -50 -43 -93 -33 -124 -103 -13 -32 0 19
14061 19 21 -90 9 12 36 22 -58 2 -13 -76 -79 137 -3 -78 -58 -1 129 100 66 -4 60 -79 -48 -46 -21 38 -61 -149 -27
14090 -27 70 -4 30 14 -20 -57 46 -14 -46 -41 -63 -114 -140 61 -28 -29 -57 -143 -46 64 72 -25 115 60 56 -26 -151 -81 87
14119 87 -21 17 -66 6 -28 11 42 -11 -24 1 7 -43 47 -13 21 -21 -17 -11 2 -18 41 31 59 35 49 1 97 -65 47 24
14149 24 90 -10 51 41 41 -20 87 44 28 38 22 94 -17 -153 37 -23 23 -61 2 -30 -92 -68 -36 91 -86 2 52
14176 52 53 -64 45 28 15 -21 -134 -27 57 -55 3 89 -23 -9 116 102 23 19 -19 -19 -5 48 -115 45 70 36 -97
14203 -97 7 -68 39 -64 6 -24 34 10 37 -26 125 109 -86 -47 4 108 7 136 14 38 26 30 188 -21 -35
14228 -35 27 -47 114 1 -7 45 28 90 99 -54 87 65 35 26 -10 -38 63 7 40 44 -143 -35 -18 44 -17 -33 -44 -11
14256 -11 -71 -24 58 25 -33 -39 -62 -65 46 -97 97 -19 59 13 -77 14 121 3 -16 -26 -97 12 83 57 46 -45 11
14283 11 85 -2 -6 -49 46 98 -48 12 32 -72 13 -6 7 99 38 -56 2 -61 -10 51 42 -64 -19 2 -86 76 -43 -24
14311 -24 -66 -23 5 28 20 63 -82 6 -16 -12 111 169 66 -23 45 54 139 -65 -17 3 -69 -17 36 -125 21 15 28 -84
14339 -84 -19 -124 58 64 -34 -37 158 33 3 34 -5 41 58 -63 -21 15 -106 -154 43 30 -27 6 -16 16 -134 -153 -62
14366 -62 -62 25 -31 -32 -47 -2 177 4 58 39 -9 41 24 47 -7 75 -45 0 77 -28 167 0 44 19 73 -26 -104 -27
14394 -27 -26 22 6 -33 62 69 13 -42 -103 -19 33 -62 -29 -58 57 -64 -49 31 -2 89 -98 -37 88 -31 67 -131 27
14421 27 74 -13 -17 120 131 -66 -75 62 126 -35 -17 -144 93 82 -49 -61 14 -71 -39 1 -22 99 15 -12 -1 4 -54
14448 -54 65 2 -56 -151 -61 -83 -61 -136 130 -10 -42 -60 -16 -72 46 47 -26 -36 79 -23 -182 -71 38 -119 -143
14473 -143 -44 0 58 -44 -68 -120 9 43 -42 25 -82 -31 -55 -40 82 -18 -1 40 -104 -109 -32 52 -5 -18 4 -154
14499 -154 -53 -30 -73 -31 -37 -40 -56 14 -81 -83 -33 -58 137 -8 -104 28 146 -8 52 -136 -90 -27 -15 -68 -104 -121 143
14526 143 60 -77 9 -22 -78 -2 -111 -76 13 79 122 -54 -60 25 26 -23 -43 7 -18 39 -60 -93 -31 8 10 99 93 -45 33
14555 33 -8 5 -111 19 -65 -225 55 8 -13 -32 27 72 -64 -48 75 74 15 19 -11 -114 -47 -21 -10 -59 -92 2 39
14582 39 17 6 47 36 126 -5 -117 76 23 -37 -107 -85 -10 29 -45 -37 -71 21 -12 -58 40 -58 23 2 35 -86 -30 -3
14610 -3 -109 14 94 -59 38 26 -58 -18 -69 -50 -62 -67 -61 8 35 -67 86 -37 53 -114 96 -109 11 102 -67 30
14636 30 40 -119 20 55 -60 115 23 102 20 -15 4 -50 -48 39 37 2 49 104 14 -105 -5 -25 49 -45 55 -30 -51
14663 -51 60 58 23 67 -111 36 70 -23 75 -18 -6 -18 -29 4 39 -109 -69 -45 -53 17 68 -59 -11 -87 73 -55 7
14690 7 -16 61 -15 35 51 -112 4 35 90 -59 -85 77 36 52 -89 19 160 -62 -41 65 -87 92 60 137 51
14715 51 -7 -117 2 -24 14 -26 37 -61 -77 72 -37 48 7 -71 35 -42 -60 -23 -53 29 11 99 109 75 -9 -20 24
14742 24 -72 -17 -23 86 -61 7 -37 -52 72 34 7 53 -64 -43 30 33 -10 16 1 46 84 3 -19 -9 -1 54 70 -26 105
14771 105 -44 -60 83 140 54 -163 49 -4 18 55 -36 65 -77 90 -32 -54 -75 -40 3 -8 7 93 56 -21 87
14796 87 -56 -86 108 -4 88 57 132 -35 -65 -118 -89 -17 25 22 129 -13 -85 -11 9 162 -61 15 -27 86 -12 -122
14822 -122 20 -151 29 -15 0 -52 -95 2 69 60 30 56 -16 -146 -49 16 124 -27 24 -63 -66 73 5 28 -117 72
14848 72 -20 -27 78 30 104 -108 53 -26 35 -99 36 -86 51 41 -65 -71 18 115 -71 97 -46 40 41 10 -132
14873 -132 -34 45 -46 41 -63 -7 60 -15 61 73 10 -4 -4 46 -27 55 5 8 -145 -30 -99 -25 191 75 -53 -198 -71
14900 -71 -17 -9 -10 96 43 -14 4 -31 40 -33 84 -63 12 128 9 -78 72 -5 75 30 76 -113 -65 87 119 -34
14926 -34 12 97 69 -6 94 -107 -67 69 -70 -69 18 106 -28 -29 -47 2 -4 60 50 -9 36 53 72 -26 -55 23 -3 -42 73
14955 73 -25 159 -31 68 58 62 -15 8 -49 60 22 156 -27 -2 -119 116 23 -40 13 117 -38 97 -130 63
14979 63 -54 -11 -9 113 198 -15 -28 -58 151 -2 -2 41 33 160 -25 31 -75 41 -15 30 161 -22 79 17 116
15004 116 -61 141 80 184 -107 115 -23 34 6 -31 -1 11 24 64 48 45 123 18 33 -27 27 -58 7 -15 0 -29
15030 -29 -182 26 76 -16 -32 15 -56 42 -54 -76 106 16 47 53 12 -6 -78 -61 19 -97 -43 -35 -10 25 -7 -34 31 -28 -98
15059 -98 -18 13 -10 -44 102 28 -23 3 -131 -68 -95 -42 -11 -63 53 45 28 -39 -54 29 18 134 -217 -72 19 -75 41
15086 41 20 -43 92 46 -67 -56 98 -11 77 -11 -114 74 68 -14 -3 -65 -44 -208 -19 35 12 7 -80 -43 -111 59
15112 59 117 60 48 37 -93 2 -70 -43 -33 39 -60 0 -33 -41 11 -14 -57 -147 -1 48 -86 26 -63 90 -53 -56 105
15139 105 -9 61 38 11 -68 -25 35 81 76 -18 86 -112 -29 -37 122 -28 35 57 53 -79 -87 96 -9 -39 -35 70 42
15166 42 51 -38 83 -7 -59 5 -37 24 -64 76 49 -86 -41 21 39 -26 -105 -58 41 51 139 -64 75 18 -7 4 71 -22
15194 -22 -72 89 123 -105 32 31 -34 9 34 54 -48 -134 77 4 -89 -38 -43 -130 86 -78 -1 44 38 19 -34 37 -105
15221 -105 20 57 -10 -9 -73 28 -44 -48 105 -23 77 68 -20 81 -48 -10 14 1 -15 9 -30 -46 10 -11 77 146 -92
15248 -92 1 63 35 18 16 54 39 19 28 32 -43 112 90 66 -16 65 104 -39 35 72 9 -81 -43 62 90 5 4 -56 -58 9 32
15279 32 2 4 71 -67 -5 36 -8 -45 -9 -37 36 -57 118 42 -104 -78 -96 -48 -51 11 -2 23 -8 91 129 86 42 -144 -17
15308 -17 5 -89 -85 64 19 -74 -74 -40 61 40 -23 8 125 171 40 -33 -122 -10 -5 36 39 -87 -52 50 85 24 23 -95
15336 -95 37 -84 25 48 -21 41 20 -43 5 -45 111 98 -12 19 97 41 5 111 9 110 89 -1 -118 -145 -18
15361 -18 38 2 -24 6 -6 -14 75 -31 -147 -66 -65 -43 49 -105 99 -21 -18 0 22 -122 50 56 39 37 -2 -72 -45 -78 24
15390 24 -22 -65 34 -25 11 -60 -24 92 3 5 -23 -16 -59 37 101 110 14 117 -9 84 -45 40 63 4 13 -29 -33 -24 -5 97
15420 97 -21 30 100 -71 -38 -115 -81 23 33 78 88 -13 26 9 -11 57 -21 94 -30 91 65 83 51 -135 -19
15445 -19 -14 70 56 91 2 163 47 -26 28 -152 -99 82 -53 85 17 -119 -29 -87 21 -110 -43 -30 -78 114 90
15470 90 -10 -54 -15 -1 195 -16 -45 -88 150 -1 41 141 -122 -94 -108 1 -48 -37 15 -69 35 -84 -39 89
15494 89 103 -44 -80 -24 39 45 -37 54 45 -14 27 50 37 -18 45 9 -82 -53 -108 103 -43 34 -101 65 10 -26 84 -29
15522 -29 47 -12 -38 80 -71 8 4 75 38 105 101 -49 220 87 -7 -46 -15 142 -6 -20 57 -19 47 -41 0 37 100
15549 100 11 -65 11 -28 -9 -38 10 130 -56 -14 78 5 60 73 44 149 -46 25 41 47 59 17 -23 65 -31 -58 28 -19
15577 -19 -13 -3 -17 69 -52 -2 -20 20 70 -20 -37 22 -64 -54 183 144 81 38 -74 89 79 -33 22 7 -113 30 50
15604 50 -33 -23 61 -35 -17 45 62 28 -35 105 29 10 -22 -34 13 -50 80 -84 56 -22 -11 83 135 -65 81 4 143
15631 143 76 -112 62 -69 79 60 -4 134 -1 203 -11 32 68 127 -61 50 -86 -40 -39 -4 -21 69 47 -6
15655 -6 -32 -48 67 -1 -13 64 97 -129 -18 -61 17 37 -53 14 -14 26 98 27 118 53 9 28 68 -58 -42 -58 93 -31
15683 -31 16 79 81 75 131 59 -14 29 15 -115 0 -88 -21 -19 -18 16 -53 -76 1 43 -11 -132 14 -15 -10 60 -46 7 -103
15712 -103 6 -98 68 29 17 158 -67 116 34 -19 -72 -116 70 12 -36 -66 -16 33 -79 -103 -158 3 -81 -95 -49
15737 -49 -86 -82 15 -44 -60 1 -42 67 -23 7 -103 13 108 -14 -108 12 28 71 42 25 -2 74 63 -29 22 51 83 35
15765 35 -24 65 -51 36 -93 -52 114 -52 -81 8 -46 -50 -43 36 120 80 155 -43 -47 -43 -65 -22 28 86 -58 23 -55 93
15793 93 -81 -61 -108 -18 77 46 -43 -79 -6 26 1 -66 -35 69 59 6 101 -87 -18 23 -85 -74 4 1 1 60 10 -61 144
15822 144 -55 15 95 -25 -63 51 13 97 -49 -3 -157 59 46 -61 4 -4 107 37 45 -3 121 -70 -48 30 54
15847 54 94 -100 50 8 34 -29 74 25 -64 96 4 -23 60 20 32 7 -22 66 22 9 -38 -76 64 58 53 -89 9 56
15875 56 46 39 12 -47 -115 -8 -58 63 -29 -13 5 47 67 50 43 118 -70 -17 25 -51 4 65 -26 11 26 -7 -23 53 -12
15904 -12 -22 18 50 42 -71 -64 37 -12 -91 63 -15 16 18 -27 114 -40 26 192 -105 -14 154 -52 105 -24 132
15929 132 -45 -34 38 -69 6 -20 5 10 100 -35 -67 42 53 -40 -80 81 91 -58 39 -10 -58 125 -4 -116 29
15954 29 -106 -98 -149 99 -99 -73 -19 -11 45 -60 10 -138 -30 -18 -25 -39 -27 41 44 -56 88 -19 -18 -53 14 -23 -1 -16
15982 -16 -70 55 22 57 7 68 -52 -87 -79 0 151 -36 33 7 14 82 -39 -2 73 -36 99 49 -53 48 79 87 26
16009 26 -151 -27 -7 2 -38 71 54 -89 7 -28 -16 -38 -119 -2 51 -110 109 -26 27 43 17 -22 29 107 93 62
16035 62 -28 -42 56 -29 -63 -43 15 29 -36 -121 37 -18 -36 3 -46 -40 74 -38 20 -86 -67 -18 -88 27 9 80 -18 116
16063 116 22 -174 -73 -31 -14 19 -99 -119 33 8 -70 70 -63 -5 -72 96 66 -26 20 87 -63 46 199 -38
16087 -38 67 -30 83 -15 -77 -91 64 61 -55 -24 -66 5 -10 24 23 -16 -94 -29 55 57 -32 173 7 -7 -173 -8 36
16114 36 125 89 101 26 -59 -25 -35 -3 -24 5 -84 0 -32 -8 0 87 149 126 -104 15 -99 62 -2 5 1 35 130 38 21
16143 21 11 -81 -123 -19 -50 26 -17 -20 -20 60 86 -2 -60 49 -92 56 4 -66 -30 62 123 82 -97 -36 -40 -7 -51 128
16171 128 -41 -18 73 33 73 25 -62 77 -53 -48 -50 -134 72 -130 -55 -53 41 5 -87 20 -69 20 -44 -45 -13 128 117 82
16199 82 25 26 48 -112 -26 -100 -53 -14 90 -43 -172 13 44 -14 -30 -13 -3 -78 -40 -17 20 -53 160 12 0 -28 -55
16226 -55 97 22 59 10 24 -10 14 51 66 -142 51 9 -31 119 35 10 -128 -25 -42 -13 -16 -12 -53 5 133 -13 -96
16253 -96 66 82 107 -84 -3 -15 -42 102 -37 63 -15 44 85 5 -48 -61 40 27 42 -5 -14 -120 -16 -8 -48 21 59
16280 59 -31 28 64 -4 71 12 -39 -10 11 30 -1 77 71 -107 -12 -17 4 -64 -81 -7 -36 79 41 -7 80 41 131 21 83
16309 83 -6 94 7 156 37 -1 -66 27 30 0 -107 10 -36 -15 70 -1 -54 -14 36 11 149 77 -108 -9 -172 18
16335 18 78 -3 -61 34 -33 85 61 -18 14 11 -30 -4 -34 -12 -16 -16 22 -7 26 -74 80 -81 47 -35 -18 -101 -42 -28 -46
16364 -46 -44 -8 78 103 71 31 64 67 -2 -39 15 -26 -38 -73 -38 -20 21 -10 9
16383I
$$ Imaginary data points
##PAGE= N=2
##DATA TABLE= (X++(I..I)), XYDATA
0 0 0 0 0 0 0 0 0 0 0 0 0 0 0 32 -32 32 -32 64 -64 64 -96 96 -128 160 -169 192 -230 288 -320 352 -416 480
32 480 -544 608 -687 768 -864 974 -1088 1216 -1350 1504 -1665 1841 -2039 2254 -2485 2739
48 2739 -3023 3336 -3665 4043 -4459 4917 -5433 6017 -6681 7444 -8332 9381 -10644 12190
62 12190 -14144 16702 -20210 25337 -33575 49000 -87874 400274 496721 -398110 -234294
73 -234294 278292 331123 -191290 -264751 35308 70894 -330184 -358585 73783 287161 -75044
84 -75044 -266744 89223 429948 212862 -55718 87612 284710 55639 -199427 -14825
94 -14825 274554 68240 -360056 -342459 54333 136807 -152869 -198480 137638 238766 -69598
105 -69598 -175054 187937 394686 64224 -244078 -11239 320124 140188 -270212 -245276
115 -245276 101249 121575 -197615 -235997 100186 205170 -103767 -244749 64254 301786
125 301786 88164 -164767 -22330 226885 129871 -137483 -129071 77637 77289 -100786 -89302
136 -89302 81185 39179 -176056 -145553 129788 182368 -77286 -180363 65304 229911 23077
147 23077 -193407 -45849 193946 99495 -149701 -100950 146764 126919 -138968 -180987 66739
158 66739 161102 -44232 -160632 12238 136789 -31247 -190286 -34349 188376 105667
168 105667 -121197 -93954 116733 125564 -62038 -89506 79889 115722 -53813 -119386 23982
179 23982 84541 -75728 -172660 -16259 127983 13470 -134826 -29599 145214 72435 -105683
190 -105683 -43409 167118 151356 -71681 -123935 53345 105176 -82271 -171975 5556 128406
201 128406 -38146 -203712 -64525 151320 90463 -105200 -71474 129477 147541 -22291
211 -22291 -62370 71855 89926 -72065 -121454 38548 109562 -60141 -185720 -54633 94950
222 94950 15426 -108852 -19626 134305 77087 -79939 -39987 131390 119141 -64247 -95769
233 -95769 66573 105372 -70520 -155269 -8992 87355 -44488 -150412 -11894 145439 50462
244 50462 -123806 -63064 131528 128453 -43945 -66452 81936 100976 -62226 -117272 24167
255 24167 86409 -53691 -140470 -10922 106026 5258 -123689 -39974 114255 74970 -62158
266 -62158 -28591 111420 82667 -78138 -83515 68742 91029 -64325 -119891 18124 91215
277 91215 -38877 -136922 -16330 118784 37936 -98195 -31037 119222 76351 -81802 -69253
288 -69253 83021 94125 -52985 -93130 32033 79102 -46900 -118675 976 104011 10471
299 10471 -102905 -25297 100502 45480 -80913 -41559 88259 68409 -60989 -63059 57608
310 57608 68502 -61434 -99671 29978 98733 -17006 -105362 -3942 99405 13231 -98928
321 -98928 -23584 106750 57778 -79778 -61463 69550 69883 -63010 -88007 42474 92888
332 92888 -29722 -101961 7877 95576 381 -96260 -9957 105172 43724 -79484 -47693
343 -47693 68804 52914 -64282 -66431 51790 71100 -50224 -91503 24917 85361 -19384
354 -19384 -88890 13011 104677 22680 -81872 -24743 81927 40876 -74162 -53949 64583
365 64583 60745 -67831 -92079 31516 77703 -32453 -86198 23296 100440 9394 -80952
376 -80952 -9274 90690 38624 -69591 -39232 69066 48800 -73799 -81672 35905 61156
387 61156 -47006 -79829 30570 84634 -12266 -78167 9311 94313 27798 -65890 -17321 79434
399 79434 37412 -78556 -63561 50693 51899 -61148 -76995 35253 70150 -32174 -79915
410 -79915 19067 92204 16212 -65337 -4056 85227 33327 -72990 -45752 59526 45669 -62765
422 -62765 -67034 36543 54105 -45881 -77553 21829 80293 2836 -61753 5659 79314 19743
434 19743 -67618 -22600 72509 40506 -64080 -55459 42299 44780 -51739 -67350 29405 65834
446 65834 -19641 -66358 15628 78412 5116 -73132 -12554 78663 36378 -61399 -40808 50045
458 50045 37098 -55535 -53383 45207 62792 -33801 -71627 16089 69854 -5958 -69864 -3975
470 -3975 69017 14963 -64343 -22432 61402 30439 -58271 -39264 57923 60167 -36078 -59257
482 -59257 26024 58208 -22868 -66329 9165 63004 -6895 -74929 -18807 58991 21313 -54223
494 -54223 -21845 63929 47533 -41233 -40639 46858 58281 -29779 -58323 19546 53819 -24885
506 -24885 -76388 -8940 53665 299 -66538 -17872 66140 41171 -40251 -28217 51451 50044
518 50044 -25876 -31052 40764 44184 -43321 -72679 6592 52607 -14597 -72081 -17012 51065
530 51065 15485 -46055 -9338 63773 39123 -36744 -21506 58475 54760 -33797 -60525 5927
542 5927 36807 -20276 -54851 -4219 32186 -18119 -59175 -425 67442 30836 -39387 -16053
554 -16053 55974 47108 -22768 -30170 26069 31159 -31402 -51510 5488 32747 -24192 -64368 -11105
567 -11105 47181 17770 -31825 -4883 46314 26394 -23518 -7679 44755 32787 -31273 -40245
579 -40245 16638 31925 -28770 -60568 -6110 39877 1788 -42721 -9670 39767 20211 -22578
591 -22578 -4190 42521 29837 -23640 -25592 23789 30698 -23531 -45155 2660 30880 -11082
603 -11082 -41859 -2135 34552 1190 -38277 -6070 48076 33272 -25002 -30125 19867 33654
615 33654 -10145 -28174 9546 24375 -17530 -37511 7015 36714 -3439 -42976 -11486 37575
627 37575 22547 -25035 -20639 23156 21949 -22542 -22529 29675 38239 -20523 -46565 3843 40940
640 40940 4623 -34203 -7940 28704 5925 -34039 -14660 32043 19150 -32876 -27321 30106
652 30106 36567 -19437 -34695 17434 39257 -7849 -35330 7639 41377 123 -47631 -18895
664 -18895 35331 20103 -34056 -27869 23876 23032 -25912 -24477 29887 37658 -15499 -31344 19358
677 19358 43322 -5726 -42548 -3535 38140 3602 -46520 -20622 33818 16569 -39637 -28910
689 -28910 31999 35201 -18639 -26903 25346 41284 -8687 -33655 10806 40433 -3952 -46347
701 -46347 -11608 33621 4048 -46015 -22671 33191 22714 -28828 -22445 31941 36255 -15363
713 -15363 -27485 22229 40944 -8625 -39382 2276 35342 -5192 -47465 -15221 31374 9601
725 9601 -34764 -15868 32632 22612 -25727 -19962 34166 40201 -15412 -35643 11563 36545 -7639
738 -7639 -41078 -5246 30476 306 -38507 -13581 30334 14961 -27999 -17293 30689 30874 -14752
751 -14752 -22522 18218 28205 -13845 -30458 9236 30757 -8340 -39995 -8981 28651 8353
763 8353 -28657 -12831 27012 18293 -20719 -15426 26057 26447 -17020 -25725 15340 30601 -9587
776 -9587 -35058 -3145 26404 1205 -30462 -8858 27113 12073 -25366 -15029 25454 23147
788 23147 -16211 -19881 17657 26436 -10762 -27845 4156 25574 -3512 -29715 -5182 25239
800 25239 5518 -27135 -11318 24731 16191 -19127 -14831 21582 22622 -14839 -24073 11097 26472
813 26472 -6893 -29299 -442 26400 907 -30146 -9388 25826 12971 -21799 -13836 21735
825 21735 20534 -15460 -20596 14370 25396 -8824 -26742 4048 25646 -3165 -30436 -5728
837 -5728 25462 7920 -23827 -10933 22132 15310 -17851 -15561 19456 23127 -13061 -23882 10502
850 10502 25461 -8941 -30439 127 26785 1797 -27689 -7690 24629 11494 -21864 -13046
862 -13046 23603 22088 -16229 -21890 14739 25036 -11299 -27888 4756 25362 -3619 -28294
874 -28294 -4286 24123 6706 -23268 -9933 23968 17723 -17438 -16862 18070 21200 -14533 -22809
887 -22809 11212 23508 -9416 -27572 678 23816 1133 -24896 -6004 24801 12214 -21025
899 -21025 -13495 21449 18562 -17340 -19426 15680 22090 -12414 -25518 5196 23283 -2892 -25024
912 -25024 -2415 24684 7190 -23323 -10632 22646 14778 -19106 -15636 17955 18354 -15145 -21141
925 -21141 10366 21815 -7123 -23184 2898 24766 2343 -24358 -6326 23583 9816 -21627
937 -21627 -12299 19560 13944 -18719 -18390 14349 20224 -9775 -21053 7153 24456 -917 -23091
950 -23091 -1585 24046 5568 -23060 -9401 19879 9442 -21494 -16418 15064 16958 -12022
962 -12022 -17914 10613 22460 -4009 -19986 5138 25289 2028 -23045 -5209 20351 4825
974 4825 -23762 -13738 15655 11436 -16964 -16691 13822 20510 -7547 -17857 10234 25902 58
987 58 -20345 514 21358 1249 -24470 -10435 16205 6822 -20672 -16079 13144 15390 -10859
1000 -10859 -14853 14038 24064 -2614 -17195 6601 23059 352 -21949 -6361 15643 2535
1012 2535 -22085 -13790 12253 9348 -15606 -13733 15309 21478 -4998 -14453 10050 22870 332
1025 332 -17314 -449 16663 -386 -22643 -11097 12617 5569 -18814 -13975 13521 16320 -7995
1038 -7995 -12112 12641 21378 -1611 -14367 5192 19132 -630 -21307 -7896 13457 2830
1050 2830 -20460 -12879 12859 11332 -12384 -12166 13107 19185 -3524 -12272 8691 19830 -1511
1063 -1511 -19076 -2635 16299 1594 -21263 -11276 12956 7544 -15375 -11674 12994 15192 -7556
1076 -7556 -12046 11354 20308 -2566 -17433 892 17562 565 -18784 -5897 13801 2315
1088 2315 -18903 -9337 15867 12351 -13023 -14089 11972 19406 -4545 -15921 5280 18154 -2579
1101 -2579 -18626 -122 18139 1147 -20910 -8236 16228 9854 -14303 -11488 12853 13220 -11133
1114 -11133 -13934 12093 18868 -8064 -20126 4463 20859 -419 -20098 -3645 17383 4844
1126 4844 -16881 -7179 16578 9960 -16279 -13825 14102 16525 -11160 -17524 8238 17823 -6220
1139 -6220 -18091 4616 20369 319 -19732 -3663 19594 7754 -18615 -11637 15664 12876
1151 12876 -14507 -15413 10776 14654 -10093 -16179 8184 18547 -3338 -17410 1847 19544 3143
1164 3143 -18021 -5223 17683 7033 -18243 -11511 14607 11121 -14991 -14892 11347 17080 -7058
1177 -7058 -17055 4262 18651 1051 -15483 -80 17714 2691 -18384 -6312 16606 7570
1189 7570 -17217 -13117 11547 12940 -9020 -13765 7026 15391 -3555 -14495 4108 18854 1346
1202 1346 -17726 -4480 15802 6481 -13841 -8861 9353 6328 -11582 -9868 9854 12555 -7540
1215 -7540 -14439 5729 18180 696 -15066 -1671 14283 3491 -13024 -4677 11820 5063 -13493
1228 -13493 -10903 9236 12475 -6527 -14018 3290 14135 -5 -11295 1813 13561 745
1240 745 -13374 -2694 13275 5331 -13276 -10684 8204 10701 -6745 -12014 4518 11954 -3529
1253 -3529 -11968 4011 15275 530 -13822 -2264 13851 6061 -11937 -9182 8153 8095 -9149
1266 -9149 -11016 7124 11687 -6582 -13691 5187 16628 599 -14169 -2055 14177 5592 -11669
1279 -11669 -6866 10009 6668 -11627 -10994 8603 11137 -8738 -14422 5379 15909 -546 -12645
1292 -12645 1022 14279 2481 -12540 -2775 13906 5369 -14998 -10781 10660 10387 -10912 -14092
1305 -14092 6600 13669 -4520 -12547 4994 16065 129 -13776 133 16744 4698 -15616
1317 -15616 -8800 11461 7591 -12938 -11685 8558 10359 -9252 -12668 7688 16056 -2241 -13593
1330 -13593 2838 17119 3014 -14218 -4081 12921 4109 -14565 -8835 10078 7021 -12412
1342 -12412 -11939 8842 13649 -5155 -12215 5576 15972 -74 -12453 1142 14680 1703 -14981
1355 -14981 -5763 11497 4917 -13709 -10599 8643 9905 -7593 -10529 7289 13787 -2978 -11219
1368 -11219 4420 14744 63 -13522 -2356 11750 2685 -12882 -7235 9041 6103 -10221
1380 -10221 -9162 8683 10882 -6086 -10367 6249 13529 -1743 -11277 1023 11742 654 -12052
1393 -12052 -3728 10104 4064 -11201 -7622 9010 8297 -8085 -9322 6873 10870 -4168 -10215
1406 -10215 3184 11100 -684 -10758 -1089 10839 3263 -10196 -5062 9259 6119 -8766 -7493
1419 -7493 7303 7755 -6678 -9498 4163 9235 -2945 -9979 1415 10942 1617 -9505 -1781 11126
1433 11126 5057 -9231 -5381 8740 6235 -8702 -9214 4884 7333 -5736 -10631 2090 10304
1446 10304 -136 -9310 495 12275 4426 -8520 -2352 10566 5258 -9219 -7608 5650 5505
1459 5505 -7861 -10474 2311 8013 -3179 -9722 2114 12136 2748 -8102 652 12381 4829
1472 4829 -8784 -4662 7547 4470 -9273 -9720 3312 6107 -6341 -11001 2573 11071 76
1485 76 -8743 2217 13261 4384 -7844 -1819 9726 4570 -9170 -8033 4502 4933 -8388 -11093
1499 -11093 2747 8721 -3107 -9189 3189 12210 2111 -7453 1078 11425 3856 -8699 -5036
1512 -5036 6912 4138 -9539 -10065 4010 6842 -6033 -9940 3970 10911 -511 -8147 2588
1525 2588 12044 3031 -8327 -2518 8716 3914 -9649 -7979 5429 5696 -7848 -9718 4343 9149
1539 9149 -2982 -8482 3367 11318 1386 -8240 -438 9895 3264 -9100 -5447 7077 4771 -8651
1553 -8651 -8087 5506 7440 -5415 -8451 4411 10122 -1187 -8794 1045 10305 1746 -9421 -3169
1567 -3169 8869 3909 -9336 -6446 7270 6699 -6755 -7824 5160 9045 -3182 -8634 2258
1580 2258 9524 -423 -9502 -1154 9511 2293 -9509 -4240 8526 5368 -7485 -6203 6637 7551
1594 7551 -4787 -7892 3794 8754 -2644 -9738 433 9050 110 -9701 -2357 8939 3699 -7640
1608 -7640 -4008 8107 6685 -5805 -6602 5412 7937 -4142 -9250 1589 8075 -1746 -9721 -1090
1622 -1090 8196 1729 -7861 -2281 8588 5362 -6050 -4715 6783 7203 -4927 -7841 3036 6914
1636 6914 -3592 -9286 247 7253 -579 -8333 -1302 8590 4112 -6110 -3211 7499 6563 -4678
1650 -4678 -5597 4418 5984 -4769 -8340 1518 6637 -2090 -8761 -1081 7674 2632 -6040 -2144 7413
1665 7413 5106 -4969 -4024 5888 5876 -4723 -7347 2055 6005 -2516 -8021 -753 6052 719 -6375
1680 -6375 -1192 7717 3904 -5687 -3312 6849 6102 -4289 -6300 2751 5505 -2785 -7017 151 5596
1695 5596 -882 -7468 -1061 7753 3079 -6161 -3054 6865 5435 -4351 -4508 4093 4924 -4000 -6780
1710 -6780 1601 6177 -2055 -8474 -731 7678 2322 -6669 -2223 7154 4062 -4919 -3072 6123 4833
1725 4833 -5036 -6540 3011 6345 -3005 -8470 -158 6975 40 -7261 -518 7919 2325 -6480 -1928
1740 -1928 7776 4989 -5601 -5841 4289 6042 -3770 -7557 1360 6025 -2786 -7758 1315 8374 542
1755 542 -7545 -807 8740 4219 -5740 -3674 5854 4736 -5387 -6242 3996 5719 -5333 -8793 2199
1770 2199 8100 -1275 -7870 302 8131 2341 -5566 -734 7689 3206 -6874 -4418 6163 5124
1784 5124 -6572 -7980 2939 6033 -3532 -7205 2207 7110 -728 -6238 1456 8819 2575 -6731
1798 -6731 -2611 7132 4117 -6655 -5896 3919 3881 -5789 -6350 3617 6164 -2999 -6847 2396 8579 1484
1814 1484 -5960 -705 7081 2631 -6183 -2897 5222 2373 -6912 -5530 4100 4660 -4198 -6107 2459
1829 2459 6736 -198 -4846 1269 6838 769 -5928 -802 6378 1911 -6873 -4584 4053 3606 -4381
1844 -4381 -5034 2715 4852 -2139 -4722 2406 6593 -109 -5820 25 6425 1721 -5584 -3059 4147
1859 4147 2445 -4469 -3793 3407 3943 -3266 -4871 2533 5837 -825 -5412 113 5384 899 -4902
1874 -4902 -1506 4470 1778 -4732 -2962 4144 4003 -3417 -4653 2591 5356 -1383 -5151 701 4893
1889 4893 -319 -5196 -741 4903 1509 -5176 -2776 4497 3998 -3182 -3747 3143 4758 -1953 -4615
1904 -4615 1524 4637 -1367 -5804 -672 4832 616 -5397 -2306 4761 3285 -3514 -2676 4439 4715
1919 4715 -2573 -3966 2788 4762 -2251 -6057 -335 4388 -568 -6127 -1938 4623 1965 -4529 -1835
1934 -1835 5581 4491 -3082 -3045 4211 5260 -2359 -5488 655 3998 -1940 -6560 -1416 4329 332
1949 332 -5661 -1531 5925 3641 -3335 -1890 5360 5139 -2373 -3725 2584 4253 -2753 -6335 -490
1964 -490 4092 -1389 -6622 -1377 5333 1802 -4362 -1164 5943 4282 -2702 -2435 4256 4451 -2859 -5332
1980 -5332 1116 3986 -2553 -6743 -661 4489 -185 -5233 -654 5736 2926 -3236 -1221 5165 4423
1995 4423 -2876 -3940 2525 3945 -3166 -6052 333 3870 -1681 -5815 -227 4979 1218 -3993 -690
2010 -690 5433 3619 -2968 -2554 3818 3902 -3283 -4823 1600 3646 -2515 -5591 223 4359 -301 -4447
2026 -4447 -382 5046 2348 -3411 -1538 4533 3329 -3406 -3563 2792 3713 -3067 -4886 1368 3979
2041 3979 -1348 -4581 269 4681 925 -4030 -946 4821 2598 -3749 -2556 3806 3237 -3403 -3908
2056 -3908 2163 3713 -2065 -4444 747 4360 -44 -4455 -579 4415 1559 -4160 -1819 4094 2635
2071 2635 -3686 -3075 3015 3344 -2423 -3771 1565 4071 -895 -4484 45 4339 407 -4497 -1143
2086 -1143 4119 1785 -3936 -2294 3495 2951 -2866 -3083 2452 3784 -1622 -3995 1020 4278 -334
2101 -334 -4687 -557 4122 778 -4363 -1882 3757 2225 -3343 -2732 2938 3465 -1992 -3524 1845 4137
2117 4137 -975 -4134 103 4126 -51 -4592 -1186 3650 1464 -3791 -2131 3290 2942 -2451 -3073
2132 -3073 2439 3843 -1425 -3770 968 4050 -405 -4360 -602 3746 716 -3855 -1868 3493 2201
2147 2201 -2977 -2440 2913 3430 -1975 -3307 1772 3881 -800 -3934 67 3692 184 -4005 -1303
2162 -1303 3482 1408 -3406 -2269 3094 2948 -2564 -3062 2421 3723 -1527 -3520 853 3683 -344
2177 -344 -4013 -412 3648 826 -3835 -1708 3436 2243 -3038 -2505 2671 3087 -1907 -3104 1716 3560
2193 3560 -1009 -3796 325 3763 231 -3933 -952 3615 1421 -3233 -1819 3149 2472 -2427 -2584
2208 -2584 2426 3322 -1500 -3510 941 3552 -510 -3773 -245 3444 235 -3733 -1027 3531 1612
2223 1612 -3031 -1921 2964 2833 -1938 -2754 1683 3158 -1222 -3424 727 3231 -688 -3663 -426
2238 -426 3347 896 -3150 -1308 2907 2077 -2022 -1877 2436 2623 -1865 -2798 1486 3189 -1132 -3513
2254 -3513 50 2874 10 -2874 -679 2558 1142 -2369 -1077 2745 2252 -1979 -2323 1864 2521 -1317
2270 -1317 -2836 643 2285 -630 -2738 -57 2502 322 -2548 -820 2675 1822 -1875 -1583 1833
2285 1833 2000 -1382 -1979 1176 1797 -1296 -2513 233 2191 -17 -2423 -647 2323 1264 -1616 -859
2301 -859 2045 1527 -1722 -1331 1646 1689 -1541 -2376 215 1869 -256 -2220 -540 1867 648 -1715
2317 -1715 -413 2282 1238 -1604 -1223 1650 1661 -1106 -1864 442 1466 -424 -1921 -211 1746 55
2333 55 -2149 -355 2320 1058 -1802 -1160 1704 1589 -985 -1519 939 1434 -782 -2000 385 2125
2349 2125 -262 -2484 -509 2202 783 -1857 -994 1777 1115 -1450 -1198 1593 1551 -1367 -1958 757
2365 757 2312 -389 -2262 -147 2210 156 -2070 -329 2066 578 -2180 -1081 1833 1561 -1449
2380 -1449 -1976 1178 2124 -779 -2080 696 2156 -521 -2442 185 2364 177 -2482 -852 2020
2395 2020 1180 -1853 -1365 1643 1761 -1159 -1624 1622 2289 -1040 -2349 708 2356 -271 -2478 -480
2411 -480 1925 299 -2229 -850 2068 1077 -1966 -1264 1980 2131 -1301 -1881 1333 2251 -585 -2200
2427 -2200 270 1815 -463 -2685 -439 2076 563 -2297 -1049 2177 1614 -1326 -1268 1639 1841 -970
2443 -970 -1756 943 1944 -796 -2474 -109 2026 -47 -2439 -733 1919 910 -1577 -676 2117 1551
2459 1551 -1284 -1341 1354 1949 -843 -2001 217 1664 -343 -2116 -244 1757 217 -1905 -366 1953
2475 1953 1279 -1271 -822 1599 1510 -829 -1560 718 1413 -727 -1901 190 1523 -179 -1887 -330
2491 -330 1812 715 -1365 -589 1518 1102 -960 -1078 1012 1386 -919 -1659 518 1546 -418 -1683
2507 -1683 -142 1443 356 -1249 -565 1503 850 -1179 -883 1198 1373 -985 -1386 588 1437 -382
2523 -382 -1572 142 1383 79 -1314 -395 1532 648 -1369 -768 1335 977 -1127 -1192 846 1211 -583
2540 -583 -1304 268 1362 -79 -1438 -191 1451 506 -1333 -642 1169 873 -1175 -1005 954 1049 -730
2557 -730 -1127 589 1225 -306 -1233 -9 1463 279 -1396 -368 1170 438 -1180 -678 968 763 -992
2574 -992 -1046 657 1009 -435 -1194 260 1269 63 -1164 -16 1361 308 -1334 -509 1131 515 -1100
2591 -1100 -854 588 756 -694 -908 535 1251 -108 -1052 178 1349 81 -1010 -255 1059 290 -999
2608 -999 -672 711 584 -846 -897 630 1019 -447 -949 495 1187 -244 -1028 269 1017 82 -1114 -205
2626 -205 884 258 -886 -684 535 598 -721 -921 644 1096 -397 -863 454 1055 -61 -1004 -68 781
2644 781 94 -1083 -475 633 401 -850 -696 754 713 -581 -853 615 1014 -160 -781 90 840 -198
2662 -198 -1058 -235 775 134 -1003 -510 870 582 -834 -683 778 925 -422 -649 506 926 -262
2679 -262 -920 113 844 67 -966 -285 664 267 -834 -407 765 604 -479 -530 677 752 -323 -699
2697 -699 260 680 -203 -912 33 805 29 -919 -211 858 399 -663 -419 663 590 -469 -536 454 707
2716 707 -343 -917 218 738 -174 -914 -46 610 134 -693 -236 803 618 -463 -428 651 677 -392 -681
2735 -681 237 552 -387 -884 -86 703 -132 -723 -256 765 286 -528 -348 673 601 -445 -552 563 568 -416
2755 -416 -764 73 699 -299 -837 -54 742 231 -685 -158 615 487 -579 -441 498 578 -410 -638 329 672
2775 672 -351 -877 -40 720 89 -645 -147 864 279 -584 -262 652 575 -566 -610 315 606 -289 -799 118
2795 118 623 -116 -715 17 651 231 -578 -136 679 466 -514 -550 530 556 -384 -661 278 562 -186 -826
2815 -826 165 868 16 -728 -88 842 317 -610 -316 538 453 -562 -434 404 570 -480 -761 167 860 -42
2835 -42 -823 103 887 179 -752 -150 640 389 -674 -461 714 648 -467 -858 419 813 -256 -849 334
2854 334 749 -161 -791 58 678 124 -811 -357 533 467 -736 -495 541 539 -494 -665 545 669 -245 -670
2874 -670 251 832 44 -684 -259 591 117 -592 -339 647 282 -703 -420 603 666 -380 -575 296 694 -119
2894 -119 -582 50 534 -79 -765 -230 641 248 -690 -420 530 382 -396 -366 469 606 -83 -339 241 603
2914 603 -222 -667 -11 491 228 -538 -297 515 288 -519 -213 502 472 -347 -306 219 488 -33 -466 -14 407
2935 407 -39 -443 -64 387 -83 -450 -79 489 304 -242 -439 273 548 -82 -265 106 308 -137 -574 -14
2955 -14 387 -159 -522 -194 376 154 -213 -262 325 357 -56 -284 232 400 -104 -427 67 336 20 -511 -91
2976 -91 171 172 -244 -141 308 187 -264 -265 369 398 -100 -363 111 357 -17 -439 -127 305 32 -316 -185 227
2998 227 170 -339 -355 263 347 -211 -304 130 300 -108 -449 33 374 -32 -423 -223 323 119 -337 -127 323
3019 323 444 -129 -218 365 363 -207 -356 276 457 -6 -431 -105 412 142 -382 -148 435 236 -418 -267 408
3040 408 374 -229 -341 227 362 -144 -451 93 525 -125 -467 -18 400 247 -380 -179 511 348 -284 -214 241
3061 241 323 -204 -320 81 428 -53 -526 84 477 73 -480 -72 315 70 -353 -146 268 189 -364 -262 395
3082 395 466 -232 -384 181 311 -38 -457 -31 374 -104 -365 16 205 332 -375 -184 312 276 -239 -385 193
3103 193 276 -314 -335 153 308 -106 -343 33 222 86 -354 -173 232 241 -384 -359 325 188 -293 -162 217 297
3125 297 -143 -267 152 247 -109 -358 -75 318 45 -251 -236 310 176 -269 -217 206 97 -252 -291 104 367
3146 367 -118 -251 -41 377 51 -341 -36 257 116 -283 -239 387 219 -284 -220 156 260 -171 -327 52 309
3167 309 -36 -335 -24 322 -8 -282 -93 207 142 -280 -111 295 272 -153 -196 94 332 -50 -355 110 467
3188 467 46 -313 28 248 121 -201 -135 188 231 -174 -179 179 219 -69 -143 75 348 2 -227 22 239 100
3210 100 -299 -63 224 185 -295 -145 288 232 -166 -216 205 468 -64 -240 56 250 62 -381 -76 234 128
3231 128 -213 -120 305 59 -213 -160 163 182 -199 -266 103 220 -104 -439 -66 285 26 -300 -118 172 213 -325
3253 -325 -192 209 279 -238 -215 46 314 -103 -162 64 266 -147 -278 150 329 76 -287 -110 285 71 -224
3274 -224 -141 121 74 -119 -245 -26 246 -153 -235 -15 342 58 -270 -54 269 19 -306 -113 343 167 -238
3295 -238 -254 170 165 -163 -194 37 336 -52 -265 -53 203 -66 -274 -121 214 112 -154 -11 250 131 -182
3316 -182 -21 203 358 -94 -175 145 148 -33 -205 -57 103 -47 -272 -117 293 179 -286 -268 51 175 -149
3337 -149 -269 168 210 3 -256 44 128 22 -150 -93 152 45 -213 -250 69 56 -137 -200 287 306 -216 -155 43
3360 43 145 95 -192 -202 294 2 -245 -84 199 159 -269 47 241 95 -107 -118 -62 37 -121 -146 101 126 -56
3383 -56 -213 -39 202 58 -213 -59 143 27 -122 -15 148 92 -152 -167 31 143 -134 -245 -15 113 1
3404 1 -237 -66 270 -80 -191 45 83 90 -11 -157 111 94 -47 -56 79 206 -61 -109 1 190 50 -119 51
3427 51 122 71 -66 -162 60 176 -38 -223 85 181 -54 -37 52 100 -6 -264 -24 84 57 -102 -24 62 98 -123
3451 -123 -123 208 210 -106 -159 46 -10 37 -120 56 160 -1 -191 4 98 138 -16 -127 241 121 -144 -147 -3 121
3475 121 -167 -35 34 92 -135 -44 147 205 62 -143 17 170 84 -184 -28 78 -53 -214 -93 164 142 -145
3497 -145 -100 247 97 -102 -207 35 226 -126 -195 -58 139 -7 -257 -96 178 168 -110 -218 -1 160 -103
3518 -103 -205 136 183 -97 -157 24 296 107 -268 23 176 7 -172 -188 140 216 -243 -100 103 207 -25
3539 -25 -183 134 136 22 -244 39 138 13 -251 0 91 -10 -191 -49 110 207 46 -96 152 158 2 -92 27
3562 27 222 -12 -105 -99 143 -3 -114 -133 233 90 -107 -79 98 163 -146 -209 -14 133 -115 -280 92 152 8
3585 8 -178 -64 54 38 -112 -61 243 195 -100 -229 139 134 11 -183 -73 225 -42 -310 5 169 -36 -225
3607 -225 -137 130 45 -151 -95 96 159 43 -17 -44 78 -265 -189 59 170 -74 -262 3 178 25 -90 -145 93
3630 93 133 -104 -188 85 124 -117 -109 84 95 -38 -344 9 175 66 -163 12 162 95 -26 -104 258 265 -26 -161
3654 -161 57 150 -85 -146 -8 137 14 -64 6 236 57 -157 -244 123 156 -83 -167 111 -29 -51 -153 -26 117
3677 117 -56 -196 -202 336 -50 -180 -63 148 189 -99 -104 175 37 -204 -117 185 106 -108 -261 -64 252 -25
3699 -25 -257 -151 132 28 -226 -35 253 161 -170 -125 103 118 -49 -149 6 208 15 -176 18 265 86
3720 86 -174 -23 187 39 -262 -196 166 204 -199 -102 113 32 -76 -138 -4 59 -115 -143 1 177 -2 -121 70
3743 70 135 35 -76 -29 101 199 -121 -180 18 95 -112 -110 -44 168 -53 -44 48 180 -10 -75 -64 124 193 -106 -70
3768 -70 77 181 -65 -91 114 125 -49 -81 154 50 -81 -113 82 156 35 -226 -6 33 167 -272 -147 128
3790 128 50 -21 -197 25 141 -43 -252 -86 119 -6 -168 -33 109 33 -156 -105 145 76 -198 -50 102 203
3812 203 2 -63 83 46 -109 -38 -2 58 74 -201 29 163 -40 -81 24 118 46 -86 -101 169 75 -126 -289 110
3836 110 176 45 -144 -17 59 2 -236 -71 160 148 -198 -141 84 161 22 -105 104 152 -30 -131 136 130 -46
3859 -46 -202 -66 191 3 1 74 194 6 -137 -97 118 185 -96 -136 62 55 15 -266 14 80 -97 -127 6 152
3883 152 182 -49 -41 169 129 -143 -134 150 96 -122 -74 11 148 -52 -155 -60 208 123 -219 -45 222 120 -97 -201
3907 -201 144 216 -58 -180 145 117 -11 -40 65 152 -14 -208 141 140 -12 -100 -106 102 99 -198 -129 190 117 -189
3931 -189 -142 73 179 -46 -190 38 186 -21 -190 7 136 95 -164 -24 45 85 -47 -31 145 259 -95 -236
3953 -236 153 191 -94 -134 -16 210 -33 -161 7 191 10 -183 -104 138 102 -121 -76 91 115 -219 -188 112
3975 112 89 -14 -189 -11 160 -118 -261 -80 107 187 -34 -166 181 194 3 -50 71 194 -81 -259 -19
3996 -19 138 -67 -206 -19 195 65 -128 -116 115 159 -58 -164 48 71 42 -193 -19 219 -14 -256 -56 274
4018 274 -102 -180 -93 138 90 -71 -83 175 179 -127 -213 121 32 -13 -239 -91 158 12 -210 18 164 23 -132
4041 -132 -5 69 101 -70 -130 17 133 -108 -124 190 246 -5 -220 36 192 -54 -98 -99 101 141 -201 -127 235
4064 235 99 -167 -137 161 201 -40 -182 89 219 7 -177 83 290 -47 -232 -64 52 236 -141 -170 216
4085 216 116 -41 -183 116 170 57 -252 84 147 -32 -87 111 333 70 -192 -21 206 125 -111 -191 97 259
4107 259 -60 -207 25 230 34 -214 -44 208 8 -130 -43 175 -21 -124 -133 230 86 -322 -290 173 194 -87
4129 -87 -200 129 215 40 -221 -32 202 -45 -123 -145 168 132 -188 -202 175 214 -136 -282 77 281 -90 -319
4151 -319 17 227 176 -310 15 202 179 -237 -110 117 162 -153 -95 120 106 -100 -311 8 321 -79 -162 33
4173 33 231 47 -215 -19 240 185 -186 -105 214 138 -144 -229 75 230 -101 -206 -50 331 33 -206 34 157
4195 157 84 -138 25 207 27 -242 -93 159 218 -241 -133 129 184 5 -93 69 223 -30 -240 -62 230
4216 230 56 -287 -105 125 116 -154 -203 66 242 -249 -125 -27 160 26 -196 -87 232 51 -245 -64 296
4237 296 110 -225 -123 108 186 -184 -127 64 104 -59 -170 40 336 -118 -294 -4 143 128 -204 -130 140 121
4259 121 -122 -61 223 211 -90 -125 15 273 -137 -154 -143 211 -63 -147 -94 235 150 -321 -167 198 143 -238 -192
4282 -192 147 238 -140 -325 53 221 -150 -294 43 153 -27 -171 -47 250 257 -50 -161 277 274 -111 -209 179
4304 179 214 -141 -274 12 -6 69 -230 -116 143 181 -119 65 277 168 -235 -276 167 223 -239 -154 44 225
4326 225 -84 -289 -79 224 9 -214 51 197 216 -197 -60 102 82 -135 -103 216 200 -51 -256 -27 181
4347 181 13 -343 5 398 -3 -305 -2 233 261 -87 -166 154 128 -239 -74 166 371 22 -192 47 287
4368 287 10 -201 -91 170 145 -202 -146 125 80 -186 -269 130 152 -153 -279 6 195 -7 -299 -59 214 88
4390 88 -181 -201 324 91 -41 -41 173 144 -51 -256 129 194 -79 -267 53 241 -67 -166 -22 185 90 -206 -111
4413 -111 96 173 -233 -220 111 194 -101 -165 23 225 22 -133 -1 205 103 -180 22 80 -26 -46 -177 212
4435 212 188 -164 -272 71 234 -118 -79 74 266 -39 -62 45 208 53 -184 -51 102 149 -83 -150 207 114
4457 114 -78 -214 -5 297 -8 -155 -2 114 -7 -313 -144 301 58 -169 -112 166 69 -117 -137 123 212
4478 212 -16 -235 -68 268 95 -243 -12 215 -15 -121 -133 140 127 -182 -142 0 155 -137 -168 100 297
4499 297 -78 -303 43 195 41 -281 -24 279 56 -204 -160 118 287 -220 -218 202 252 -277 -204 -38 170 40
4521 40 -270 -35 192 59 -160 -142 120 90 -235 -296 200 210 -203 -359 154 204 -40 -232 95 250 65 -247
4543 -247 -131 203 75 -183 -193 251 228 -91 -175 294 288 -131 -254 111 208 -103 -252 -4 380 -32 -277 -143
4565 -143 268 65 -285 -203 281 88 -158 -148 218 308 -109 -168 6 109 23 -188 -107 304 105 -175 -33 206
4587 206 102 -206 -168 223 179 -49 -112 116 217 -78 -290 11 283 -121 -210 -135 240 313 -162 -130 237 170 -145
4610 -145 -136 104 211 -166 -113 102 189 3 -214 -91 283 89 -294 -121 281 140 -220 -129 183 223 -120 -168
4632 -168 191 200 -35 -300 30 72 -127 -352 -30 336 -85 -101 21 219 348 -204 -200 180 176 -32 -233 -54 162
4655 162 -1 -112 65 94 160 -218 41 251 30 -93 -114 138 245 -58 -80 112 21 -101 -182 -134 187 50
4677 50 -219 -55 122 160 -125 -143 213 182 -227 -124 110 124 -45 -148 -68 214 -23 -232 20 172 106 -227
4699 -227 42 154 231 -184 -148 119 94 -145 -270 62 134 -112 -162 114 190 90 -229 -117 246 171 -204 15
4721 15 143 71 -183 -99 99 147 -160 -273 60 197 46 -254 -27 144 32 -227 -104 204 -34 -198 -150 66
4743 66 118 -163 -256 155 201 80 -440 4 227 -188 -218 -27 242 3 -150 -32 246 68 -173 -82 78 111
4765 111 -29 -146 111 228 -171 -168 107 196 36 -236 62 235 89 -153 -97 145 75 -156 -104 168 130 -66
4787 -66 -202 189 217 -56 -319 37 216 31 -150 -76 185 18 -202 -88 213 94 -199 -129 177 169 -131 -115
4809 -115 204 249 12 -146 -66 196 38 -288 -201 158 81 -150 -60 236 -25 -161 -122 116 173 9 -209 89
4831 89 208 -75 -248 -152 254 25 -247 -88 247 113 -188 -107 99 317 -152 -177 58 147 -154 -214 173 246
4853 246 81 -196 -105 202 62 -146 -160 195 22 -159 -157 133 154 -73 -209 122 385 2 -217 -45 233 -17
4875 -17 -248 -238 100 190 -56 -211 198 260 -38 -198 141 39 -194 -242 -20 170 -13 -108 -94 125 44 -122 -131
4898 -131 135 165 -68 -142 212 317 -116 -191 27 114 42 -179 35 235 7 -215 -53 207 48 -122 -206 112
4920 112 236 -46 -169 88 85 13 -171 32 150 -13 -160 -14 330 0 -295 34 208 188 -72 -219 84
4941 84 176 -105 -144 23 295 -74 -318 -47 134 76 -327 -57 187 45 -200 -141 193 171 -54 -239 56 221
4963 221 -34 -286 -50 18 -133 -180 -60 235 16 -263 -72 123 139 -222 -31 110 156 -18 -341 8 223
4984 223 25 -269 -131 218 83 -171 -122 186 77 -225 -160 102 193 -80 -162 90 182 -42 -214 46 378 20
5006 20 -262 -30 111 17 -132 -38 53 146 -79 -117 91 168 -227 -266 128 203 -14 -180 16 191 -31 -201 -52
5029 -52 292 124 -251 -68 190 152 -159 -39 59 306 -120 -235 70 215 -61 -148 -16 257 62 -207 -33
5050 -33 190 223 -97 -54 91 104 -252 -6 -44 3 -124 -216 -20 205 -28 -159 -17 323 251 -113 -80 167 70
5073 70 -107 -79 131 107 -22 -145 126 223 -126 -137 54 233 -23 -270 -108 156 192 -65 -65 155 49 -151 -200
5096 -200 79 40 -34 -227 190 142 31 -209 91 107 -8 -26 66 68 -85 -49 -91 116 108 -105 -199 -11 167 -75
5120 -75 -145 73 110 -6 -202 -20 88 128 16 -39 74 265 -133 -87 113 138 -163 -247 47 97 -3 -270 21
5143 21 152 63 -189 -183 143 108 -204 -187 95 243 -119 -138 -4 125 -23 -191 120 240 144 -145 42 192 117
5166 117 -163 -187 144 197 -122 -283 213 103 -133 -105 143 189 -34 -241 33 256 3 -307 -172 219 120 -122
5188 -122 -146 199 225 -49 -182 83 294 -96 -277 26 228 52 -381 -148 240 50 -197 -142 152 96 -239
5209 -239 -209 162 268 -106 -219 99 265 -42 -243 109 310 -5 -218 -6 166 138 -161 -137 242 271 -106
5230 -106 -158 185 276 -93 -326 68 314 -55 -219 1 157 46 -240 -98 310 138 -235 -121 162 192 -120
5251 -120 -163 202 274 -82 -300 77 258 15 -248 -103 133 46 -201 -78 252 230 -99 -145 113 276 -111 -275
5273 -275 96 117 -32 -264 -27 264 187 -122 -42 174 -29 25 -99 169 139 -151 -108 51 37 -68 -187 -50
5295 -50 85 -28 -247 -45 229 188 -208 -244 -6 76 -110 -111 108 211 -51 -122 -59 266 -24 -201 -56 231 69
5318 69 -239 -102 146 158 -90 -68 117 171 -51 -265 -77 141 -71 -143 -31 291 -38 -217 -153 96 96 -193 -175
5341 -175 132 143 -2 -90 34 123 -53 -208 -150 175 81 -222 -97 261 85 -226 -97 190 111 -37 -141 177
5363 177 138 -9 -205 -120 281 -56 -330 2 124 14 -190 40 100 155 -51 -200 65 191 -152 -229 19 259
5385 259 -87 -214 125 181 50 -237 -24 60 60 -203 -17 131 181 -250 -173 73 234 -34 -264 3 215 -199
5407 -199 -193 -6 216 -2 -132 -19 147 134 -181 -84 202 222 -90 -37 132 170 -180 -136 61 173 30 -245 -2
5430 -2 115 76 -321 -162 166 129 -175 -132 140 128 -242 -94 58 131 -147 -200 -14 125 -17 -209 -56 224 147
5453 147 -160 -64 195 227 -39 -197 79 74 -23 -262 -22 251 -28 -237 -26 175 -12 -114 -16 281 59 -110
5475 -110 -110 299 100 57 -192 19 121 -100 -148 7 140 -72 -158 21 154 117 -171 -82 154 117 -100 -83 149
5498 149 192 -53 -237 0 235 -121 -150 104 181 -37 -129 -20 148 25 -90 -26 176 128 -128 -112 -162 219 -26
5521 -26 -193 150 178 126 -225 -19 233 118 -225 39 175 116 -122 -225 50 160 -210 -205 103 158 18 -75 -169
5544 -169 231 170 -192 -71 91 73 -213 -91 31 132 -128 -137 83 194 -93 -200 79 160 59 -180 -24 113
5566 113 171 -194 -98 143 113 -117 -193 194 195 -67 -171 106 238 52 -305 69 233 -23 -152 -153 131 132 -232
5589 -232 -192 123 105 -113 -238 85 227 -76 -172 -7 201 -13 -244 -80 72 150 -136 35 45 67 -105 -166
5611 -166 -11 140 -44 -112 46 328 -60 -255 50 238 36 -182 -113 138 -46 -187 -208 21 144 -120 -250
5632 -250 119 288 94 -152 68 244 24 -166 -77 146 31 -163 -168 159 131 -152 -193 132 230 -97 -16 204
5654 204 237 -175 -234 69 156 135 -129 -104 231 -19 -193 -149 254 105 -80 -234 123 196 -71 -121 55 130 60
5677 60 -146 -99 141 41 -216 -89 139 101 -222 -225 214 239 -19 -123 114 179 -75 -124 -100 56 -7 -183 -56
5700 -56 160 50 -29 -101 181 105 -99 -3 11 210 3 -130 83 233 93 -146 -93 109 14 -272 -77 138 36
5723 36 -202 -57 119 26 4 -112 117 76 -30 -280 -50 198 -27 -177 30 191 76 -153 -91 30 149 -39
5745 -39 -63 164 118 5 -107 122 163 167 -207 -57 144 84 -232 -107 160 92 -107 -83 46 209 6 -142 91
5768 91 195 36 -138 19 202 89 -119 -79 113 254 -77 -215 78 221 -127 -154 147 244 -86 -118 8 34
5790 34 -49 -150 -77 174 124 -167 -87 163 204 -158 -147 85 265 -38 -85 133 219 -14 -135 -54 217 50 -133
5813 -133 -25 218 147 -282 -165 147 175 -74 -123 111 132 -70 -248 -27 203 -11 -247 -2 119 74 -124 -76
5835 -76 179 90 -195 -139 182 128 -16 -123 174 184 -85 -103 -53 168 -44 -100 -73 262 165 -88 -18 194 189 -82
5859 -82 -41 243 104 -35 -118 -66 167 -8 -188 -61 203 -70 -129 -88 202 97 -138 102 80 143 -120 -140 57
5882 57 191 -46 -100 -33 94 -26 -134 121 52 29 -156 92 91 204 -73 -51 36 58 -142 -212 99 155 -6 -210
5906 -210 43 114 -53 -40 32 99 2 -123 -133 170 161 -93 -129 123 79 -142 -62 117 135 -92 -75 -46 51 47 -174 -105
5932 -105 187 130 -147 -236 46 45 -237 -132 -41 113 -13 -58 117 240 9 -102 165 64 66 -80 -79 78 10 -81
5956 -81 3 48 154 -42 -120 106 233 -34 -225 -15 82 36 17 -22 63 35 -146 -157 -6 -17 -173 -191 62 54 -13
5981 -13 -11 114 195 -2 -127 96 220 -43 -161 -70 79 29 -92 -24 43 156 -6 -258 43 156 -41 -48 -26 345
6005 345 137 49 -29 57 138 -58 -60 67 145 -143 -111 35 138 -9 -122 128 47 44 -140 -8 233 34 -177 -88
6029 -88 77 77 -152 -212 103 17 -94 -206 15 185 -89 -143 56 40 -33 -243 -71 69 65 -237 -127 150 155 -216
6053 -216 -203 129 186 -72 -147 36 177 22 -204 -117 215 72 -108 -91 175 64 -26 -170 139 12 -124 -12
6075 -12 218 234 -69 -117 -58 176 31 -166 -149 121 47 -222 -1 148 140 -152 -156 100 125 -89 -209 146 213 65
6099 65 -275 61 202 -6 -173 -126 167 47 -116 -31 209 221 -118 -16 40 144 -2 -212 -138 234 -3 -264
6121 -264 -73 178 111 -166 -122 149 128 -152 -94 96 174 -69 -108 142 162 -29 -118 18 214 0 -69 -27 111
6144 111 168 -202 -190 39 124 17 -146 96 237 -82 -264 58 153 -5 -157 -152 128 98 -160 -91 200 154 -189
6167 -189 -94 177 170 -25 -229 138 202 -54 -202 -6 131 57 14 -81 235 67 -57 -35 94 156 -51 -95 158
6190 158 89 14 -63 -99 144 -69 -204 -166 109 45 -127 -91 127 190 -196 -34 113 165 24 -63 134 75 52 -234
6214 -234 -47 110 171 -224 -37 122 73 1 -9 90 168 -32 -87 70 -24 -116 -161 40 213 108 -192 -92 212
6237 212 81 -95 -105 -4 114 -68 -83 111 55 -49 -196 -41 75 -38 -197 63 122 -95 -138 -26 214 -59
6259 -59 22 -12 132 140 -123 -136 10 139 -88 -197 174 83 -70 -69 150 159 -21 -199 61 164 13 -98 -51 154
6283 154 82 -151 -163 45 100 -23 -94 64 155 41 -140 -175 103 84 15 -1 231 211 -77 5 240 78 -165 -23
6307 -23 6 169 29 -43 -19 -59 -43 -217 -68 115 -2 -284 -61 118 -4 -176 -101 78 101 -88 -187 62 61 -44
6331 -44 -279 72 221 82 -97 -30 154 -48 -58 7 100 -45 -65 -22 75 191 66 -218 -24 133 66 -97 68
6354 68 150 24 -231 115 232 109 -142 -7 114 158 -115 -100 -1 178 -24 -82 134 150 -55 -191 6 155
6376 155 83 -105 -207 13 78 -110 -57 59 34 6 -120 26 168 -139 -4 25 183 -78 -199 10 203 61
6398 61 -111 -91 77 176 -8 -66 5 131 5 -128 -35 204 0 -209 -52 137 32 -116 -254 58 -3 -120
6420 -120 -23 99 124 -55 -89 45 195 3 -146 61 96 12 -196 -32 112 162 -228 -159 70 110 -80 -225 69
6443 69 204 -80 -101 -1 187 165 -133 -114 222 207 -96 -193 132 86 -98 -160 212 143 -89 -182 90 178 -27 -220
6467 -220 41 270 61 -236 -100 140 11 -146 -42 96 17 -70 -147 156 102 13 -194 -10 130 -45 -96 -35
6489 -35 55 -9 9 -152 13 184 -137 -48 91 140 -77 -43 23 174 83 -26 59 15 -50 -143 -43 48 168 -82 -199
6514 -199 37 196 -76 -112 -111 188 -66 -130 84 141 -50 -143 -88 67 -30 -122 -7 92 56 -32 -96 127 164 -161 -121
6539 -121 30 93 -67 -124 20 147 75 -124 -82 86 -6 -59 -90 192 -12 -102 -149 -49 139 -123 -135 -6 51 -68
6563 -68 -49 -57 55 45 -115 9 80 42 -39 -68 67 163 -58 -37 -39 64 29 -22 2 70 101 -80 28 103 25 -179 -56
6590 -56 61 -13 -53 -74 40 98 4 -162 8 50 17 -50 -104 144 78 22 -68 48 108 -68 39 113 -46 -81 -41 62
6616 62 2 -43 -100 146 139 -5 -18 -35 36 113 -177 5 123 150 -85 -132 41 7 74 -72 -53 86 92 -101 -2 10
6642 10 -4 -60 -80 71 87 20 67 -8 43 -27 -78 -61 87 -7 -173 9 106 -53 -75 -55 106 46 -78 -25 126 75
6668 75 -169 -137 -12 79 -56 -91 -24 89 69 -74 54 87 61 -9 -62 -32 62 90 -63 145 18 -177 -136 64 81
6693 81 -55 -48 -29 79 40 -148 96 180 53 -128 -122 66 46 -77 -26 63 42 -96 -95 45 66 48 -210 44 -1 -15
6719 -15 -22 10 73 29 -39 105 -5 21 -131 -43 72 97 -37 -142 -74 73 22 -130 107 141 2 -127 37 25 76
6744 76 -5 26 60 111 -10 -134 35 70 -10 -112 7 106 -143 -49 122 33 32 -162 -46 84 71 -1 -31 91 -12
6769 -12 -68 -18 155 57 -53 -17 34 11 -38 -234 -50 71 56 -105 0 99 131 -134 -20 61 155 -44 -16 -37 146
6794 146 -89 -105 55 -30 156 -101 -2 48 68 -40 -48 40 82 -66 34 35 26 -74 -83 -92 38 -1 -61 -51 68 -71 -43
6821 -43 -35 1 57 -3 21 -44 13 18 18 39 -50 -120 -15 13 81 -4 -73 -113 64 104 54 -68 -4 159 -26 -144 40 33 -34
6850 -34 -152 103 24 67 -25 -77 111 102 11 58 -48 -12 -66 -38 15 56 -60 -81 5 3 -20 -113 4 77 -34 -62 -105 109
6878 109 100 5 -90 63 104 -45 -2 93 193 -26 -107 -11 109 98 -27 31 -28 34 -116 -16 61 6 -215 -89 72
6903 72 -58 -132 97 62 -40 -133 -21 -2 15 127 -139 14 -47 66 -42 31 55 87 -45 -76 48 0 -77 -84 144
6928 144 -2 -9 -22 -32 -40 61 -171 4 107 60 -142 -80 88 218 -9 17 41 110 22 10 20 92 -46 -127 -37 84
6954 84 -87 11 -19 27 127 103 -14 -80 108 5 -139 79 10 -55 -52 -12 16 -67 -64 99 -31 96 -42 -102 47
6979 47 61 -108 -32 18 -26 13 -79 86 6 73 0 -17 93 76 93 2 35 3 -21 -98 79 8 -85 -71 53 85 -116
7006 -116 -162 25 7 -62 -23 40 133 -42 -18 63 14 24 -49 -46 36 -38 -104 -101 36 -9 -117 11 -25 165 18 -128 -61
7033 -61 32 33 -19 38 31 -86 -36 65 105 19 -49 -61 -75 124 80 -89 -28 -17 92 -10 -59 8 -115 -64 29 -77 49
7060 49 26 -68 -48 82 -29 -31 -8 82 62 -88 23 39 79 -75 -13 80 -51 115 5 23 -16 45 -246 -18 113
7085 113 -10 -82 -38 77 124 -124 -15 73 41 -46 53 31 54 12 -104 35 3 -59 -102 143 174 3 -62 24 -8 -37
7111 -37 -83 -53 66 75 55 -52 114 40 -12 -77 -12 139 -106 -70 58 72 101 -6 -216 -5 -59 -47 -30 16 93 74
7137 74 -87 63 126 -100 -1 -12 112 97 -109 -20 12 -67 -83 -106 -163 9 -111 -44 41 -107 36 -5 -19 24 44 -37
7163 -37 -18 47 45 -71 -3 95 -28 -82 -37 65 53 -77 67 137 19 -5 -26 -90 24 63 2 47 172 -25 -51 60
7189 60 54 55 -95 21 58 -6 26 -1 45 43 26 -47 46 151 -79 -136 -1 30 81 10 1 34 56 8 -44 94 46 -38 -31 3
7219 3 83 -116 -117 93 -13 55 -10 -12 230 88 38 11 47 -41 -50 97 -55 223 -45 47 18 -111 -55 -80 78 15 -12
7246 -12 65 63 114 119 -87 8 6 7 7 54 -100 41 60 -95 -17 59 3 -63 89 -46 66 -36 -6 23 26 -46 -61 -46 83
7275 83 -88 -160 22 42 61 -58 67 -128 127 65 94 93 36 -6 -18 -44 140 -176 -184 -17 83 44 -152 6 16
7300 16 122 -3 34 59 109 -57 -29 49 38 -69 21 44 -26 26 -153 -64 80 -3 -96 -58 75 25 -32 21 -24 143
7326 143 -20 46 -15 13 37 16 -20 47 -103 22 5 -53 -5 -56 33 26 76 120 -2 71 17 -2 -22 -16 109 -103 44
7353 44 -49 8 5 -59 33 -6 -25 -132 -54 -2 77 -10 15 54 1 87 29 38 -3 9 -20 -2 12 -25 -63 -85 12 2 -14 -35 38
7384 38 141 37 28 78 27 -57 -47 -119 -4 -101 -84 -106 43 72 -163 -87 11 33 49 -94 -103 -41 -104 -64 -45 8 -131 -28
7412 -28 -72 60 -75 -80 56 65 105 58 24 80 21 -70 -27 -62 -101 -12 -1 -16 93 -24 3 -33 79 111 -98 62 60 -17
7440 -17 -63 -14 36 -90 -19 -1 21 26 -58 -36 -72 93 -16 -94 -16 70 76 115 19 14 4 -28 -55 59 63 -27 -43 111 72 -4
7470 -4 6 -27 143 -51 -14 -27 -58 29 -17 -176 63 141 99 -42 -75 -100 -11 4 17 51 -34 -8 -172 13 -50 97 8
7497 8 -9 28 -125 -101 -80 58 -51 15 46 161 -49 6 75 72 112 64 -58 86 48 63 184 48 7 -111 133 77
7523 77 74 -59 65 34 -15 -81 18 14 57 1 -98 -120 -35 -60 -48 -112 -65 49 35 -103 -17 -65 21 21 7 154 46 -10 81
7552 81 -68 -35 -36 -143 47 143 -40 60 56 -82 125 -108 105 86 -6 -36 70 1 24 -110 -69 14 14 -61 -6 -47
7578 -47 24 97 -9 -16 86 -26 -108 38 120 -78 -25 36 -91 -30 27 -8 -126 78 59 78 -21 -74 -53 77 7 113
7604 113 -148 -104 10 151 -8 -24 84 -7 62 -14 -51 153 61 -5 -20 4 97 -65 -40 -38 -29 43 -96 -68 28 -54 -80
7631 -80 36 13 86 -65 -37 30 -18 -89 -82 34 4 -135 118 22 5 10 49 43 6 142 20 -1 71 6 -117 56 81
7658 81 20 65 -33 108 -52 -35 93 -51 47 98 -30 -36 45 -100 108 35 121 108 84 0 12 -71 -106 6 -24 -69 87
7685 87 11 5 52 -8 -40 33 -39 133 -63 -97 107 106 -115 3 -54 -77 112 37 20 -19 -29 49 14 -78 5 -53 -15 21
7713 21 160 -84 -16 -23 37 53 -96 84 112 -9 -59 60 -20 58 -35 -7 -76 -22 44 -37 151 40 -71 -97 -24 58
7739 58 -15 -59 54 -3 -11 -40 28 74 -34 -127 -15 19 79 -67 -95 33 117 -67 48 -20 21 106 7 -44 23 -110 45
7766 45 -72 -25 85 -13 -87 73 57 -48 133 -37 39 25 -22 -41 35 81 9 -98 1 56 -134 -90 -9 -28 -52 -33
7792 -33 59 39 -137 -114 -17 -57 87 -92 24 108 -125 -59 77 186 -6 -32 -28 32 -4 24 -25 -8 71 -24 -26 -55 -46 51
7820 51 -75 67 88 56 -110 2 40 -37 -82 -228 18 -15 30 -36 -59 43 -3 -27 77 -47 4 -91 38 -17 -56
7845 -56 -6 -4 47 36 -58 -24 22 48 93 13 81 8 56 -99 3 119 -62 90 106 -13 20 -134 -134 -17 108 101 13
7872 13 84 9 106 -38 -25 55 -110 -153 -25 55 16 -97 -12 92 9 38 3 42 59 -43 -91 128 4 -37 -1 -102
7898 -102 -46 36 55 4 24 39 -103 10 -76 122 -30 9 5 55 66 32 -6 52 10 -11 30 77 28 -114 -26 -41 -29 76
7926 76 17 20 -10 -27 18 92 116 7 -9 -24 48 -50 178 -17 3 -39 -94 -5 -80 -48 -44 55 51 143 96 -38 -6 49 24 49
7956 49 9 107 59 -2 38 15 -19 28 6 52 36 -80 -143 15 32 7 12 -134 5 -129 -42 56 121 -38 -45 -31 9 14 -16
7985 -16 -20 47 -7 -16 7 -9 31 37 -16 0 67 -83 70 33 -11 -29 -140 24 44 27 -25 113 -34 5 74 -60 60 20
8013 20 -45 28 53 95 190 64 1 -63 71 -42 -76 41 65 -44 -103 6 49 122 -66 -59 -61 91 -52 -113 183 35
8039 35 -30 -60 -6 113 -61 117 7 192 64 -36 47 125 37 186 73 -2 40 -99 36 78 -105 -57 45 -21
8063 -21 15 -20 -47 59 -13 -55 88 -151 -81 -41 4 38 139 106 -77 -15 -20 78 60 180 52 -67 40 -8 55 67
8089 67 20 -75 36 103 -15 -76 37 58 61 46 -33 27 67 -2 -14 104 -55 54 -81 -25 -52 -43 2 4 11 115 -58 -19
8117 -19 -17 -38 -85 -27 -29 64 3 -5 122 -8 -10 24 59 3 34 35 50 10 61 -8 43 -25 -42 70 -19 -50 -22 -9 73 5 -35
8148 -35 211 -96 59 56 51 27 79 -88 38 -3 -31 -6 18 -20 -18 115 -4 3 53 55 109 48 4 128 -8 0 -34 -37 -19
8177 -19 -31 -76 -128 15 40 -81 -59 13 0 -154 27 21 7 -26 3 -110 -1 64 -61 26 -4 12 81 -12 16 48 -5
8204 -5 -112 -18 -74 -56 -74 -23 87 -35 -144 -39 30 54 -4 -36 47 -94 37 -115 12 3 -45 -67 -92 -37 -62 -42 -27
8231 -27 67 34 19 0 -8 -91 -52 91 99 -38 48 49 -6 29 14 13 -12 159 -103 49 -115 -62 -6 -99 50 26 9 29 82
8260 82 27 -36 12 -33 91 39 20 -51 -26 146 5 11 20 2 15 78 -99 79 60 40 -54 96 -11 -28 6 -60 22 -76
8288 -76 -145 -51 6 78 98 -220 -39 65 8 46 21 145 -36 -28 61 -40 -66 5 67 89 2 36 -104 -27 -87 135 -45
8315 -45 39 -30 -45 -49 -5 50 2 -3 -70 55 46 -81 -86 25 -94 116 24 81 47 6 40 76 88 -63 93 -97 -15 62
8343 62 -30 25 116 26 39 -29 121 -29 -84 91 36 -27 72 68 -33 104 70 -14 71 3 20 58 108 45 -120 -77 -68 -56
8371 -56 -63 -54 55 -60 30 -15 -18 68 -79 80 81 43 177 30 48 74 -70 1 90 116 132 -64 -33 -21 10 110 -77
8398 -77 -70 -45 -34 -57 -42 -96 86 67 -95 35 107 39 -57 -82 -113 46 45 75 -33 92 61 36 57 -78 36 18 -6
8425 -6 -11 43 -79 -4 87 -1 -91 -1 102 -137 -14 56 29 -10 66 -124 188 -89 85 -20 4 6 100 49 21 128 11
8452 11 -13 28 27 -2 -4 -32 39 17 156 -122 -7 110 48 31 31 36 31 -79 -98 -94 -39 11 21 116 -22 34 32 53 -73 49
8482 49 -102 -60 51 -65 -9 54 43 -10 31 28 -55 -26 -45 13 109 156 -7 -33 56 -36 30 10 53 -51 -46 -13 50 118 45
8511 45 -9 -84 26 -63 18 -27 -32 4 39 -45 0 -101 -48 11 -65 -46 -3 -91 23 -16 80 -62 -75 2 24 -23 55 40 28
8540 28 43 -45 -10 -13 18 -3 35 99 163 -32 -79 -14 53 -37 -9 -19 -48 64 -25 10 -47 -6 14 32 3 59 38 -60 4 16
8570 16 73 -105 -53 34 18 -54 -79 73 -9 -60 -19 -58 54 -90 -59 53 142 -112 75 -18 32 -40 -100 -97 -103 -67 -90 92
8598 92 15 25 -19 -92 113 23 -26 -118 30 81 12 15 54 59 -29 88 -19 100 3 -119 -26 -10 -3 -68 2 59 80 -116
8626 -116 22 11 27 -21 -35 -43 -8 -95 78 75 -84 26 -16 -66 104 60 -50 -73 102 -3 -49 -13 89 12 5 -72 -2
8653 -2 24 97 -124 -81 105 15 0 -109 41 -55 -3 -58 87 60 -42 -53 89 4 21 54 52 24 -130 35 32 18 -58
8680 -58 -72 70 38 -24 -47 -26 116 78 32 79 92 141 6 116 -24 60 15 74 -33 -73 -152 -36 -14 67 -86 -98
8706 -98 -61 2 -12 3 -88 -7 -82 -22 113 90 -82 23 22 54 -14 -30 20 -118 -60 17 -127 -46 -14 -86 82 8 -144
8733 -144 95 -49 -118 10 112 93 -6 15 -51 -32 -75 -48 91 11 -7 -11 19 102 -24 -26 -170 159 -44 -59 25 -42
8759 -42 -18 -68 14 26 -56 -65 160 57 75 67 -3 12 22 144 -25 24 95 24 -30 15 104 106 -46 -41 22 -17 -58 62 -28
8788 -28 -70 93 -23 105 68 -7 -88 98 34 -110 88 -11 -112 63 -34 -10 -54 88 44 -134 -24 34 129 -120
8812 -120 -34 -35 9 113 -125 -9 -26 -56 -27 34 92 -41 76 -17 103 105 -19 -7 58 41 45 -39 -4 17 13 -93 -67 -126
8840 -126 -116 20 53 -54 4 -39 -73 140 -107 -3 54 53 -25 -159 -46 -75 110 -51 -42 23 -52 -18 9 -45 49 21
8866 21 -39 15 14 -73 -82 -137 -36 -53 -111 -41 5 -7 24 59 46 41 -9 -128 -35 -61 7 52 -157 19 19 1 -40 -1 -59 68
8896 68 -19 120 -102 -84 -13 -3 -17 -19 -91 -98 -14 -8 -15 -3 -51 195 91 -24 -44 72 -38 83 148 66 35 -102 -68 26
8924 26 30 26 10 28 -39 27 186 48 -61 -5 47 -44 65 88 90 37 -24 45 36 -14 29 -17 -26 -50 -120 166 -192 -1 97
8953 97 -24 -146 -45 -53 61 -121 51 -1 -63 15 -47 -119 -148 41 -27 -39 50 33 -36 -14 -10 11 1 -125 -63 28 -24
8980 -24 -37 -23 69 98 -31 -53 -28 -141 71 -17 70 24 61 -107 -8 98 -43 -31 37 -72 -73 -119 -74 -124 -18 -5 30
9007 30 -42 29 -10 -54 81 -61 31 -107 19 81 17 22 -25 51 51 -84 3 97 -76 11 131 -34 67 68 43 -29 90
9034 90 -53 16 69 -6 -93 124 -123 -44 -37 33 -89 157 -29 -5 -17 -42 52 40 19 55 -18 -23 80 -13 2 -101 24
9061 24 30 28 -4 28 -21 164 -54 -14 -53 -59 2 -69 -6 -67 13 -40 -140 -22 69 -99 -6 19 33 -13 -127 65 -30 67
9089 67 59 -35 -48 -21 7 -69 -12 113 -6 -90 45 -23 -46 -148 29 26 -51 -121 96 78 -93 -126 -34 68 27 18 12 31
9117 31 70 -34 -108 -5 74 -1 -6 -39 -4 72 13 -16 70 3 3 43 87 85 -81 -60 -33 17 -17 -1 -9 -137 -57 -99 6 -29
9147 -29 65 -23 -36 8 -3 26 4 -15 -10 65 90 61 -19 95 -60 32 149 -23 13 41 87 54 -62 -59 -34 85 30 -49
9175 -49 37 109 110 -60 25 7 -4 1 9 90 -27 -27 -25 -87 -28 -88 54 12 -13 129 -9 1 37 -76 4 -50 -9 31 -74
9204 -74 108 36 108 32 -18 91 26 72 -33 -45 107 110 25 -18 50 48 -35 -32 -5 -40 88 -21 -59 101 -22 60 12 78
9232 78 27 -56 6 53 112 -53 -45 8 49 28 24 -75 -46 -105 -31 -5 2 34 29 -14 83 -38 171 -72 -104 110 134 -13 7
9261 7 -6 -85 8 15 161 -127 49 7 7 -21 100 21 67 -49 -46 -77 71 -54 48 -143 40 -58 43 -20 -24 -12 32
9288 32 -70 71 -56 -39 -136 -15 120 162 -119 0 21 25 16 -37 78 86 -75 -23 33 39 51 90 -17 0 94 -6 4
9315 4 -22 -57 -135 103 85 -112 -110 47 -119 65 77 -57 -26 62 0 -3 -56 -51 -99 -109 -104 -2 49 -41 -12 27 123 27 84
9344 84 31 80 72 -187 128 -36 123 -45 21 -19 -2 87 68 -51 20 73 12 124 38 92 36 -71 -13 16 -132 -34
9370 -34 0 79 37 77 91 95 14 -78 36 82 62 50 97 36 7 -14 -158 39 30 -33 7 -28 44 17 -102 15 55 1 21
9399 21 34 -24 -104 32 28 -43 -147 -172 -52 -50 -40 54 -40 -11 -76 6 118 55 18 83 -50 14 2 68 -158 126 -40
9426 -40 20 70 37 3 20 -44 -53 23 4 -48 -126 -4 -17 -3 -77 -51 -38 62 8 39 48 -104 51 57 -24 34 -36 -28 -173 45
$$ [...]
16383a42
##END NTUPLES=NMR FID
##END=
