##TITLE=abcd
##JCAMPDX= 6.0         $$ Bruker NMR JCAMP-DX V2.0
##DATA TYPE= NMR SPECTRUM
##DATA CLASS= NTUPLES
##ORIGIN= UXNMR, Bruker Analytische Messtechnik GmbH
##OWNER= root
$$ XWIN-NMR		Version 3.5
$$ Mon Sep 15 17:39:01 2025 Russian Standard Time (UT+4h)  servis@DPX200
##.OBSERVE FREQUENCY= 200.131235884673
##.OBSERVE NUCLEUS= ^1H
##.ACQUISITION MODE= SIMULTANEOUS
##.ACQUISITION SCHEME= undefined
##.AVERAGES= 16
##.DIGITISER RES= 18
##SPECTROMETER/DATA SYSTEM= spect
##.PULSE SEQUENCE= zg
##.SOLVENT NAME= CDCl3
##.SHIFT REFERENCE= (INTERNAL, CDCl3, 0, 16.4885)
##AUDIT TRAIL= $$ (NUMBER, WHEN, WHO, WHERE, WHAT)
$$ ##TITLE= Audit trail, XWIN-NMR		Version 3.5
$$ ##JCAMPDX= 5.01
$$ ##ORIGIN= Bruker BioSpin GmbH
$$ ##OWNER= servis
$$ F:\spectra/data/av/nmr/H1/1/pdata/1/auditp.txt
$$ ##AUDIT TRAIL=  $$ (NUMBER, WHEN, WHO, WHERE, WHAT)
(   1,<2025-09-15 17:38:22.67 +0400>,<servis>,<DPX200>,
      <created by zg, POWCHK disabled, PULCHK disabled
       terminated by command 'halt'
       configuration hash MD5:
       00 E9 B6 7A A2 85 ED C7 34 08 36 98 17 FE 4E 26
       data hash MD5: 32K
       76 0E 44 20 ED 4E D4 9D 07 A7 48 09 5D 55 FA D6>)
(   2,<2025-09-15 17:38:25.75 +0400>,<servis>,<DPX200>,
      <Start of raw data processing
       efp BC_mod = 2 LB = 0.05 FT_mod = 6 PKNL = 1 PHC0 = -196.7045 PHC1 = 2.101565 SI = 16K 
       data hash MD5: 16K
       14 04 D5 57 55 6F 87 9F 91 41 91 D8 44 47 2D 64>)
(   3,<2025-09-15 17:38:36.00 +0400>,<servis>,<DPX200>,
      <pk PHC0 = -1.4 PHC1 = 0 
       data hash MD5: 16K
       1A 03 03 B3 64 16 63 63 9E 1B EA 57 04 C7 79 40>)
$$ ##END=
$$ 
$$ hash MD5
$$ A2 93 54 FB 9F 45 2F A0 8E D4 BF FE 38 B6 5F 82
##$RELAX= 
##$RELAX= 
##$RELAX= 
##$RELAX= 
##$RELAX= 
##$RELAX= 
##$RELAX= 
##$RELAX= 
$$ Bruker specific parameters
$$ --------------------------
##$DU= <F:\spectra>
##$EXPNO= 1
##$NAME= <H1>
##$PROCNO= 1
##$TYPE= <nmr>
##$USER= <av>
##$AMP= (0..31)
100 100 100 100 100 100 100 100 100 100 100 100 100 100 100 100 100 100 
100 100 100 100 100 100 100 100 100 100 100 100 100 100 
##$AQSEQ= 0
##$AQ_mod= 1
##$AUNM= <au_zg>
##$AUTOPOS= <>
##$BF1= 200.13
##$BF2= 200.13
##$BF3= 200.13
##$BF4= 200.13
##$BF5= 500.13
##$BF6= 500.13
##$BF7= 500.13
##$BF8= 500.13
##$BYTORDA= 1
##$CFDGTYP= 0
##$CFRGTYP= 5
##$CHEMSTR= <none>
##$CNST= (0..31)
1 1 145 1 1 1 1 1 1 1 1 1 1 1 1 1 1 1 1 1 1 1 1 1 1 1 1 1 1 1 1 1 
##$CPDPRG= <>
##$CPDPRG1= <>
##$CPDPRG2= <>
##$CPDPRG3= <>
##$CPDPRG4= <mlev>
##$CPDPRG5= <mlev>
##$CPDPRG6= <mlev>
##$CPDPRG7= <mlev>
##$CPDPRG8= <mlev>
##$CPDPRGB= <>
##$CPDPRGT= <>
##$D= (0..31)
0 2 0 0 0 0 0 0 0 0.06 0 0 0 0 0 0 0.0002 0 0 0 0 0 0 0 0 0 0 0 0 0 0 
0 
##$DATE= 1757943502
##$DBL= (0..7)
120 120 120 120 120 120 120 120 
##$DBP= (0..7)
150 150 150 150 150 150 150 150 
##$DBP07= 0
##$DBPNAM0= <>
##$DBPNAM1= <>
##$DBPNAM2= <>
##$DBPNAM3= <>
##$DBPNAM4= <>
##$DBPNAM5= <>
##$DBPNAM6= <>
##$DBPNAM7= <>
##$DBPOAL= (0..7)
0.5 0.5 0.5 0.5 0.5 0.5 0.5 0.5 
##$DBPOFFS= (0..7)
0 0 0 0 0 0 0 0 
$$ [...]
##$SUBNAM4= <"">
##$SUBNAM5= <"">
##$SUBNAM6= <"">
##$SUBNAM7= <"">
##$SUBNAM8= <"">
##$SUBNAM9= <"">
##$SW= 20.6817932712277
##$SWIBOX= (0..15)
0 0 3 0 0 0 0 0 0 0 0 0 0 0 0 0 
##$SW_h= 4139.07284768212
##$TD= 32768
##$TD0= 1
##$TE= 0
##$TE2= 300
##$TE3= 300
##$TEG= 300
##$TL= (0..7)
0 120 120 120 120 120 120 120 
##$TP= (0..7)
150 150 150 150 150 150 150 150 
##$TP07= 0
##$TPNAME0= <>
##$TPNAME1= <>
##$TPNAME2= <>
##$TPNAME3= <>
##$TPNAME4= <>
##$TPNAME5= <>
##$TPNAME6= <>
##$TPNAME7= <>
##$TPOAL= (0..7)
0.5 0.5 0.5 0.5 0.5 0.5 0.5 0.5 
##$TPOFFS= (0..7)
0 0 0 0 0 0 0 0 
##$TUNHIN= 0
##$TUNHOUT= 0
##$TUNXOUT= 0
##$USERA1= <user>
##$USERA2= <user>
##$USERA3= <user>
##$USERA4= <user>
##$USERA5= <user>
##$V9= 5
##$VALIST= <valist>
##$VCLIST= <CCCCCCCCCCCCCCC>
##$VD= 0
##$VDLIST= <DDDDDDDDDDDDDDD>
##$VPLIST= <PPPPPPPPPPPPPPP>
##$VTLIST= <TTTTTTTTTTTTTTT>
##$WBST= 1024
##$WBSW= 30
##$XGAIN= (0..3)
0 0 0 0 
##$XL= 0
##$YL= 0
##$YMAX_a= 1306057
##$YMIN_a= -1212674
##$ZGOPTNS= <>
##$ZL1= 120
##$ZL2= 120
##$ZL3= 120
##$ZL4= 120
##$ABSF1= 0
##$ABSF2= 0
##$ABSG= 0
##$ABSL= 0
##$ALPHA= 0
##$AQORDER= 0
##$ASSFAC= 0
##$ASSFACI= 0
##$ASSFACX= 0
##$ASSWID= 0
##$AUNMP= <proc_1d>
##$AZFE= 0.1
##$AZFW= 0.1
##$BCFW= 0
##$BC_mod= 2
##$BYTORDP= 0
##$COROFFS= 0
##$CY= 18.4799938201904
##$DATMOD= 1
##$DC= 0
##$DFILT= <>
##$DTYPP= 0
##$F1P= 9.9274215381318
##$F2P= -0.165520771350173
##$FCOR= 1
##$FTSIZE= 16384
##$FT_mod= 6
##$GAMMA= 0
##$GB= 0
##$INTBC= 1
##$INTSCL= 4.127829e-11
##$ISEN= 128
##$LB= 0.05
##$LEV0= 0
##$LPBIN= 0
##$MAXI= 10000
##$MC2= 0
##$MEAN= 0
##$ME_mod= 0
##$MI= 50
##$NCOEF= 0
##$NC_proc= -3
##$NLEV= 6
##$NOISF1= 3.799351
##$NOISF2= 2.8
##$NSP= 0
##$NTH_PI= 0
##$NZP= 0
##$OFFSET= 16.48848
##$PC= 4
##$PHC0= -198.1045
##$PHC1= 2.101565
##$PH_mod= 1
##$PKNL= yes
##$PPARMOD= 0
##$PSCAL= 4
##$PSIGN= 0
##$REVERSE= no
##$SF= 200.130005582386
##$SI= 16384
##$SIGF1= 3
##$SIGF2= 2
##$SINO= 400
##$SIOLD= 16384
##$SREGLST= <1H.CDCl3>
##$SSB= 0
##$STSI= 16384
##$STSR= 0
##$SW_p= 4139.07284768211
##$SYMM= 0
##$S_DEV= 0
##$TDeff= 32768
##$TDoff= 0
##$TI= <>
##$TILT= no
##$TM1= 0
##$TM2= 0
##$TOPLEV= 0
##$USERP1= <user>
##$USERP2= <user>
##$USERP3= <user>
##$USERP4= <user>
##$USERP5= <user>
##$WDW= 1
##$XDIM= 16384
##$YMAX_p= 295975322
##$YMIN_p= -418659
$$ End of Bruker specific parameters
$$ ---------------------------------
##NTUPLES= NMR SPECTRUM
##VAR_NAME=  FREQUENCY,     SPECTRUM/REAL,   SPECTRUM/IMAG
##SYMBOL=    X,             R,               I
##VAR_TYPE=  INDEPENDENT,   DEPENDENT,       DEPENDENT
##VAR_FORM=  AFFN,          ASDF,            ASDF
##VAR_DIM=   16384,         16384,           16384
##UNITS=     HZ,            ARBITRARY UNITS, ARBITRARY UNITS
##FACTOR=    0.252644378177508, 1,           1
##FIRST=     3299.83951724647, 0,            0
##LAST=      -839.233330435636, 0,           0
##MIN=       -839.233330435636, -418659,     0
##MAX=       3299.83951724647, 295975322,    0
$$ Real data points
##PAGE= N=1
##DATA TABLE= (X++(R..R)), XYDATA
$$ [...]
8290 -77901 -78080 -74327 -73686 -74681 -70758 -79349 -74041 -74630 -72034 -72182 -72366 -75595 -78679 -74888 -72827 -75751
8274 -75751 -77510 -75681 -76958 -74843 -72195 -70461 -73553 -71877 -70063 -69357 -73578 -76213 -77175 -74643 -73666
8259 -73666 -76488 -72368 -72488 -68980 -67432 -71679 -75380 -73501 -69897 -70142 -76168 -71357 -69714 -76965 -71805
8244 -71805 -69991 -74239 -73800 -74984 -72251 -75930 -73757 -72201 -69466 -75595 -78048 -75112 -71156 -74551 -70592
8229 -70592 -71485 -75001 -68600 -73956 -70672 -69697 -74584 -73179 -77072 -68463 -71996 -73420 -73255 -65074 -70272
8214 -70272 -70070 -67243 -73619 -71115 -72421 -70057 -63169 -67006 -83219 -57589 -74023 -65536 -64188 -71423
8200 -71423 -76862 -81061 -68867 -69465 -79083 -67129 -69518 -85537 -100371 -86913 -78478 -68317 -76085
8187 -76085 -76664 -89990 -64252 -71625 -76869 -65348 -81737 -76297 -96800 -74017 -76460 -74660 -72472
8174 -72472 -70096 -72430 -76438 -71919 -75159 -71186 -80982 -80490 -78810 -83176 -73702 -73530 -75208 -72352 -73651
8159 -73651 -73027 -72824 -76211 -71088 -80845 -71940 -69977 -75383 -75710 -82594 -70221 -71981 -74900 -71928 -73981
8144 -73981 -77475 -74720 -68889 -76832 -77958 -74410 -72916 -71655 -74447 -72559 -70694 -71779 -79306 -71920 -76266
8129 -76266 -73685 -77763 -78302 -79322 -75445 -71005 -77012 -73345 -80363 -68974 -73659 -72018 -75790 -74676 -72996
8114 -72996 -79345 -73223 -76608 -73323 -78153 -76677 -75861 -75670 -75806 -75457 -77126 -79209 -79844 -78697 -82250 -73467
8098 -73467 -79562 -76922 -74187 -80836 -75659 -76193 -77950 -74546 -74919 -75099 -74533 -77978 -77129 -75431 -71748 -76423
8082 -76423 -75463 -74504 -79281 -75473 -72105 -73298 -78106 -71381 -68706 -73479 -69812 -70859 -75716 -67995 -68975
8067 -68975 -72094 -69054 -72008 -72742 -74610 -69008 -68338 -70082 -68240 -65814 -71376 -66053 -67531 -66515 -66551 -65507
8051 -65507 -64601 -66849 -70880 -71275 -71339 -72071 -69885 -70745 -70631 -67507 -66371 -64040 -68666 -65458 -65101 -65522 -65403
8034 -65403 -67017 -67061 -66340 -64460 -68892 -65687 -64730 -64182 -63433 -68259 -65954 -68849 -62086 -62077 -65055 -60922 -62522
8017 -62522 -62052 -64164 -61151 -60958 -60026 -59761 -65312 -59967 -63022 -64921 -62270 -63857 -57540 -62199 -63898 -60172
8001 -60172 -59644 -60175 -58553 -59641 -59543 -54082 -54174 -50188 -57600 -60046 -55393 -57480 -57202 -55711 -56961 -58170
7985 -58170 -57241 -60182 -58796 -62698 -58961 -57322 -56798 -58773 -57822 -55122 -58063 -59602 -57485 -57533 -60526 -54671
7969 -54671 -53380 -53842 -54772 -56572 -59125 -56741 -55770 -53067 -54394 -57498 -57825 -54569 -56219 -54961 -57504 -58462
7953 -58462 -53192 -55627 -52581 -53292 -57108 -55423 -58127 -58719 -56796 -57328 -54136 -55287 -56451 -57333 -57773 -58212
7937 -58212 -54423 -57330 -54915 -52869 -55365 -56783 -55406 -55726 -56579 -54348 -56335 -54992 -54467 -52752 -54133
7922 -54133 -57591 -57470 -56994 -55837 -56120 -53147 -58489 -55503 -52667 -54807 -53340 -53887 -54940 -51869 -52949 -54865
7906 -54865 -51046 -55762 -57621 -55270 -56224 -52718 -54696 -55260 -51267 -55248 -55072 -53641 -53558 -51955 -57026 -52883
7890 -52883 -56484 -54086 -53625 -54709 -54639 -51608 -54645 -53723 -57813 -54111 -55109 -54018 -52782 -55262 -53465 -55028
7874 -55028 -55416 -52603 -52862 -54751 -54502 -52620 -53321 -50044 -52067 -52857 -50565 -52640 -51597 -53840 -53186 -52754
7858 -52754 -53798 -53600 -56901 -44610 -63014 -59524 -55012 -53130 -52125 -53366 -52877 -51882 -52943 -50992 -55765
7843 -55765 -51095 -53278 -50826 -48327 -57841 -55926 -51568 -49790 -49473 -50617 -53181 -53591 -52287 -53309 -50115
7828 -50115 -52453 -50673 -48147 -54089 -52934 -50085 -52899 -52798 -53047 -53530 -52337 -52815 -50444 -54483 -51382 -49434
7812 -49434 -50594 -51867 -51937 -50995 -49452 -52005 -47059 -51439 -49213 -49197 -51738 -53818 -51946 -51384 -51012 -51168 -53700
7795 -53700 -49878 -50971 -49261 -51278 -50891 -52913 -55646 -54349 -51475 -54813 -52837 -50771 -53621 -53403 -50689
7780 -50689 -49908 -53431 -52562 -53881 -49552 -51435 -47155 -52021 -50126 -50299 -53492 -49234 -51780 -46670 -51497
7765 -51497 -53103 -52455 -49811 -49810 -50363 -48385 -49772 -50389 -51562 -49559 -47081 -51230 -52147 -49678 -49232 -51142 -51080
7748 -51080 -48619 -48127 -47318 -47985 -49251 -49712 -49731 -47371 -49645 -50538 -49235 -50613 -50043 -49983 -47130 -48050 -48546 -49020
7730 -49020 -50731 -50930 -49680 -48998 -49432 -49860 -45268 -50869 -52500 -50099 -48773 -47206 -48922 -44649 -45042 -49691
7714 -49691 -46871 -47468 -47177 -45463 -47345 -48761 -49415 -48193 -45278 -47333 -46543 -47268 -51260 -46209 -52285 -49680
7698 -49680 -47736 -46384 -50737 -43381 -47218 -45294 -50221 -49269 -49788 -49259 -46686 -47985 -50188 -44869 -46455
7683 -46455 -47383 -50442 -51220 -46285 -49153 -47852 -47035 -47097 -49220 -50771 -44018 -46100 -45267 -46920 -45566 -46653
7667 -46653 -46011 -49471 -49175 -44581 -47493 -47958 -47322 -47656 -46234 -47620 -47244 -46293 -47277 -41881 -46425 -44931 -42834
7650 -42834 -44885 -42658 -43356 -47027 -43729 -45969 -45882 -44620 -45088 -48015 -49534 -45346 -45757 -46788 -48830 -47018
7634 -47018 -47802 -44033 -45953 -46318 -42048 -48978 -46598 -45765 -46972 -42379 -42825 -48305 -45565 -48890 -47141 -46235
7618 -46235 -46237 -44003 -48689 -45257 -44704 -45159 -46035 -44729 -44871 -44911 -44729 -46593 -47025 -44147 -45182 -45664 -48021 -45352
7600 -45352 -47973 -56828 -35034 -40398 -38665 -40210 -38679 -42745 -43336 -41184 -40373 -44039 -45886 -45940 -41339
7585 -41339 -45112 -43264 -40853 -41885 -38910 -40784 -41957 -42128 -38503 -41687 -41532 -40555 -43754 -38907 -38592 -42887
7569 -42887 -43225 -43833 -43478 -42870 -45281 -41186 -42110 -40192 -41301 -38538 -42305 -41211 -42702 -42236 -40436 -38212
7553 -38212 -37111 -39711 -38825 -39195 -42934 -38515 -40599 -40000 -42985 -40624 -37367 -41296 -38689 -38342 -38463 -38805
7537 -38805 -41872 -40416 -35431 -37582 -38811 -38593 -39307 -39714 -39360 -36446 -37027 -36865 -37658 -38333 -37487 -37299 -38346
7520 -38346 -39123 -39513 -35675 -37826 -39948 -35347 -37656 -35855 -36536 -36265 -34725 -34303 -36841 -35709 -37866 -38306
7504 -38306 -35069 -36997 -36550 -39662 -37384 -37721 -34975 -37922 -36777 -37919 -41801 -39510 -39010 -38579 -38326 -40068
7488 -40068 -37523 -38101 -35820 -36628 -35980 -37231 -39003 -37562 -39362 -37488 -37005 -37803 -37440 -36928 -35446 -34665 -36098
7471 -36098 -34134 -37129 -36151 -34563 -32948 -33155 -31459 -34949 -32440 -32904 -29899 -33356 -31061 -32267 -31319 -31960
7455 -31960 -28545 -31971 -32089 -28577 -31403 -29587 -29295 -29572 -30782 -35310 -32981 -31422 -29036 -31348 -32234 -31369
7439 -31369 -31331 -29301 -28814 -29534 -27711 -28321 -29616 -27063 -27196 -27333 -26367 -28900 -25971 -28516 -28135 -24051 -23310
7422 -23310 -19644 -20202 -17924 -19921 -17574 -12814 -17320 -12874 -17899 -13414 -15665 -17135 -18591 -16998 -17091
7407 -17091 -16973 -15056 -13604 -14711 -14810 -14240 -15531 -16692 -20022 -15352 -18302 -19513 -18954 -18776 -24678 -21335
7391 -21335 -21944 -25180 -21603 -19888 -24676 -21587 -23561 -21051 -22671 -24000 -22501 -23790 -21180 -23139 -25150
7376 -25150 -22441 -24129 -22405 -22761 -23848 -26484 -20661 -23278 -22206 -19357 -23251 -22666 -19953 -18068 -19712
7361 -19712 -19006 -18486 -21984 -21990 -21555 -23161 -22125 -25365 -19044 -21732 -20810 -21869 -20124 -20272 -19925 -20067 -20796
7344 -20796 -20167 -23114 -20002 -19932 -17877 -21523 -20163 -22533 -19444 -21513 -21997 -22268 -25262 -22832 -23912 -20517
7328 -20517 -21347 -17014 -20978 -18689 -20433 -17888 -20478 -22459 -21211 -20701 -23479 -21887 -25082 -21666 -20146
7313 -20146 -20109 -20385 -18748 -19028 -18067 -19216 -15520 -19819 -19918 -17563 -22192 -18396 -19269 -21250 -20291 -18328 -19932
7296 -19932 -20009 -22039 -16341 -19284 -19132 -15407 -14874 -19521 -17157 -16347 -18624 -16032 -14873 -14494 -19721 -21798
7280 -21798 -19358 -19250 -18165 -19398 -18150 -18433 -18063 -13651 -17955 -13527 -15636 -14099 -14538 -16150 -16892 -15147
7264 -15147 -18674 -16684 -15782 -16517 -17878 -19020 -16541 -14678 -14895 -13869 -16427 -12971 -16894 -18355 -15565
7249 -15565 -15718 -16543 -14598 -16323 -15933 -16306 -15290 -16487 -16948 -11461 -11813 -13215 -17354 -13293 -12980 -14977
7233 -14977 -14099 -14250 -14587 -13372 -12615 -12378 -15335 -12156 -11098 -12815 -11656 -13958 -13263 -15732 -11067 -12850
7217 -12850 -12948 -12967 -15965 -12729 -11769 -11897 -11705 -13252 -10817 -11733 -14229 -9930 -10813 -11325 -15941 -12588 -10926
7200 -10926 -10599 -11271 -12969 -10195 -12066 -11127 -14762 -11845 -8471 -12866 -11266 -11226 -10463 -8728 -7312 -9358
7184 -9358 -8270 -9032 -7245 -8793 -10397 -7778 -8713 -7525 -12387 -10367 -9672 -6904 -9126 -7751 -5505 -7245
7168 -7245 -8533 -5250 -7537 -8134 -6098 -6250 -6397 -7447 -6110 -6034 -6072 -9417 -7550 -5491 -4427 -4578 -7623
7151 -7623 -5631 -6312 -3817 -7251 -7078 -6520 -4719 -4045 -4832 -3367 -8690 -6407 -5287 -8689 -4866 -4333
7135 -4333 -6114 -7555 -1763 -5393 -4169 -4825 -5537 -4789 -5230 -3240 -8557 -2510 -5864 -6785 -1993 -4219
7119 -4219 -4603 -4090 -4226 -1599 -1101 531 -3427 -3185 -59 -2871 -285 -2898 -1066 -1084 1205 -1591 -272
7102 -272 -1349 -243 -3379 440 -4561 493 21 -11 1538 -241 575 -560 857 740 -1611 -3167
7086 -3167 -1944 -135 202 2410 787 -2052 108 2692 -2265 -1081 -1056 790 175 2994 3224 995
7070 995 373 1320 1044 -329 171 4599 -471 109 -975 811 1092 2952 -1157 4504 1907 4232 3478
7053 3478 441 2431 3944 3397 2306 -313 4869 4357 892 5388 6531 5027 2879 1474 1851 4296
7037 4296 3192 5461 3772 3246 3664 2246 9860 4657 6010 4682 1730 3858 3456 7348 3869 4120
7021 4120 4561 5445 3989 4162 5957 9018 5951 5056 8605 6913 8025 8918 7604 7535 4650 10892 7366
7004 7366 6244 6227 6103 7942 6828 8579 10758 10777 8420 10641 7880 9494 9221 9861 6835 9209 5404
6987 5404 5287 6447 8005 10605 10431 8092 10985 10149 8472 10886 10283 10395 10449 10685 10371 9463 11686
6970 11686 11654 10592 12495 7626 11841 10626 13045 12226 14033 11874 12953 14308 14535 12880 10829 11252
6954 11252 15470 11954 12462 14742 11673 14973 14331 14619 11677 14740 17181 16937 15363 15385 14697 17149
6938 17149 16485 15585 17438 15768 17764 16109 18771 15569 19869 20010 15597 18342 20649 17497 18411 20095
6922 20095 15320 17009 20100 16256 18471 17829 21614 19726 17531 17800 18794 17323 19742 21228 15657
6907 15657 19659 21291 17688 19968 19066 18742 20773 20433 19536 23452 22442 21753 22659 22201 21670 20160 19906
6890 19906 19517 23073 23242 22645 22402 21876 23473 24175 19580 21791 23716 20692 28114 27193 30045 27206
6874 27206 28275 27636 26184 26921 23230 26807 26328 24680 23739 22741 27878 25717 27265 25778 26604 27945
6858 27945 26747 28190 29241 28908 26205 26496 26700 23194 24502 28379 25544 24768 24575 26562 24493 25250
6842 25250 28170 27908 28082 28623 30199 28788 26912 29395 27604 26310 30473 29390 31614 30479 31852
6827 31852 28581 29268 31395 34818 36272 35918 35009 39154 37978 36924 38699 37803 37252 39984 36720 37233
6811 37233 34937 37009 36770 36738 41071 42886 39696 39641 35937 36519 39667 35892 39799 36559 36355 34634
6795 34634 35049 32971 37418 35917 34614 34233 34945 35903 35233 37613 36594 37723 34956 36673 39228 34345
6779 34345 37006 34249 37266 35114 38245 37108 38051 40404 41850 42002 40386 40648 43383 44589 45429 43513
6763 43513 49317 46299 45466 43724 45197 44893 47642 47640 46148 47721 45619 46413 47680 45955 48917 49721
6747 49721 49065 49790 50078 50540 48196 45923 47610 46827 47667 46912 45751 45699 46622 45298 47836 46270 48487
6730 48487 43333 47816 48651 47272 45938 48996 46466 46680 47883 45299 48619 47137 45897 49256 49949
6715 49949 49851 48483 52501 52359 53861 53951 55843 53709 52620 55595 51342 49457 56550 53712 54299 56057
6699 56057 57163 54650 55277 61075 58669 58848 59574 60449 57844 56963 57139 57819 56777 55384 57349 56519 57235
6682 57235 56272 57957 56914 54851 57956 58312 55531 58479 60274 56389 55753 56988 55394 55194 56710 57513
6666 57513 58306 57739 59808 57808 57769 58981 59612 60704 63264 60535 63557 61859 65824 64250 66782 65106
6650 65106 64174 63389 61554 63956 63447 65468 67111 65580 69508 68731 70137 69430 72496 71131 71743 73299
6634 73299 70131 71836 72407 69783 73640 73957 73434 74361 77651 72702 72464 74352 75882 78237 75615 76032
6618 76032 76934 80074 81574 78495 78907 79976 80250 79750 81179 79075 80758 83021 82507 85608 83544 82317
6602 82317 86162 85957 87680 87454 86801 87813 89597 90344 92905 89016 90699 91974 91320 91792 92527 92441 94048
6585 94048 94017 92235 95388 94185 93776 95978 98098 99446 96909 96301 98899 99091 98385 98947 102513 105362
6569 105362 103500 107971 104382 104263 105080 109375 103522 106428 107859 108799 109629 108113 109468 110752 114785
6554 114785 115459 111741 113519 115465 115547 115478 117431 115059 114355 116207 120829 118398 120675 121194 121398 119815
6538 119815 121498 122078 121889 124642 127630 125601 125403 126356 124500 128891 126001 129238 128613 125451 127420 127878
6522 127878 132058 128875 130165 133105 133680 131741 134331 134216 136199 136008 135318 134414 134020 136808 136840 136249 136628
6505 136628 135089 137488 138544 140725 139808 140724 141715 144041 143060 143115 145386 143049 143091 146269 147037 151303 147813
6488 147813 147069 145963 147826 151506 150321 150467 153663 155088 155654 156887 156857 154290 158615 159723 158352 159848
6472 159848 156088 162276 161290 163806 163289 162654 165390 166583 168364 171821 168401 172297 173054 175738 180285
6457 180285 175770 179962 179623 178734 181483 181618 183619 182960 181708 184699 188007 188156 187945 189324 188840 189802
6441 189802 190401 194011 194620 196956 199222 198482 200546 201534 204684 202066 205773 208289 208303 208620 207957 209476
6425 209476 210306 211767 214514 215987 219006 223446 226116 225412 224274 228005 230046 234193 233915 235357 245576
6410 245576 236371 237073 238520 239078 243674 243104 251362 251215 250722 252118 254520 258198 261637 261359 264557 266478
6394 266478 269285 271709 272837 273343 277834 279936 282364 283640 286626 289752 289752 292962 292002 295906 297643 303181
6378 303181 310258 304848 315308 315035 314962 317601 320135 325929 326052 330865 332818 336752 340245 342248 347833
6363 347833 351780 352362 358400 359539 361538 366771 370344 375546 381032 383737 385401 389297 393077 398710 400947
6348 400947 404654 407903 414112 420122 425214 425486 431678 438030 440791 444234 451334 453389 458595 465669 471633
6333 471633 473722 481842 486617 490543 494411 500752 507275 508380 516668 521043 527552 533656 538687 545985
6319 545985 555110 566606 569761 577267 587545 593490 602802 607721 615053 623967 633622 641580 648906 659288
6305 659288 666384 675415 681243 688098 697691 706198 711291 722401 733662 742519 754799 760831 770083 781005
6291 781005 793126 799040 809795 814732 825972 836637 845543 850734 859454 858835 870187 875542 881338
6278 881338 887012 894567 904646 917964 920793 933064 941410 948856 958015 966305 976123 985150 993627 1003775
6264 1003775 1013973 1022543 1031488 1041893 1053864 1061606 1076401 1087450 1093600 1104945 1117144 1130897
6252 1130897 1145809 1156096 1168484 1181125 1191101 1205031 1221616 1232493 1244290 1260007 1275927 1293658
6240 1293658 1310163 1322937 1341981 1359485 1376491 1397513 1417000 1440757 1461008 1484340 1506202
6229 1506202 1525804 1545700 1566049 1590103 1614221 1638288 1662400 1688278 1713447 1742414 1770409
6218 1770409 1802135 1833116 1864967 1902041 1940581 1977432 2014432 2058136 2098155 2140101 2180904
6207 2180904 2227766 2269752 2322541 2373110 2430780 2492532 2555166 2619701 2690220 2767105 2841852
6196 2841852 2918956 3001718 3087169 3180151 3282356 3387269 3499764 3617779 3742307 3879832
6186 3879832 4023761 4177179 4347696 4529650 4725525 4938596 5167116 5408364 5674719 5959127
6176 5959127 6268916 6603630 6973456 7380330 7831949 8333028 8894304 9520596 10223779 11009873
6166 11009873 11901768 12904988 14030305 15311562 16757571 18411724 20293862 22439273
6158 22439273 24864913 27568949 30499548 33574006 36647048 39547463 42106266 44210148
6150 44210148 45793780 46913093 47697388 48322180 48949970 49726933 50769476 52167826 54014585
6141 54014585 56391287 59382122 63053391 67394565 72279188 77447220 82446860 86691080
6133 86691080 89579963 90665900 89810339 87246576 83529594 79277008 75014944 71045931
6125 71045931 67523238 64510681 61990840 59950543 58364544 57198514 56393402 55858964
6117 55858964 55450508 55003086 54320079 53233594 51634130 49505601 46916342 44009096 40966972
6108 40966972 37948164 35058611 32362207 29889897 27639438 25593873 23743449 22066866
6100 22066866 20543041 19163234 17905247 16765825 15726605 14776331 13902224 13102069 12358538
6091 12358538 11685744 11069294 10502408 9986422 9512088 9074933 8666219 8291945 7941199
6082 7941199 7615528 7310604 7027546 6762407 6510368 6270500 6044640 5827402 5621035 5419850
6072 5419850 5236019 5060152 4897923 4737035 4592898 4457387 4325138 4197136 4074744 3959163
6062 3959163 3847063 3743534 3641533 3547313 3455067 3369784 3287469 3203923 3125352 3054891 2987445
6051 2987445 2919199 2855482 2798083 2737057 2683858 2628436 2578958 2526127 2471968 2422132 2372413
6040 2372413 2321265 2277347 2230539 2185457 2142015 2102670 2062335 2025509 1989788 1954174 1920138
6029 1920138 1886149 1852848 1821132 1789918 1764310 1732938 1699115 1672585 1638520 1607539 1578485
6018 1578485 1550957 1521458 1492973 1462656 1426181 1403495 1373989 1349872 1322629 1297737 1275915
6007 1275915 1250479 1230636 1206470 1181591 1158191 1133189 1106828 1083106 1058654 1033657 1009646
5996 1009646 993372 975103 950829 930331 908814 892862 871307 855282 833231 817586 799963
5985 799963 783965 764897 746958 727591 707705 688767 670643 654079 640046 629453 612825 607873
5973 607873 600118 591859 584375 570799 565038 550922 538215 532106 520773 513650 510340 499152 490980
5960 490980 479106 476542 467093 458429 453664 448667 440512 437154 430335 425237 421993 415758 408718 401716
5946 401716 399825 393391 388513 383683 380456 376910 368884 364896 361678 353824 348149 344324 340409 334603
5932 334603 330076 323977 318917 316053 309359 302383 299260 295475 292003 287895 284314 282563 276804 272954
5918 272954 266952 264848 256987 254009 253496 248716 244089 240199 241676 235790 232811 228386 225630 223720 219436
5903 219436 214493 215297 211632 209546 204792 202454 200865 194994 195707 191283 189618 185404 184192 182723 181329
5888 181329 175494 176898 172590 171794 167599 163739 167950 160753 157869 157947 157310 154711 152423 148996 149022 147113
5872 147113 147770 143499 145348 141604 138965 138114 135786 132775 136177 135029 133820 131337 127850 128540 127285
5857 127285 127711 125723 120694 120791 121675 114977 116915 116165 115015 112053 109621 111418 109210 110985 106666 108975
5841 108975 108614 105945 105402 106382 105339 102756 100695 100850 98338 99825 96186 96034 94956 94237 93629 90488
5825 90488 94589 92223 88453 88297 89252 92718 89503 89366 87702 88992 89535 86469 86117 84637 85554 82880
5809 82880 86403 82331 82402 80805 84328 83927 84869 81566 79178 85739 81594 82047 79801 82177 82480 82689
5793 82689 82509 86038 82095 82741 82391 83540 82559 83456 84756 85269 84145 85127 86429 87184 84646 86275 86780
5776 86780 87400 85039 88968 87056 88540 89625 86527 92663 92496 94084 97118 96134 93110 91237 95431
5761 95431 93606 92814 93749 92903 95042 92412 100742 96669 99792 97938 98209 102479 100804 101769 100191 103100
5745 103100 104240 104028 106250 108574 111197 110165 106279 108404 109121 108735 115065 116433 114959 118580 116657
5730 116657 120698 120947 120509 123299 120629 122777 127171 127041 129592 130530 135129 135830 134445 137896 140682 142335
5714 142335 143833 142202 144898 148345 147543 147691 153506 153081 156995 160756 160911 164133 165728 164781 171604 171378
5698 171378 173649 176921 178127 182099 187084 187266 190396 194613 195685 197503 197372 200554 203642 207523 211057
5683 211057 220225 218180 222408 225552 227772 230357 232284 239826 242261 245464 249424 254284 260284 263401
5669 263401 267692 273108 275146 280656 285121 288534 292606 296117 297250 298926 300995 300872 301988 303633 305019
5654 305019 306003 306173 312737 316963 323536 322625 326852 330102 335139 337254 341190 345656 348494 355461 357690
5639 357690 363681 367889 372865 376138 383618 387147 396593 398941 401105 407144 411554 418891 422337 425974
5625 425974 430275 432800 439972 442132 442595 451756 456179 457037 468300 473801 482594 489128 496101 504241 513673
5610 513673 521578 531412 538253 543741 553507 563313 570493 575800 587126 597670 605830 616115 622978 635040
5596 635040 643362 655625 668044 677772 690275 703934 718093 730350 744278 758821 770284 780915
5584 780915 797615 813797 827965 845507 864982 884513 906535 926228 951565 972020 997865 1021061
5572 1021061 1045034 1067859 1098696 1126663 1157993 1186724 1220691 1258433 1293894 1329103 1369603
5561 1369603 1410109 1453609 1499575 1552601 1606582 1660592 1719687 1780886 1845123 1910793 1978312
5550 1978312 2055919 2137724 2221300 2316840 2419108 2529143 2648029 2772147 2913652 3066634
5540 3066634 3226996 3397956 3588110 3787551 4012171 4252228 4519511 4809047 5124189 5469854
5530 5469854 5856441 6284347 6764257 7306190 7911658 8600434 9376592 10252542 11247742 12370613
5520 12370613 13638086 15088817 16741771 18645971 20837271 23347316 26164925 29234336
5512 29234336 32402516 35441457 38035531 39851312 40612763 40213407 38767723 36568061
5504 36568061 33967389 31269770 28645300 26197248 23953283 21913649 20059819 18381987
5496 18381987 16868717 15507990 14277513 13168460 12168243 11259973 10439155 9693519 9024960
5487 9024960 8423811 7878864 7389385 6948055 6545646 6177257 5842395 5538795 5260118 5002162
5477 5002162 4764983 4543468 4334331 4138247 3958482 3784144 3624709 3465809 3313700 3167218
5467 3167218 3027397 2897669 2780581 2664320 2555550 2454611 2364923 2271431 2188972 2108830
5457 2108830 2030978 1965720 1898620 1838387 1776496 1721494 1668759 1619917 1573845 1524903 1484160
5446 1484160 1446737 1408259 1371551 1334103 1302182 1269845 1238215 1206214 1173393 1145199 1111366
5435 1111366 1086495 1065734 1037190 1020365 991221 970510 949674 930462 909214 888502 870852
5424 870852 854163 837111 820195 801199 790015 772401 757072 737743 723122 711300 696485 685321
5412 685321 671155 661587 645916 639187 628636 618290 609861 599699 589030 581086 570440 563186 556280
5399 556280 544902 538830 532019 522220 512702 501563 497863 484540 475636 464920 454678 445133 437415
5386 437415 430609 420327 413522 404593 399357 391743 384754 377593 368308 363202 350065 344373 339839 333129
5372 333129 327623 320263 314922 307990 301152 290742 287902 275595 271457 266858 258647 257933 250384 241524
5358 241524 233648 227345 219945 217737 209639 207593 202919 202925 199355 194903 192365 194860 188492 186508 186188
5343 186188 183673 182903 179732 179605 177848 178738 176058 176078 174190 172149 168104 166206 162790 161397 160229 159128
5327 159128 157963 159494 154015 154182 154437 154571 147405 146894 148724 148201 148885 145377 143905 141967 139805 133056
5311 133056 132736 130847 128433 128946 127814 126290 123787 123020 125851 122092 121244 118730 118018 118160 118706 117626
5295 117626 113257 110140 112154 109146 107040 110268 108823 109916 108537 107955 105814 107094 103258 107809 101483
5280 101483 100208 101829 99583 101613 100049 98669 95153 97208 98920 93281 96403 98475 95704 95486 95932
5265 95932 96667 93348 94425 91878 93951 91835 91706 89779 89674 92923 91628 93165 91033 90674 91456 87295
5249 87295 92076 91543 86612 88625 88707 90222 91481 88274 84974 86921 85843 82870 88691 85624 88391
5234 88391 86169 87661 87659 88109 87381 88661 87952 89581 86330 87054 84364 86575 82553 83206 86133 81904 81361
5217 81361 83997 85214 85714 83846 84166 83529 86394 86741 85883 83703 88774 83879 85450 83509 83612 84089
5201 84089 84074 87584 85238 85422 86364 85320 85817 87353 88232 88847 88177 89228 88978 88094 87940 90000 89055 89148
5183 89148 90832 91833 91666 93200 90739 93947 91657 93334 93554 95414 95110 94469 98035 98368 95668 97860
5167 97860 97560 101152 100662 100472 99031 102314 99835 101426 100729 103600 101984 101517 102209 103123 105164 105872 110278
5150 110278 106536 107136 107979 108304 109005 110401 109688 108772 109492 111778 113259 115475 112540 115926 114357 116195
5134 116195 116480 117937 118181 122017 119437 121899 120763 119508 122237 124041 123270 121816 125474 122501 124867
5119 124867 129396 128660 128247 129979 129635 129225 132215 133209 132935 135790 135850 136170 135813 136818 136745 143426 137511
5102 137511 140179 141733 143992 143169 145505 147422 147688 147458 149748 153593 151344 150801 155113 153083 155447
5087 155447 157432 156392 158521 159084 160707 162078 162040 165929 168359 165834 169671 166809 171095 169045 168944
5072 168944 171918 172895 175727 176893 176542 178221 183097 180739 183935 182308 186096 188438 184868 188660 190629
5057 190629 193552 194386 197298 199562 198971 200884 202262 202688 206141 207079 210615 213592 212555 217348 217913 222258
5041 222258 222326 224013 227411 226204 232138 237072 241301 243775 244642 250512 255417 260238 260794 265668 276086
5026 276086 283017 291083 299300 307913 317311 329165 343891 356039 368136 377764 383612 388813 387481
5013 387481 390309 394829 395728 397942 404858 412081 415873 423301 434708 447462 459578 474454 487263
5000 487263 500721 515823 526601 541592 555355 574046 596617 618599 646780 667732 694295 710075
4988 710075 718576 719978 714137 708525 705278 698964 696123 700008 703485 710259 717531 731447 748979 768853
4974 768853 789444 804037 822163 829688 836486 837345 834432 835293 841797 849615 864149 875426 883825 889649
4960 889649 889999 883402 870537 858874 846770 833578 828181 824546 824367 824671 833666 843474 852875 866381
4946 866381 880427 891882 898566 898833 894229 879397 865870 851661 836868 825404 817092 811825 802720
4933 802720 796846 792475 785812 775026 768846 766077 755960 756752 751221 752303 753208 755342 757369 762840
4919 762840 770600 773369 779109 784437 783556 783197 779843 777833 776815 768982 767472 768870 768440 769797 771675
4904 771675 770631 777338 782180 787824 791260 798549 803545 813145 821011 825348 832557 841222 850076 854835
4890 854835 863557 868662 881805 888322 897834 905681 914970 924734 938512 949384 957540 970279 981925
4877 981925 990277 1004589 1016540 1026733 1041067 1052484 1066790 1081173 1094336 1109288 1121282 1134219
4865 1134219 1144560 1151931 1165125 1175704 1182454 1198459 1210481 1223195 1238500 1251236 1267332 1279228
4853 1279228 1295935 1311660 1328997 1343050 1359614 1377194 1392393 1407319 1421838 1435744 1454357
4842 1454357 1470413 1485361 1503360 1520108 1535057 1553739 1568648 1583024 1600384 1616493 1629321
4831 1629321 1648378 1666038 1684752 1700742 1720828 1743565 1760394 1778988 1799921 1826482 1844321
4820 1844321 1866536 1886430 1909836 1925219 1949174 1968720 1991394 2014440 2041156 2062743 2091853
4809 2091853 2117775 2140364 2171108 2193889 2223533 2252002 2286403 2314223 2346099 2378679 2411423
4798 2411423 2446379 2483867 2525269 2567917 2609389 2649899 2695005 2741700 2787970 2829525 2881092
4787 2881092 2933244 2981469 3034903 3096076 3155685 3217719 3285157 3355747 3429887 3508869 3589535
4776 3589535 3679438 3768644 3866337 3962235 4073700 4187792 4313656 4443155 4586208 4736816
4766 4736816 4895653 5069523 5261131 5469239 5688543 5934074 6198222 6490541 6813485 7179962
4756 7179962 7584923 8040640 8558172 9140366 9798003 10551502 11416914 12424736 13608566
4747 13608566 14994888 16603286 18419635 20386978 22397030 24300975 25932010 27155966
4739 27155966 27918666 28267519 28353936 28337646 28349930 28478018 28766605 29254508 29971509 30934337
4729 30934337 32174586 33693692 35488634 37497406 39643861 41828144 43952588 45980213
4721 45980213 47985332 50125442 52643227 55723068 59423970 63603934 67924450 71921162
4713 71921162 75082816 77030719 77619609 77039978 75733885 74178848 72728972 71601544
4705 71601544 70922511 70765937 71168066 72170606 73790040 76020730 78753664 81783752 84813353
4696 84813353 87456765 89324375 90213878 90180585 89562074 88884108 88679204 89218215 90461001
4687 90461001 92088800 93615348 94500247 94345917 93003466 90665846 87780499 84785786
4679 84785786 82008724 79633903 77769996 76464400 75748887 75634899 76139776 77214266 78738351
4670 78738351 80474243 82077870 83121590 83171354 81989866 79590207 76281069 72567259
4662 72567259 68958634 65784605 63131097 60915050 58939637 56990803 54895521 52587503
4654 52587503 50135401 47672693 45333605 43200273 41320601 39707104 38370975 37302603
4646 37302603 36507949 35969406 35671236 35552077 35515401 35423605 35108803 34414403 33259305 31662466
4636 31662466 29734328 27655064 25601147 23662957 21903176 20317480 18903115 17632776
4628 17632776 16485055 15447387 14501651 13649581 12880431 12179424 11542727 10958673 10426155
4619 10426155 9936859 9481277 9069099 8686995 8334595 8008817 7707375 7432310 7169837
4610 7169837 6927821 6700690 6485699 6284655 6094622 5911398 5738607 5575735 5419005 5268642
4600 5268642 5117882 4973646 4836110 4700501 4575600 4456291 4339009 4227104 4117295 4011305
4590 4011305 3908582 3818503 3725156 3636492 3557462 3475976 3396459 3323435 3250367 3178865 3110111
4579 3110111 3041348 2977030 2915152 2850600 2789678 2725993 2668053 2607796 2552512 2498755 2444111
4568 2444111 2392714 2340306 2290881 2237594 2190372 2139349 2092829 2047758 2003995 1958345 1917683
4557 1917683 1876547 1837265 1797355 1761161 1723681 1687161 1650805 1613863 1577974 1541010 1506956
4546 1506956 1471105 1434376 1401938 1369267 1337180 1303790 1272973 1246342 1220842 1185090 1163374
4535 1163374 1135798 1107797 1082029 1056730 1026753 1004894 982553 960542 938615 918348 900417
4524 900417 880605 856990 839086 818904 797645 778722 761302 742529 722161 704774 682560 667392
4512 667392 649961 634644 619672 604209 595422 582773 569558 559486 542858 532742 521810 511107
4500 511107 500096 487859 478683 469550 458227 450184 443915 431079 422661 410595 403594 392058 384025
4487 384025 375946 366663 361244 353090 342582 337419 330417 325966 321262 315504 308214 303840 299124 294853
4473 294853 291564 289086 283546 282973 278300 278863 283196 280933 284549 289736 291818 292510 297961 298187 298475 293023
4457 293023 291494 282429 277999 274376 269520 266822 262479 265516 268971 271016 272078 272874 283185 287407
4443 287407 293243 300219 310510 316700 320859 334869 348137 361601 384169 400298 417801 430621
4431 430621 434574 427308 419646 408173 397754 384110 377539 374048 368924 371381 374326 379910 391010
4418 391010 402570 419943 429883 443585 447847 447405 439070 433162 427647 427017 433044 434042 442804 445006
4404 445006 445470 441444 425461 409216 389167 372835 356191 340633 327578 322442 320071 319392 322160
4391 322160 324439 332487 335309 344919 345519 337014 327300 308034 285622 264281 245522 227080 209021
4378 209021 195555 187822 172550 158908 140912 129324 115234 102163 88130 76778 68194 57553
4366 57553 49477 45787 39380 39439 38864 34350 32102 28903 21537 14986 3831 -7673 -21791 -31003 -44592
4351 -44592 -55702 -63394 -72165 -82278 -87643 -92925 -97607 -106784 -109342 -115134 -119493 -124809 -126884 -134106
4337 -134106 -134928 -138667 -142347 -141614 -146007 -149619 -149082 -151697 -157388 -155478 -161276 -161314 -164436 -165532 -166971 -167443
4321 -167443 -166451 -170971 -173069 -171610 -174286 -180146 -180317 -182242 -180704 -185516 -181990 -183796 -184959 -187426 -189054
4306 -189054 -187910 -188858 -191114 -189411 -193045 -193482 -192476 -193728 -196986 -198225 -196364 -197321 -199046 -199056 -197224 -197930
4290 -197930 -201076 -201618 -201123 -201034 -202284 -203201 -204752 -206457 -206626 -202899 -205844 -206400 -210549 -208010 -209702 -210572
4274 -210572 -211599 -209777 -210773 -210647 -214261 -212467 -213700 -215827 -212295 -210318 -213572 -214961 -212896 -214731 -212952
4259 -212952 -214340 -214960 -214458 -214195 -214384 -216632 -215051 -217383 -215971 -213709 -215798 -214815 -216050 -216886 -214768 -213682
4243 -213682 -216922 -212991 -213586 -214856 -213255 -212962 -211386 -209657 -213862 -211562 -213109 -213308 -213115 -211259 -212453
4228 -212453 -211383 -209195 -209006 -209180 -210013 -209581 -210318 -208745 -211125 -209305 -207337 -209356 -210186 -209791 -206430 -209829
4212 -209829 -209137 -207616 -207995 -205590 -209346 -205486 -207095 -207610 -204113 -205009 -205381 -203979 -204274 -203980 -204419 -203313
4196 -203313 -204284 -204632 -203233 -204171 -199624 -201455 -200084 -201747 -196773 -195642 -198648 -197499 -197996 -195830 -195388 -196297
4180 -196297 -192838 -193993 -195157 -198942 -193660 -197361 -198969 -198604 -197251 -197038 -197093 -194611 -191562 -193194 -194365
4165 -194365 -196188 -189986 -190167 -193592 -191570 -190795 -191194 -190943 -191635 -191289 -189088 -192373 -190038 -192490 -190284 -190279 -191776
4148 -191776 -187638 -186098 -186300 -189659 -189580 -189734 -186258 -189143 -183376 -184571 -185040 -185874 -187495 -184510 -187275 -184442
4132 -184442 -185064 -182243 -182117 -181422 -181807 -180219 -179489 -180703 -179996 -181316 -179504 -178832 -180315 -181620 -181566 -182527 -183081
4115 -183081 -180499 -184611 -182512 -182281 -182637 -182659 -182277 -180162 -178988 -180367 -176740 -176370 -178546 -179582 -179379 -180039
4099 -180039 -179356 -177946 -179106 -180637 -178761 -177817 -177440 -176565 -177850 -177477 -177326 -179348 -178586 -174631 -175484 -176434 -173526
4082 -173526 -174085 -175995 -176651 -177495 -172411 -175523 -173195 -175626 -175859 -177041 -174287 -174104 -173955 -170498 -170455 -169058
4066 -169058 -170412 -168983 -170086 -167890 -169069 -168954 -168681 -170029 -169160 -168406 -168950 -169060 -169769 -167489 -166459 -169879
4050 -169879 -168819 -167716 -165278 -165526 -162965 -165522 -164567 -161624 -164994 -166334 -162183 -161488 -163443 -163872 -163022 -161129
4034 -161129 -162604 -160077 -161281 -163549 -162229 -162528 -161749 -159480 -157964 -158210 -155609 -158724 -157698 -158711 -159819
4019 -159819 -158743 -157129 -160064 -158914 -159565 -157692 -157615 -155467 -153875 -158162 -158160 -156325 -154565 -152507 -157839 -153710
4003 -153710 -156351 -154408 -154525 -154300 -152309 -153904 -152515 -153710 -152509 -152856 -152421 -149673 -152826 -152384 -151283 -150325
3987 -150325 -152489 -148661 -148839 -149372 -150514 -152079 -149469 -149297 -150388 -147225 -146377 -147742 -145019 -147651 -148500 -145542
3971 -145542 -148302 -146196 -145478 -146058 -145903 -142829 -143117 -145856 -144091 -146102 -144615 -143323 -141967 -143465 -141013
3956 -141013 -141950 -143515 -143911 -141631 -139648 -141844 -141980 -141816 -139691 -140456 -140950 -137093 -138891 -138231 -137261 -138450
3940 -138450 -134961 -139996 -137977 -137845 -137161 -136160 -136349 -136765 -136825 -135709 -136555 -136786 -135280 -135769 -136022 -133420 -133970
3923 -133970 -138607 -134096 -133503 -133589 -133172 -134542 -132309 -131274 -132087 -131924 -131630 -130472 -134169 -132179 -130750 -130613
3907 -130613 -131621 -131355 -128517 -127818 -128370 -128700 -129669 -129710 -128928 -128017 -128589 -128507 -125335 -126457 -127285 -126941 -125336 -125227
3889 -125227 -124407 -124726 -125416 -124683 -124749 -124620 -123729 -124717 -121082 -122064 -124938 -121703 -126959 -124091 -125770 -125581 -121899
3872 -121899 -124453 -121596 -121575 -122289 -121780 -118098 -122019 -120785 -118577 -122900 -119355 -116591 -117722 -116503 -119174
3857 -119174 -115889 -118006 -115870 -115723 -115650 -114447 -116137 -117511 -113346 -114879 -114484 -111787 -113543 -113725 -115430 -111468
3841 -111468 -108511 -109293 -112583 -112057 -111833 -108469 -112051 -109371 -109017 -110537 -107486 -108261 -108292 -108151 -110970 -106426
3825 -106426 -107950 -110322 -108888 -107173 -108194 -104205 -106320 -105791 -104567 -101647 -107041 -106529 -103383 -104921 -104607
3810 -104607 -103462 -102113 -101860 -100399 -101594 -103649 -101088 -103712 -99038 -101206 -98463 -100654 -99440 -99026 -98260
3795 -98260 -98819 -97836 -97725 -97793 -96676 -97680 -93501 -92262 -96579 -96387 -96387 -95180 -93816 -94750 -91597 -95302 -94186
3778 -94186 -93897 -93423 -93008 -92616 -92672 -94446 -90637 -89694 -92879 -94984 -92365 -90703 -91169 -90771 -90458 -90319 -91122 -88961
3760 -88961 -88204 -91539 -89307 -86247 -87520 -86877 -86039 -85870 -85895 -84959 -84707 -85212 -86701 -85635 -84787 -84143 -85372
3743 -85372 -84376 -84357 -84046 -83608 -82298 -81769 -81303 -84231 -81996 -77739 -83386 -82952 -79697 -83747 -81066 -81380 -83429
3726 -83429 -79148 -80300 -76392 -76367 -79465 -76793 -74370 -79786 -78372 -78087 -78346 -77231 -74880 -76981 -76407 -75804
3710 -75804 -76708 -77622 -76166 -73956 -74624 -71343 -73312 -72923 -71120 -71431 -70648 -69665 -72119 -69690 -71194 -67969
3694 -67969 -66413 -68658 -67220 -68818 -65480 -69334 -68310 -67409 -67094 -67666 -68578 -64245 -64122 -67727 -67828 -64213
3678 -64213 -63944 -66187 -65150 -64310 -67314 -63547 -62754 -64058 -62587 -62191 -60797 -62014 -61383 -62481 -60806 -60239
3662 -60239 -59572 -58672 -58326 -59485 -58268 -59718 -59094 -58491 -59095 -59098 -56415 -55491 -56570 -59354 -57529 -56752 -57798
3645 -57798 -55376 -54784 -55102 -55062 -53707 -54839 -52947 -55643 -51051 -54331 -52210 -54761 -50509 -49962 -52212 -50320
3629 -50320 -52091 -48118 -50018 -44760 -49808 -48065 -46503 -44616 -43695 -44198 -44109 -44775 -42156 -43647 -39147 -39360
3613 -39360 -37133 -37684 -34399 -33690 -32583 -24850 -23996 -17167 -11001 -4152 2685 7343 3532 839 -4290
3598 -4290 -9380 -12866 -17506 -18499 -21712 -23938 -26579 -24437 -24936 -26706 -25105 -26423 -30312 -28632 -28947 -28537
3582 -28537 -27616 -27556 -27608 -31046 -31365 -30319 -28456 -26196 -30366 -26798 -27157 -27490 -27612 -29254 -27580 -28848 -26137
3565 -26137 -26042 -27854 -27802 -25630 -26849 -23731 -22292 -25621 -25672 -20831 -22703 -27633 -24319 -24884 -25413 -22968 -25092
3548 -25092 -24586 -18072 -19998 -19515 -18651 -20709 -20201 -17398 -19378 -21046 -19426 -17722 -15809 -17007 -16254 -13278
3532 -13278 -14886 -15845 -14974 -11363 -10937 -11817 -10282 -13382 -9976 -11576 -10648 -11623 -12871 -10915 -10586 -12870
3516 -12870 -12609 -9148 -10856 -10755 -11588 -9466 -7097 -8154 -5864 -6684 -8822 -6520 -5178 -7420 -9453 -8771
3500 -8771 -9181 -4277 -10167 -5715 -5693 -4876 -5027 -1872 -3984 -1065 -1682 -89 -1710 1323 983 3418 4054
3483 4054 4461 4772 3662 5278 4067 5464 7440 7612 5827 10142 9615 8461 8935 9067 14242 11242
3467 11242 13163 9048 10829 12703 10491 11993 12428 10579 11817 12904 10138 11625 11944 13513 12926
3452 12926 15920 15412 15782 14992 13194 17104 13672 16915 13877 17354 18877 16319 19059 16630 17074 19001
3436 19001 18646 20244 24098 22457 22982 23194 24901 25296 25571 25479 25862 24771 24821 24823 23903 25421 27200 28491
3418 28491 26785 29406 28659 28478 28910 30804 30727 31210 30929 32369 31262 32610 33414 35009 35494 35052 34255
3401 34255 37506 38178 38861 35939 37750 39849 43800 41982 44104 44829 44270 46034 46833 45527 48012 49544
3385 49544 48288 48561 49382 49132 50210 50558 49321 49905 49554 51278 51155 50428 50331 52999 52216 51322 52376 53797
3367 53797 54155 55195 55163 54846 57827 56988 56083 57759 57854 59941 59780 61885 59707 61180 63380 61863 61252
3350 61252 64083 61435 64352 65675 61637 66055 64355 65561 67308 68453 70091 67660 67750 70104 68435
3335 68435 69851 68567 73212 72216 74504 75106 70676 73965 78023 76817 77911 77096 76311 77671 78417 79663
3319 79663 80345 80091 77620 79280 81539 79343 78347 82445 81040 84718 83369 82083 86132 84373 84883 87539
3303 87539 88414 87992 88262 90393 89307 92373 93812 94353 93044 93906 92408 94581 94924 93106 96177 98892
3287 98892 96606 100349 102139 97992 99953 101446 100153 98924 101672 98919 102495 102428 105362 102761 103657
3272 103657 104126 105578 106028 105249 111018 108956 109971 110604 114788 114452 115935 116432 114544 119974 121633 119659
3256 119659 119265 119555 121791 121862 125295 123264 126176 125939 127460 127713 130174 129197 130064 129362 136457 135166 135621
3239 135621 136168 135774 140617 139076 141360 143219 142651 145735 143610 144207 145354 149035 150304 148514 151366
3224 151366 151321 154434 151620 153839 156763 155343 157434 159120 159444 160653 162961 166769 165763 168328 167768
3209 167768 170710 172022 169779 171614 172809 178685 176133 177399 180415 184032 184093 184243 180941 185546 189811
3194 189811 191790 191767 195123 195001 199061 202518 202888 203405 203392 203833 204269 205562 206557 207024 211119 207729 210519
3177 210519 207315 211581 213952 216507 216505 217751 219822 221744 220035 223301 223949 229305 229491 233481 234577 238043
3161 238043 242373 241671 244576 248230 250544 248280 247328 246332 244051 242850 247220 248883 250149 252042 252245
3146 252245 254552 255606 255632 256733 259663 264492 264762 266960 269089 272567 269849 271979 274219 276178 279524
3131 279524 279075 285730 289296 285736 286215 289510 288030 290380 293336 297514 299404 299384 302963 303974 304861 306705
3115 306705 306254 308427 313133 314400 319126 321510 325019 325079 328321 332526 333360 337823 336280 344444 341559
3100 341559 343540 349138 349019 358161 361387 366109 364849 366599 366938 371646 373002 377273 384089 387266 390428
3085 390428 393001 394649 396840 401413 406073 407345 411215 417885 418958 425314 427587 434527 438569 443921
3071 443921 450218 456215 459215 465953 467861 475382 481370 485880 491083 502150 509135 513635 523616 528009
3057 528009 536277 545527 557012 569020 577437 591527 609334 625913 647824 663250 686894 714371
3045 714371 744119 782401 822676 878301 957926 1046904 1148004 1267786 1377006 1429316 1433132
3034 1433132 1368012 1270027 1188816 1126172 1086587 1054780 1026429 1016395 1006192 999535 1000347 1008910
3022 1008910 1021119 1037983 1060453 1090158 1124663 1164773 1218180 1292640 1398698 1557589 1723218
3011 1723218 1909408 2129328 2320783 2383837 2364933 2195201 1992648 1833693 1709564 1610160
3001 1610160 1533459 1473877 1426247 1382424 1346439 1321078 1301681 1289096 1282328 1277343 1279609 1287486
2989 1287486 1303711 1326742 1359685 1412310 1481299 1561600 1644357 1743223 1824157 1849899 1840373 1759405
2977 1759405 1671118 1600115 1543926 1499959 1466107 1441681 1423097 1402431 1387001 1374979 1371231 1369712
2965 1369712 1370716 1374968 1380535 1379387 1382713 1385203 1390236 1399017 1404039 1411542 1422534 1437717 1456043
2952 1456043 1473969 1492887 1510218 1531574 1552645 1581496 1605387 1627879 1641247 1654264 1662653 1668913
2940 1668913 1669302 1678715 1689273 1700660 1716600 1729673 1746034 1762789 1781005 1798063 1816586 1840114
2928 1840114 1868088 1898123 1927535 1955854 1985831 2011996 2039515 2069681 2108042 2152835 2197614
2917 2197614 2231044 2255770 2274464 2280534 2280508 2280345 2284201 2284063 2292972 2311805 2328831 2347372 2358979
2904 2358979 2373138 2389987 2408293 2435179 2473559 2504578 2541942 2573086 2609382 2644513 2676935
2893 2676935 2718225 2757433 2806686 2848920 2899042 2938249 2970306 2998678 3015499 3036174 3055484
2882 3055484 3078060 3102199 3127974 3150738 3175280 3186582 3208148 3235832 3272648 3318506 3369493
2871 3369493 3420145 3467802 3522530 3572385 3620416 3667268 3718466 3767692 3820561 3877222 3945749
2860 3945749 4027462 4109827 4195927 4274164 4347432 4408164 4464214 4518912 4572918 4635437 4703932
2849 4703932 4790816 4886723 4991264 5093747 5192024 5290298 5391768 5501915 5624272 5751950
2839 5751950 5889678 6026494 6156231 6300251 6445413 6599420 6772361 6963267 7172747 7391228
2829 7391228 7617099 7850721 8096107 8354993 8633892 8941487 9282026 9665736 10079598 10489731
2819 10489731 10933334 11420158 11941055 12512804 13121132 13761857 14463873 15229581 16063099
2810 16063099 17004761 18077577 19294916 20691048 22315455 24232151 26528588 29164536
2802 29164536 32022553 35256019 39016184 43394839 48683232 55391606 64143947 76537112
2794 76537112 92937829 109536999 128868002 149606523 161788075 164287254 157324022
2787 157324022 138570836 121403867 107801813 97131108 89076676 83087205 78807735
2780 78807735 75674349 73006015 71485847 71287756 72384802 74444003 77260542 80987974
2772 80987974 85863426 92247308 100665011 112131863 127878984 151188098 180713782 209650308
2764 209650308 243796481 278658527 294509915 295975322 279355168 244159143 212747073
2757 212747073 186207674 164480271 147005423 132991542 121860979 112394292 103168468
2750 103168468 95568877 89662079 85198199 81796129 79330423 77407335 76349764 76396975
2742 76396975 77726991 80880685 86447673 95943386 108900001 122278503 138622626 155546100
2734 155546100 163412804 163002497 152610108 132954481 115709601 101436992 89789939
2727 89789939 80358335 72679237 66390756 60837947 55404428 50504389 46340285 42778677
2719 42778677 39652099 36910249 34291073 31870982 29733377 27822848 26161881 24704913
2711 24704913 23419276 22269525 21207721 20214448 19313242 18490469 17746832 17076214 16438129
2702 16438129 15822179 15245395 14697483 14183699 13706714 13263305 12843483 12414714 11902488
2693 11902488 11429340 11011849 10638594 10301344 9982624 9672767 9383122 9098780 8823885
2684 8823885 8566124 8322650 8102490 7902749 7715871 7531065 7348318 7172579 6996174 6830682
2674 6830682 6669869 6509721 6358348 6207314 6061907 5919688 5783595 5640538 5510405 5386784
2664 5386784 5275450 5174716 5079012 4985786 4890862 4796636 4700745 4605887 4518566 4436677 4356016
2653 4356016 4271006 4194201 4114278 4035416 3956081 3877387 3800004 3716768 3634055 3541204 3447281
2642 3447281 3354280 3257682 3160640 3076458 3004581 2929721 2868419 2812466 2760994 2709079 2657686
2631 2657686 2602987 2551909 2498522 2448444 2403242 2366961 2332487 2290294 2250322 2204622 2150051
2620 2150051 2097678 2045999 1986297 1936172 1887037 1832036 1778756 1719537 1661041 1595197 1534403
2609 1534403 1473890 1413530 1366412 1328756 1306995 1289823 1278517 1261413 1238929 1211668 1178746
2598 1178746 1157370 1139419 1125327 1107411 1088951 1064697 1034678 1008752 981522 956551 931802
2587 931802 912294 890007 867050 839450 808774 775234 740799 710437 683422 663723 657219 656560
2575 656560 655223 652060 646792 634647 617799 605698 592625 581887 570141 566235 553489 545020 535272
2562 535272 526101 516876 506704 503221 494514 492178 489654 489985 491749 495985 498887 507594 520332 536200
2548 536200 558478 586615 632772 709729 788609 883090 989510 1072745 1094110 1066424 961870
2537 961870 852600 761293 690607 635802 593609 561783 534657 512362 490556 475793 472546 473051
2525 473051 481483 488089 506584 525506 558177 607004 673048 774547 928199 1082574 1267493
2514 1267493 1478883 1623168 1653804 1594951 1378939 1172350 1007622 873014 766177 682484
2504 682484 614528 555516 500665 451968 411177 380239 354959 334308 318908 306984 297663 300988
2492 300988 313943 332715 375433 442027 505016 581856 673897 723756 728967 683350 573120 471745
2480 471745 385440 315046 258295 208246 170566 135675 100878 71616 43407 24000 606 -14986
2468 -14986 -36937 -53829 -69659 -85123 -97417 -106891 -119269 -131975 -135024 -150050 -156295 -159646 -167778
2455 -167778 -177093 -179038 -191618 -196026 -202645 -206476 -211569 -216976 -221635 -229428 -232112 -235688 -241013 -246629
2441 -246629 -249219 -252264 -255000 -259658 -265187 -266240 -271817 -278131 -281791 -283917 -289132 -290078 -294479 -296168 -300324
2426 -300324 -301577 -306358 -309078 -311771 -312178 -314492 -316916 -319297 -320204 -321593 -326258 -328402 -330057 -336923 -336462
2411 -336462 -338333 -334925 -341353 -340565 -343311 -342839 -346769 -348555 -348092 -352338 -355011 -356472 -358036 -359958 -363992
2396 -363992 -364053 -364422 -367399 -370671 -370721 -373706 -374316 -375407 -375763 -374691 -378480 -375932 -380791 -380375 -381780 -383073
2380 -383073 -384570 -384322 -381044 -384275 -387972 -387027 -386714 -389867 -390836 -393526 -396944 -396445 -400609 -401104 -406072 -408713
2364 -408713 -410836 -410070 -407791 -409572 -409083 -408827 -404778 -405356 -407186 -408259 -406301 -408465 -409849 -408031 -411054
2349 -411054 -411392 -413587 -410858 -413445 -411372 -410319 -407747 -411659 -412005 -414679 -416573 -418477 -414982 -414774 -413282
2334 -413282 -413459 -410749 -415776 -416358 -415905 -413616 -415388 -416787 -415321 -413879 -413461 -411850 -414165 -414453 -413665 -414713
2318 -414713 -414333 -415053 -415635 -414364 -415218 -414127 -414984 -415260 -418659 -416598 -416489 -415532 -417592 -418194 -418104 -415906 -413617
2301 -413617 -413536 -415462 -412288 -415181 -415438 -411692 -414825 -411614 -412515 -414653 -412032 -414681 -414334 -412616 -415033 -414192
2285 -414192 -413129 -411637 -411566 -408446 -409995 -410822 -411346 -408928 -411553 -410189 -412122 -410764 -412100 -412664 -409182 -413868
2269 -413868 -414554 -411939 -414071 -413955 -411409 -410504 -409817 -413149 -412266 -411572 -412843 -415386 -410550 -413993 -412006 -413436
2253 -413436 -407099 -408847 -411745 -411126 -408985 -410349 -409491 -409381 -409894 -404949 -406807 -407946 -408483 -401694 -404623 -409497
2237 -409497 -404351 -406054 -405112 -409432 -406547 -409305 -405526 -405542 -404091 -402198 -406023 -405459 -405492 -403720 -402306 -405001
2221 -405001 -403158 -401423 -402709 -402302 -406620 -400958 -404734 -406433 -407833 -407125 -402733 -401992 -404804 -401904 -403824
2206 -403824 -401951 -402910 -402388 -398639 -402377 -405649 -403751 -402051 -403949 -403020 -404804 -400910 -403325 -400151 -403158
2191 -403158 -401553 -401457 -403433 -403068 -402782 -401964 -400681 -399227 -400581 -399309 -399280 -398228 -395259 -400841 -400226 -398837
2175 -398837 -401114 -401581 -401007 -398927 -401473 -403242 -403691 -402322 -401155 -399345 -401592 -402351 -399286 -402612 -400437
2160 -400437 -396249 -397422 -396835 -400287 -395755 -396713 -396580 -395766 -395131 -396081 -396557 -395460 -392461 -393917 -391602 -394403
2144 -394403 -391989 -393407 -391801 -392232 -390475 -391525 -391159 -389801 -393363 -389795 -390095 -390309 -390833 -392995 -391023 -392108
2128 -392108 -390786 -392781 -394793 -392834 -391444 -391802 -388450 -392790 -388998 -391312 -392017 -386649 -392402 -391042 -389893
2113 -389893 -391429 -388498 -392875 -389133 -390915 -389173 -387568 -386982 -387778 -389444 -385179 -387355 -386627 -383728 -382905
2098 -382905 -385196 -384712 -384003 -382877 -383743 -384832 -381647 -382938 -384022 -382124 -383364 -383285 -382208 -383400 -382024 -381389
2082 -381389 -381820 -380463 -384106 -379073 -380362 -379328 -380186 -379530 -382547 -380974 -381753 -377336 -381391 -381665 -382041 -384305
2066 -384305 -381880 -381221 -380165 -377669 -375611 -377601 -378796 -377245 -374001 -375832 -377403 -380010 -374788 -370980 -375567
2051 -375567 -372806 -375507 -376478 -375125 -376688 -375249 -375832 -373767 -374938 -374015 -372378 -370587 -369444 -370380 -374095
2036 -374095 -373018 -372400 -370810 -373468 -372626 -369621 -371247 -372545 -373517 -373790 -371709 -370507 -372399 -371308 -370503 -373228
2020 -373228 -370101 -373867 -369143 -372057 -368464 -369355 -367852 -369424 -368486 -371672 -370414 -367008 -371119 -368834 -369949
2005 -369949 -366362 -366694 -366433 -368416 -367684 -364892 -366511 -363077 -362073 -363142 -363971 -364958 -364082 -365337 -364272 -365810
1989 -365810 -364976 -366982 -362855 -363173 -367207 -365918 -364038 -363207 -364963 -361761 -364439 -362599 -361761 -363311 -364651
1974 -364651 -362259 -361906 -364001 -361692 -364605 -364091 -362311 -361942 -362842 -360742 -362711 -360729 -360894 -360028 -360347 -359241
1958 -359241 -357759 -360321 -360555 -357788 -357694 -360299 -360001 -358769 -357055 -355333 -358757 -356622 -361208 -358061 -359523
1943 -359523 -356353 -359535 -358530 -355914 -358530 -356814 -355959 -357128 -355598 -355093 -353847 -358027 -353845 -353622 -355178
1928 -355178 -353326 -353059 -354100 -354066 -351088 -353178 -353760 -351855 -350890 -352281 -350698 -349858 -353064 -352306 -349299 -350883
1912 -350883 -348555 -348818 -351662 -349372 -349229 -350802 -347653 -348944 -346649 -346629 -347941 -347014 -345122 -348071 -344868 -347285
1896 -347285 -348766 -349634 -344951 -348033 -348440 -344543 -346498 -343454 -344143 -342562 -344150 -344233 -345861 -344409 -347369 -347637
1880 -347637 -343956 -345302 -342351 -345387 -345637 -341458 -343378 -341615 -343020 -343414 -343707 -342160 -341528 -341628 -345962 -343261
1864 -343261 -344260 -341879 -341070 -342596 -340539 -341808 -340686 -341278 -342741 -341132 -340047 -341590 -341155 -339037 -340343
1849 -340343 -337185 -338934 -336522 -337040 -339444 -338646 -337317 -339933 -335460 -336566 -338353 -335767 -336415 -336216 -333673
1834 -333673 -336647 -336121 -335777 -338856 -335202 -335448 -335066 -332151 -332230 -332191 -336744 -331417 -334937 -335494 -333402 -331913 -332823
1817 -332823 -335887 -337491 -332174 -334158 -333369 -334810 -335800 -334134 -331038 -330938 -332027 -330830 -331827 -331292 -329948 -333087
1801 -333087 -330608 -331804 -333814 -332971 -330124 -329299 -334123 -330048 -330564 -328748 -329244 -331272 -328995 -329546 -331339 -328477
1785 -328477 -327868 -328704 -329690 -328071 -326934 -328855 -327383 -326398 -325378 -329664 -329861 -327030 -329550 -332163 -328070 -326645
1769 -326645 -328867 -327151 -327590 -326746 -327056 -326478 -326715 -326920 -331053 -325338 -325235 -325120 -325998 -328664 -325626 -325113 -326112
1752 -326112 -326104 -326379 -326107 -324701 -324362 -325492 -322803 -324159 -325024 -322703 -323264 -325013 -323428 -322744 -323426 -322852 -323194
1735 -323194 -325014 -324130 -323379 -326287 -325507 -323916 -325191 -322349 -320681 -323183 -321445 -323305 -322454 -322574 -322795 -321755
1719 -321755 -319549 -323765 -321741 -323722 -321104 -321787 -322177 -321609 -322790 -320284 -321027 -319776 -321030 -319791 -318954 -316026
1703 -316026 -318825 -319144 -318531 -318656 -318648 -318302 -317233 -320663 -318999 -319380 -318175 -315507 -317903 -317406 -316457 -317391 -316221
1686 -316221 -317242 -318035 -315686 -316774 -317109 -316118 -317105 -316361 -316107 -313933 -315300 -316227 -315790 -314733 -313647 -314519 -312990
1669 -312990 -316764 -312993 -316776 -316274 -315443 -313839 -316620 -313837 -315475 -315600 -313450 -316172 -315520 -314804 -313726 -316139
1653 -316139 -312322 -312920 -313529 -314357 -315341 -312820 -311697 -311208 -310927 -314431 -312932 -316085 -312192 -311258 -311454 -311668 -314804
1636 -314804 -312411 -309718 -309047 -309984 -309416 -310853 -310091 -307142 -307510 -307460 -306136 -310851 -309311 -309656 -310342 -307667 -310473
1619 -310473 -308428 -308847 -307506 -306080 -307795 -309622 -308252 -310029 -306797 -305260 -309535 -308689 -307128 -306038 -304741
1604 -304741 -309734 -305224 -307048 -306277 -307630 -307345 -305901 -308553 -306196 -309309 -305036 -304117 -306482 -307594 -304666
1589 -304666 -305571 -306167 -301312 -303922 -302768 -305108 -307205 -304968 -308977 -304189 -309315 -303813 -303146 -306512 -300582
1574 -300582 -305305 -304500 -306563 -304702 -301759 -303999 -301925 -303669 -303107 -303569 -302293 -304246 -305373 -303013 -303001 -302821
1558 -302821 -302194 -300393 -304456 -300582 -299315 -301398 -301580 -300019 -300035 -299664 -297510 -300998 -299774 -302250 -301972 -301567
1542 -301567 -302227 -299415 -301726 -298151 -301115 -303774 -300674 -297495 -298212 -300864 -298653 -302712 -301891 -300574 -297255
1527 -297255 -303217 -299951 -300379 -297731 -300915 -300857 -299790 -301280 -303132 -299327 -298915 -297321 -298713 -300708 -297696
1512 -297696 -298148 -297167 -299538 -299911 -296139 -298654 -297017 -298054 -292630 -298050 -299968 -297798 -296360 -296451 -296364 -296584
1496 -296584 -296052 -296459 -297312 -298343 -297812 -298663 -294576 -299193 -298142 -296871 -294618 -295323 -295238 -297442 -293882 -297224
1480 -297224 -293993 -296715 -295137 -295560 -295804 -296763 -297658 -296336 -299848 -293281 -297298 -294786 -298849 -292649 -298358
1465 -298358 -294378 -296347 -296164 -294695 -296855 -298301 -294930 -297895 -294514 -293263 -295771 -295283 -297381 -294064 -297062
1450 -297062 -295674 -295444 -294068 -290678 -293839 -291212 -292967 -293929 -295182 -294610 -293364 -295981 -295416 -294716 -293031 -295165
1434 -295165 -293743 -293476 -292997 -295063 -292334 -291112 -294946 -293087 -294377 -295626 -293398 -293162 -289694 -294353 -295273
1419 -295273 -292380 -292766 -292394 -292671 -293721 -291355 -292339 -293451 -289589 -293334 -291321 -290573 -295341 -293589 -290212 -295058
1403 -295058 -291484 -294853 -294500 -295017 -293139 -293204 -291834 -294043 -291294 -289799 -291037 -293730 -292197 -292934 -290699 -290073
1387 -290073 -291260 -291665 -292135 -292419 -290729 -292695 -292001 -295111 -291116 -290878 -292550 -294986 -293541 -289685 -293521 -297675
1371 -297675 -295429 -295596 -297018 -296318 -294292 -297565 -293476 -293297 -290812 -292592 -294589 -290064 -294345 -293990 -290673
1356 -290673 -294026 -291332 -293922 -292698 -294396 -291385 -292801 -293299 -293334 -292387 -290335 -290497 -291924 -290361 -287719 -288055
1340 -288055 -288212 -288142 -288424 -288236 -289652 -289979 -285403 -287465 -286458 -289441 -286208 -286577 -288447 -289768 -284870 -287584
1324 -287584 -285189 -284038 -286744 -283444 -284739 -283499 -284653 -282952 -280865 -280624 -283063 -286221 -281706 -282783 -281209
1309 -281209 -282519 -282169 -283172 -280493 -281481 -284892 -283989 -279571 -279637 -279198 -279462 -279782 -278348 -276993 -276780 -279476 -278100
1292 -278100 -278080 -277682 -279703 -277347 -277542 -280351 -274712 -278505 -274766 -276061 -277197 -274350 -273808 -276005 -273549 -272779
1276 -272779 -274384 -273865 -272952 -275590 -274279 -273994 -275376 -274182 -275506 -274005 -272233 -268678 -269476 -271598 -271659 -270726
1260 -270726 -268481 -270462 -274055 -268923 -270950 -269310 -271114 -268165 -268839 -268750 -270231 -266495 -268259 -268776 -268968 -266413
1244 -266413 -270940 -268787 -267362 -265813 -268096 -266856 -268850 -266488 -268325 -269113 -266736 -267041 -264898 -266557 -268350
1229 -268350 -266875 -267694 -266184 -267642 -265664 -267081 -265504 -264982 -268765 -267067 -266629 -265351 -265430 -265815 -268217 -265741
1213 -265741 -265202 -266348 -266611 -264682 -265182 -264535 -266637 -266995 -263595 -269181 -268441 -267062 -265408 -265976 -265528 -264281
1197 -264281 -265165 -267967 -265583 -264684 -265410 -266839 -266865 -266921 -262874 -264878 -266403 -268159 -267686 -266831 -266599 -263259 -269386
1180 -269386 -266443 -265286 -264938 -266060 -263921 -263394 -266795 -268422 -266259 -264898 -264792 -263392 -265161 -268703 -267299
1165 -267299 -264299 -264837 -265681 -263248 -263788 -266729 -262045 -265604 -262273 -263580 -265333 -262951 -265496 -264688 -261359
1150 -261359 -264818 -267393 -264527 -264032 -262293 -264966 -260644 -264259 -261300 -266588 -263242 -263174 -260424 -260098 -260988 -262354
1134 -262354 -262941 -264327 -262481 -264619 -262781 -261270 -263001 -259677 -262660 -263997 -262582 -262179 -262782 -260710 -262205
1119 -262205 -261722 -263795 -264457 -261775 -262615 -263671 -262728 -261548 -262451 -259990 -262950 -261802 -259096 -260574 -260953 -262274
1103 -262274 -262218 -258956 -262556 -262602 -259099 -257721 -260425 -258784 -258308 -262501 -261984 -262189 -261049 -260836 -261647 -263585 -260139
1086 -260139 -261793 -259476 -260074 -260888 -259495 -259518 -262058 -261054 -266151 -259448 -260483 -258749 -257312 -259814 -261246
1071 -261246 -257859 -259566 -259721 -262039 -261642 -258712 -259578 -260718 -259855 -259628 -260322 -259798 -259564 -261351 -260149 -257664
1055 -257664 -258848 -256935 -260265 -260151 -258635 -256538 -259832 -261616 -260109 -258114 -259455 -257708 -258611 -261322 -260838
1040 -260838 -259440 -258823 -259783 -256455 -258963 -256948 -259982 -258842 -256760 -256289 -258260 -255855 -260278 -257396 -257754
1025 -257754 -255536 -258148 -258827 -258767 -257386 -258721 -256906 -253388 -257104 -256870 -257225 -256785 -258816 -258141 -258899 -253318
1009 -253318 -259442 -256809 -256573 -257501 -259413 -259053 -256130 -256160 -253028 -256105 -258327 -257020 -259048 -259221 -257999 -257091
993 -257091 -257266 -254931 -258719 -253700 -259743 -255632 -256056 -256527 -259661 -259491 -257738 -257845 -255283 -256428 -257037 -259103
977 -259103 -255838 -256182 -255518 -256831 -255829 -254348 -255480 -257756 -257312 -253907 -256740 -256254 -255140 -255803 -255509 -258140
961 -258140 -257023 -256780 -257120 -255635 -255928 -257041 -256172 -254887 -257665 -257660 -257852 -256420 -257603 -256305 -253955 -253611 -254831
944 -254831 -254026 -255454 -257745 -253820 -255147 -255067 -253336 -252544 -255201 -258306 -259028 -257133 -257483 -258041 -256063 -257634
928 -257634 -258966 -255526 -258597 -257490 -258087 -258761 -255640 -255711 -255915 -256979 -255590 -259596 -259749 -259763 -260193 -261122 -259157
911 -259157 -260530 -261890 -260358 -257946 -256677 -258879 -256838 -256517 -259225 -252914 -256298 -257115 -259729 -258434 -256581
896 -256581 -258122 -258995 -257566 -257522 -256798 -256492 -257752 -258596 -257223 -256018 -253166 -251908 -257016 -256389 -257854 -257405 -257485
879 -257485 -258149 -255537 -256642 -256551 -257276 -257305 -260412 -260593 -258821 -260420 -255899 -256367 -257016 -254983 -258950 -258877 -260621
862 -260621 -259954 -259029 -250890 -251417 -250202 -247323 -249500 -249922 -252239 -253985 -252594 -253946 -256379 -254968 -256386 -255572
846 -255572 -255125 -255260 -254873 -250739 -249618 -249168 -242820 -244972 -248341 -251945 -250627 -251858 -253646 -252818 -252417 -249033
830 -249033 -246840 -242361 -243428 -245256 -244521 -244950 -246679 -250750 -251092 -250586 -247206 -248033 -249001 -248078 -247371 -246179 -242114
813 -242114 -240228 -240200 -238071 -239786 -235826 -243002 -243496 -246184 -247847 -245229 -247255 -242761 -243029 -242841 -243499 -241804
797 -241804 -243428 -241275 -242787 -239605 -239688 -238403 -239018 -240583 -243077 -239347 -239110 -238559 -238786 -238455 -237542 -236884 -237353
780 -237353 -239101 -242612 -240160 -240991 -241004 -238212 -239398 -236412 -239141 -238901 -240405 -240810 -238643 -237363 -234181 -238197
764 -238197 -233781 -235931 -234351 -236462 -237224 -234782 -235626 -237911 -237047 -237319 -236269 -238039 -235953 -238099 -234607 -235166
748 -235166 -229941 -234996 -232445 -235914 -233770 -234245 -233639 -234193 -232550 -232604 -232763 -235974 -233019 -233476 -236000 -233892
732 -233892 -232420 -233416 -231431 -232837 -231229 -233848 -237528 -235488 -233924 -234061 -233748 -236107 -234057 -236009 -230841
717 -230841 -232248 -235948 -237569 -233011 -232738 -234862 -231401 -230794 -233004 -236052 -232185 -233930 -232805 -234039 -232149
702 -232149 -232067 -233304 -232632 -234447 -231239 -233660 -231505 -232805 -235349 -234248 -233585 -233092 -230683 -232683 -231136 -228267
686 -228267 -231456 -231752 -231448 -230478 -231983 -229539 -230017 -233065 -231963 -230312 -233223 -231587 -229602 -231640 -230767 -232667
670 -232667 -231751 -230188 -231621 -230491 -228924 -232227 -231966 -232323 -230315 -230997 -229865 -231441 -229959 -231783 -234186 -229611
654 -229611 -232415 -230197 -231163 -231802 -234624 -231958 -235984 -234189 -232292 -229322 -231408 -233101 -231785 -231651 -230707 -233957
638 -233957 -234619 -229488 -230792 -230129 -234655 -233711 -235619 -233216 -232290 -233234 -228760 -231688 -234517 -230844 -232516 -228304
622 -228304 -228447 -230488 -228526 -229643 -228912 -232080 -229644 -228300 -229202 -232177 -230625 -231341 -228899 -228424 -231419 -231099
606 -231099 -230083 -228411 -231272 -231116 -230517 -231323 -230022 -227982 -229237 -231132 -229500 -228796 -230082 -228467 -231135 -232337
590 -232337 -232347 -232746 -230091 -228969 -230765 -231446 -227875 -227817 -228995 -228592 -231816 -232508 -230351 -229082 -230866 -227165 -229984
573 -229984 -231063 -232057 -229853 -230555 -225292 -227654 -228152 -229673 -227911 -226546 -227023 -228253 -228294 -228216 -228107 -227138 -229302
556 -229302 -229041 -229555 -230008 -230940 -229726 -229632 -227099 -230137 -226860 -229939 -231358 -227815 -229696 -227339 -228513 -230647
540 -230647 -227701 -229472 -230658 -228182 -228956 -227986 -228689 -230027 -227338 -228505 -228402 -230484 -228446 -230006 -228101 -229773
524 -229773 -227778 -227653 -227957 -228240 -231040 -228852 -226838 -229349 -229683 -227159 -229412 -228488 -227870 -226380 -228073 -227608
508 -227608 -227733 -229500 -225869 -228588 -227094 -226737 -227942 -226267 -226761 -229352 -227599 -228874 -229782 -230381 -229198 -227203
492 -227203 -224196 -227708 -228079 -226335 -225126 -226082 -225218 -227385 -226405 -229547 -226814 -228234 -226516 -227073 -226244 -225864
476 -225864 -225754 -228417 -226345 -226862 -225835 -224699 -225537 -225219 -226827 -225889 -226791 -228300 -225531 -228066 -225957 -224616
460 -224616 -225762 -226686 -228023 -225196 -226943 -225135 -225225 -226400 -223598 -225548 -226573 -224429 -223860 -226890 -227047 -225984
444 -225984 -225515 -226904 -226352 -225825 -227873 -225635 -225221 -224886 -226411 -225926 -224491 -222807 -225610 -227305 -223657 -225222
428 -225222 -226890 -225145 -225389 -224779 -226787 -223550 -224977 -223562 -225229 -223487 -225522 -223947 -225577 -222878 -224971
413 -224971 -224115 -224187 -225514 -224708 -226308 -225531 -225477 -224474 -223867 -225693 -227850 -222757 -226030 -223981 -223948 -225426 -222082
396 -222082 -224328 -225657 -223169 -226979 -224619 -223363 -221524 -225043 -223757 -224513 -227221 -225936 -224258 -228382 -223523
381 -223523 -227027 -225213 -223286 -222565 -224048 -227017 -224824 -223478 -226538 -223151 -222098 -222414 -224748 -226752 -225121
366 -225121 -222694 -222109 -222028 -218751 -222276 -224390 -223451 -222193 -220577 -222691 -221632 -222691 -220634 -220349 -221448 -221964
350 -221964 -221623 -222910 -223364 -218661 -223348 -224667 -221278 -221541 -221400 -224183 -220809 -222564 -224392 -219162 -223975 -225410
334 -225410 -222704 -222449 -220097 -224180 -224178 -219335 -223327 -222908 -222507 -221988 -222290 -222583 -222373 -224099 -224731 -223505 -225786
317 -225786 -223817 -226062 -225109 -223007 -223427 -222920 -221872 -223855 -222318 -220258 -223038 -221239 -222620 -222096 -222268 -221643
301 -221643 -223609 -222426 -221657 -221593 -221763 -221034 -221924 -221189 -222604 -220214 -219669 -221783 -221877 -221602 -220508 -221712 -221659 -217982
283 -217982 -222714 -219775 -222694 -220296 -218238 -222973 -218267 -220065 -219866 -218199 -218657 -215901 -218551 -218382 -221580
268 -221580 -220513 -225544 -220654 -222365 -222627 -221645 -217841 -222429 -218731 -219520 -220313 -219579 -220793 -220404 -223200 -217925
252 -217925 -219708 -219182 -224485 -221909 -221474 -216843 -219182 -219939 -221334 -220755 -221429 -222441 -220675 -220329 -221641 -219820
236 -219820 -220955 -217201 -217811 -221735 -222871 -219581 -220501 -223559 -220435 -219847 -219220 -220673 -219854 -220063 -220025 -222561 -220326
219 -220326 -220684 -221962 -220986 -221725 -220776 -221099 -219432 -220036 -218966 -218696 -222773 -220096 -220353 -223130 -218352 -219398 -219221
202 -219221 -218244 -216597 -219474 -218439 -217983 -217364 -221773 -218797 -215812 -218188 -216572 -221059 -216770 -215080 -220857
187 -220857 -217667 -217146 -218255 -220018 -217956 -216732 -222291 -219233 -215081 -217372 -219066 -216555 -217690 -218739 -218678
172 -218678 -217568 -220767 -219285 -217891 -218062 -217591 -215761 -216476 -216788 -217793 -215081 -216717 -216381 -216297 -220253 -218607
156 -218607 -221001 -217854 -216061 -217270 -216127 -218645 -215991 -215546 -217012 -217413 -217526 -215905 -215734 -218403 -216469 -215738
140 -215738 -212760 -217229 -216988 -216332 -218101 -215362 -216531 -215706 -217684 -216782 -216132 -218209 -213711 -215484 -213169 -215858
124 -215858 -217118 -216834 -217047 -216957 -216231 -216498 -214538 -216968 -218569 -217843 -217144 -217595 -216597 -215432 -216556 -216528 -216192 -214230
106 -214230 -214737 -214101 -215481 -216894 -215934 -215960 -215304 -214381 -213114 -215048 -216082 -216454 -216979 -214876 -217132 -216441 -216243
89 -216243 -218196 -215212 -215838 -217201 -218077 -216096 -216582 -218152 -218787 -217926 -217114 -216672 -217001 -216978 -216840 -216854 -218277 -218836
71 -218836 -217872 -216782 -217481 -217014 -215867 -217449 -218220 -214422 -213959 -216127 -214771 -214056 -214535 -214077 -214209 -215073 -213389
54 -213389 -213928 -212940 -213392 -214318 -215810 -214307 -214387 -215590 -216481 -215953 -216006 -217375 -216506 -214068 -213874 -215383 -217988 -215043
36 -215043 -217515 -216196 -214084 -215655 -214916 -218150 -215504 -214868 -214510 -217097 -214985 -217163 -215441 -215075 -213634 -213549
20 -213549 -214029 -214034 -210899 -210141 -213008 -211597 -212319 -210355 -210879 -214589 -214221 -213610 -214785 -214629 -214712 -213025 -213357 -214220
2 -214220 -212619 -214836
0 -214836
$$ Imaginary data points
##PAGE= N=2
##DATA TABLE= (X++(I..I)), XYDATA
16383 -725547 -716443 -707793 -700628 -692064 -684483 -670050 -664231 -656545 -645759 -634810 -627790 -618332 -610511
16370 -610511 -599117 -593570 -583592 -574342 -565440 -556268 -548425 -539001 -531640 -521206 -514561 -507943 -498890 -488817
16356 -488817 -480882 -469151 -462810 -451373 -444073 -436229 -427359 -421943 -411073 -402819 -396726 -387289 -380217
16343 -380217 -371356 -362746 -352997 -344126 -335437 -326863 -320823 -312354 -303333 -294429 -284165 -277976 -271876 -261787
16329 -261787 -252739 -245945 -240327 -227699 -221339 -212403 -207302 -200290 -192877 -183443 -175693 -166362 -162059 -154232
16315 -154232 -142882 -136876 -129733 -122841 -113410 -108232 -99393 -93157 -87183 -78851 -73679 -64105 -57255 -49310
16301 -49310 -41912 -33350 -28330 -20749 -15447 -5263 1880 4824 12403 20022 26536 35034 40888 46810
16287 46810 54456 60674 67668 76003 79515 85713 93731 98262 105687 111010 115217 121736 131596 137164
16273 137164 142051 148665 154906 158576 168839 172164 179012 183917 187420 196669 200026 207193 212581 214437
16259 214437 222398 228754 236096 240598 245859 250383 256659 261689 266030 271378 276946 279549 284831 290257
16245 290257 295945 299964 304930 313402 313539 319647 325070 328869 333902 339866 341900 346997 351245 356553
16231 356553 356179 363211 370157 370958 376524 379243 384205 391459 392435 399150 398682 404835 409506 410907 415549
16216 415549 420394 423643 426755 431025 433670 438683 441168 444129 447455 452703 456089 456654 460586 465284
16202 465284 467012 471408 473008 478714 482635 481751 487266 489435 490759 497423 496997 499485 505696 507016 511845
16187 511845 512320 516637 515852 517020 521319 523041 527048 529099 532700 533437 539603 538416 541294 545209 545723
16172 545723 551075 549725 553824 554863 558451 557815 559507 562928 562436 568142 569097 567734 571910 574067 576836
16157 576836 578732 579081 582261 583775 585200 587538 586676 589196 589049 592531 594285 592609 595734 595727 598243 600410
16141 600410 601639 601357 606048 605141 608303 609188 608743 610314 613016 611405 616252 616133 619448 620973 621183 622257
16125 622257 622989 624300 624163 626486 629614 629818 628995 631241 629888 630542 629816 632140 635068 632733 633781 637354
16109 637354 639391 639179 636421 637395 641760 640297 643719 643119 642776 648365 646009 645449 646360 646694 648051 645899
16093 645899 648196 647961 651125 647532 648083 652228 650817 650973 651390 655194 653234 654226 655562 655414 655995 654927
16077 654927 657815 655864 656025 658873 658035 657321 657397 660170 657555 658337 659557 659161 660176 660011 661472 659800
16061 659800 660590 661690 660568 662593 665033 660021 663783 660062 661887 665150 664095 664405 664525 664067 661635
16046 661635 661361 664759 664789 664080 665880 664609 669336 665549 665683 667060 665802 665577 664848 666341 667759 672488
16030 672488 668027 670045 667716 668549 666219 670488 668387 667911 668644 667773 667029 671058 671165 668602 669458 670132
16014 670132 670082 671989 671677 669010 668196 669904 668667 668200 669725 669228 670648 670777 669544 673516 670534 670618
15998 670618 673042 673021 670234 671853 673275 671616 671352 673324 671781 671536 671558 671962 671084 672709 673292 672297 673306
15981 673306 674340 673426 673034 674564 674650 671980 674595 674019 674720 672976 675926 676246 673979 676618 673093 674572
15965 674572 673458 673196 677680 675747 674298 673675 674624 674573 678171 674649 676013 676097 675662 673077 674646 672891
15949 672891 674472 675240 677232 675828 675028 673369 675056 673186 674017 674780 675421 674889 677347 673817 673848 676072
15933 676072 677144 677744 676846 673557 678078 673005 675869 675738 677531 676401 677470 678600 678289 674535 678375
15918 678375 677868 676000 677905 676359 678031 678860 677439 674660 677165 678508 680205 676170 676153 676231 681583 675819
15902 675819 678655 674476 679281 679673 677588 677996 682298 677130 679911 679242 679147 680005 677535 679066 676506 679434
15886 679434 675554 679898 676707 676033 679082 678434 677082 679274 678776 680648 679630 680826 677033 681182 676597
15871 676597 680339 679138 680464 678150 680926 679846 678075 678137 680481 680498 681146 680218 680975 683109 680451 682517
15855 682517 678200 683298 682516 683048 681424 682018 679884 679884 681679 681541 681268 683171 683901 683955 683575 682631 683900
15838 683900 680716 678994 683699 683025 682578 682858 683707 680207 681747 679320 683781 682200 683928 683036 681919
15823 681919 681983 683168 684359 681141 681783 682489 681407 682785 683699 680986 683982 682890 684151 683097 684106
15808 684106 683213 684402 683858 687972 682419 686054 682356 684807 686383 681615 686265 685579 684019 684898 684793
15793 684793 686093 683714 685454 683567 686352 684315 689368 683855 682873 683791 684636 685998 685897 684201 685578
15778 685578 684389 686603 682507 685645 685442 683939 686126 685340 686284 684674 687144 683984 683722 681553 682978
15763 682978 685213 683940 686449 681787 686343 685468 685436 685027 687581 684584 688345 687951 686689 685318 686693
15748 686693 687907 687920 688520 685296 684532 687652 689761 687489 689813 686023 686990 689825 687371 690070 689092 689387
15732 689387 688167 686545 687559 688945 685618 687506 685006 689442 688851 686986 685959 687563 686881 690198 689890
15717 689890 686926 691084 690204 690035 692909 689617 688801 687492 688468 689294 689044 689805 689823 691463 689260 690495
15701 690495 693568 693213 693926 694096 694118 690645 690560 690678 689539 691111 691450 692058 690190 689828 690650 694557 691718
15684 691718 692430 695365 691415 694793 692353 688798 689406 689201 689041 692086 690691 690367 691377 687848 687739 688994
15668 688994 688929 688809 692415 691246 690923 694410 690368 691658 690574 693338 692553 689963 691554 692677 695009
15653 695009 693102 694608 690776 694980 695169 695748 694958 695720 696276 696559 693777 698872 695850 694724 698381 696975
15637 696975 692957 697120 695625 696063 692260 695233 695203 696090 695518 693575 693925 695804 694202 692116 694079 692733
15621 692733 691765 693653 692582 692791 693633 691371 691022 693053 693505 690999 693129 697067 695258 693792 695868
15606 695868 695238 695621 695394 696247 694758 692817 697555 698297 699472 698336 695525 698652 697433 696514 700923 698325
15590 698325 699179 699687 699171 700699 700188 699000 698017 700529 699989 699655 696211 701125 695532 698132 696200 696750
15574 696750 697611 698359 699640 697292 697737 697403 696065 698504 696606 699409 695361 698799 698328 696457 698358
15559 698358 697652 698467 696729 697135 699484 698580 696461 697519 701310 701327 698829 702360 703531 701038 699140 699616
15543 699616 702492 701075 701328 700826 702899 703779 701097 702326 699929 701683 702165 703779 701823 704865 702765
15528 702765 702929 699208 699713 699956 700570 702006 704035 702419 698004 699686 697521 698923 699960 701071 698969
15513 698969 700446 700400 701119 699845 699111 703868 700790 701510 701220 699201 702697 703102 699714 705337 704598 701153
15497 701153 705667 704089 706569 702636 707182 705309 707199 703412 703556 706166 705899 704843 706063 704589 704034
15482 704034 707610 705252 706715 704437 703648 706000 709245 703773 702397 705329 704608 703150 706850 706532 703668
15467 703668 705962 704255 704657 703533 702731 703643 705512 703990 705849 705321 708405 705570 703591 706314 706725
15452 706725 706769 709367 706588 707342 706224 706763 707687 704709 706093 708485 705767 709349 706239 707658 707521 707770
15436 707770 710128 706531 710244 709089 708060 707313 709520 707958 710091 709150 707274 704815 706560 707741 709024
15421 709024 708773 708733 708897 707879 708187 709859 708975 708785 707220 709602 710864 705443 710275 707571 710615 707909
15405 707909 709244 709901 705370 708688 705629 710685 709204 708010 708701 712359 708819 710961 708592 711261 709686
15390 709686 711313 711435 709139 713100 712784 710943 707725 710687 710534 711120 711380 712506 712886 710100 710545 709877
15374 709877 707426 712598 711434 711259 711982 709753 713847 712429 711925 711092 713535 712806 710841 712242 710743
15359 710743 710901 708725 711405 710139 710491 713632 711222 713238 711108 713009 715053 711938 712480 713579 711666
15344 711666 712322 711664 712248 712479 711184 712115 712130 710720 713085 713734 711894 714461 715825 718365 716310 714815
15328 714815 713505 712256 711656 712639 712678 714362 715811 716086 715057 714591 712675 714254 715199 716724 714360 714607
15312 714607 712182 715831 715143 714384 713620 714780 713835 713769 713174 713543 717743 713407 716342 715740 716015 718273 716746
15295 716746 715474 718442 716066 714710 714312 718231 718699 713742 716753 713522 716111 718592 717096 721005 716903
15280 716903 717333 717574 716461 718760 718746 713956 719320 716689 717995 718085 716766 716182 716246 719293 721529 719341
15264 719341 723915 721874 720586 722165 719262 718538 717790 718881 719388 718197 722084 720952 717364 720499 717172
15249 717172 719552 720687 721811 718221 722901 722392 719537 720386 721570 718606 719544 720553 720837 720309 721636
15234 721636 720990 718599 719070 722430 724668 723703 723622 722289 724995 721003 720741 719785 719624 721569 723487 722017
15218 722017 719988 722185 724917 719517 721954 723542 722714 723744 723075 722979 722966 723449 724660 725328 723485 725604
15202 725604 723229 723273 728382 721050 726054 722501 725913 723766 723688 727674 723739 726083 724200 724470 725927
15187 725927 722193 724555 726499 721659 722370 722389 721911 722387 723886 725217 728456 727389 727377 725124 724882 726993
15171 726993 726318 725534 728408 724853 726054 726048 725412 724319 723752 725762 727305 726608 724989 727245 728913 727636
15155 727636 728104 726694 726571 728085 727165 722828 727032 727160 729185 723860 728639 728499 727429 729378 727499
15140 727499 728078 727534 728061 727682 730262 729210 728052 728924 727200 729901 724680 728602 727397 728091 727874 728882
15124 728882 727602 727242 728778 730937 727386 727448 727863 729231 727617 728510 728386 728497 725801 727675 726091 727873
15108 727873 727459 726204 727109 729788 726639 729879 730136 728462 727420 728830 729069 729984 726784 728764 729690 730823
15092 730823 730043 731076 728883 731580 730934 730975 732624 735311 735456 731704 733042 733008 732778 735089 732104 732136 733056
15075 733056 732567 733733 732336 729793 733194 733624 732991 735871 737189 733529 732965 731276 733043 730556 732196
15060 732196 730980 729753 735126 729991 731028 733365 730228 728220 730075 731328 731028 731583 732545 731043 731216
15045 731216 733617 731628 729843 730941 734194 730247 733244 732388 732640 733154 736739 734797 735584 738394 738650
15030 738650 740361 737531 739197 739082 740056 740312 738796 736704 737474 737506 738959 736526 738980 738070 742313 738169
15014 738169 739282 740250 742459 735907 739786 739586 738234 739156 737937 739608 736113 736453 734527 735765 737721
14999 737721 735079 735832 735911 736041 737420 735952 736995 736076 734456 735459 735186 734015 732137 734564 733768 735449
14983 735449 737392 739745 737406 737494 738934 738673 736631 739829 738917 743392 740957 740230 740247 739942 738633 739399
14967 739399 740181 740652 741903 743328 743557 742691 747298 743773 746187 746266 745700 744681 743348 743215 741759 743191
14951 743191 741496 742151 740784 739932 742049 739895 741976 740364 740072 737996 741161 738814 740066 740173 740819
14936 740819 740234 741075 739240 738124 736375 738772 738788 739838 739218 739910 740554 742289 741265 743376 741739 743006
14920 743006 743242 743156 742560 743204 739998 744712 742632 745651 742268 747258 746387 746387 747402 745155 745103 746330 747815
14903 747815 747654 747998 746878 745335 746216 747410 745846 745689 743103 745111 742320 746584 745987 744110 743963 744171
14887 744171 749627 748204 745669 744703 743247 743250 746072 745044 744918 745274 744951 744095 744236 743316 745948 747070 745378
14870 745378 744791 742322 744931 743770 744601 745542 748122 745094 746682 748224 745633 746345 745070 747993 748619
14855 748619 748902 751868 748389 747979 747690 749751 751697 747181 748319 747976 749619 750541 749865 750540 751245 748386
14839 748386 749893 746547 748929 748661 749807 749935 752702 751727 750381 751595 750406 749818 751715 749750 750642
14824 750642 750405 749106 750620 748224 747044 747977 749839 749875 750305 751057 751273 752052 752079 751461 752421 747894 752066
14807 752066 750485 747747 749737 750440 752269 749603 750683 752928 753326 751472 751795 750710 754977 754007 752159
14792 752159 750261 754327 752072 750183 749813 754165 751904 752831 751616 752292 753456 752835 755911 754265 755760
14777 755760 755645 751117 752549 754529 753853 751505 752537 755653 753057 754163 755004 755695 756002 753410 754202 754455
14761 754455 750508 757724 757302 757151 755847 758473 753665 754566 754313 753272 755177 755742 753297 754828 753442
14746 753442 756236 753440 754861 756934 756838 752845 754682 757353 753632 755398 755526 754815 755098 754651 756287 756115
14730 756115 761238 754912 757373 760721 758329 759434 757793 755083 757438 758615 757492 758549 757565 753862
14716 753862 754894 756507 756946 758573 757573 760002 762683 758606 756631 761497 759174 759118 759607 756348 760976
14701 760976 758822 760660 759700 760187 759630 761095 758907 759881 760198 758936 761561 760707 760026 760712 759683 758923
14685 758923 758705 757848 759970 760237 762328 759225 758715 759811 759626 759451 762111 760136 761378 760134 757641 761756
14669 761756 760545 762845 763770 763033 758906 758746 764335 761742 763588 761912 761744 764116 766288 763223 762806
14654 762806 763114 765179 763250 763052 763385 762536 765314 761491 764043 762139 760498 763753 764772 764105 764674 764530
14638 764530 766188 763965 766894 766060 762335 763572 763516 765655 763061 759946 765158 763561 764566 767732 763560
14623 763560 766830 767410 765192 765619 768711 767801 766537 765280 766240 765279 767019 763714 764439 767244 768170 767287
14607 767287 768923 767478 769341 768310 767686 767076 767992 769589 768425 767675 769456 767276 767605 765770 765537 769632
14591 769632 762493 764868 767087 770544 769492 766668 771784 767028 770012 771222 768673 770456 771346 768939
14577 768939 767586 769299 768036 768497 772310 768986 767827 768332 767958 769139 769176 771102 769109 772307 769543
14562 769543 770783 770405 770377 771591 770592 771460 771385 768426 773685 770658 772443 770051 769600 771836 770690 772776
14546 772776 774108 770886 775173 771479 771934 768882 772422 772111 776909 771325 772962 771780 774099 774146 772870
14531 772870 773289 771022 772315 773207 772869 771135 772802 772868 772369 770152 774459 772639 776661 773273 775243 773016
14515 773016 772806 775484 772191 774119 773578 774407 772241 773297 772380 772708 774577 774004 773282 776314 775756 778048
14499 778048 773179 774626 774865 776371 774612 774365 774073 771479 773179 774566 774407 773842 774368 775096 777093 780003
14483 780003 777646 777527 779343 776476 778014 777743 778118 777702 776369 779888 777360 775535 776362 773882 776788
14468 776788 779398 776245 775910 780610 777398 778027 781396 779721 781595 777979 779830 775530 778391 780962 778103
14453 778103 778124 777756 776543 776887 779180 777966 781511 781093 781752 781509 780385 777113 778251 781498 781527 779346
14437 779346 781392 779115 775031 777883 777955 778717 780254 778561 779815 779884 782628 782878 783661 782555 780895 778709
14421 778709 782066 779810 779900 782287 782587 778165 780139 781574 783547 783962 781705 781604 779944 783973 787219
14406 787219 784283 785532 785043 784000 781449 782508 783809 780985 781057 782172 784984 784153 783962 783885 781741 785415
14390 785415 786864 786341 784365 786077 784791 783464 783764 783576 780712 782660 783872 781569 786492 784278 783901
14375 783901 784000 783327 784372 788283 786043 786762 788761 784904 785175 787326 783124 783579 783354 785765 781592 787710
14359 787710 782498 783601 789945 783433 789318 788482 788821 785337 788906 789077 792301 787355 788976 787505 785765
14344 785765 790021 788243 785074 785875 787553 786846 789565 789077 788000 789039 791313 791258 791169 791144 788370 788934 788271
14327 788271 789420 788950 788619 785796 786783 787456 787907 786793 789635 789865 790466 788135 792070 791453 790496 789893 789019
14310 789019 789566 788386 787385 789860 785363 786962 786820 790890 789482 789286 789630 792717 790997 792904 791830
14295 791830 794802 793652 792531 794789 790419 793075 791186 791141 792950 790931 791395 791987 792329 790701 794104
14280 794104 792971 797003 792525 796963 792517 793688 793149 795583 794132 791004 794434 792994 795071 793386
14266 793386 791961 791550 796696 793679 795263 796792 797184 797801 794709 795711 795244 794141 793697 793022 792752 794664
14250 794664 794159 792967 793712 795099 795343 796714 792862 794670 795618 797667 793475 797242 798735 793756 796812
14235 796812 795601 796531 795399 792675 794754 795890 795781 796729 795719 799694 796601 798454 796903 797144 796155
14220 796155 796675 798303 798081 794349 797887 797458 797962 796866 799364 798456 798483 802930 797959 797528 799394 799897
14204 799897 801022 800155 799855 799716 799586 802257 801898 803100 798456 800562 803020 800927 799980 799306 802875 802347
14188 802347 799690 800995 803313 801728 804428 799986 802682 801357 801591 801648 803057 799538 802452 800882 801053
14173 801053 802637 803058 802601 801028 800743 800802 797147 801783 798252 800141 805450 800607 805119 803279 802797 805111
14157 805111 803757 799585 799456 801555 801421 803643 801642 804720 804393 802168 803538 804518 804367 806241 802887
14142 802887 805765 803837 805043 805290 806223 806237 805518 806470 807011 803471 805211 806727 803503 801832 805808 805137
14126 805137 804298 805885 808964 806429 805562 804366 808225 806629 805551 807424 806200 809231 807571 805363 806336
14111 806336 804859 806673 806191 805675 804941 806450 808456 807592 807355 807303 808600 805574 808215 809418 807001 805577
14095 805577 807390 809506 808859 811406 807289 807445 807585 811130 809583 809910 808942 809783 809551 812500 811993 810681
14079 810681 813366 808970 807020 808084 807100 810125 809225 812329 811457 810971 807459 809988 811994 809247 812171
14064 812171 810977 812289 811388 808099 810593 813675 812457 813378 812859 810087 812884 811476 813700 814741 813834
14049 813834 813610 809718 812156 810779 815735 811472 812815 810131 814971 813338 812127 814668 814829 814899 814193
14034 814193 811694 813226 813683 814136 814528 815004 813531 817506 812914 815831 816873 815079 816509 814393 815229
14019 815229 814345 814499 813696 816512 817239 814889 814848 814586 816878 816735 816016 815977 815147 818445 819034 816560 816704 816726
14001 816726 819896 816014 816326 817049 818666 816490 814770 816419 817397 815476 818317 818353 817666 817395 817007 816762
13985 816762 818647 820334 818236 817346 817473 818401 816805 818279 819618 818145 818376 818916 818786 818914 818416 820496
13969 820496 819744 820662 820245 823859 819966 821369 817171 821131 820395 821371 819323 821626 822555 820178 821178 820757
13953 820757 822430 822064 822394 821618 823417 822069 822351 821832 823981 820495 820634 823789 823588 818983 826122 821521
13937 821521 824169 824080 820328 822698 820776 823081 820762 824142 821543 819678 823910 822358 822345 823928 823124
13922 823124 822544 823525 820907 823254 824675 824928 823894 824796 825089 822964 825576 823078 825273 826809 826435 823182
13906 823182 825038 823891 824706 824530 826313 823393 826615 825648 823353 824685 823196 825474 825542 825072 825622 825773
13890 825773 827102 826841 824374 826743 826909 828939 828061 826624 825556 826394 823175 829195 825217 825354 826039 824579
13874 824579 825849 830960 828994 829031 829754 829245 830591 832360 830306 829482 829748 829726 826601 826625 828729 826610 829574
13857 829574 825553 829133 827518 828940 830893 827844 832598 832141 832774 831006 831216 828645 829359 833066 831313
13842 831313 833315 828304 829842 827533 831611 829397 826816 828871 830347 830421 831696 831360 834438 831758 831153
13827 831153 832646 831322 831493 829678 830341 831441 830800 828501 830483 829741 830398 834530 834796 836318 831729 836729
13811 836729 834660 837119 836588 834263 836658 838304 834915 832268 831982 834599 833379 836350 835318 833809 833434
13796 833434 834128 836602 838826 836215 840529 840165 837883 837950 837532 837320 835404 834592 834953 835063 834527 833487 835587
13779 835587 834029 836325 835014 839209 839791 841253 838770 838490 839732 839819 837177 836339 837231 836676 834922 834641
13763 834641 835553 837319 837591 837428 840319 838211 839868 843655 840804 841769 840733 841722 841943 840186 839412 841623
13747 841623 836606 837424 840327 836133 838993 840593 842656 841455 840855 841243 842974 841819 845114 843299 842146
13732 842146 841083 841701 840209 835674 839431 839100 840004 841737 838961 840445 840563 842702 841417 843378 841407
13717 841407 843170 846303 844410 841968 843270 841077 843722 839762 841621 841659 841536 843236 843130 845149 847739
13702 847739 843700 843566 849054 844528 847366 846362 843009 847126 847256 844131 842193 843433 846729 848094 844349
13687 844349 846091 844864 845342 848629 847102 847302 847313 850195 845838 849250 847409 848237 844832 846850 846432 843557
13671 843557 842216 847476 846825 846165 846615 848957 848845 846972 848602 847909 848297 847572 847504 849444 846168 848817
13655 848817 846492 849000 849632 846488 846631 848239 847156 850170 850496 849681 847302 851350 850514 852840 848641
13640 848641 849019 848234 847438 850578 851666 850064 850900 849260 851906 851378 851794 852862 849227 852194 856460 852069
13624 852069 848124 851807 856662 855482 854669 850819 854220 854181 853329 852536 849514 853761 857220 853519 851875
13609 851875 858161 853979 853514 854445 852537 853693 856728 852640 853760 851785 853292 854089 852873 854075 853753
13594 853753 856515 854032 853604 854652 855147 855313 856022 854504 854535 858079 856596 857582 853237 854631 854836 856397
13578 856397 851953 856591 857269 854420 857451 854830 857548 857815 854726 856549 856797 857464 858047 857539 858235 855764
13562 855764 857186 857522 857503 856532 854937 858104 859864 860190 854921 857679 857374 857753 858595 856212 858956 858471
13546 858471 859616 858243 855293 857507 859722 857951 859024 857302 858972 860694 858937 856419 859756 856699
13532 856699 860239 860647 863137 861473 862352 861721 859637 859639 857179 861492 859809 861904 860764 857624 858259 858862
13516 858862 858459 860132 861537 861964 861190 859085 861932 861220 861122 861711 864072 863103 861794 862868 862798 862201 861455
13499 861455 860657 865371 861780 864456 863435 863675 863270 862939 862154 865367 866318 863479 866485 865135 866596 863146
13483 863146 867012 866821 864594 867658 866505 865373 864363 867696 864060 863212 864018 866259 865142 867809 864927
13468 864927 865082 868172 868181 869601 867839 866226 864312 864680 866642 865689 866296 863948 867725 866862 864853 867417
13452 867417 868937 870269 869293 865582 867997 865338 870350 869312 865091 869091 867527 870160 868510 869969
13438 869969 870027 867107 868416 870738 870811 870094 871111 870354 869278 871198 870819 870659 872352 870731 870115 870934 872000
13421 872000 869539 870951 871673 871694 874110 870300 867813 871524 876389 874094 871250 870826 870491 874246 869900
13406 869900 875222 873290 872584 873260 874641 874526 872672 873580 874215 873547 871974 870429 871296 874846 871261 873911
13390 873911 872992 873540 872635 873973 873674 874871 876577 874105 879447 873065 875212 875749 874494 875316 875748 876905
13374 876905 877482 878982 874900 875352 874056 874184 876627 879414 878078 879121 874969 879364 877739 874984 877218
13359 877218 877649 876252 874521 878079 878252 876870 880242 876114 880053 879999 876976 878446 878108 879391 878699 876120
13343 876120 877808 877802 877199 878865 878746 877517 875848 877914 876013 878901 877928 876686 881070 879228 877177 882319
13327 882319 879817 879290 879194 882156 882030 877057 880210 877459 878779 882178 878973 881400 880250 883887 881464
13312 881464 883741 882299 885193 882301 883717 880886 881871 882200 881041 882718 881240 881810 880243 882453 884173
13297 884173 882137 882666 882469 882980 883775 883619 884014 883874 884709 883949 883235 883448 883513 884636 880428 885336 883530
13280 883530 887306 886131 882989 884500 885358 885586 887585 883599 885805 885801 886903 885526 884084 887364 885138
13265 885138 886596 887351 885893 882628 887238 885176 888732 887724 886530 887949 886847 889207 890710 891554 888190
13250 888190 889062 886546 886111 887862 889809 888493 889686 886718 889732 888146 885861 886704 887309 889799 887579
13235 887579 889210 888039 887985 889381 889375 888997 890470 887401 889007 887805 890580 890092 888918 888972 891463 890775 889422
13218 889422 889756 890792 897311 896231 894580 891019 893153 892885 894738 891334 891404 891532 890838 891437 889628 893026
13202 893026 892296 891919 891533 891154 894052 894938 893689 892850 894484 894323 893830 891664 895522 891553 892034 892098 891548
13185 891548 894117 893209 892392 892942 893323 894306 894672 895078 895001 898852 897254 895271 895913 897815 895775 897936 897100
13168 897100 895238 896898 897128 895765 898199 898342 897620 897394 899045 899929 901563 901644 901853 897504 899143 900689
$$ [...]
##END NTUPLES=NMR SPECTRUM
##END=
