##TITLE=abcd
##JCAMPDX= 6.0         $$ Bruker NMR JCAMP-DX V2.0
##DATA TYPE= NMR SPECTRUM
##DATA CLASS= NTUPLES
##ORIGIN= UXNMR, Bruker Analytische Messtechnik GmbH
##OWNER= root
$$ XWIN-NMR		Version 3.5
$$ Tue Jul 22 16:22:53 2025 Russian Standard Time (UT+4h)  servis@DPX200
##.OBSERVE FREQUENCY= 200.131235884673
##.OBSERVE NUCLEUS= ^1H
##.ACQUISITION MODE= SIMULTANEOUS
##.ACQUISITION SCHEME= undefined
##.AVERAGES= 32
##.DIGITISER RES= 18
##SPECTROMETER/DATA SYSTEM= spect
##.PULSE SEQUENCE= zg
##.SOLVENT NAME= CDCl3
##.SHIFT REFERENCE= (INTERNAL, CDCl3, 0, 16.4885)
##AUDIT TRAIL= $$ (NUMBER, WHEN, WHO, WHERE, WHAT)
$$ ##TITLE= Audit trail, XWIN-NMR		Version 3.5
$$ ##JCAMPDX= 5.01
$$ ##ORIGIN= Bruker BioSpin GmbH
$$ ##OWNER= servis
$$ F:\spectra/data/av/nmr/H1/1/pdata/1/auditp.txt
$$ ##AUDIT TRAIL=  $$ (NUMBER, WHEN, WHO, WHERE, WHAT)
(   1,<2025-07-22 16:20:44.00 +0400>,<servis>,<DPX200>,
      <created by zg, POWCHK disabled, PULCHK disabled
       configuration hash MD5:
       00 E9 B6 7A A2 85 ED C7 34 08 36 98 17 FE 4E 26
       data hash MD5: 32K
       55 EA 11 3C 81 78 2A C0 5F 46 32 F5 BE 80 C6 EB>)
(   2,<2025-07-22 16:20:45.64 +0400>,<servis>,<DPX200>,
      <Start of raw data processing
       efp BC_mod = 2 LB = 0.05 FT_mod = 6 PKNL = 1 PHC0 = -275.1915 PHC1 = 4.101552 SI = 16K 
       data hash MD5: 16K
       F1 AA 74 AE EA D5 92 BC 74 6B E7 F4 CC AF 61 90>)
$$ ##END=
$$ 
$$ hash MD5
$$ 58 7E 49 80 C9 16 7B 3A 97 B4 77 BA 82 61 FD B5
##$RELAX= 
##$RELAX= 
##$RELAX= 
##$RELAX= 
##$RELAX= 
##$RELAX= 
##$RELAX= 
##$RELAX= 
$$ Bruker specific parameters
$$ --------------------------
##$DU= <F:\spectra>
##$EXPNO= 1
##$NAME= <H1>
##$PROCNO= 1
##$TYPE= <nmr>
##$USER= <av>
##$AMP= (0..31)
100 100 100 100 100 100 100 100 100 100 100 100 100 100 100 100 100 100 
100 100 100 100 100 100 100 100 100 100 100 100 100 100 
##$AQSEQ= 0
##$AQ_mod= 1
##$AUNM= <au_zg>
##$AUTOPOS= <>
##$BF1= 200.13
##$BF2= 200.13
##$BF3= 200.13
##$BF4= 200.13
##$BF5= 500.13
##$BF6= 500.13
##$BF7= 500.13
##$BF8= 500.13
##$BYTORDA= 1
##$CFDGTYP= 0
##$CFRGTYP= 5
##$CHEMSTR= <none>
##$CNST= (0..31)
1 1 145 1 1 1 1 1 1 1 1 1 1 1 1 1 1 1 1 1 1 1 1 1 1 1 1 1 1 1 1 1 
##$CPDPRG= <>
##$CPDPRG1= <>
##$CPDPRG2= <>
##$CPDPRG3= <>
##$CPDPRG4= <mlev>
##$CPDPRG5= <mlev>
##$CPDPRG6= <mlev>
##$CPDPRG7= <mlev>
##$CPDPRG8= <mlev>
##$CPDPRGB= <>
##$CPDPRGT= <>
##$D= (0..31)
0 2 0 0 0 0 0 0 0 0.06 0 0 0 0 0 0 0.0002 0 0 0 0 0 0 0 0 0 0 0 0 0 0 
0 
##$DATE= 1753186843
##$DBL= (0..7)
120 120 120 120 120 120 120 120 
##$DBP= (0..7)
150 150 150 150 150 150 150 150 
##$DBP07= 0
##$DBPNAM0= <>
##$DBPNAM1= <>
##$DBPNAM2= <>
##$DBPNAM3= <>
##$DBPNAM4= <>
##$DBPNAM5= <>
##$DBPNAM6= <>
##$DBPNAM7= <>
##$DBPOAL= (0..7)
0.5 0.5 0.5 0.5 0.5 0.5 0.5 0.5 
##$DBPOFFS= (0..7)
0 0 0 0 0 0 0 0 
##$DE= 6
##$DECBNUC= <off>
##$DECIM= 32
##$DECNUC= <off>
##$DECSTAT= 4
##$DIGMOD= 1
##$DIGTYP= 9
##$DL= (0..7)
0 120 120 120 120 120 120 120 
##$DP= (0..7)
150 150 150 150 150 150 150 150 
##$DP07= 0
##$DPNAME0= <>
$$ [...]
##$SUBNAM4= <"">
##$SUBNAM5= <"">
##$SUBNAM6= <"">
##$SUBNAM7= <"">
##$SUBNAM8= <"">
##$SUBNAM9= <"">
##$SW= 20.6817932712277
##$SWIBOX= (0..15)
0 0 3 0 0 0 0 0 0 0 0 0 0 0 0 0 
##$SW_h= 4139.07284768212
##$TD= 32768
##$TD0= 1
##$TE= 0
##$TE2= 300
##$TE3= 300
##$TEG= 300
##$TL= (0..7)
0 120 120 120 120 120 120 120 
##$TP= (0..7)
150 150 150 150 150 150 150 150 
##$TP07= 0
##$TPNAME0= <>
##$TPNAME1= <>
##$TPNAME2= <>
##$TPNAME3= <>
##$TPNAME4= <>
##$TPNAME5= <>
##$TPNAME6= <>
##$TPNAME7= <>
##$TPOAL= (0..7)
0.5 0.5 0.5 0.5 0.5 0.5 0.5 0.5 
##$TPOFFS= (0..7)
0 0 0 0 0 0 0 0 
##$TUNHIN= 0
##$TUNHOUT= 0
##$TUNXOUT= 0
##$USERA1= <user>
##$USERA2= <user>
##$USERA3= <user>
##$USERA4= <user>
##$USERA5= <user>
##$V9= 5
##$VALIST= <valist>
##$VCLIST= <CCCCCCCCCCCCCCC>
##$VD= 0
##$VDLIST= <DDDDDDDDDDDDDDD>
##$VPLIST= <PPPPPPPPPPPPPPP>
##$VTLIST= <TTTTTTTTTTTTTTT>
##$WBST= 1024
##$WBSW= 30
##$XGAIN= (0..3)
0 0 0 0 
##$XL= 0
##$YL= 0
##$YMAX_a= 428258
##$YMIN_a= -333425
##$ZGOPTNS= <>
##$ZL1= 120
##$ZL2= 120
##$ZL3= 120
##$ZL4= 120
##$ABSF1= 0
##$ABSF2= 0
##$ABSG= 0
##$ABSL= 0
##$ALPHA= 0
##$AQORDER= 0
##$ASSFAC= 0
##$ASSFACI= 0
##$ASSFACX= 0
##$ASSWID= 0
##$AUNMP= <proc_1d>
##$AZFE= 0.1
##$AZFW= 0.1
##$BCFW= 0
##$BC_mod= 2
##$BYTORDP= 0
##$COROFFS= 0
##$CY= 18.4799938201904
##$DATMOD= 1
##$DC= 0
##$DFILT= <>
##$DTYPP= 0
##$F1P= 9.9274215381318
##$F2P= -0.165520771350173
##$FCOR= 1
##$FTSIZE= 16384
##$FT_mod= 6
##$GAMMA= 0
##$GB= 0
##$INTBC= 1
##$INTSCL= 4.127829e-11
##$ISEN= 128
##$LB= 0.05
##$LEV0= 0
##$LPBIN= 0
##$MAXI= 10000
##$MC2= 0
##$MEAN= 0
##$ME_mod= 0
##$MI= 50
##$NCOEF= 0
##$NC_proc= -7
##$NLEV= 6
##$NOISF1= 3.799351
##$NOISF2= 2.8
##$NSP= 0
##$NTH_PI= 0
##$NZP= 0
##$OFFSET= 16.48848
##$PC= 4
##$PHC0= -275.1915
##$PHC1= 4.101552
##$PH_mod= 1
##$PKNL= yes
##$PPARMOD= 0
##$PSCAL= 4
##$PSIGN= 0
##$REVERSE= no
##$SF= 200.130005582386
##$SI= 16384
##$SIGF1= 3
##$SIGF2= 2
##$SINO= 400
##$SIOLD= 16384
##$SREGLST= <1H.CDCl3>
##$SSB= 0
##$STSI= 16384
##$STSR= 0
##$SW_p= 4139.07284768211
##$SYMM= 0
##$S_DEV= 0
##$TDeff= 32768
##$TDoff= 0
##$TI= <>
##$TILT= no
##$TM1= 0
##$TM2= 0
##$TOPLEV= 0
##$USERP1= <user>
##$USERP2= <user>
##$USERP3= <user>
##$USERP4= <user>
##$USERP5= <user>
##$WDW= 1
##$XDIM= 16384
##$YMAX_p= 364113917
##$YMIN_p= -1530308
$$ End of Bruker specific parameters
$$ ---------------------------------
##NTUPLES= NMR SPECTRUM
##VAR_NAME=  FREQUENCY,     SPECTRUM/REAL,   SPECTRUM/IMAG
##SYMBOL=    X,             R,               I
##VAR_TYPE=  INDEPENDENT,   DEPENDENT,       DEPENDENT
##VAR_FORM=  AFFN,          ASDF,            ASDF
##VAR_DIM=   16384,         16384,           16384
##UNITS=     HZ,            ARBITRARY UNITS, ARBITRARY UNITS
##FACTOR=    0.252644378177508, 1,           1
##FIRST=     3299.83951724647, 0,            0
##LAST=      -839.233330435636, 0,           0
##MIN=       -839.233330435636, -1530308,    0
##MAX=       3299.83951724647, 364113917,    0
$$ Real data points
##PAGE= N=1
##DATA TABLE= (X++(R..R)), XYDATA
$$ [...]
8798A913269o84862R41143l62901N80253l27310K49711L6614j045174L92175N84791
8788B277709l64388J40424r22051K52201j21951O95544o68889J98792n3701N80606
8778B014296l55708J23180r3162O42350L42n20978l55351Q03337R924r14052L59419
8767A713597P7040o3656Q47894r21266k04673R74322j302676P30082J26522k40738
8757A736448N90879N0778q76218J419096n89584j035257P83038J07663j225566
8748I61277J121326Q1226l95850J95506m32751p58372J251484l0578N22419j609222
8738I06465O80030K48040m22752J35225l74728M65713J11951M72283o08516J76687
8728A790398m11172K3570R18861q51046N40424n92111R6265q5083N12243K50009
$$ plain form
8798 1913269 1228407 2169550 1806649 2386902 2059592 2309303 2345917 1300743 1692918 2277709
8788 2277709 1913321 2053745 1131694 1383895 1261944 1957488 1288599 1487391 1433690 2014296
8778 2014296 1658588 1781768 1688606 2330956 2331298 1810320 1454969 2258306 2268230 1354178 1713597
8767 1713597 1790637 1726981 2574875 1653609 1448936 2423258 1120582 1850664 1977186 1736448
8757 1736448 2327327 2378105 1501887 2920983 2331399 1296142 2079180 2186843 961277
8748 961277 2082603 2163829 1767979 1963485 1530734 772362 2023846 1993268 2515687 906465
8738 906465 1586495 1834535 1411783 1547008 1172280 1637993 1749944 2222227 1613711 1790398
8728 1790398 1379226 1402796 2321657 1470611 2011035 1418924 1515189 1430106 1942349 2192358
8718B192358J32808j003218L82101L39083L91937p71334M64521k46757L29081
8709B210580k83784L08431K63098o31693R3435j53007J82798K96330j30431m2989
8699B112768l41242m3651N68020n98139m21959N08580K39102j94448O42851o22709
8689A849173k4929Q6652j5077N23983r45683O82264l5270k45017J34255K46529
8679B256880L8998J61030n14451O87731m30737K78610j70522j17650M55470K26016
8669B871375M20623l20533k85273K91253J27416j175924M29971m81506M02274
8660B279676Q443K7851k76043j30814K43602M64719q94417N78749J83367L85977
8650B871110n94667l22819m78008M19602P36568p75089Q22893j06801r54638N52878
$$ plain form
8718 2192358 2325166 1321948 1704049 2043132 2435069 1663735 2128256 1881499 2210580
8709 2210580 1926796 2235227 2498325 1866632 1960067 1807060 1989858 2286188 2155757 2112768
8699 2112768 1771526 1727875 2295895 1697756 1275797 1784377 2023479 1829031 2471882 1849173
8689 1849173 1824244 1910896 1895819 2419802 1474119 2156383 2121113 1876096 2010351 2256880
8679 2256880 2295878 2456908 1942457 2630188 2199451 2478061 2307539 2189889 2645359 2871375
8669 2871375 3291998 2971465 2686192 2977445 3104861 1928937 2358908 1877402 2279676
8660 2279676 2288119 2315970 2039927 1909113 2152715 2617434 1723017 2301766 2485133 2871110
8650 2871110 2276443 1953624 1475616 1895218 2631786 1856697 2679590 2572789 1618151 2171029
8640B171029k72444l70573L14225K04562k13549k67472L72085j42384L64242l8331
8630B121390k99537l20451M97463K74374l34806m15241N02195r45393J105133
8621B185127P2329K00621j012485K0408Q94541m67719k21965K35406M82286q62534
8611A526015P2246k86753J024431m25368n60472R44876m14940N53346p52613J64659
8601A845427Q5357o09786M24525N77179m77449m64131J219218j75584n18464P07584
8591B613876o91215j42897J28829l10309J062594q96112J56296N88708m86203
8582B023567K53830o66133M13664n3977L56838q77932k6103M63429l6545J63727
8572B014365R783N36785j378868R57949k86659k08971P07631o35272L7441O053
$$ plain form
8640 2171029 1898585 1528012 1842237 2046799 1833250 1565778 1937863 1795479 2159721 2121390
8630 2121390 1821853 1501402 1998865 2273239 1938433 1523192 2025387 1079994 2185127
8621 2185127 2257456 2458077 1445592 1466000 2360541 1892822 1670857 1906263 2388549 1526015
8611 1526015 1598261 1311508 2335939 1910571 1350099 2294975 1880035 2433381 1680768 1845427
8601 1845427 1930784 1320998 1745523 2322702 1845253 1381122 2600340 2424756 1906292 2613876
8591 2613876 1922661 1779764 1908593 1598284 2660878 1764766 1921062 2509770 2023567
8582 2023567 2277397 1611264 2024928 1970951 2327789 1449857 1423754 1887183 1850638 2014365
8572 2014365 2024148 2560933 1182065 2140014 1853355 1644384 2352015 1716743 1754184 1760237
8562A760237P24765j091280L99599l71975N03028k48926J15869P27290m19235
8553B099372N176k00020K66122l29340L31962k33774J11745j251975R73549R08581
8543B681398q92740O05124m93003N82372k17139p5583N17343n19668M17156m09095
8533B196165L78539J156601l743734J146438R87649r1083o97200J76811M08057
8524A918243j69302M16072L30114p25882N21462l13731J31429J94256l81115L60611
8514B282157K44163l48042m35180K36641N24163j98560o0771k44039P2714J29645
8504B202891l65089N2914P85649j005752K28543J71717m33698P91132l95022o62568
8494A370717K62916N14190n82235J052563o60917n22714J109400p0535m8544k28188
$$ plain form
8562 1760237 2485002 1393722 1793321 1421346 1924374 1675448 1791317 2518607 2099372
8553 2099372 2104548 1904528 2170650 1841310 2173272 1939498 2051243 799268 1772817 2681398
8543 2681398 1788658 2393782 1900779 2483151 2266012 2190429 2707772 2188104 2605260 2196165
8533 2196165 2574704 3731305 -12429 1134009 2121658 2030575 1333375 1510186 1918243
8524 1918243 1748941 2165013 2495127 1769245 2290707 1976976 2108405 2302661 1921546 2282157
8514 2282157 2526320 2178278 1743098 1979739 2503902 2305342 2244571 2000532 2073246 2202891
8504 2202891 1837802 1890716 2676365 1670613 1899156 2070873 1637175 2428307 2033285 1370717
8494 1370717 1633633 2147823 1565588 2618151 1957234 1434520 2543920 2473385 2424841 2196653
8484B196653p49999P78139o54224R81776n19091M57516k40153R3357p2130l0826
8474B241018m37361L55989o56082k99949O48105J97340K4817M50504j00768m33280
8464A990333N4755k38226P14197l07178R35482j263889K28634Q05673o17769o58467
8454A643545M73526l71847O33058k07952L15151J78006p61397J27233l1294M06480
8444B404509m56402N1935Q11033m22756j059803P68266M74018L17599p12209n6311
8434B119879L39946k19730N32309o42844K67459K44526p49645J312251j267371
8425A936780n0761j26954J6452J70294K1410L4085O00086q71134N19496J94751
8415B444505o17459O29927M43168m34690j16322m39795o5663N56180m73276J02578
$$ plain form
8484 2196653 1446654 2224793 1570569 2552345 2033254 2490770 2250617 2343974 2271844 2241018
8474 2241018 1803657 2159646 1503564 1203615 1851720 2049060 2073877 2524381 2423613 1990333
8464 1990333 2045088 1806862 2521059 2213881 3149363 1885474 2114108 2919781 2302012 1643545
8454 1643545 2117071 1745224 2378282 2170330 2485481 2663487 1902090 2029323 1998029 2404509
8444 2404509 1948107 2000042 2811075 2388319 1328516 2096782 2570800 2888399 2176190 2119879
8434 2119879 2459825 2240095 2772404 2129560 2397019 2641545 1891900 3204151 1936780
8425 1936780 1886019 1759065 1775517 1945811 1967221 2001306 2601392 1730258 2249754 2444505
8415 2444505 1827046 2456973 2900141 2465451 2349129 1909334 1843671 2399851 1926575 2029153
8405B029153j48415P00746n77603L60298O65266o79415k34000r4218L80266m57204
8395A944874J78408P86907p63937N01516l52044k14159j43886J144959j307569
8386A775069L60647R66378j90293m64037j57641L11454k62068o1209N33049m35175
8376B376174l95352N82423j65302j0845n28904J258813j211277M48042J83247
8367B537019K51649r10472l1794J119170j77372k34184O22423j345089J4819J02059
8357A948228M48278M99048m14167K1153J19196n93357N35875l28461O65541n42384
8347B358950P53895m87332N47937K22843r96177M6277k9282L1360O8179J74555
8337B691205k62866P869m5655k58319o7388O91349m64769N58718m9869m95005
$$ plain form
8405 2029153 1880738 2581484 2003881 2364179 3029445 2350030 2116030 2021812 2402078 1944874
8395 1944874 2123282 2910189 2146252 2647768 2295724 2081565 1937679 3082638 1775069
8386 1775069 2135716 3102094 2911801 2447764 2290123 2601577 2339509 2278300 2811349 2376174
8376 2376174 1980822 2563245 2397943 2387098 1858194 3117007 1905730 2353772 2537019
8367 2537019 2788668 1878196 1846402 2965572 2788200 2554016 3176439 1831350 1846169 1948228
8357 1948228 2396506 2895554 2481387 2502540 2621736 2028379 2564254 2235793 2901334 2358950
8347 2358950 3112845 2625513 3173450 3396293 2400116 2446393 2417111 2448471 2516650 2691205
8337 2691205 2428339 2436208 2390553 2132234 2064846 2756195 2291426 2850144 2800275 2305270
8327B305270P0694K94283N56758j018796O66054m27537j43758M62917J7142m70948
8317B312079M2813K8277j86292K05414j16254P73646j31447k60622j59850l13712
8307B194052O76311j114629J116438j07791L03504m32874K61785j14892O7029
8298B848933m76396J78718j06363j004686Q21577L64298P05763l75430n0141k21255
8288B685018n01201J342975o76226k09325j29070P0165K75547j62943M14854o0225
8278C049569q08063l5035Q26423m45770M69251j57008j23965k07980p16720K22247
8268B072949P10552m54839K56236M68805j49961k58548l23609P55847J36446l13987
8258B899891m09682K35525L90804l07551J60121L7166j7621n01463L86482M2559
$$ plain form
8327 2305270 2375964 2670247 3227005 2208209 2874263 2446726 2302968 2765885 2783027 2312079
8317 2312079 2354892 2383169 2196877 2402291 2286037 3059683 2928236 2667614 2507764 2194052
8307 2194052 2870363 1755734 2872172 2764381 3067885 2635011 2896796 2781904 2848933
8298 2848933 2372537 2551255 2444892 1440206 2261783 2626081 3331844 2956414 2906273 2685018
8288 2685018 2183817 3526792 2850566 2641241 2512171 2582336 2857883 2694940 3109794 3049569
8278 3049569 2241506 2206471 3032894 2587124 3056375 2899367 2775402 2567422 1850702 2072949
8268 2072949 2783501 2328662 2584898 3053703 2903742 2645194 2321585 3077432 3213878 2899891
8258 2899891 2490209 2725734 3116538 2808987 2969108 3006274 2988653 2487190 2873672 2916231
8248B916231o07572Q13824n71603M22349j943m51881n998l03622L34955J365119
8238C909859j242286j68583J60391k02831j3825j93567p0108N31490Q2439L19614
8228C112593K42291K68003o25969j17073j390843J711256o81798P13028J59151
8219C390639k79631n80710n52753Q10860N76919k22816J53865p9890J54829l49362
8209C021950K99871j054207L17439L95890M9516K6933O64597j628306L46947Q0335
8199B520965Q21273j072728J040851o82445P85693Q4558r69148P80998o54229
8190B655788P2229Q37006o5149q69843O44941l6806j00765j74562K27579j11811
8180C078607j98201N83661o21254J73536N35866J24153j45666n47192M26795J33754
$$ plain form
8248 2916231 2308659 3122483 2550880 2973229 2971286 2519405 2513407 2209785 2544740 3909859
8238 3909859 2667573 2498990 2659381 2456550 2442725 2249158 2179050 2710540 2792979 3112593
8228 3112593 3354884 3622887 2996918 2879845 1489002 3200258 2518460 3231488 3390639
8219 3390639 3111008 2530298 1977545 2788405 3365324 3142508 3296373 3216483 3371312 3021950
8209 3021950 3321821 2267614 2585053 2980943 3030459 3057392 3721989 2093683 2440630 2520965
8199 2520965 3342238 2269510 3310361 2627916 3413609 3498167 2529019 3310017 2655788
8190 2655788 2728017 3565023 3499874 2630031 3274972 3238166 3137401 2962839 3190418 3078607
8180 3078607 2880406 3464067 2842813 3016349 3552215 3676368 3530702 2983510 3410305 3544059
8170C544059n08987Q05438m65903o4821k96177J224554n98589o99750N69894J54492
8160C664210L05359p08448R5584J08806j47626O57350m50800L56373K16681j09067
8150C988422k30863K40805k92642p5025K5966N1375o25285L37183K58160k07143
8140C470953J58417o03210L37008P18869q9362p44543O00196p40693N47259Q9581
8130C744475o69110K18351L63675j042936J007531o90806j7670N21579K13866
8121C648955L78681l77258J73151j84472J55337l6030K73233j518453M56176N33251
8111C502571N40040m39630K21671j226409R07217k19506M25259L48032J85786
8102D245031l80269k22070o50627M39755j63084l02483R76139l60041j69115k44838
$$ plain form
8170 3544059 3035072 3840510 3374607 3309786 3013609 4238163 3639574 2939824 3509718 3664210
8160 3664210 3969569 3261121 3356705 3465511 3317885 3975235 3524435 3880808 4097489 3988422
8150 3988422 3757559 3998364 3705722 3630697 3656663 3708038 3082753 3419936 3678096 3470953
8140 3470953 3629370 3026160 3363168 4082037 3992675 3248132 3848328 3107635 3654894 3744475
8130 3744475 3075365 3293716 3657391 2614455 3621986 2931180 2913510 3435089 3648955
8121 3648955 4027636 3650378 3823529 3639057 3794394 3758364 4031597 2513144 2969320 3502571
8111 3502571 4042611 3602981 3824652 2598243 3505460 3285954 3711213 4059245 4245031
8102 4245031 3864762 3642692 2992065 3431820 3268736 2966253 3942392 3582351 3413236 3168398
8092C168398L49225L32246l89723L30925l25634P7705K74488R6204k72516L9388
8082C680706m04468k6658k16723O55110M31737n04669K31545J54635n83787N35153
8072C952581k41145O89253o42549o33299O65880n05765J26738p2921j5464O16500
8062C939809k22693o58086O83618R3061q2270m79688J528286n17802n37105N81131
8052D328261l59164n723j564J91488k32217p19832J101287k1080l16158k96440
8042C668858N02236k83957n1879K70790O18892K56256p98122l71194O84104l25450
8032D170534Q7012O32614l07443R0893o03829L4904l22658j58359n5951K76729
8022C844446Q5208Q1729L2158P9516Q07730q06873L22329k37397l01922n41901
$$ plain form
8092 3168398 3517623 3849869 3460146 3791071 3465437 3543142 3817630 3913834 3641318 3680706
8082 3680706 3276238 3249580 3032857 3687967 4119704 3615035 3846580 4001215 3417428 3952581
8072 3952581 3711436 4400689 3758140 3124841 3790721 3284956 3411694 3338773 3323309 3939809
8062 3939809 3717116 3059030 3742648 3835709 3753439 3273751 4802037 4284235 3747130 4328261
8052 4328261 3969097 3963374 3961810 4153298 3921081 3201249 4302536 4281456 3965298 3668858
8042 3668858 4171094 3887137 3835258 4106048 4724940 4981196 4183074 3811880 4495984 4170534
8032 4170534 4257546 4890160 4582717 4673610 4069781 4104685 3782027 3623668 3567717 3844446
8022 3844446 3929654 4011383 4043541 4123057 4930787 4123914 4446243 4208846 3906924 3365023
8012C365023P20680P8606L80641r87898P75491m20933K52930j14783l86497P86103
8002D449363o16304K63885o69507J106218j33390k37822k84264O24582j040635
7993C462126O57169k49362J72732M93111o25239j35137j65776l36728R20557M65827
7983D659280o03712K76251l6171m24702j85956j80038R06909l58519Q9143R32124
7973E074609l35041p44101N4596O6948l94509P59806o75353J63442k50236N11180
7963D231341O5080l37691L21828k41195Q29079l47313j21656k65790L91154q9471
7953D435366k94341J1244j34895l1011J053137m16514l36105l92395N67284k75708
7943D186062J6541K83779j451779J125310j55450K27822K36601k97m23804j30049
$$ plain form
8012 3365023 4085703 4164309 4544950 3557052 4332543 3911610 4164540 4049757 3663260 4449363
8002 4449363 3833059 4096944 3427437 4533655 4400265 4162443 3878179 4502761 3462126
7993 3462126 4119295 3869933 4042665 4535776 3910537 3775400 3609624 3272896 4193453 4659280
7983 4659280 4055568 4331819 4295648 3870946 3684990 3504952 4411861 4053342 4142485 5074609
7973 5074609 4739568 3995467 4050063 4117011 3722502 4482308 3806955 3970397 3720161 4231341
7963 4231341 4296421 3958730 4280558 4039363 4868442 4521129 4399473 4133683 4524837 4435366
7953 4435366 4141025 4152269 4017374 3986363 5039500 4622986 4286881 3894486 4461770 4186062
7943 4186062 4202603 4486382 3034603 4159913 4004463 4232285 4468886 4468589 4044785 3914736
7933C914736M44571j59052J45625N08877r05746J078906p83451m10911O05376
7924D438931r27030P33640O24766L3554J69126j308699O67258l79677O64483l28436
7914D387916k75089L46914Q8798l71157N27843L04242r96035J019616j410153
7905C622895Q72839n77889O5556O41342K37719K35718k64774j008503N96956j43811
7895D278048N96429l69241j44557L96733j75094L64418m04742n90261K98690N99729
7885D850152J5681o53093N67655m3459j61185P14755q04222n73448J077900j82697
7875D808039l82693L78684K75560j075186K41854P19061o01225M27566k55915
7866D535745j43545Q77491o70968K54069j5577l36286n11194M89742k53880Q60859
$$ plain form
7933 3914736 4359307 4200255 4345880 4854757 3949011 5027917 4244466 3833555 4438931
7924 4438931 3511901 4245541 4870307 4903861 5072987 3764288 4431546 4051869 4716352 4387916
7914 4387916 4112827 4459741 4548539 4177382 4705225 5009467 4013432 5033048 3622895
7905 3622895 4495734 3917845 3983401 4624743 4862462 5098180 4833406 3824903 4421859 4278048
7895 4278048 4874477 4505236 4360679 4757412 4582318 4946736 4541994 3951733 4250423 4850152
7885 4850152 4865833 4212740 4780395 4736936 4575751 5290506 4486284 3912836 4990736 4808039
7875 4808039 4425346 4804030 5079590 4004404 4246258 4965319 4364094 4791660 4535745
7866 4535745 4392200 5269691 4598723 4852792 4837215 4500929 3989735 4479477 4225597 5086456
7856E086456R3599n35282L43891J749275j664003m96633N50225n51359N55561
7847E131730k80514M91947j339443P89544J18851o6613Q56799q06053j87992N5152
7837D763408N30197k8019o49709M18832m66297K55698M47917R0691l00963r4462
7827D967293m15517R424L13749O63197l28185k46463N99135j102277J232175l4433
7817E658098p01400N2889l64329P6262M54634o33700O33980k48869J41155J095381
7807F164101r78120M37435m56119J46933r60635N32126J165960k78546k07978
7798E565157K92211m07975O6205m01713l93743P94542l21790n39463J178883m91988
7788E340326P20238k36468m07634O253K11565J48618k25206j287819J356860p0372
$$ plain form
7856 5086456 5180055 4644773 4988664 6737939 5073936 4577303 5127528 4576169 5131730
7847 5131730 4851216 5343163 4003720 4793264 4912115 4845502 5702301 4896248 4708256 4763408
7837 4763408 5293605 5265586 4615877 5034709 4568412 4824110 5272027 5362718 5061755 4967293
7827 4967293 4551776 4561200 4874949 5538146 5209961 4963498 5562633 4460356 5692531 5658098
7817 5658098 4956698 5009587 4645258 4721520 5176154 4542454 5176434 4927565 5068720 6164101
7807 6164101 5185981 5623416 5167297 5314230 4353595 4885721 6051681 5773135 5565157
7798 5565157 5857368 5449393 5515598 5113885 4720142 5514684 5192894 4653431 5832314 5340326
7788 5340326 6060564 5824096 5416462 5422715 5634280 5782898 5557692 4269873 5626733 5556361
7778E556361R58224r37403r38408J375184m45533M53789L5046j204516J000124
7769E852868m13040j75989l84420J88931k27582O77498M35420k88505l04935k10304
7759E149942J028800j98385j15636j47817n37701j11782Q5236M72386K05405o54830
7749E175618L6059K81712J00223Q40136p59453q5635J8059J53166J9794m94158
7739E285521L28119L80015r65451O65194L37536j42392q00724R68306L76817m69934
7729E963007J08185R3689j62889m55625l6139R63473l03650J67720p52818J58089
7719E743042J94738O32018q14760L76707m09378Q64555j164665O41599j8055L52717
7709F398518p41373R03177p50036M6935K29877n25325Q69029o15253n46298P73248
$$ plain form
7778 5556361 6514585 5577182 4638774 6013958 5568425 6022214 6057260 4852744 5852868
7769 5852868 5439828 5263839 4879419 5068350 4840768 5518266 5953686 5665181 5360246 5149942
7759 5149942 6178742 5980357 5864721 5716904 5179203 5067421 5152657 5625043 5830448 5175618
7749 5175618 5211677 5493389 5593612 6433748 5674295 5588660 5606719 5759885 5779679 5285521
7739 5285521 5613640 5993655 5028204 5693398 6030934 5888542 5087818 6056124 6432941 5963007
7729 5963007 6071192 6164881 6001992 5546367 5510228 6473701 6170051 6337771 5584953 5743042
7719 5743042 5937780 6569798 5755038 6131745 5722367 6586922 5422257 6063856 6045801 6398518
7709 6398518 5657145 6560322 5810286 5857221 6087098 5561773 6430802 5815549 5269251 6042499
7699F042499P72985r33853P07557m91538J57066n8756n03601N49141p35961n1260
7689E454279M09361Q46553n15238M0987p44873P84865n18363O1138N36885k3637
7679F331957k56831N12105o21153J50808O15834L7454l26026j49123K58969n89579
7669E964415K96006J08678J21882l76566P20233k77848L9891J88377j033713M13552
7659F164907K35268Q36268k08238p3008O03914j017247m73708P91009m63366L36167
7649F731966l19702Q65201k09457n06733J14681R49535j294819J043818p00696
7640F673794K85039J15350l86131j21335j37716K98287J93138n00503M45073n35497
7630F329499N99028K1114j42728M87503k91236n15069R1436L63139k50564l82267
$$ plain form
7699 6042499 6815484 5881631 6589188 6097650 6254716 6195960 5692359 6241500 5505539 5454279
7689 5454279 5863640 6710193 6194955 6235942 5491069 6275934 5757571 5818709 6355594 6331957
7679 6331957 6075126 6587231 5966078 6116886 6732720 6770174 6444148 6295025 6553994 5964415
7669 5964415 6260421 6369099 6490981 6114415 6834648 6556800 6596691 6785068 5751355 6164907
7659 6164907 6400175 7236443 7028205 6955197 7559111 6541864 6068156 6859165 6395799 6731966
7649 6731966 6412264 7277465 7068008 6561275 6675956 7625491 6330672 7374490 6673794
7640 6673794 6958833 7074183 6688052 6566717 6429001 6727288 6920426 6419923 6864996 6329499
7630 6329499 6928527 6949641 6806913 7294416 7003180 6488111 6579547 6942686 6692122 6309855
7620F309855J027523r05703J155849p35021K45233j88856K44363J70089l4985
7611G288347l35091L74781k80073L77408k14248J694K62007p099J4857k41221
7601G241362J21829M96594j288805J382838j61620o09288M83437l1603O53578
7592H288322r30041q6324k56681J103014j336934P1072R83882j19244J7660n8987
7582G675739P82051j646487Q19483k72631o07537J230894L79574n24310l36428
7573G500348M94660k58332l99974L15036j48166M62017M52092m6492m31464o8930
7563G870795l9788O6135M1327k10926O40539m8908j069547O79706M01978o46148
7553G685163Q90101k08650l14666K62590Q5609k44997o50793J52493K80554L92344
$$ plain form
7620 6309855 7337378 6431675 7587524 6852503 7097736 6908880 7153243 7323332 7288347
7611 7288347 6953256 7328037 7047964 7425372 7211124 7212818 7474825 7467726 7482583 7241362
7601 7241362 7363191 7859785 6570980 7953818 7792198 7182910 7666347 7634744 8288322
7592 8288322 7358281 7271957 7015276 8118290 6781356 6852428 7836310 7717066 7734726 7675739
7582 7675739 8457790 6811303 7630786 7358155 6750618 7981512 8361086 7836776 7500348
7573 7500348 7995008 7736676 7336702 7651738 7503572 7965589 8417681 8371189 7939725 7870795
7563 7870795 7831007 7897142 7938469 7727543 8368082 8319174 7249627 7929333 8331311 7685163
7553 7685163 8575264 8366614 8051948 8314538 8400147 8155150 7504357 7656850 7937404 8329748
7543H329748K1191k5128l17770n6929l54378O80365j83546K09689K59913m41366
7533H121789N71943q58403P92717j630701J884119n55196J69023m79006J228073
7524I244358m39831j206688O97881m07925P47411m19052J24332l58697J004807
7515H986596p2055j051852M49081j90867J164150j809080Q64610P1894M63981
7506H876458O57922j028771M68081n71310Q89504o28845M82918n71635M45562
7497I019884K99400p41333m1509K43811l68245q8510J327482n79259J2792k99030
7487H785483M83172q32886L21751o18419M28088K79614M36710o65498k0465O10219
7477I207769l18004l31189J034959q44009M45952M9202J96544o66748K51155m48655
$$ plain form
7543 8329748 8350939 8325811 8008041 7951112 7596734 8277099 8093553 8303242 8563155 8121789
7533 8121789 8693732 7835329 8628046 6997345 8881464 8326268 8495291 8016285 9244358
7524 9244358 8804527 7597839 8295720 7887795 8635206 8216154 8340486 7981789 8986596
7515 8986596 8914541 7862689 8311770 8120903 9285053 7475973 8340583 8412477 8876458
7506 8876458 9534380 8505609 8973690 8402380 9291884 8663039 9145957 8574322 9019884
7497 9019884 9319284 8577951 8536442 8780253 8412008 8323498 9650980 9071721 9084513 8785483
7487 8785483 9268655 8435769 8757520 8139101 8567189 8846803 9283513 8618015 8597550 9207769
7477 9207769 8889765 8558576 9593535 8749526 9195478 9244680 9441224 8774476 9025631 8576976
7467H576976M26038O45739r67n95515Q76648j144329r8113N10949R6815O45230
7457I939471r85008p8210j21415l75898J113760o16156J82938M61018N46193n33594
7447I533099K43744n8769p47108r6328O31006O20895p72q2321K89772j058113
7437I275105L58051J14175J71873n66809R0036k9418R82996n83863o7006k38589
7427I506551P40337k58694j38977q3199k80702K81576J99177n46191K75786P11692
7417A0407356j5814j4116o74042J122837j653636J260217j33847J69495j302335
7408I166115P49935L82730Q94740p88389p19541j82741J489958p61689M09098
7399A0640216m29807K15964j76796R7903m48745L5796P21688l20473q70049J345099
$$ plain form
7467 8576976 9003014 9648753 9647786 9052271 9928919 8784590 8686477 9197426 9294241 9939471
7457 9939471 8954463 8876253 8754838 8378940 9492700 8876544 9059482 9520500 10066693 9533099
7447 9533099 9776843 9718074 8970966 8874638 9505644 10126539 10125767 10043446 10333218 9275105
7437 9275105 9633156 9747331 9919204 9352395 9442431 9413013 10396009 9812146 9745140 9506551
7427 9506551 10246888 9988194 9849217 9766018 9485316 9766892 9966069 9419878 9695664 10407356
7417 10407356 10391542 10377426 9703384 10826221 9172585 10432802 10298955 10468450 9166115
7408 9166115 9916050 10298780 11193520 10405131 9685590 9502849 10992807 10231118 10640216
7399 10640216 10210409 10426373 10249577 10347480 9898735 9934531 10656219 10335746 9465697 10810796
7389A0810796n35433l44441L1019P28120R7075L81194j053508L18671J004828
7380A1438321j065373R44416n57960O9391n5145M51943m05848L29340j08494k84933
7370A0755658l0043n4679K12839R3642o89056P57179K45139j43446l09532M134
7360A0841835K90882R3561r12059k8822Q66206j23090O58470r78214k4823L20396
7350A1004342M38017J02360l18785n9728o5506L57929k49549j9964J12798L75411
7340A1677325q8105L92553q15854J12745K36265O7465J93455p93137K67234Q54538
7330A2104484J01796o67469N40594p03687J67299L73848l95437M47436m03316
7321A1565548O037m7959K78109l04759p2487q92689J482803K70665m87717l76459
$$ plain form
7389 10810796 10275363 9930922 9961941 10690061 10787136 11168330 10114822 10433493 11438321
7380 11438321 10372948 11317364 10759404 10828795 10773650 11225593 10819745 11149085 11040591 10755658
7370 10755658 10725615 10670936 10883775 10977417 10288361 11045540 11290679 11147233 10837701 10841835
7360 10841835 11132717 11226278 10314219 10285397 11151603 11028513 11686983 10708769 10683946 11004342
7350 11004342 11442359 11544719 11225934 11166206 11100700 11458629 11209080 11189116 11301914 11677325
7340 11677325 11589220 11981773 11165919 11278664 11514929 11582394 11775849 10982712 11249946 12104484
7330 12104484 12206280 11538811 12079405 11375718 11543017 11916865 11521428 11968864 11565548
7321 11565548 11571585 11523626 11801735 11496976 11424489 10531800 12014603 12285268 11797551 11421092
7311A1421092N85972o63675K0387J78806K85926P15154j148313Q32104r0233j1333
7301A2125887k26718J39926K51970N53610j236719P98732J48430J94202o02708
7292A2146612k40714K04994R7761j88150M22185j86475k73981j86379Q00726L9925
7282A2636504j23733k60846K90578P5059l78670L13251K2515k44790p54761J481091
7272A3056198k76821L37817j28368p29209M50017K26959m53383L03870J71636
7263A2958716M42287j062702L75410L51396m40731M71247L4376L75547L13465
7254A3819011r07176K50588p78102Q09006k65938J64966J66765L35272O1123n8607
7244A3596908k5701o29766N36539p64822J70465P39169j93820l06798m78150N83013
$$ plain form
7311 11421092 12007064 11343389 11363776 11542582 11828508 12543662 11395349 12227453 12137220 12125887
7301 12125887 11899169 12039095 12291065 12844675 11607956 12406688 12555118 12749320 12146612
7292 12146612 11905898 12110892 12208653 12020503 12442688 12256213 11982232 11795853 12596579 12636504
7282 12636504 12512771 12251925 12542503 12617562 12238892 12552143 12574658 12329868 11575107 13056198
7272 13056198 12779377 13117194 12988826 12259617 12709634 12936593 12483210 12787080 12958716
7263 12958716 13401003 12338301 12713711 13065107 12624376 13095623 13129999 13505546 13819011
7254 13819011 12911835 13162423 12384321 13193327 12927389 13092355 13259120 13594392 13655515 13596908
7244 13596908 13571207 12941441 13477980 12713158 12883623 13622792 13428972 13122174 12644024 13227037
7234A3227037j79599J99357O09292l02376l46126M70861k71253q70047J459798
7225A3996944Q0743K75545j020984Q7331K86690K99526N37496r96381O20358l03345
7215A3863923j204149J298941R3023m88945L48257M71536p07913N13964K75536
7206A4464173j299191L52568P76532k62356l99308P3919l78830Q93997j02850
7197A4118654J58311N16385j552297R14664p4889J22789J78461K30852p10997
7188A3901933P74589r56043J19901L0357R01451p58021Q45644p42691n4712P97184
7178A4859592r92686Q61147k10863n14017K46737Q2544j96413N16849k93328k88091
7168A4071471O19393l24110J74307k26354K72406J44842j4753K08851j6198L3049
$$ plain form
7234 13227037 13047438 13246795 13856087 13553711 13207585 13678446 13407193 12537146 13996944
7225 13996944 14077687 14353232 13332248 13419579 13706269 14005795 14543291 13546910 14167268 13863923
7215 13863923 12659774 13958715 14051738 13562793 13911050 14382586 13674673 14188637 14464173
7206 14464173 13164982 13517550 14294082 14031726 13632418 13706337 13327507 14221504 14118654
7197 14118654 14276965 14793350 13241053 14155717 14080828 14203617 14382078 14612930 13901933
7188 13901933 14676522 13720479 13840380 13870737 14772188 14014167 14859811 14117120 14062408 14859592
7178 14859592 13866906 14728053 14517190 14003173 14249910 14332454 14136041 14652890 14359562 14071471
7168 14071471 14690864 14366754 14541061 14314707 14587113 14731955 14717202 14926053 14909855 14942904
7158A4942904j0521N40518m97811j66713K89306m43804k6001R68546q82240R01640
7148A5615824n78101j13009m28890L52029M70176j04865K04761j05451m50110
7139A4862364k09127j85017J035417K10152j382024P67637L44750J97852j124143
7130A4517861O65154P8741K07804l96794O70533n40994J55519j0387k63326N33032
7120A5617143L0174k22969O3651o3635m11814K36823j90075M81586O97148n95975
7110A5642057J63431o14200N88756l34737M16372L27139j018097N16947m47594
7101A5240074P32874l89602j71487n44124R38509m42176P5830k84433j14412P09505
7091A5750558k51951K95677J64309j091846J91018R86318k86308J49226L04060
$$ plain form
7158 14942904 14932383 15472901 14975090 14808377 15097683 14653879 14627878 15596424 14714184 15615824
7148 15615824 15037723 14924714 14495824 14847853 15318029 15213164 15417925 15312474 14862364
7139 14862364 14653237 14468220 15503637 15713789 14331765 15099402 15444152 15642004 14517861
7130 14517861 15183015 15261756 15469560 15072766 15743299 15202305 15357824 15347437 15084111 15617143
7120 15617143 15647317 15424348 15487999 15424364 15012550 15249373 15059298 15540884 16238032 15642057
7110 15642057 15805488 15191288 15780044 15445307 15861679 16188818 15170721 15687668 15240074
7101 15240074 15972948 15583346 15411859 14867735 15806244 15364068 15439898 15155465 15041053 15750558
7091 15750558 15498607 15794284 15958593 14866747 15057765 16044083 15757775 15907001 16211061
7082A6211061j65567j39797J4315k4224p30241J348763r01065N66528j18559M03393
7072A6464607j272215M76286J07037J69216M55728Q8333p1528K36028N5712m32926
7062A6276278L70555q1398l90794O7948O48030o04266N22065p94637N38381N65272
7052A7117434p34925J91412r48861N11014N32428j004732L09353M21762j98107
7043A6196778N40222p80802J859N67760P48082r93724m43582J01407N12273P1471
7033A6521744k91728k8179N40019k02752J02541K770j1985K07075n91770L50582
7023A6598317J66802K53913J71362q65749O87696q07706O01890K52828r4148J86329
7013A7151534n25264N95855q16497P41201J16476m48115N81673l70787p5010J33390
$$ plain form
7082 16211061 16045494 15905697 15920012 15895788 15165547 16514310 15613245 16179773 16061214 16464607
7072 16464607 15192392 15668678 15775715 15944931 16400659 16488992 16417464 16653492 16709204 16276278
7062 16276278 16646833 16565435 16174641 16242589 16890619 16286353 16808418 16013781 16552162 17117434
7052 17117434 16382509 16573921 15625060 16136074 16668502 15663770 15973123 16394885 16196778
7043 16196778 16737000 15956198 15958057 16525817 17273899 16280175 15836593 15938000 16450273 16521744
7033 16521744 16230016 16201837 16741856 16539104 16641645 16644415 16632430 16839505 16247735 16598317
7023 16598317 16765119 17019032 17190394 16324645 17012341 16204635 16806525 17059353 16965205 17151534
7013 17151534 16626270 17222125 16405628 17146829 17263305 16815190 17396863 17026076 16951066 17084456
7003A7084456j35574J83946R3547r39471R27515K84715l10745R2837J1806l78086
6993A6914946J003499p61621m83707k9310R79968l58555J2905m59865j2139O70969
6983A7477090j076132J420336n93108o6173m22751Q89143l33700m02620J394955
6974A8287040j102510k08847m79238N88240K16565L58635p64869M2928o94084
6965A6243860R67851k93719K82623L66367k50659r7628j356112J201355K260J9107
6955A7085305k36193J90244N4338N58842j664914R82879Q47658j96914j60323
6946A7460922l8751j59394L23001j8189K24495l24105P3252O73351q68420O75062
6936A8021224j066025J331339p79883j41452J182677o58381L42143j077078O96419
$$ plain form
7003 17084456 16948882 17132828 17226375 16286904 17214419 17499134 17188389 17281226 17293032 16914946
6993 16914946 17918445 17156824 16673117 16643807 17623775 17265220 17278125 16818260 16806121 17477090
6983 17477090 16400958 17821294 17228186 17162013 16739262 17628405 17294705 16892085 18287040
6974 18287040 17184530 16975683 16496445 17084685 17301250 17659885 16895016 16937944 16243860
6965 16243860 17211711 16917992 17200615 17566982 17316323 17218695 15862583 17063938 17066198 17085305
6955 17085305 16849112 17039356 17093694 17652536 15987622 16970501 17818159 17621245 17460922
6946 17460922 17422171 17262777 17585778 17567589 17792084 17467979 17541231 18214582 17346162 18021224
6936 18021224 16955199 18286538 17506655 17365203 18547880 17889499 18231642 17154564 17850983
6927A7850983J02849m95542M72365q23753N4448M40470r12389P0226L48627n16721
6917A6591563K09841L74107J79232N75535q29451O44805k00060K09663p6567M09653
6907A8088321n79725L88802N70148j210494N25403J5550m01841P6529L32143m22473
6897A7382363J96841K55937O3315j141431M17182L54826o07245r6176o62365N20526
6887A6683773L59646N14001m47389J60776O6352N19968L7851M12629k34185k24636
6877A7848786L6844K53966n98110L5758J32692J674906N88809R4865J096110J017785
6867B2182411R41390M95736r0118m16982j789190j42951n13743j311476L78463
6858A9733540n66405K86761m13255r0948k48879m48955O81318O68585J01698p85000
$$ plain form
6927 17850983 17953832 17458290 17930655 17106902 17161350 17601820 16689431 16759657 17108284 16591563
6917 16591563 16801404 17175511 17354743 17930278 17100827 17745632 17545572 17755235 17678668 18088321
6907 18088321 17508596 17897398 18467546 17257052 17782455 17798005 17396164 17472693 17804836 17382363
6897 17382363 17579204 17835141 17898456 16757025 17174207 17529033 16921788 16825612 16163247 16683773
6887 16683773 17043419 17557420 17110031 17270807 17337159 17857127 17894978 18307607 18073422 17848786
6877 17848786 17885630 18139596 17541486 17577244 17709936 19384842 19973651 20068516 21164626 22182411
6867 22182411 23123801 23619537 23529419 23112437 21323247 21180296 20666553 19355077 19733540
6858 19733540 19167135 19453896 19040641 18949693 18700814 18251859 18933177 19601762 19703460 18918460
6848A8918460J473219n19333L71693J62796k23857Q82835J218414M84110J463230
6839B4231567J160721J789415J388800K60439J8599j105147j762940p00308J178167
6830B6459313o39020j458657j91936j449131j109094j434493k8442K81219j011672
6821A9418087O7537o3929R298L83449j045488K90287j21773J97586l58338J079984
6811A9856700J5746L63662L72034J196207m08809J964780L78092J353053o45272
6802B4446193l44506p86272j925275n89148o89673m61513r62862k7894M75116
6793A9134166j172464j33940M63821j486824J520279J97021m22080J72177M46202
6784A8718358J089145p46023J18548n14789J86844q83549l5983o46563r1393m43877
$$ plain form
6848 18918460 20391679 19872346 20244039 20406835 20182978 21065813 22284227 22768337 24231567
6839 24231567 25392288 27181703 28570503 28830942 28849541 27744394 25981454 25281146 26459313
6830 26459313 25820293 24361636 24169700 22720569 21611475 20176982 20148540 20429759 19418087
6821 19418087 19485624 19421695 19430993 19814442 18768954 19059241 18937468 19135054 18776716 19856700
6811 19856700 19872446 20236108 20608142 21804349 21395540 23360320 23738412 25091465 24446193
6802 24446193 24101687 23315415 21390140 20800992 20111319 19649806 18686944 18659050 19134166
6793 19134166 17961702 17827762 18291583 16804759 18325038 18522059 18099979 18272156 18718358
6784 18718358 19807503 19061480 19180028 18665239 18852083 17968534 17932551 17285988 17194595 16750718
6774A6750718m728P57706m78159Q54971r81964J40843n7336m30554M65673k21215
6764A6795955Q21125m19949o7841O81823j83911J540155o05916M00663P07290
6755A9669394Q29053L23026P36212M53004o09919L33226q50282j41522m56564
6746B0285628R9922n92982J63963r22479q39510O28259m65943L6598J76079M15420
6736A8984955j051017P86439N55382J38898K1432n33920O26325L16915r24253
6727A8921156J082717q69959N15374p42092K64088J96190J204919O27957r61180
6718B0239170j03333j151457N0718M0641l28736J12946n95863Q77560P9778p17100
6708A8504324N24625r03486j371088L73192K91264j24137j874296R22207n11218
$$ plain form
6774 16750718 16745990 17503696 17025537 17880508 16898544 17039387 16982051 16551497 17017170 16795955
6764 16795955 17617080 17197131 17129290 17811113 17627202 19167357 18561441 18962104 19669394
6755 19669394 20498447 20821473 21557685 22010689 21400770 21733996 20883714 20742192 20285628
6746 20285628 20385550 19792568 19956531 19034052 18194542 18822801 18356858 18393456 18569535 18984955
6736 18984955 17933938 18720377 19275759 19414657 19436089 18902169 19528494 19845409 18921156
6727 18921156 20003873 19133914 19649288 18907196 19171284 19367474 20572393 21200350 20239170
6718 20239170 20135837 18984380 19035098 19075739 18747003 18859949 18264086 19141646 19221424 18504324
6708 18504324 19028949 18125463 16754375 17127567 17418831 17294694 15420398 16342605 15831387
6699A5831387J70911j35991N78979n36122K29218l63468l5690n34428P74042n06976
6689A5471862J48189J56740O10945q99657O15965R1501K75910o15936k62991Q99464
6679A6491992j224856M92605N43606q66689L93034K81212l73880P30335p75236
6670A5692123k67910L1462J22355L81228o62546N65489J94900p65157Q41703j80966
6660A5952681O42093n27185O33180m96190N5010L50041j52334L168m52504Q15839
6650A6823799p23944K11253j61775J246353n72426l25167l91443L88692O58842
6641A7154184J16384J60255l1951n36504J12453j13391N21758K98623l63365J10389
6631A7428835O68844m21022r5632N68122q88285l2875N97785L07496m99709M03310
$$ plain form
6699 15831387 16002298 15866307 16445286 15909164 16138382 15774914 15739224 15204796 15978838 15471862
6689 15471862 15620051 15776791 16387736 15488079 16104044 16195545 16471455 15855519 15592528 16491992
6679 16491992 15267136 15759741 16303347 15436658 15829692 16110904 15737024 16467359 15692123
6670 15692123 15424213 15455675 15578030 15959258 15296712 15862201 16057101 15291944 16133647 15952681
6660 15952681 16594774 16067589 16700769 16204579 16259589 16609630 16457296 16460464 16007960 16823799
6650 16823799 16099855 16311108 16149333 17395686 16823260 16498093 16106650 16495342 17154184
6641 17154184 17270568 17430823 17398872 16862368 16974821 16861430 17383188 17681811 17318446 17428835
6631 17428835 18097679 17676657 17581025 18149147 17260862 17227987 17825772 18133268 17633559 18036869
6621A8036869k38345P68200o6871K61036o3065m33264L22943p69639J169873j14545
6611A8873192O4618K20222m44468N66887J39578l13974P51395k29054N4505Q0127
6601A9763028J28681P4605O9530j01626p3379R84857j331189J226879k28623M64415
6591B0977178K81727k53848M82729J2399L75537l57102K48852p57511J072228
6582B2082189J2780j14444O16429m75294N3523J31152N49295l91174P42538M2990
6572B3249984P54675l55294m6045R8991J12092n84366M73127P57811k63367n75596
6562B3622012Q34481P15192k41419J314047j401396P44186n19094Q10739K10273
6553B6089021N56275l4411p3614J38790k71643J53055J124589k90888R95483n08615
$$ plain form
6621 18036869 17798524 18566724 18499853 18760889 18697824 18264560 18587503 17817864 18987737 18873192
6611 18873192 18937810 19158032 18713564 19280451 19420029 19106055 19857450 19628396 19682901 19763028
6601 19763028 19891709 19966314 20035844 19934218 19860839 20845696 19514507 20741386 20512763 20977178
6591 20977178 21258905 21005057 21487786 21500185 21875722 21518620 21767472 21009961 22082189
6582 22082189 22094969 21980525 22596954 22121660 22175183 22306335 22855630 22464456 23206994 23249984
6572 23249984 24004659 23649365 23603320 23702311 23814403 23230037 23703164 24460975 24197608 23622012
6562 23622012 24456493 25171685 24930266 26244313 24842917 25587103 25068009 25878748 26089021
6553 26089021 26645296 26610885 26537271 26676061 26404418 26557473 27682062 27391174 28386657 27878042
6543B7878042R78769j327793J646065K572j013125J738107n05587N23549Q5650
6534C0006249R26724K41111Q942O9708O02650k49133M15452O34105J124896M10793
6524C4191497l1344R01659M58348P11645M26010Q99982O04343r0530J284456J191127
6514D0547193L52127P10403M90573J485278L30375J346264J764048P69890J254818
6505D9050969J900566J109144J568780J802763R93452K024318K259582J342138
6497F2051712L146026J841757K577905K845815K626372L553314J804646M880614
6489H5328161K463458M146114L074053L118633L890291M444176L828947M351568
6481A14645401K745268M563129L442832K178269L267548K761110J354742J889088
$$ plain form
6543 27878042 28856811 27529018 29175083 29177655 28164530 29902637 29397050 29920599 30006249
6534 30006249 30932973 31174084 31183026 31252734 31855384 31606251 32021703 32655808 33780704 34191497
6524 34191497 34160153 35061812 35520160 36231805 36657815 37557797 38162140 38071610 39356066 40547193
6514 40547193 40899320 41609723 42100296 43585574 43915949 45262213 47026261 47796151 49050969
6505 49050969 50951535 52060679 53629459 55432222 56425674 58449992 60709574 62051712
6497 62051712 65197738 67039495 69617400 72463215 75089587 78642901 80447547 85328161
6489 85328161 87791619 91937733 95011786 98130419 102020710 106464886 110293833 114645401
6481 114645401 117390669 121953798 125396630 127574899 130842447 133603557 134958299 136847387
6473A36847387l9278L73082k58959j562415l2153j579182j714879k180946j173744
6464A28678913j394870j669037k212090j857443k042417k023223j943921j748610
6456A13787302k292821k598768k983335j513991l220443k089900l241315l288649
6448I2558080k321802l123828k286773k115323k857229k371915k137209o24600
6440G4719401k246380j640614k762556m12963j414319r20264r87904j455103p97763
6431F2081535j116236o54104j172038l91350n91853j328202q73527Q6449r98208
6422E5042466O5473j134358k55594n68228K24979j419070O0621m73503J85259
6413E1728045j566845J31558q62811R3557J99752j065749p37129j045879r2194
$$ plain form
6473 136847387 136808109 137181191 136922232 135359817 135327664 133748482 132033603 129852657 128678913
6464 128678913 127284043 125615006 123402916 121545473 119503056 117479833 115535912 113787302
6456 113787302 111494481 108895713 105912378 104398387 101177944 99088044 95846729 92558080
6448 92558080 90236278 87112450 84825677 82710354 79853125 77481210 75344001 74719401
6440 74719401 72473021 70832407 68069851 67656888 66242569 65322305 64334401 62879298 62081535
6431 62081535 60965299 60311195 59139157 58747807 58155954 56827752 55954225 56040674 55042466
6422 55042466 55107939 53973581 53717987 53149759 53374738 51955668 52016289 51542786 51728045
6413 51728045 50161200 50292758 49429947 49523504 49723256 48657507 47920378 46874499 46782305
6404D6782305l77391j70666m90446j087525K94973j010753P7370K75736j50247
6395D4143356l18316o90989L43876L53809o44514Q07573m03798o59567N9552L47857
6385D3338839k57001m13278N46378n33700L4066K02288P51629q9687n36582j39486
6375D2903466J40298M22317N35450N9289n4255p2817K21705M51087J45444L29798
6365D5081782N7376J33314P03036O0861p05943J033677J988043j162273J007727
6356D8197600j01736P02267P94206L18059K41291M18246J26415l3465Q29339J6518
6346E1508740P09395J55056m4366P65878L4580m01784J89245j24822k21733q36240
6336E1733949P84124j052018J1273J61222k11743J38507m19960J90171J85295
$$ plain form
6404 46782305 46404914 46234248 45743802 44656277 44951250 43940497 44017867 44293603 44143356
6395 44143356 43825040 43134051 43477927 43831736 43187222 43994795 43590997 42931430 42990982 43338839
6385 43338839 43081838 42668560 43214938 42681238 42715304 42917592 43669221 43579534 43042952 42903466
6375 42903466 43043764 43466081 44001531 44060820 44006565 43933748 44155453 44606540 44751984 45081782
6365 45081782 45139158 45272472 45975508 46036369 45330426 46364103 48352146 47189873 48197600
6356 48197600 48095864 48798131 49592337 49910396 50151687 50569933 50696348 50662883 51492222 51508740
6346 51508740 52218135 52373191 52328825 53094703 53129283 52727499 52916744 52791922 52570189 51733949
6336 51733949 52518073 51466055 51477328 51638550 51426807 51565314 51145354 51335525 51520820
6327E1520820n9696J321025K63583R10938k59768n1165r21828M64188m89124l77373
6317E2321600q54287Q19273r9467j612047J82885J58418o48749q94995l35091
6308D9037540k8221j634437o85505O7412j309302j019327r12215O3163n95561
6299D2983547q37976J352667j666721L80133M45204n46756M65651k17267J82890
6290D2541372Q37057J069331O9959J216839K152482N59173O6201J391618R65672
6281E0869704j358942r74732o46436q60567n74665j073832o10775o37541o84550
6272D3447664o9203j034451k99059J25914j63003L18131l1702n4622J33566K49830
6262D2623065J183851j56674L93347J237585R65046J430107O19713q00786J142232
$$ plain form
6327 51520820 51461124 52782149 53045732 53956670 53696902 53645737 52723909 53188097 52698973 52321600
6317 52321600 51467313 52286586 52187119 50575072 50757957 50916375 50267626 49372631 49037540
6308 49037540 49009319 47374882 46689377 46756789 45447487 44428160 43515945 43579108 42983547
6299 42983547 42145571 43498238 41831517 42211650 42656854 42110098 42575749 42358482 42541372
6290 42541372 43378429 44447760 44517719 45734558 47887040 48446213 48512414 49904032 50869704
6281 50869704 49510762 48536030 47889594 47029027 46454362 45380530 44769755 44132214 43447664
6272 43447664 43378461 42344010 42044951 42170865 42007862 42325993 42294291 42239669 42373235 42623065
6262 42623065 43806916 43650242 44043589 45281174 46246220 47676327 48296040 47495254 48637486
6253D8637486J149420M32747L45340p09531j578975k522700j493973k108730j542054
6244D0609030n11595j445639k19360l79645m28775M0156o79067M15365q03087
6235C6597383q77915J006289m80097L92357k23005K17659k32899J59645q5867
6226C6473550N11084J564384p1820P84125J31428J253573k021614j000954m48951
6217C7174805m39257j622307N50818j115053L58821q56915O46068K16230k42185
6208C4671025j30606J03205j51201l05143l28859m50028J11815r7942P66217o77529
6198C3510954M3975q08418m60171L05849k07202R26450N16842O21391P41170o33944
6188C4556896l61860p8602q78466k87899j89961j78546R9945j106899N26730j08639
$$ plain form
6253 48637486 49786906 50219653 50564993 49855462 48276487 45753787 44259814 42151084 40609030
6244 40609030 40097435 38651796 38432436 38052791 37624016 37664172 36985105 37400470 36597383
6235 36597383 35719468 36725757 36245660 36638017 36415012 36632671 36399772 36559417 36473550
6226 36473550 36984634 38549018 38477198 39261323 39392751 40646324 38624710 37623756 37174805
6217 37174805 36735548 35113241 35664059 34549006 34907827 34050912 34696980 34913210 34671025
6208 34671025 34540419 34643624 34492423 34187280 33858421 33408393 33520208 33422266 34188483 33510954
6198 33510954 33554929 32746511 32286340 32592189 32384987 33311437 33828279 34449670 35190840 34556896
6188 34556896 34195036 34116434 33237968 32950069 32760108 32581562 32681507 31574608 32101338 31992699
6178C1992699l10969P2526o76421l19573N80571q57048O78235J12534N82191m92380
6168C1362365j03918J198775q7163O89357O68951o20988r98030j07902Q76333
6159C2877780k61060j77882p74503k11907k00954j168116q26741j336034j84545
6150B7736038k71955j81444P8303M49335q44025O50037j055256K19551M9764r38438
6140B5891910k04423k31475J87534l37266r7725R2738l81719k66615j18977M2886
6130B4576868M78143m04326O36839K45985k26343j98620j555250P38261j217429
6121B3074128N3622k85664m29476j71354K09243O00718p84732L70388N7013n93006
6111B2100880n093k19816o93401R46354o68385R84113o63977O5977R54348k02620
$$ plain form
6178 31992699 31681730 31754256 31077835 30758262 31338833 30481785 31160020 31272554 31854745 31362365
6168 31362365 31258447 32457222 32370059 33059416 33728367 33107379 32109349 32001447 32877780
6159 32877780 32616720 32438838 31664335 31452428 31251474 30083358 29256617 27920583 27736038
6150 27736038 27464083 27282639 27360942 27810277 26966252 27616289 26561033 26780584 26830348 25891910
6140 25891910 25687487 25456012 25643546 25306280 25208555 25301293 24919574 24652959 24533982 24576868
6130 24576868 25055011 24650685 25287524 25533509 25307166 25108546 23553296 24291557 23074128
6121 23074128 23127750 22842086 22412610 22241256 22450499 23051217 22266485 22636873 22693886 22100880
6111 22100880 22095787 21875971 21182570 22128924 21460539 22444652 21780675 21846652 22801000 22598380
6101B2598380M41652o12254R12140j27585M31567M37896l03433L61232N6636M21871
6091B4618102Q22871J56287M07082P75444l620J231315M30401L5705J147880L36051
6081B9957518R54523J651352J943110N42030J395532K407836P20301K477097J334385
6072D3383684K458632L169180L174282K211820L930105M909708N820433N949900
6064G5007744N841370O522000O603054P016001P877072R077664J1782108J5139016
6056A44866029J7979827K4939587L1278391L8452296M4602605M1874052K0121130
6049C64113917j7289769m8219812m7635127l7574438k8717046k2195688j8677201
6042A43804836j3282518j1560626r525996q656339p558233o520997n817266m862161
$$ plain form
6101 22598380 23040032 22427778 23339918 23212333 23643900 24081796 23778363 24139595 24196231 24618102
6091 24618102 25440973 25597260 26004342 26779786 26776166 28007481 28437882 28473587 29621467 29957518
6081 29957518 30912041 32563393 34506503 35048533 36444065 38851901 39572202 42049299 43383684
6072 43383684 45842316 49011496 52185778 54397598 58327703 63237411 69057844 75007744
6064 75007744 80849114 87371114 93974168 100990169 108867241 117944905 129727013 144866029
6056 144866029 162845856 187785443 219063834 257516130 302118735 343992787 364113917
6049 364113917 346824148 298604336 250969209 213394771 184677725 162482037 143804836
6042 143804836 130522318 118961692 109435696 100779357 93221124 86700127 80882861 76020700
6034G6020700m242914m016996m207956j801374l268573k993616j844461k149887
6026E1494923j688359j345041k374463j063427j012758l48731k462841L1953j290701
6017C9940555q89468j269379m99908p07219m84347j503217O90478j550330n14526
6008C3212639N2749n63089j258667j173K85416q50400q36223O62942K70110j308651
5998B9665653R48273p42629K2262l33591J44438j119031J047916k3160j24023
5989B9486108N60922n89506M88773J63000O33898k49183L37796k17799J109636
5980C1723645n26424M33822O21079J66021M86632P72284M79796M84675P42768
5971C5384298N05157Q48362K32573J012415J887786O07579J231987J604414O52181
$$ plain form
6034 76020700 71777786 67760790 63552834 61751460 58482887 55489271 53644810 51494923
6026 51494923 49806564 48461523 46087060 45023633 44010875 43662144 41199303 41231256 39940555
6017 39940555 39051087 37781708 37281800 36574581 36090234 34587017 35277495 33727165 33212639
6008 33212639 33265388 32702299 31443632 31442459 31727875 30877475 30041252 30704194 30974304 29665653
5998 29665653 30613926 29871297 29893559 29559968 29704406 28585375 29633291 29610131 29486108
5989 29486108 30047030 29457524 29946297 30109297 30743195 30494012 30831808 30614009 31723645
5980 31723645 31197221 31631043 32252122 32418143 32904775 33677059 34156855 34641530 35384298
5971 35384298 35889455 36737817 36970390 37982805 39870591 40478170 41710157 43314571 43966752
5962D3966752L244012Q40570J347708J742037K000294J694237K791475K019993
5954E9647078L054115L876751K249780L964602L412847L562361K090408J935502
5946H3793444Q60126J452086j133916j31823j998304j973821j356946j797828
5938G7713018j174001q49617j259375r70517m81902Q36698p15285j653020k079019
5929F9366980j471332j320464j561567L18057o98071o77796N92296j322017M75973
5920F3702059k253896J53859R7796k80400P21494K45933P14421O34382J171789
5911F4907437J413828J112164J144684J166101O61964P18780K385293L217698
5903G6727949J294148m92027l068203k470448k379597j560299R02296o96290q92828
$$ plain form
5962 43966752 47210764 48051334 49399042 51141079 53141373 54835610 57627085 59647078
5954 59647078 62701193 66577944 68827724 72792326 76205173 79767534 81857942 83793444
5946 83793444 84653570 86105656 84971740 84839917 82841613 80867792 79510846 77713018
5938 77713018 76539017 75689400 74430025 73459508 72977606 73814304 73099019 71445999 69366980
5929 69366980 67895648 66575184 65013617 65331674 64633603 63955807 64548103 63226086 63702059
5920 63702059 61448163 61602022 61699818 61419418 62140912 62386845 63101266 63735648 64907437
5911 64907437 66321265 67433429 68578113 69744214 70406178 71124958 73510251 76727949
5903 76727949 78022097 77530070 74461867 71991419 69611822 68051523 68953819 68257529 67364701
5894F7364701j69824r90458J91219k97237J30269J374145n24691r45117K27077
5885F6360084k77910P85399P06686J674696L38524J656786J235134J721525J704689
5876G5905613J664130K11396K313527K219251K668926N06087O61564J424385J669199
5867H9244078J272241K897988K290815K906657K862788L853389L423424M579146
5859A13330526L505263L566066L348985J488861R09045o8225j045137j683280
5851A23352104j976481o18495j778440j380626k88720r96540q32174J128113k8526
5842A16580215K056659J787489J276488K769842L394469L544906K974083K295743
5834A36679894J500884J057991m55295K16055R41079J194951J538622J759782
$$ plain form
5894 67364701 67194877 66204419 66395638 66098401 66228670 67602815 67078124 66133007 66360084
5885 66360084 66082174 66867573 67574259 69248955 69587479 71244265 72479399 74200924 75905613
5876 75905613 77569743 77781139 80094666 82313917 84982843 85488930 86150494 87574879 89244078
5867 89244078 90516319 93414307 95705122 98611779 101474567 105327956 108751380 113330526
5859 113330526 116835789 120401855 123750840 125239701 126148746 126080521 125035384 123352104
5851 123352104 121375623 120757128 118978688 117598062 117309342 116312802 115480628 116608741 116580215
5842 116580215 118636874 120424363 121700851 124470693 127865162 131410068 134384151 136679894
5834 136679894 138180778 139238769 138783474 138999529 139940608 141135559 142674181 144433963
5826A44433963J832033P61054j095649j814928k126592l470989m812316m443632
5818A29262944m354613m575215l826853l617620l953953k549555k006806k813654
5810A01564675r13517j257512n7941r91915N66309m43576R85415Q5101L91437
5801I9928476J919812P35594J385818J552389N33362J263013J616649M01385l16450
5792A09020048k84302o01705j225370j423023m77107j025155p31085o87720k86903
5783A02277678k5496j74293O39635J705860M93217L254672K408832J335342L175058
5774A15090505M012454M404534J971079J152853j018151l873717k621167k469955
5766A16648435k055306J24112j858990n28438k96353j423502l51303j519613J118789
$$ plain form
5826 144433963 146265996 147027050 145931401 144116473 141989881 138518892 133706576 129262944
5818 129262944 124908331 120333116 116506263 112888643 108934690 106385135 104378329 101564675
5810 101564675 100651158 99393646 99335705 98343790 98910099 98466523 99451938 99537039 99928476
5801 99928476 101848288 102583882 103969700 105522089 106055451 107318464 108935113 109336498 109020048
5792 109020048 108735746 108134041 106908671 105485648 105008541 103983386 103252301 102564581 102277678
5783 102277678 102252182 102077889 102717524 104423384 104916601 108171273 110580105 111915447 115090505
5774 115090505 119102959 123507493 125478572 126631425 125613274 121739557 119118390 116648435
5766 116648435 114593129 114717241 112858251 112329813 112033460 110609958 110258655 108739042 109857831
5757A09857831N932J066036J795576K022505M545112L480485L923165m49141k700358
5748A23547143o88938j179681q66530J817676P26379K701788K519054M538348
5740A33115239O020130R131914J0784054J0462695M240760j0731684j1901475
5733A51121633p028205m633666l013736j303987j710794p29507l59701p52231
5725A31589806R0738p25822k43582l81648L6546n8363o20204m87768l36559m73660
5715A28389484j271164q40182j424079o09373k084197j032257k153740j729411
5707A17245081J38006k051003j040019j840379j594617l63144r11005j633734
5699A07949186j98669j116179j608212k78043r56063j398596L38226j522726J70370
$$ plain form
5757 109857831 109863763 110929799 112725375 114747880 119292992 122773477 126696642 126247501 123547143
5748 123547143 122858205 121678524 120811994 122629670 123356049 126057837 128576891 133115239
5740 133115239 139135369 148267283 159051337 169514032 173754792 163023108 151121633
5733 151121633 144093428 139459762 136446026 135142039 133431245 132701738 132342037 131589806
5725 131589806 131680544 130954722 130711140 130329492 130366038 130307675 129687471 129199703 128863144 128389484
5715 128389484 127118320 126278138 124854059 124244686 122160489 121128232 118974492 117245081
5707 117245081 117383087 115332084 114292065 112451686 110857069 110493925 109582920 107949186
5699 107949186 107750517 106634338 105026126 104748083 103792020 102393424 102731650 101208924 101379294
5690A01379294r99435j33298o98802j384045q6735j943395j550723j020104k395069
5681I1167688k335000k040088j965334k028437j754872j493320j568951q07991
5673G7173695j395032n43611j013857r47329l25055p90039p22576j258811J148584
5664G1325969j119510k08403q97130K26912j102423N8890l61086M37935l41240
5655F8019914m29606k19080j224602j501771k48548j301138l13630j326730k65727
5646F1189082q19734p18504n95319J49643l5901k89895K36063J31428j97689L44816
5636E9393990k95181N12922j95714K70510L50796O99541O7675M97109P42233J188078
5626F3231959O11353K020039L464123M148497M626820K801105m430190n960716
$$ plain form
5690 101379294 100379859 100246561 99547759 98163714 98076979 96133584 94582861 93562757 91167688
5681 91167688 88832688 86792600 84827266 82798829 81043957 79550637 77981686 77173695
5673 77173695 75778663 75235052 74221195 73273866 72948811 72158772 71436196 70177385 71325969
5664 71325969 70206459 69998056 69100926 69327838 68225415 68284305 67923219 68361154 68019914
5655 68019914 67590308 67371228 66146626 64644855 64396307 63095169 62781539 61454809 61189082
5646 61189082 60369348 59650844 59055525 59205168 59169267 58879372 59115435 59246863 59049174 59393990
5636 59393990 59098809 59611731 59416017 59686527 60037323 60736864 60804539 61301648 62043881 63231959
5626 63231959 63843312 65863351 69327474 73475971 78102791 80903896 76473706 70512990
5618G0512990l279729k294106q89684l75995j093352l62607J6335l37405k73958
5609F1622489n26564M27435m81728o44779M81675n65651n27420K98875Q58054
5600F0942386o01778L98031l7277J61989J146375o79847K09112k14479K39938
5591F1564450p18416L90071J013658j414913N32399O25131n77883J443078j610707
5582F1246868O48538N89510o12697O17893N1487P10700k72477k76348m0941R30436
5572F3592969J13731K17965j76969m563O81665K92152l47783m30100K82889J501751
5562F5723707k26948K36190j54134N09001p191l83076O26208L55767m76645m58894
5552F5743985N97384Q66161j407774J64165L95531o22114j14841q81628L64499
$$ plain form
5618 70512990 67233261 64939155 64049471 63673476 62580124 62217517 62233852 61896447 61622489
5609 61622489 61095925 61523360 61041632 60396853 60878528 60312877 59785457 60084332 60942386
5600 60942386 60340608 60738639 60701362 60863351 62009726 61329879 61538991 61324512 61564450
5591 61564450 60846034 61236105 62249763 60834850 61367249 61992380 61414497 62857575 61246868
5582 61246868 61895406 62484916 61872219 62490112 62541599 63252299 62979822 62703474 62662533 63592969
5572 63592969 63706700 63924665 63747696 63743133 64424798 64716950 64369167 63939067 64221956 65723707
5562 65723707 65496759 65732949 65578815 66087816 66080625 65697549 66323757 66679524 66202879 65743985
5552 65743985 66341369 67207530 65799756 65963921 66359452 65737338 65622497 64740869 65105368
5543F5105368n26051M50669N9569n32315l80138k79813M72854o31448L43126L87858
5533F4469679J72658J87733J69513p33537J180931n7882P13857K49541j78544
5524F6173949Q66250l45777M67294J703251N16478N56906J247975P07748k23029
5515G1671045l56885o87953M251j88972K60509Q93124p19943K04803n6711N85944
5505G1609212k53082M98741j94452M93001q46177J142115M51192N22862L03896
5496G3727308N81972k56389O94595p0677J56073N22637M32523j74716L13811J147963
5486G7075100K36638Q39242J73870R75867M91703p45748J484148N08929j029012
5477H0010737K71646m55272r51602J32442j067706J32822j720653k33804L2239
$$ plain form
5543 65105368 64579317 65029986 65089555 64557240 64177102 63897289 64370143 63738695 64081821 64469679
5533 64469679 64642337 64830070 64999583 64266046 65446977 65389095 66102952 66352493 66173949
5524 66173949 67040199 66694422 67161716 68864967 69381445 69938351 71186326 71894074 71671045
5515 71671045 71314160 70626207 70630458 70441486 70701995 71595119 70875176 71079979 71023268 71609212
5505 71609212 71356130 71854871 71660419 72153420 71307243 72449358 72900550 73423412 73727308
5496 73727308 74309280 74052891 74747486 74676809 74832882 75355519 75788042 75613326 75927137 77075100
5486 77075100 77311738 78150980 78324850 79300717 79792420 79046672 80530820 81039749 80010737
5477 80010737 80282383 79827111 78875509 79007951 77940245 78073067 76352414 76118610 76150849
5468G6150849M46720p06588j50902L38008k88784m16997O7360O1633k81129Q77097
5458G6097267j151033K93192j01655M36233L82447k57213L84533J040846L40387
5449G7465004j029151O47056K74r45706p73667k07381n93012l48106m84199J57490
5439G3888602j061715N04212k34458o16176L78706k59380J14287p18935n1034
5430G1944109j15779l93380R52308j261177K34740k2717l72038n07416O31219
5421G1089869O04738o8861J137418Q95062J428745j38039O59056p11092j590014
5412G3306882p00353j647383j687580m68497m32518j502312o46467n1264j019900
5403F5150608m01560L00956j285522L51162j233764l93416m7783o79228m57922
$$ plain form
5468 76150849 76597569 75890981 75740079 76078087 75789303 75372306 75439666 75501299 75220170 76097267
5458 76097267 74946234 75239426 75137771 75574004 75956451 75699238 76083771 77124617 77465004
5449 77465004 76435853 77082909 77083183 76137477 75363810 75156429 74563417 74215311 73731112 73888602
5439 73888602 72826887 73331099 73096641 72480465 72859171 72599791 72714078 71995143 71944109
5430 71944109 71828330 71434950 72387258 71126081 71360821 71338104 70966066 70458650 71089869
5421 71089869 71694607 71625746 72763164 73658226 75086971 74948932 75607988 74896896 73306882
5412 73306882 72606529 70959146 69271566 68803069 68370551 66868239 66221772 66170508 65150608
5403 65150608 64749048 65050004 63764482 64115644 62881880 62488464 62440681 61761453 61303531
5394F1303531p56385J064556q96410K39727j221013N32499J65298K49728k83948
5385F0397583j11359m76747r89624K73352l47101o38581O1985m30160o08053p16561
5375E6414734M65081j173456N60484Q6942j228426l87146K61630K09475l39962
5366E4869356O0123R54157K8586l25924J483244j611601J424663o59810j20998
5357E6101796L99834o67959j04087q44257J91575o50159m97720k58497k82952
5348E3387574q62567m19223K85786m46593K22614k94863o36690R74644j307580
5339E0903102Q56367o3987j90226l24949N8603o05678J23009r36733p00841O28093
5329D9746760j126078r8553j295455l22668K04302o77389m84424L01204l04130
$$ plain form
5394 61303531 60547146 61611702 60715292 60955019 59734006 60266505 60431803 60681531 60397583
5385 60397583 60286224 59809477 58819853 59093205 58746104 58107523 58169508 57739348 57131295 56414734
5375 56414734 56879815 55706359 56266843 56353785 55125359 54738213 54999843 55209318 54869356
5366 54869356 54929479 55883636 55912222 55586298 57069542 55457941 56882604 56222794 56101796
5357 56101796 56501630 55833671 55729584 54885327 55076902 54426743 53929023 53670526 53387574
5348 53387574 52525007 52105784 52391570 51944977 52167591 51872728 51236038 52210682 50903102
5339 50903102 51759469 51695482 51505256 51180307 51238910 50633232 50756241 49819508 49118667 49746760
5329 49746760 48620682 48522129 47226674 46904006 47108308 46430919 45946495 46247699 45943569
5320D5943569j093190n4762q38553j59821J55174o82172j56633o04668k60577
5311D2248367m32059r82776k26811N49023k33431o92132m69254P48302p21857
5302C9787372j007650l98993o5591p21218J8763K5086K21381j96684j75015r09569
5292C6577882L33099o7465n45308K43684p48084N7919m18575K47942K40193M08563
5282C6329850p90403j5519k70848q43471M80852m79054J77239K32085j55735k22969
5272C4442027Q34720n84315o00542K26875L77626N8940m80411o25842P75621j190744
5262C3233955L38351N42750o75464N04086J38777o58481L95412l53848J50950
5253C3616488o01408K74444l28240j54913q5716k15379O54605j702486Q70191
$$ plain form
5320 45943569 44850379 44795617 43957064 43797243 43952417 43270245 43113612 42508944 42248367
5311 42248367 41816308 40833532 40606721 41155744 40922313 40230181 39760927 40509229 39787372
5302 39787372 38779722 38380729 38315138 37593920 37612683 37637769 37859150 37662466 37487451 36577882
5292 36577882 36910981 36843516 36298208 36541892 35793808 35851727 35433152 35681094 35921287 36329850
5282 36329850 35539447 35523928 35253080 34409609 34890461 34411407 34588646 34820731 34664996 34442027
5272 34442027 35276747 34692432 34091890 34318765 34696391 34755331 34274920 33649078 34424699 33233955
5262 33233955 33572306 34115056 33439592 33943678 34082455 33423974 33819386 33465538 33616488
5253 33616488 33015080 33289524 32961284 32806371 32720655 32505276 33159881 31457395 32327586
5244C2327586n77646l96831N4365P6189r907j164241j95473N63861r86876P68889
5234C0459916j371484m86668l0567l11580k42839o91814k72764k56069M20408
5225B7216539j195416K8239k7078k09338j03115j34910j278869N88790j200753
5216B3684089O60854n01497K29006j166780M68702m26591j210333O21964l46931
5207B2012483l1429j5283j615858K04366J78595j14360k10465K52036k66909J3751
5197B0406927K8526o67403J09454j09890l97971N75192j100570O20471M84138
5188A9948874j53947l00005k26780p97700K47619M95945r4205R42749j105509
5179A8957041j48906Q99729j293817R75023Q1933M403l90557k6390l97656M88287
$$ plain form
5244 32327586 31749940 31353109 31407474 31483663 31473756 30309515 30114042 30677903 29691027 30459916
5234 30459916 29088432 28601764 28571197 28259617 28016778 27324964 27052200 26796131 27216539
5225 27216539 26021123 26049362 26022284 25812946 25709831 25574921 24296052 24884842 23684089
5216 23684089 24344943 23843446 24072452 22905672 23374374 22947783 21737450 22359414 22012483
5207 22012483 21981054 21965771 20349913 20554279 20732874 20618514 20408049 20660085 20393176 20406927
5197 20406927 20435453 19768050 19877504 19767614 19369643 19944835 18844265 19464736 19948874
5188 19948874 19794927 19494922 19268142 18470442 18718061 19214006 19119801 20062550 18957041
5179 18957041 18808135 19707864 18414047 19389070 19471003 19475406 19084849 19058459 18660803 19149090
5169A9149090M15999j44867l32543J42669j7698o02632J268661j123727J37337
5160A8892289N9271L08829j4909K15662L80577n92161J25721j51107L33464p95714
5150A8761922R14521m575M02334o21362k28212P83053q51719L24076N04194n40195
5140A9444037O70049p24346K93343N89313M79575L27252q43327L94021k9618J35975
5130B0736274L78748M36552L8901o19134M91647k96191K3622R25096O7142J82079
5120B2364736N9168J276579m43253k10640Q52616o9935P60821L28369o20315n7340
5110B4240806Q62422J88713Q8277J609287j089440O73365n8646J370502l22830
5101B7562456J44764O14604K65721k76048N65859R19584J78470J679027k86191
$$ plain form
5169 19149090 19565089 19420222 19087679 19230348 19212650 18610018 19878679 18754952 18892289
5160 18892289 18951560 19260389 19245480 19461142 19841719 19249558 19375279 19224172 19557636 18761922
5150 18761922 19676443 19671868 20074202 19452840 19224628 20007681 19155962 19480038 19984232 19444037
5140 19444037 20114086 19389740 19683083 20272396 20751971 21079223 20235896 20629917 20600299 20736274
5130 20736274 21115022 21551574 21590475 20971341 21462988 21166797 21190419 22115515 22182657 22364736
5120 22364736 22423904 23700483 23257230 23046590 23899206 23829271 24590092 24918461 24298146 24240806
5110 24240806 25103228 25291941 25380218 26989505 25900065 26573430 26514784 27885286 27562456
5101 27562456 27707220 28321824 28587545 28311497 28877356 29796940 29975410 31654437 31368246
5092C1368246M74186L70365Q92355J080645N60848J31223M41516k83935J945618
5083C6981067J199031K82866O75630R75704M14365P29112J213578J461529N88333
5074D4521215M61359M2429M5023J316261L08841J591937O00084J068778J914198
5065E1870125Q56146R93222J515149J793332J009971J163988K040396J875051
5057F3117380J335905K446977J514321K275170J274745N25236L65419L33357J317002
5048G4505512L26767j945121o15816j141148m18639N29361q1748O28320R03109
5039G2690597J50965p880K99839p82956N17969J251104K27540K29417N56448J102192
5029G6235235m34242j90648J031165j852492l39617o50241J035893n13569Q15687
$$ plain form
5092 31368246 31842432 32212797 33105152 34185797 34746645 34877868 35319384 35035449 36981067
5083 36981067 38180098 38462964 39138594 40114298 40528663 41257775 42471353 43932882 44521215
5074 44521215 44982574 45025003 45070026 46386287 46695128 48287065 48887149 49955927 51870125
5065 51870125 52726271 53719493 55234642 57027974 58037945 59201933 61242329 63117380
5057 63117380 64453285 66900262 68414583 70689753 71964498 72489734 72855153 73188510 74505512
5048 74505512 74832279 72887158 72271342 71130194 70711555 71240916 71159168 71787488 72690597
5039 72690597 72841562 72833682 73133521 72350565 72868534 74119638 74347178 74576595 75133043 76235235
5029 76235235 75800993 75610345 76641510 74789018 74449401 73799160 74835053 74321484 75137171
5020G5137171l72977J863268k3788J365809Q01431j08258M5677m05387R7694j048109
5010G7352531m15614K67208p39986N92183M71140k38232J523527m45197r2723
5001G8274837J16706m20159n83282m36760o24033n67801m13419j317038l0716
4992G3998335N5489M70624l40356m07608N77963M24864n14948L55431J27812n77512
4982G4170094o45247r15096N1199j53786n8376j15910o30538n35275k62334m02804
4972G0501927m44300j342493l73024n5056j003355m37299r09761K51200j953517
4963F4234322m90427j28966l44591j43368k90087r74139O01524m41578K91239
4954F2313929p38914Q8914l76782r10310k05102j441152K62190j779472o61448
$$ plain form
5020 75137171 74764194 76627462 76603674 77969483 78770914 78662656 78708333 78302946 78400640 77352531
5010 77352531 76936917 77204125 76464139 77056322 77527462 77289230 78812757 78367560 78274837
5001 78274837 78391543 77971384 77388102 76951342 76327309 75759508 75346089 74029051 73998335
4992 73998335 74053824 74524448 74184092 73776484 74354447 74779311 74264363 74619794 74747606 74170094
4982 74170094 73524847 72609751 72660950 72507164 72448788 72332878 71702340 71167065 70904731 70501927
4972 70501927 70057627 68715134 68342110 68287054 67283699 66846400 65936639 66187839 64234322
4963 64234322 63743895 63614929 63270338 63126970 62836883 61862744 62464268 62022690 62313929
4954 62313929 61575015 61663929 61287147 60376837 60171735 58730583 58992773 57213301 56551853
4945E6551853o81717m97467j65771j528657q97741j307944m09189j106229p33279
4936D9223859m63987J092j436048l54061j134270n97582l17210J65760j162677
4927D3924876n63493L0077O3910l5790j074766m15761r94403m51781K55372n47745
4917D0190496j082973j018728j613596M47088K00465j517554R4808j129800j73302
4908C4396904l04288j577291j3234j25931k04919J32278p57780m79028n31540
4899C0535171M0081j255690o9183M91745j584626J152548j24934m36090p88150
4890B7960872j37144O67149j050606o653K97482j001926l57139J0038m69610L9178
4880B5951641r187O00643J42901p72470O0785l97280l46387O72342j18823L09449
$$ plain form
4945 56551853 55870136 55372669 55206898 53678241 52780500 51472556 51063367 49957138 49223859
4936 49223859 48759872 48760964 47324916 46970855 45836585 45239003 44921793 45087553 43924876
4927 43924876 43361383 43391460 43455370 43419580 42344814 41929053 40934650 40482869 40738241 40190496
4917 40190496 39107523 38088795 36475199 36922287 37122752 35605198 35700006 34570206 34396904
4908 34396904 34092616 32515325 32502091 32376160 32171241 32303519 31545739 31066711 30535171
4899 30535171 30575252 29319562 29250379 29742124 28157498 29310046 29185112 28749022 27960872
4890 27960872 27823728 28490877 27440271 27433618 27731100 26729174 26372035 26382073 25912463 25951641
4880 25951641 25942454 26543097 26685998 25913528 25974313 25577033 25230646 25902988 25784165 26093614
4870B6093614m92324L55726L21296j27747p76310J014718k15146L69007n26756
4861B6016078J56764p575L81481M29905L55996n47695O60684O79826L52408n46272
4851B7931600P76834k61048N44385O45449j005594J392377l97839O98090M93132
4842C0817386L39352O36771K93201J95852K26191P02146O92532J48320J561712
4833C5613463m22854O39352J503489k56897M30976J120617R77461J153894j04529
4824D0654972K031038M85454J252972R51786J403266O38241R03839Q91032Q62902
4815E0075502J603749l73465Q43296J00007N89746J588142M84861M28466N06786
4806E5847090J978704Q99153J086094J298356J230195J105034J961438L95735
$$ plain form
4870 26093614 25601290 25957016 26278312 26150565 25374255 26388973 26173827 26542834 26016078
4861 26016078 26172842 26165267 26546748 26976653 27332649 26784954 27445638 28125464 28477872 27931600
4851 27931600 28708434 28447386 28991771 29637220 28631626 30024003 29626164 30324254 30817386
4842 30817386 31156738 31793509 32086710 32282562 32508753 33210899 33903431 34051751 35613463
4833 35613463 35190609 35829961 37333450 37076553 37507529 38628146 39605607 40759501 40654972
4824 40654972 42686010 43171464 44424436 45376222 46779488 47417729 48321568 49212600 50075502
4815 50075502 51679251 51305786 52149082 52249089 52838835 54426977 54911838 55340304 55847090
4806 55847090 57825794 58724947 59811041 61109397 62339592 63444626 65406064 65801799
4798F5801799J485023J571005J933698J015429J009421J134517J783759J257328
4790G6991979J762644K422423J996556J870085Q03996J363878K003574J284896
4782I0500031J969959J518813K459283J325754K918815K520910K268020L114061
4774A08595646K569546L217963J088244L505925L186683K392134K419041L154965
4766A30130147K671786J907334K424425L058100L050917K702277L099115J787819
4758A50831920L347618K205614K754724K613164L444379K243765L179687J901320
4750A72522191K551920J141907K374739J579270K038812R80513J415199J194567
4742A85799118O44028J443071k05617L71989q896k29571m75798l83660K75430
$$ plain form
4798 65801799 67286822 68857827 70791525 71806954 72816375 73950892 75734651 76991979
4790 76991979 78754623 81177046 83173602 85043687 85847683 87211561 89215135 90500031
4782 90500031 92469990 93988803 96448086 97773840 100692655 103213565 105481585 108595646
4774 108595646 111165192 114383155 115471399 118977324 122164007 124556141 126975182 130130147
4766 130130147 132801933 134709267 137133692 140191792 143242709 145944986 149044101 150831920
4758 150831920 154179538 156385152 159139876 161753040 165197419 167441184 170620871 172522191
4750 172522191 175074111 176216018 178590757 180170027 182208839 183189352 184604551 185799118
4742 185799118 186443146 187886217 187680600 188052589 188043693 187814122 187338324 186954664 187230094
4733A87230094j038139m37509p27315o40700j380693j685577q87417j532038k283508
4724A76617198j076700k198486k482182k149534k741025k561055l409642k462045
4716A57536529k710994k367614k769275l246745k860185k567090k511455l049591
4708A35453580l093692j927157l083501l044026j490835j999498k397379k318316
4700A16099176r99360l193813j734625j834066j632930k133915j732601k250731
4692A00587135j340746k438887n82891j835235j884851p39343k567440j200821
4684H7996921o56471j786934j357885n06676j501051O3287j918876o42683p65639
4675G8923993q89184j597704l54681q56743J2074o26674j209674n66968L01069
$$ plain form
4733 187230094 186191955 185754446 185027131 184386431 183005738 181320161 180432744 178900706 176617198
4724 176617198 175540498 173342012 170859830 168710296 165969271 163408216 159998574 157536529
4716 157536529 154825535 152457921 149688646 146441901 143581716 141014626 138503171 135453580
4708 135453580 132359888 130432731 127349230 124305204 122814369 120814871 118417492 116099176
4700 116099176 115099816 111906003 110171378 108337312 106704382 104570467 102837866 100587135
4692 100587135 99246389 96807502 96224611 94389376 92504525 91765182 89197742 87996921
4684 87996921 87340450 85553516 84195631 83688955 82187904 82251191 80332315 79689632 78923993
4675 78923993 78034809 76437105 76082424 75225681 75237755 74611081 73401407 72834439 73135508
4666G3135508P8928l90349n33834r5891o61903l31503l42228P16825p02768m23175
4656G0449610j37929q2064j052643k50036j153341k22573k71113j010587P4284
4647F6343608j047253r56204n85231J54811o41870j299352m14353m40005q30351
4638F0283800l63262r25086m71537j437204q53293l66358j07103j791651j292587
4629E2675719l53383j753686l58903q37123j347133q62748m06051j232583q98616
4620D4625493p39981j597635q48446L69298q33538j241946j245294l43650p47918
4611C7396383j40056p58108n85107j285007K20959n36352j652711L52600j773233
4602C1239368p59408J78031o76583o63509N30952j612455q6669j28097n55704
$$ plain form
4666 73135508 73214436 72824087 72290253 72194362 71532459 71200956 70858728 71575553 70872785 70449610
4656 70449610 70311681 70229617 69176974 68926938 67773597 67551024 67279911 66269324 66343608
4647 66343608 65296355 64340151 63754920 63909731 63267861 61968509 61554156 61114151 60283800
4638 60283800 59920538 58995452 58523915 57086711 56233418 55867060 55759957 53968306 52675719
4629 52675719 52322336 50568650 50209747 49372624 48025491 47162743 46756692 45524109 44625493
4620 44625493 43885512 42287877 41439431 41808729 40975191 39733245 38487951 38144301 37396383
4611 37396383 37256327 36498219 35913112 34628105 34849064 34312712 32660001 33012601 31239368
4602 31239368 30479960 30657991 29981408 29317899 29848851 28236396 28149727 28021630 27465926
4593B7465926j060417k17411l02823l21159r95059j14073o61640o44833l90257
4584B2758254m4434O40287j076196n24762n61829K00240m40577L5495n86061n61939
4574A9838478p75493o02555N83957L7781j196261J72630J82374j242156p56334
4565A6242421N36634L4582p28222L81235k81667o81287l01376j92332l90380p6263
4555A4543345m21456J24824k33927K60999n88331n02572L06789p529j74176l87251
4545A2920715l0650M20687q94971J16943o7461r69961J012402p9079m38326o01846
4535A1388453P18133L89843r86595p7882m65777q6983k83093J78784m77699J40373
4525A0437557L02480j45598p0892j02060k81804k12034O09259J26814q37045J33723
$$ plain form
4593 27465926 26405509 26188098 25885275 25564116 24569057 24454984 23793344 23148511 22758254
4584 22758254 22713820 23354107 22277911 21753149 21191320 21391560 20950983 20986478 20400417 19838478
4574 19838478 19062985 18460430 19044387 19082168 17885907 18058537 18240911 16998755 16242421
4565 16242421 16779055 16813637 16085415 16466650 16184983 15503696 15202320 15009988 14619608 14543345
4555 14543345 14121889 14246713 14012786 14273785 13685454 13182882 13489671 13482142 13307966 12920715
4545 12920715 12890065 13310752 12415781 12532724 12465263 11495302 12507704 12428625 11990299 11388453
4535 11388453 12106586 12496429 11509834 11431952 10966175 10879192 10596099 10774883 10297184 10437557
4525 10437557 10740037 10594439 10523547 10421487 10139683 9927649 10536908 10663722 9826677 9960400
4515I960400j87274k45424N06190r1628R213o06575j08297j69380J109495l25921
4505I850799j317536Q39985o46483J255423j396100Q2565r290J09111l18065L27747
4495H778156P47806j40378p12687R2600j8954M06754l71241J1682M23649p53566
4485H463821p66580J055335m60074J38903n0240m89090j88418J98025j18339k56614
4475G526729K60926j2812j14240M36950N38045j292296M30692M62521J75945l46334
4465H066126n2438o7167J69186k27926o79648M16819J375713j365055P71135o99526
4455G707219P58482l93719l3238l45285k17375K54563J23003n25471K5789m82113
4445F871855M44978J31363n9473k11615L75606l55453j60389L93941m41201j48488
$$ plain form
4515 9960400 9773126 9527702 10033892 9942264 9951477 9344902 9236605 9067225 10176720 9850799
4505 9850799 8533263 9373248 8726765 9982188 8586088 8668653 8659363 8768474 8450409 8778156
4495 8778156 9525962 9385584 8672897 8765497 8746543 9153297 8782056 8793738 9217387 8463821
4485 8463821 7697241 8752576 8292502 8431405 8381165 7892075 7703657 7901682 7783343 7526729
4475 7526729 7787655 7774843 7660603 8097553 8635598 7343302 7773994 8236515 8412460 8066126
4465 8066126 8013688 7946521 8115707 7887781 7208133 7624952 9000665 7635610 8406745 7707219
4455 7707219 8465701 8071982 8038744 7693459 7476084 7730647 7853650 7328179 7353968 6871855
4445 6871855 7316833 7448196 7388723 7177108 7552714 7197261 7036872 7430813 6989612 6841124
4435F841124m30328K57922M26697l30353j187345Q34826M71092K84844j114632
4426F053847J166163r71289M03884r59435J151879J2434j47942K75318o94576
4417F290283P36884p44126M60960n86289J46975M44170p5733q76094Q90732K23180
4407F910942K05442l62380K01302k53142l60014Q33141l39180l35978J054280
4398G554413m70472l03682L66049O00267J01177K49091j022133J16169L26459
4389G517338j70873L42507k1394M40161m31423K79769l5734n29958J113591q33247
4379G670737Q89888o68973R77216p01759J081568p35255Q15534J03695l91464
4370I041187O0837Q8804m10948J156974P78783K1182K49546J17593j94934k4269
$$ plain form
4435 6841124 6410796 6668718 7095415 6765062 5577717 6412543 6883635 7168479 6053847
4426 6053847 7220010 6248721 6652605 5693170 6845049 6857483 6709541 6984859 6290283
4417 6290283 7027167 6283041 6744001 6157712 6304687 6748857 6673124 5797030 6687762 6910942
4407 6910942 7116384 6754004 6955306 6702164 6342150 7175291 6836111 6500133 7554413
4398 7554413 7083941 6780259 7146308 7746575 7847752 8096843 7074710 7190879 7517338
4389 7517338 7346465 7688972 7667578 8107739 7676316 7956085 7920351 7390393 8503984 7670737
4379 7670737 8560625 7891652 8868868 8167109 9248677 8513422 9328956 9432651 9041187
4370 9041187 9102024 9190828 8779880 9936854 10715637 10736819 10986365 11103958 10909024 10884755
4360A0884755j075133Q43801o10028N04410m0809J96352J22591P51901k82878
4351A1294962j44822m76464J331125l35264O33141M53230k77426N19416O45780
4342A3643678N50435M67226J167100k22298O9889N76772P15454J233965J531957
4333A9734178J31935J347592J678526L16355J472872Q72537J190905J938391K371406
4324C1054697J945555L067292L411274N675735O239606P928039O258697J165529
4316F6746424l072618k589233j570804l021365m559923m052142n333821m663836
4308C7882682k411116l117944l747309j576285j585682j466304j474869l99867
4300B2103306j750016j307407J17163j334886n90605o64005K3770p33528l83877
$$ plain form
4360 10884755 9809622 10653423 10043395 10547805 10506996 10703348 10825939 11577840 11294962
4351 11294962 11150140 10673676 12004801 11669537 12302678 12755908 12478482 12997898 13643678
4342 13643678 14194113 14661339 15828439 15606141 15676030 16252802 16968256 18202221 19734178
4333 19734178 19866113 21213705 22892231 23208586 24681458 25553995 26744900 28683291 31054697
4324 31054697 33000252 36067544 39478818 45154553 51394159 59322198 65580895 66746424
4316 66746424 63673806 61084573 59513769 56492404 51932481 47880339 42546518 37882682
4308 37882682 35471566 32353622 28606313 27030028 25444346 23978042 22503173 22103306
4300 22103306 20353290 19045883 19163046 17828160 17237555 16573550 16597320 15863792 15479915
4291A5479915j310551R4226r23547k37291J606k98491K64364j056059l84948j04920
4281A1524304q99392L6757n80868Q5726K63109j119270j53454J06660n82046j77272
4271H504254O63970n48143j64985J37857o13522n21953J81933K35954o6807k65378
4261G543180J23132l95894k62711L7929k76152m47294m48058R67577r52732L58553
4251F247530Q58857p87928o22334P41171J10611k85149m41140n76583O73499k99022
4241E619512m45226L32205k46469M11781J65716m52646J36959k80042l15852j10081
4231D815857j52342P14131j62207p90726O26547k33190k491m33597M01059m65448
4221D317593N10308m00751j35967k41339j52448M99111l9219J67688k3191p68467
$$ plain form
4291 15479915 14169364 14263590 13340043 13102752 13104358 12805867 13070231 12014172 11629224 11524304
4281 11524304 10624912 10661669 10080801 10166527 10429636 9310366 9156912 9263572 8681526 8504254
4271 8504254 9168224 8620081 8455096 8592953 7979431 7457478 7639411 7875365 7808558 7543180
4261 7543180 7666312 7270418 7007707 7045636 6769484 6322190 5874132 6841709 5888977 6247530
4251 6247530 7106387 6318459 5696125 6437296 6547907 6262758 5821618 5245035 5918534 5619512
4241 5619512 5174286 5506491 5260022 5671803 5837519 5384873 5521832 5241790 4925938 4815857
4231 4815857 4663515 5377646 5215439 4424713 5051260 4818070 4815579 4381982 4783041 4317593
4221 4317593 4827901 4427150 4291183 4049844 3897396 4396507 4357288 4524976 4501785 3733318
4211C733318M863J46648J01785P41586p95793L13614j49297k90126R12890j24825
4201D594663n00152J67991l48546J90759o36434N47827j39835l47834l28179J120127
4191D320387j282609L34066K61379n82646J10644K72915M36531l08485j67811
4182C394371j38312m41555K17422m1001M71289r3493k58347L67829J05386p55939
4172B827650r6410P61994k33512l07245R361O99729j28965o91301J78735O80184
4162C700220k00926j20522M69508j032883J30146N22586r00624N53456o99633
4153B421328Q23548N53481j342587Q46155n61604n61627P23568l95338l2532N67959
4143C042351O76960o96736o81753Q13693j65423m89915M9256l30261L91474M33717
$$ plain form
4211 3733318 3738181 3884829 3986614 4728200 3932407 4246021 4096724 3806598 4719488 4594663
4201 4594663 4094511 4262502 3913956 4104715 3468281 4016108 3876273 3528439 3200260 4320387
4191 4320387 3037778 3371844 3633223 3050577 3161221 3434136 3870667 3562182 3394371
4182 3394371 3256059 2814504 3031926 2990925 3462214 3368721 3110374 3478203 3583589 2827650
4172 2827650 2731240 3493234 3259722 2952477 2961838 3661567 3532602 2841301 3020036 3700220
4162 3700220 3499294 3378772 3848280 2815397 2945543 3468129 2567505 3120961 2421328
4153 2421328 3244876 3798357 2455770 3301925 2740321 2178694 2902262 2506924 2474392 3042351
4143 3042351 3719311 3022575 2340822 3154515 2989092 2499177 2548433 2218172 2609646 3043363
4133C043363O03682j016165m56155J353420o19913l69059N87797J12098j102163
4124B136905L43202N47818l98197L22252j032518P29693Q01465r00940O90984
4115C240664j618927Q96709N34597q79951O17012L18104m99684p10056Q28262
4106B726730m91281P46596K94679l17790k89599j65183L76316m83116K90474J11436
4096B799262M70808o46959n03352P44183k82112R601l53739P75568m70889J171785
4086C714156m85372N3077k74241j44558K36749k43688J22416m295L73963K55215
4076C603422p87726L5649N38276J07668m25710K36675M6142p9573k03084j7386
4066C054353l51191l5469J90697L78712m887L95406j26238L41448l7715K75849
$$ plain form
4133 3043363 3647045 2630880 2174725 3528145 2908232 2539173 3126970 3239068 2136905
4124 2136905 2480107 3027925 2629728 2951980 1919462 2649155 3450620 2549680 3240664
4115 3240664 1621737 2518446 3053043 2173092 2790104 3108208 2608524 1898468 2726730
4106 2726730 2235449 2982045 3276724 2958934 2669335 2504152 2880468 2397352 2687826 2799262
4096 2799262 3270070 2623111 2119759 2863942 2581830 2591431 2237692 3013260 2542371 3714156
4086 3714156 3228784 3281861 3007620 2863062 3099811 2856123 2978539 2974244 3348207 3603422
4076 3603422 2815696 2851345 3389621 3497289 3071579 3308254 3354396 3274823 3071739 3054353
4066 3054353 2703162 2667693 2858390 3237102 3232215 3627621 3501383 3842831 3805116 4080965
4056D080965j14594M18122O7881m33389P48213r82512R81782l60196P07777j33670
4046D980379r16956P72720j1159K83327J1346N27284j292037J000549j31501K42485
4036E466437M22977o35066J68953J43896k51724M00751p9655M53911k24585j47852
4026E718043J067417o00225P44932O61383n71725J104670J71154J009761m42137
4017H863273k30970n70350K81131n51256o60162j43019K00061q79636K7527K05077
4007F541676O37233n3204k7712J01511l20609l63934J053059k19273k30197N24456
3997G643006j23892n5928k41839N81563K61341l18099n16470o05205R15300k58232
3987G281545n41944n23244L76395j473154P60238M37477p64319O55866n57543
$$ plain form
4056 4080965 3966371 4384493 4452374 4018985 4767198 3784686 4766468 4406272 5114049 4980379
4046 4980379 4063423 4836143 4824984 5108311 5119657 5646941 4354904 5355453 5223952 5466437
4036 5466437 5889414 5254348 5423301 5567197 5315473 5716224 5636569 6090480 5865895 5718043
4026 5718043 6785460 6185235 6930167 7591550 7019825 8124495 8295649 9305410 8863273
4017 8863273 8632303 8061953 8343084 7791828 7131666 6988647 7188708 6309072 6336599 6541676
4007 6541676 7178909 7125705 7097993 7199504 6878895 6514961 7568020 7348747 7118550 7643006
3997 7643006 7519114 7463186 7221347 7802910 8064251 7746152 7229682 6624477 7539777 7281545
3987 7281545 6739601 6216357 6592752 5119598 5879836 6317313 5552994 6208860 5651317
3978E651317l68492l26733J80597N59850n44562k17434J72644M3001n28822J1283
3968D632649j3015K24236m25075r41748l24466J59072l06082Q20717k76416k75988
3958C273884N3691J23986j90091n86016N58314p35783K30462k92604K96836m23573
3948B309106O76007J63162q77323l61515O0879O91421o61832N03675O083o91141
3938A818522k94545j69244R28445n65013N98429j178486P79560j92916J60134
3929A884886k12158o10911L02479N92542k24522k86599K62399J9907k01195m58114
3919A068714N75549m1225m63354J65270J326322j004465n69565N5206P40556J63955
3909B016963L8222j013146J017666m70781k27222N6546o98121M44893j09112L29488
$$ plain form
3978 5651317 5282825 4956092 5136689 5696539 5151977 4934543 5107187 5150188 4621366 4632649
3968 4632649 4619634 4843870 4418795 3477047 3152581 3311653 3005571 3826288 3549872 3273884
3958 3273884 3327575 3451561 3261470 2675454 3233768 2497985 2728447 2435843 2732679 2309106
3948 2309106 2985113 3148275 2270952 1909437 1970316 2661737 1999905 2503580 2509663 1818522
3938 1818522 1523977 1354733 2283178 1718165 2316594 1138108 1917668 1724752 1884886
3929 1884886 1672728 1061817 1364296 1956838 1732316 1445717 1708116 1728023 1526828 1068714
3919 1068714 1644263 1603038 1139684 1304954 2631276 1626811 1057246 1112452 1853008 2016963
3909 2016963 2055185 1042039 2059705 1588924 1361702 1418248 720127 1165020 1055908 1385396
3899A385396l41818k00603O79107k98883o0881M93064L0926j073693M89773K78919
3889A381307R3028n63080n0873k35242J30154J358443j504622P24986k47951k37279
3879H48871k09371l79052K67994J001840p96347q6859O54042J93381j058504J135188
3869A571183n15188K73647k73069n57124L62688N55755p24288L3064N04555j084133
3859A47090Q08654k40847K61451K76974K87357o93135l47178P6977K73374n32455
3849C18262k8310K67154l27161O65783K00887m71408J47101N09702p16501q1804
3839D83705k28523L82062q99255J076256j98690J28287n27712J262589l13419
3830A165300j369814R27048K94692k97040p88385k66937J563264l80945j23004
$$ plain form
3899 1385396 1043578 842975 1522082 1223199 1162318 1655382 1686308 612615 1102388 1381307
3889 1381307 1474335 911255 860382 625140 755294 2113737 609115 1334101 1086150 848871
3879 848871 639500 260448 528442 1530282 733935 647076 1301118 1494499 435995 1571183
3869 1571183 1055995 1329642 1056573 499449 862137 1417892 693604 726668 1231223 147090
3859 147090 955744 714897 976348 1253322 1540679 847544 500366 577343 850717 318262
3849 318262 289952 557106 229945 895728 1096615 625207 772308 1282010 565509 483705
3839 483705 255182 637244 -262011 814245 615555 743842 216130 1478719 1165300
3830 1165300 -204514 722534 1017226 720186 -68199 -335136 1228128 847183 724179
3821G24179p70114O47990j25752J86960q0515m85719K81263L94186k96720M02255
3811H78013n93467k20305O64377N2692p73762l8109K16396O84670p89892P00402
3801G81015l03131J73284N45378q44686R65516m15845R2146o73521L78229Q6048
3791G84433N74663j494005O70854k36981j025290J158887L84788K1693L23092
3782A162134o16128l0784m13603Q45516k85021N10785o09835k30595N90057n27078
3772C95448O15348k33450l4669L86543j229185L71539q3829J23785j61008K04229
3762C54751P28544j595970N34750O84069m9736l41786J71157O54313r35694j92110
3752A2288J09117K33967L55766r31277J55105J64913K07976K04679L00529j590524
$$ plain form
3821 724179 -45935 602055 476303 663263 582748 97029 378292 772478 475758 878013
3811 878013 284546 64241 728618 781310 7548 -30561 185835 870505 80613 781015
3801 781015 477884 651168 1196546 351860 1317376 901531 993677 320156 698385 784433
3791 784433 1359096 -134909 535945 298964 -726326 432561 817349 839042 1162134
3782 1162134 546006 515222 101619 947135 662114 1172899 563064 332469 922526 395448
3772 395448 1010796 777346 742677 1129220 -99965 271574 187745 311530 150522 354751
3762 354751 1083295 -512675 22075 706144 656408 314622 485779 1140092 204398 12288
3752 12288 121405 355372 711138 -220139 -65034 99879 307855 512534 813063 -777461
3742g77461J310066J02550k08966p23665K61314l28834L26435M48155M95143l53076
3732E51661R8571l42269k05969M40730k82647J089310p22273l11853M88570o50615
3722A53216k10041J22822R850k3933L60233L46897n01220P97230l41987k55113
3712D57954j93824m5497M85414p54803M85230J89212n65866M03271j90539k46279
3702B4273j54768Q9838L60269N00109N33076k49330n92288j40329k99404m47938
3692c76492L58086M8042m11128P29795k39570j02076L79690J87239j057511N47607
3682F3682k50024M85967L06896J78361k66568N57464m4082p80554J44725p1120
3672C24747M68959o1621k51972O03565j085063j78889k07282Q97932k81996m08481
$$ plain form
3742 -777461 532605 635155 426189 -297476 -36162 -364996 -38561 409594 904737 551661
3732 551661 650232 307963 101994 542724 260077 1349387 627114 315261 803831 153216
3722 153216 -56825 65997 75847 51914 412147 759044 257824 1055054 713067 457954
3712 457954 264130 218633 704047 -50756 434474 623686 57820 461091 270552 24273
3702 24273 -130495 -40657 319612 819721 1352797 1103467 511179 370850 71446 -376492
3692 -376492 -18406 29636 -381492 348303 108733 6657 386347 573586 -483925 63682
3682 63682 -186342 299625 606521 784882 518314 1075778 1031696 251142 395867 324747
3672 324747 793706 732085 480113 1083678 -1385 -180274 -387556 510376 228380 -180101
3662a80101J413343j178025k4722Q29033m97072L72227k64736J22749o06515O9860
3652E6041M47953J74847N50363p77734P00832o20214n81003L29263J07138K41998
3642F29484J7882L112p2482N6725J47873l93844R77098q46146M01705n37465Q2557
3631D66499l34416O28365K10965o84789L10211J93298J27937J09106L98058k93208
3621A132026k51920p57349J164594o9247k93681P05279k87913l3476k48029R716
3611A070000N76680p23592J29536J49191m16446p46021L19202j3811L93264m55406
3601B82597M18679O8513J12497n46217M85111o8715l03527O7346k41385n9817
3591B15082L19982k76230J92648l45965k62969J130444n50955k07977M7813K05874
$$ plain form
3662 -180101 1233242 55217 30495 859528 362456 734683 469947 592696 -13819 56041
3652 56041 503994 678841 1229204 451470 1152302 532088 -48915 280348 387486 629484
3642 629484 647366 650478 577996 634721 782594 388750 1365848 519702 921407 383942 466499
3631 466499 132083 760448 971413 286624 596835 790133 918070 1027176 1425234 1132026
3621 1132026 880106 122757 1287351 1218104 924423 1629702 1341789 1308313 1060284 1070000
3611 1070000 1646680 923088 1052624 1201815 785369 39348 358550 344739 738003 282597
3601 282597 701276 769789 882286 336069 821180 752465 448938 516284 274899 215082
3591 215082 535064 258834 451482 105517 -157452 972992 422037 214060 261873 467747
3581D67747J063746j062702j47365K3062J43570l51048M85568k38170L24131k53582
3571D54957L34550j44745N23092l30522M86951j97545o23049J58904J58147o94336
3561A26404J106000q02544Q49418j143219N22236M68308k055J254676j102587
3552A276637K01331q28961J25176J06736Q0720M26704P48434r36508J48827K75075
3542A624171j6184P22216P0465j77337P15744j04124K26686n51370o78728M47043
3532B278582L99069n84702J260319n12902P15082J211489O60651J128597j604692
3523D951493j243393m32581o31461j6924M96173j105621N69895o00006m96223
3514A491352Q41499j71595k1687l48808L76051J95696L52126Q07795M92364j316035
$$ plain form
3581 467747 1531493 468791 321426 344488 488058 137010 622578 384408 708539 454957
3571 454957 789507 644762 1167854 837332 1324283 1126738 503689 662593 820740 126404
3561 126404 1232404 429860 1279278 136059 658295 1126603 1124548 2379224 1276637
3552 1276637 1477968 649007 774183 880919 961639 1388343 2136777 1200269 1349096 1624171
3542 1624171 1607987 2330203 2400668 2223331 2939075 2834951 3061637 2510267 1831539 2278582
3532 2278582 2677651 2092949 3353268 2840366 3555448 4766937 5427588 6556185 4951493
3523 4951493 3708100 3275519 2644058 2627134 3123307 2017686 2587581 1987575 1491352
3514 1491352 2332851 2161256 2139569 1790761 2166812 2362508 2714634 3522429 4014793 2698758
3504B698758n20626k49402K27945m78206R888L53381r39590k37169L93090N02727
3494A760796J15460j78399l87806K96987j02586n15092n6400r6233P10435r29379
3484F17783P49373n46228M3106l05107N80741L47306p53575M75288K26641j19279
3474A316049Q276K5321Q76876k83549j066013J667656n47764m06657L04297M66656
3464B361148r02182J70491k02579K38945L44624N6133K86310m52344K62219L80284
3454B543049n6522N30937k49399j03353M75143M69226J422198J023041J189179
3445G243499Q41875j157643k605747k38434L38702p36132m50580R56308J0977
3436D202825J104392k80214M23201l05498K26766K50734j63852N49732K96637
$$ plain form
3504 2698758 2178132 1928730 2156675 1678469 1688357 2041738 1102148 864979 1258069 1760796
3494 1760796 1876256 1697857 1310051 1607038 1504452 989360 932960 836727 1547162 617783
3484 617783 1367156 820928 864034 558927 1139668 1486974 733399 1208687 1435328 1316049
3474 1316049 1324325 1349646 2226522 1942973 876960 2544616 1996852 1590195 1894492 2361148
3464 2361148 1458966 1629457 1426878 1665823 2010447 2066580 2352890 1900546 2162765 2543049
3454 2543049 2486527 3017464 2768065 2664712 3139855 3609081 5031279 6054320 7243499
3445 7243499 8085374 6927731 4321984 4083550 4422252 3686120 3235540 4191848 4202825
3436 4202825 5307217 5027003 5450204 5144706 5371472 5622206 5458354 6008086 6304723
3427F304723J836544J362193J996811L759270M754614K765353l715827n873498
3419A3190183k792944j107539j939239j366452M85214q07892m24986k97029J94708
3410E134024M10795m56425o67137J62606M77179j305206j45241R4170P96313q95694
3400C605384J038171J039386j480427M78596m28633L14004M29749m48964K74904
3391D822170n34233M42100J04432j03656K32643L3028Q80950N31423M92892O75949
$$ plain form
3427 6304723 8141267 9503460 11500271 15259541 20014155 22779508 19063681 13190183
3419 13190183 10397239 9289700 7350461 5984009 6469223 5661331 5236345 4939316 5134024
3410 5134024 5544819 5088394 4421257 4583863 5061042 3755836 3610595 3704765 4501078 3605384
3400 3605384 4643555 5682941 4202514 4681110 4252477 4566481 4996230 4547266 4822170
3391 4822170 4287937 4730037 4834469 4730813 4963456 4996484 5877434 6408857 6901749 7577698
$$ [...]
##END NTUPLES=NMR SPECTRUM
##END=
