##TITLE=abcd
##JCAMPDX= 6.0         $$ Bruker NMR JCAMP-DX V2.0
##DATA TYPE= NMR FID
##DATA CLASS= NTUPLES
##ORIGIN= UXNMR, Bruker Analytische Messtechnik GmbH
##OWNER= root
$$ XWIN-NMR		Version 3.5
$$ Thu Jun 26 19:03:12 2025 Russian Standard Time (UT+4h)  servis@DPX200
##.OBSERVE FREQUENCY= 200.131235884673
##.OBSERVE NUCLEUS= ^1H
##.DELAY= (6, 6)
##.ACQUISITION MODE= SIMULTANEOUS
##.ACQUISITION SCHEME= undefined
##.AVERAGES= 32
##.DIGITISER RES= 18
##SPECTROMETER/DATA SYSTEM= spect
##.PULSE SEQUENCE= zg
##.SOLVENT NAME= CDCl3
##.SHIFT REFERENCE= (INTERNAL, CDCl3, 0, 16.5164)
##AUDIT TRAIL= $$ (NUMBER, WHEN, WHO, WHERE, WHAT)
$$ ##TITLE= Audit trail, XWIN-NMR		Version 3.5
$$ ##JCAMPDX= 5.01
$$ ##ORIGIN= Bruker BioSpin GmbH
$$ ##OWNER= servis
$$ F:\spectra/data/av/nmr/H1/1/audita.txt
$$ ##AUDIT TRAIL=  $$ (NUMBER, WHEN, WHO, WHERE, WHAT)
(   1,<2025-06-26 19:00:58.17 +0400>,<servis>,<DPX200>,
      <created by zg, POWCHK disabled, PULCHK disabled
       configuration hash MD5:
       00 E9 B6 7A A2 85 ED C7 34 08 36 98 17 FE 4E 26
       data hash MD5: 32K
       F5 A3 11 56 94 8D B8 CD 0A A2 7B A8 CD CC 28 15>)
$$ ##END=
$$ 
$$ hash MD5
$$ 21 92 F2 EB 43 47 28 CE 5A C5 78 22 F8 D4 08 F4
##$RELAX= 
##$RELAX= 
##$RELAX= 
##$RELAX= 
##$RELAX= 
##$RELAX= 
##$RELAX= 
##$RELAX= 
$$ Bruker specific parameters
$$ --------------------------
##$DU= <F:\spectra>
##$EXPNO= 1
##$NAME= <H1>
##$PROCNO= 1
##$TYPE= <nmr>
##$USER= <av>
##$AMP= (0..31)
100 100 100 100 100 100 100 100 100 100 100 100 100 100 100 100 100 100 
100 100 100 100 100 100 100 100 100 100 100 100 100 100 
##$AQSEQ= 0
##$AQ_mod= 1
##$AUNM= <au_zg>
##$AUTOPOS= <>
##$BF1= 200.13
##$BF2= 200.13
##$BF3= 200.13
##$BF4= 200.13
##$BF5= 500.13
##$BF6= 500.13
##$BF7= 500.13
##$BF8= 500.13
##$BYTORDA= 1
##$CFDGTYP= 0
##$CFRGTYP= 5
##$CHEMSTR= <none>
##$CNST= (0..31)
1 1 145 1 1 1 1 1 1 1 1 1 1 1 1 1 1 1 1 1 1 1 1 1 1 1 1 1 1 1 1 1 
##$CPDPRG= <>
##$CPDPRG1= <>
##$CPDPRG2= <>
##$CPDPRG3= <>
##$CPDPRG4= <mlev>
##$CPDPRG5= <mlev>
##$CPDPRG6= <mlev>
##$CPDPRG7= <mlev>
##$CPDPRG8= <mlev>
##$CPDPRGB= <>
##$CPDPRGT= <>
##$D= (0..31)
0 2 0 0 0 0 0 0 0 0.06 0 0 0 0 0 0 0.0002 0 0 0 0 0 0 0 0 0 0 0 0 0 0 
0 
##$DATE= 1750950057
##$DBL= (0..7)
120 120 120 120 120 120 120 120 
##$DBP= (0..7)
150 150 150 150 150 150 150 150 
##$DBP07= 0
##$DBPNAM0= <>
##$DBPNAM1= <>
##$DBPNAM2= <>
##$DBPNAM3= <>
##$DBPNAM4= <>
##$DBPNAM5= <>
##$DBPNAM6= <>
##$DBPNAM7= <>
##$DBPOAL= (0..7)
0.5 0.5 0.5 0.5 0.5 0.5 0.5 0.5 
##$DBPOFFS= (0..7)
0 0 0 0 0 0 0 0 
##$DE= 6
##$DECBNUC= <off>
##$DECIM= 32
##$DECNUC= <off>
##$DECSTAT= 4
##$DIGMOD= 1
##$DIGTYP= 9
##$DL= (0..7)
0 120 120 120 120 120 120 120 
##$DP= (0..7)
150 150 150 150 150 150 150 150 
##$DP07= 0
##$DPNAME0= <>
##$DPNAME1= <>
##$DPNAME2= <>
##$DPNAME3= <>
##$DPNAME4= <>
##$DPNAME5= <>
##$DPNAME6= <>
##$DPNAME7= <>
##$DPOAL= (0..7)
0.5 0.5 0.5 0.5 0.5 0.5 0.5 0.5 
##$DPOFFS= (0..7)
0 0 0 0 0 0 0 0 
##$DQDMODE= 0
##$DR= 18
##$DS= 0
##$DSLIST= <SSSSSSSSSSSSSSS>
##$DSPFIRM= 0
$$ [...]
##$SUBNAM0= <"">
##$SUBNAM1= <"">
##$SUBNAM2= <"">
##$SUBNAM3= <"">
##$SUBNAM4= <"">
##$SUBNAM5= <"">
##$SUBNAM6= <"">
##$SUBNAM7= <"">
##$SUBNAM8= <"">
##$SUBNAM9= <"">
##$SW= 20.6817932712277
##$SWIBOX= (0..15)
0 0 3 0 0 0 0 0 0 0 0 0 0 0 0 0 
##$SW_h= 4139.07284768212
##$TD= 32768
##$TD0= 1
##$TE= 0
##$TE2= 300
##$TE3= 300
##$TEG= 300
##$TL= (0..7)
0 120 120 120 120 120 120 120 
##$TP= (0..7)
150 150 150 150 150 150 150 150 
##$TP07= 0
##$TPNAME0= <>
##$TPNAME1= <>
##$TPNAME2= <>
##$TPNAME3= <>
##$TPNAME4= <>
##$TPNAME5= <>
##$TPNAME6= <>
##$TPNAME7= <>
##$TPOAL= (0..7)
0.5 0.5 0.5 0.5 0.5 0.5 0.5 0.5 
##$TPOFFS= (0..7)
0 0 0 0 0 0 0 0 
##$TUNHIN= 0
##$TUNHOUT= 0
##$TUNXOUT= 0
##$USERA1= <user>
##$USERA2= <user>
##$USERA3= <user>
##$USERA4= <user>
##$USERA5= <user>
##$V9= 5
##$VALIST= <valist>
##$VCLIST= <CCCCCCCCCCCCCCC>
##$VD= 0
##$VDLIST= <DDDDDDDDDDDDDDD>
##$VPLIST= <PPPPPPPPPPPPPPP>
##$VTLIST= <TTTTTTTTTTTTTTT>
##$WBST= 1024
##$WBSW= 30
##$XGAIN= (0..3)
0 0 0 0 
##$XL= 0
##$YL= 0
##$YMAX_a= 596816
##$YMIN_a= -521982
##$ZGOPTNS= <>
##$ZL1= 120
##$ZL2= 120
##$ZL3= 120
##$ZL4= 120
##$ABSF1= 10
##$ABSF2= 0
##$ABSG= 5
##$ABSL= 3
##$ALPHA= 0
##$AQORDER= 0
##$ASSFAC= 0
##$ASSFACI= 0
##$ASSFACX= 0
##$ASSWID= 0
##$AUNMP= <proc_1d>
##$AZFE= 0.1
##$AZFW= 0.1
##$BCFW= 1
##$BC_mod= 2
##$BYTORDP= 0
##$COROFFS= 0
##$CY= 19
##$DATMOD= 1
##$DC= 2
##$DFILT= <>
##$DTYPP= 0
##$F1P= 11.0000007629395
##$F2P= -0.999999237060547
##$FCOR= 0.5
##$FTSIZE= 0
##$FT_mod= 4
##$GAMMA= 1
##$GB= 1
##$INTBC= 1
##$INTSCL= 1
##$ISEN= 128
##$LB= 0.05
##$LEV0= 0
##$LPBIN= 0
##$MAXI= 10000
##$MC2= 0
##$MEAN= 0
##$ME_mod= 0
##$MI= 0
##$NCOEF= 0
##$NC_proc= 0
##$NLEV= 6
##$NOISF1= 0
##$NOISF2= 0
##$NSP= 1
##$NTH_PI= 0
##$NZP= 0
##$OFFSET= 16.51637
##$PC= 1
##$PHC0= -274.4733
##$PHC1= 1.101538
##$PH_mod= 0
##$PKNL= yes
##$PPARMOD= 0
##$PSCAL= 4
##$PSIGN= 0
##$REVERSE= no
##$SF= 200.13
##$SI= 16384
##$SIGF1= 0
##$SIGF2= 0
##$SINO= 400
##$SIOLD= 16384
##$SREGLST= <1H.CDCl3>
##$SSB= 0
##$STSI= 0
##$STSR= 0
##$SW_p= 4139.07284768211
##$SYMM= 0
##$S_DEV= 0
##$TDeff= 0
##$TDoff= 0
##$TI= <>
##$TILT= no
##$TM1= 0
##$TM2= 0
##$TOPLEV= 0
##$USERP1= <user>
##$USERP2= <user>
##$USERP3= <user>
##$USERP4= <user>
##$USERP5= <user>
##$WDW= 1
##$XDIM= 8192
##$YMAX_p= 0
##$YMIN_p= 0
$$ End of Bruker specific parameters
$$ ---------------------------------
##NTUPLES= NMR FID
##VAR_NAME=  TIME,          FID/REAL,        FID/IMAG
##SYMBOL=    X,             R,               I
##VAR_TYPE=  INDEPENDENT,   DEPENDENT,       DEPENDENT
##VAR_FORM=  AFFN,          ASDF,            ASDF
##VAR_DIM=   16384,         16384,           16384
##UNITS=     SECONDS,       ARBITRARY UNITS, ARBITRARY UNITS
##FACTOR=    0.0002416,     1,               1
##FIRST=     0,             0,               0
##LAST=      3.9581328,     0,               0
##MIN=       0,             -521982,         0
##MAX=       3.9581328,     596816,          0
$$ Real data points
##PAGE= N=1
##DATA TABLE= (X++(R..R)), XYDATA
0@%%%%%%%%%%%%%%%%%%%%%%%%%%%%%%%KqJ2k0L3m0M4m8N0n6O3o5O8p3P7q4R5j02
49e2J11j20J31j48J67j88K12k43K77l25L88m67N79p40R82j358K005l249O077j5002
69a0963R2577N15202j19159o44919l32871K41882M02476J25996j34884j53693
79a8356n9489l2210k3105P9588J99148J30213j39063l36032j74666K38905M19395
90B84328R6902l38334l42909K6855K73417J84433k2948j23596j03241m3067J0274
101i7886O9923J25527Q1363r3446k12875q8771J58305K19227J2490j90329j27086
112a43558Q3123J17232l9102q1968O7063J24230m4397j84045p7281J41074J99007
123A61378K2852j90350j81266M9286K04849Q6163j22230j28021M7799J20208k6122
$$ plain form
0 0 0 0 0 0 0 0 0 0 0 0 0 0 0 0 0 0 0 0 0 0 0 0 0 0 0 0 0 0 0 0 0 2 -6 6 -14 19 -21 23 -25 25 -31 32 -33 35 -38 39 -45 50 -52
49 -52 59 -61 70 -78 89 -99 113 -130 147 -178 210 -257 322 -418 564 -794 1211 -2038 4039 -10963
69 -10963 81614 596816 477657 -167262 -500133 -258251 144225 270221 135337 -18356
79 -18356 -77845 -110055 -133160 -53572 145576 275789 136726 -199306 -373972 -135067 284328
90 284328 381230 42896 -300013 -273158 259 184692 161744 38148 -65093 -108160 -97886
101 -97886 -27963 97564 178927 85481 -127394 -216165 -57860 161367 173857 -16472 -143558
112 -143558 -60435 56797 17695 -64273 2790 127020 82623 -101422 -178703 -37629 161378
123 161378 184230 -6120 -187386 -138100 66749 152912 30682 -97339 -49540 70668 44546
134D4546j47653j0207K00816J29313j64558k57074l376K55024J92802r2419k50610
145a03396j06832J42161J81378q02j21432m5221N0088J2337n5761o863J00160
156D5817Q5988p1278j66093m8059J38422J51698j2322j42647j05615L5643J18619
167C0173N5364n6700o0406J7447K3918l6362j9736O8705P0383m5833j16315k8289
179i7651J02388R0972m7107j07604r066Q6301M1457n7383o3742K2315Q4068L4910
191G9858p3541r0451K3744J08128L8610p4051o9100K2032N8160J765m9984j1509
203c6339O2490M3932o3400j00343P978J25959R2884o1333j51886n7257J11653
214b5662J34383j1038j12298n5094L2845L3107L446J5672L0641q307o7100n9710
$$ plain form
134 44546 -103107 -113314 87502 216815 52257 -204817 -208193 46831 239633 147214 -103396
145 -103396 -210228 -68067 113311 112509 -8923 -54144 -4056 8281 -47480 -54343 45817
156 45817 131805 60527 -105566 -153625 -15203 136495 124173 -18474 -124089 -88446 30173
167 30173 85537 28837 -31569 -14122 9796 -26566 -46302 22403 92786 46953 -69362 -97651
179 -97651 4737 95709 48602 -59002 -68068 18233 59690 2307 -61435 -39120 44948 79858
191 79858 6317 -84134 -60390 47738 86348 12297 -56803 -34771 23389 25154 -24830 -36339
203 -36339 26151 70083 6683 -93660 -85682 40277 133161 71828 -80058 -137315 -25662
214 -25662 108721 97683 -14615 -69709 -36864 -3757 -311 15361 46002 37695 -29405 -89115
226h9115L2830J08676O1865o2065j16624m4454P1490J08479K7822p9173q3965
237f4234K526N1961K6143N251J2526q035n0880m5202K5137Q4816N5317m8135j05380
250e8189l6629P4593Q8933K269p0864n5870J3992M9134J6142j9937k909J6986
262A7651j3806l8666J092N0344L5923k1200n4472k8795L1441N6663R644m7748
274a929l8447J5937L8870Q394k7871j7333K4703K5698k3643l6799J6815M6681
286C1076J947m1671k2171K0118K8679J346k5198j6413J6111K1821q296k2447k88
299a5386K2267J5453j1143k7825p062L0112K6309j8874l4836j596K5475J4151
311A7045j0227j8344l040J7542R232j7412j2255K1294K1872j6286l1054L37L2149
$$ plain form
226 -89115 -56285 52391 114256 52191 -64433 -108887 -37397 71082 98904 19731 -64234
237 -64234 -61708 -9747 16396 21647 34173 26138 -24742 -69944 -44807 40009 95326 47191 -58189
250 -58189 -94818 -20225 68708 70977 113 -55757 -41765 7369 23511 3574 665 17651
262 17651 3845 -34821 -33729 16615 52538 31338 -23134 -51929 -20488 36175 45819 -1929
274 -1929 -40376 -24439 14431 22825 -5046 -22379 2324 28022 4379 -32420 -15605 31076
286 31076 33023 -8648 -30819 -10701 17978 19324 -5874 -22287 -6176 15645 7349 -15098 -15386
299 -15386 6881 22334 11191 -16634 -23696 6416 32725 13851 -20985 -22581 2894 17045
311 17045 6818 -11526 -14566 2976 12208 -5204 -17459 3835 25707 9421 -21633 -21296 10853
324A0853K1767j9300l7544m035L3029J8576j7410j8396K207P452L122K152Q6O98
338C257L875n039j3974J221K1587J1927j5130k5191p664K1109K7245m031l1433
351a2241j2770J9585J7632l361q888j455K955R42n856l572J2635J2892j3382k4678
365a9562Q97K3321J2729r319j7673p568J1586J7176J52j2623m612M391K909J181
379B985m72k713J471K430q748q004J1692J5456p728j8599j732J4727J2384k713
393A0436j3958o880R650R311m270n506K026r07m762N41L454J792K967j141r589
408f836l897J1159J0714j918q544p466m57R621P775n936q733J748K145m418r72
423f015O737O433q27r645j0210N495J8612N867j2918r753J018J491K644P276K997
$$ plain form
324 10853 32620 13320 -24224 -28259 4770 23346 5936 -12460 -10253 -2801 321 2473 2559 3257
338 3257 7132 2093 -11881 -10660 10927 22854 7724 -17467 -25131 -4022 23223 19192 -12241
351 -12241 -25011 -5426 12206 8845 -43 -1498 1457 2399 -3457 -7029 5606 18498 5116 -19562
365 -19562 -18665 4656 17385 8066 -9607 -17175 -5589 11587 11739 -884 -5496 -1105 1804 2985
379 2985 2513 -200 1271 3701 -5047 -13051 -1359 14097 6369 -12230 -13962 765 13149 10436
393 10436 -3522 -10402 -752 8559 4289 -1217 809 -98 -4860 -4319 -865 927 3894 2753 -6836
408 -6836 -10733 426 11140 9222 678 -6788 -7245 2376 10151 4215 -4518 -2770 -625 -5043 -6015
423 -6015 722 7155 6328 -3317 -13527 -8032 10580 16447 3529 -6224 -5206 -3715 -1071 6205 9202
438I202o488j0067n713L688J3095R027n093j0291o172k273O743J7351P481j4059
452F431j8196l867Q080J3149J0350l290j6910j4389k47J5046K1255O099j9788
465C723k2917J68J7075J5170M925o667j6005j1500J238J0595J5630J0309j1094
478A0650k7322j3059J5790K7125J5218q839k8633k0453J0595K9176J7129p231
490B0146k2653j9004J698J7456J3543K492k868j1911j8328l779J9670K3754O583
503B6799j5008k7279j5267J5614L2690J5884j5145l1462k0044J1283L1658J7033
515B6756j1444k0649j1464O1J0924J6075P218m155j0487j4846r687J0557K5645
528A4504J3831j1864k8837k2747Q107L7831K7842j4568l8745j9960J5299L1190
$$ plain form
438 9202 2714 -7353 -13066 -9378 3717 12744 7651 -2640 -8812 -11085 -4342 13009 20490 6431
452 6431 -11765 -15632 -7552 5597 15947 12657 -4253 -18642 -18889 -3843 17412 23511 3723
465 3723 -19194 -19026 -1951 13219 18144 11477 -4528 -16028 -14790 -4195 11435 21744 10650
478 10650 -16672 -29731 -13941 13184 28402 19563 -9070 -29523 -18928 10248 27377 20146
490 20146 -2507 -21511 -19813 -2357 11186 13678 10810 -1101 -19429 -23208 -3538 20216 26799
503 26799 11791 -15488 -30755 -15141 17549 33433 18288 -13174 -33218 -21935 9723 26756
515 26756 15312 -5337 -16801 -16740 -5816 10259 17477 13322 2835 -12011 -21698 -11141 14504
528 14504 28335 16471 -12366 -35113 -27006 10825 38667 24099 -14646 -34606 -19307 11883
540A1883J5369j2092j9042n165J221k579N343J6729R578j0530k3097j8780O026
553b5136L5444L1300j1923m5366k9229J8033M5603K5708k0238m0138j5462J5967
565a5437K0383R659J82q208j3020r419k993Q991K4447J8721j4290l7040k0288
578c8312J7057L9164K6407j4953m6010k9801J7791M3973K4817j6359l8036j9494
590c3756J5551K4996Q723k119l522j0043j3917l503J0720J8504J5863m836l3671
603a1010l1090J0932M6105L1806j7989m9653k7068K5608M4890J3805k1890k5701
615a1255p763Q469J3172M792j300L924J324j8680k3329O878L6882K6805j4441
628B5478m3700k7816K1309M7896K1513k3748l8418j6186J5348K9112J4440j0417
$$ plain form
540 11883 27252 15160 -3882 -9047 -7826 -10405 -5062 11667 21245 10715 -12382 -31162 -25136
553 -25136 10308 41608 29685 -15681 -44910 -26877 18726 44434 24196 -15942 -31404 -15437
565 -15437 4946 14605 14787 6579 -6441 -15860 -18853 -9862 14585 33306 19016 -18024 -38312
578 -38312 -21255 17909 44316 29363 -16647 -46448 -28657 15316 40133 23774 -14262 -33756
590 -33756 -18205 6791 15514 13395 9873 -170 -14087 -17590 -6870 11634 27497 22661 -11010
603 -11010 -42100 -31168 14937 46743 28754 -20899 -47967 -22359 22531 36336 14446 -11255
615 -11255 -19018 -10549 2623 7415 6115 10039 11363 -7317 -30646 -23768 13114 39919 25478
628 25478 -18222 -46038 -24729 23167 44680 20932 -17486 -33672 -18324 10788 25228 14811
640A4811j7863r288l305K124J4121J6853L071j3667k1861j3569J2551L4612K0731
653C9321j8246l9492k1878J7333M0652K2482k0412l8728j5928J6515K8158J5820
665B5597p957k2189j2340N416R655O532P626L643j0075j9669j1232J0958K9881
678A5846J8099k0251l9266j1091K8199L3120M857k3318k5298j688J9160J5341
690A3710j284q355o753l650J64J567J973P208Q543o711j9735o713J6368J9309
704A5641K556j3793j6400k654J2828J2632k49p900p596l198L057N605J684l99
718A814K036j556p544k743O148P092L688l57r157j1954J397J4962J0446m790j4353
733d871r661M505J3176O604m125o285m063j278M123O192J341j094k78o115r420
$$ plain form
640 14811 -3052 -12340 -15645 -13521 600 17453 20524 6857 -15004 -28573 -16022 18590 39321
653 39321 21075 -18417 -40295 -22962 17690 40172 19760 -18968 -34896 -18381 9777 25597
665 25597 17640 -4549 -16889 -11473 -1818 4714 12340 15983 5908 -13761 -24993 -14035 15846
678 15846 33945 13694 -25572 -36663 -8464 24656 29513 6195 -19103 -20791 -1631 13710
690 13710 12426 4071 -2682 -6332 -6168 -4601 -2628 4580 13123 6412 -13323 -20036 -3668 15641
704 15641 18197 4404 -11996 -14650 -1822 10810 10561 2661 -4935 -8133 -5076 529 2213 1814
718 1814 3850 2294 -5250 -7993 -1845 5247 8935 8578 -579 -12533 -11136 3826 14272 9482 -4871
733 -4871 -14532 -10027 3149 9753 5628 -657 -4720 -5998 -1875 4317 5658 4564 4286 -1829 -11249
748a1249K722J5144P431r705j3740m261Q074J2368M388o640q713l601K969Q149
762C336N750m220p337o69J286k004J893P227L24q020m793K368N046M329Q16l876
778A456l771k31J565K653K868j091m812j812L79L85K580L365k613m306J232K142
794a1j282J289N035k26n884l047K164L343K182q48l385k704r50N68M844M869l202
811B755p451k15N200J924P95J888k920o053o95M745M032M15l760n737j266M868
827a475M276M90j206l409l563K578N817J574j971k471l907j335N092M633k760
842B363m425j452l50J686M863J910l936l855L31K647L649J545l591m035K60J778
858f12J140J752m64m884j704L736K486p70N57k63l174N8M144J752j895j834j551
$$ plain form
748 -11249 -8527 6617 14048 4343 -9397 -13658 -5584 6784 11172 4532 -4181 -7782 -4813 3336
762 3336 9086 4866 -2471 -3140 -1854 -3858 -1965 5262 5586 -2434 -7227 -4859 187 4516 5332 1456
778 1456 -2315 -2546 -981 1672 4540 3449 -1363 -3175 -2796 -2411 169 3534 921 -3385 -2153 -11
794 -11 -1293 -4 5031 4805 -1079 -4126 -1962 1381 3563 2715 -670 -3374 -4324 -3756 1088 5957 2755
811 2755 -4696 -4911 289 2213 3008 4896 1976 -4077 -4772 -27 4005 4420 660 -5077 -6343 -1475
827 -1475 2801 3291 2085 -1324 -4887 -2309 3508 5082 3111 640 -3267 -4602 490 5123 2363
842 2363 -2062 -3514 -3864 -2178 2685 4595 659 -3196 -2865 -218 3431 4976 1385 -2650 -2390 -612
858 -612 528 2280 1816 -3068 -4772 -1036 1450 680 1237 974 -2200 -2142 2002 3754 1859 25 -1526
875a526m84K155J819j476j517p12j139J130M004K85l334q48J673K80J069J857
891C236k125l199J208J962j179o09J268j329k237J477K064P62l52j562p08K404
907A081J553k212n36K152j691l421K399L344k789l119J897J756j075j50J206M40
923H35j0o74r00J539K208j891k391R58K49r90J074R52k639r85K882L73k136J486
941f0K658j709j911J128J059k13N41p38j829l77J30M72J899J32l203j020L283
958B42P37j612K117K181l623l562K698M015k70k175k341j674J510K382L69o30
974C64m53j797o57K605J817k00R00o31m746j477N925L868l292m633j278N25K718
991d42K712m61k177r30n67j91L147L351j040l323k413j056K806M755k35n742k369
$$ plain form
875 -1526 -2010 145 1964 488 -1029 -1741 -2880 -1750 2254 2539 -795 -1643 30 310 1379 3236
891 3236 1111 -2088 -880 1082 -97 -706 562 -767 -3004 -1527 537 1299 947 -615 -1323 1081
907 1081 2634 422 -114 2038 347 -3074 -675 2669 -120 -3239 -1342 414 -661 -811 395 835
923 835 825 151 -749 790 2998 1107 -1284 -326 -77 -1067 7 959 -1680 -2665 217 590 -1546 -60
941 -60 2598 889 -1022 106 1165 952 1493 755 -1074 -1451 -1321 -849 1050 1182 -2021 -3041 242
958 242 979 -633 1484 3665 42 -3520 -822 3193 2923 748 -1593 -3267 -1757 625 994 364
974 364 -89 -1886 -2543 62 1879 1679 2579 1948 -2798 -4275 1650 5518 2226 -2407 -3685 -3160 -442
991 -442 2270 1809 -368 -1298 -1865 -2056 1091 4442 3402 79 -2334 -3390 -584 4171 3936 -1806 -4175
1008d175K195J031N84K059K28j897j184p69l6L860M332j873o911l654K838O677
1024C305L190n147p650R47O494J027l303P22L055p00l142k152J457N688L707m954
1040B544q270j121N601N548J187m729o715j52N790L529m85q26j536k723J95K650
1056D87J511Q76L76l535m889Q51M464K841K07j948m346l039L094O220M314j610
1072E874q236o971N052J1419K006q783o439J264M531K740j612l385J835M455k229
1087A521p425k68R217P819l414j2837p474Q832J5092M85j3544q933M166Q990M051
1102F278l745o692K96O602Q56o483j722P055N833l470r746m892O919J1144P37
1117H970j0207p429J526O628O082Q23o343n677K427M736R09j4L64k454k911P69
$$ plain form
1008 -4175 -1980 -949 -365 1694 1922 25 -1159 -1928 -1964 1896 6228 4355 -2556 -6210 -3372 3305
1024 3305 6495 1348 -6302 -5355 1139 2166 -1137 -415 2640 1940 -1202 -3354 -1897 3791 7498 2544
1040 2544 -5726 -6847 -1246 4302 5489 760 -5955 -6107 -317 3212 2727 1901 365 -2358 -2163 487
1056 487 1998 2874 3250 -285 -5174 -4323 141 2982 3189 1241 -3105 -6144 -3050 3170 7484 5874
1072 5874 -2362 -9333 -4281 7138 9144 361 -6078 -4814 -283 2457 845 -2540 -705 3750 1521
1087 1521 -5904 -6172 3045 10864 7450 -5387 -12861 -4029 11063 11548 -1996 -10929 -6763 2227 6278
1102 6278 2533 -4159 -3863 2739 3595 -2888 -4610 2445 8278 4808 -4938 -9830 -2911 8233 8970
1117 8970 -1237 -8666 -7140 -512 5570 6393 50 -5627 -3200 1536 2445 2431 2795 341 -2570 -1801
1133a801J520j45M69J719O35l231n426q04R251R807n106j4528m000J0624J0804
1148I788P5r504r669J578J1043M672p894o935L851P407l63q051m465Q374J1768
1163A1675k750j5538o839J0892J3889N31j2690j2093L635J4868N167j0590q631
1176h474M939P436o91n335j332M684N203k581q177k397O592O048n35n673o180
1191f473j76P054N179k612m395j026n65J183M951K536m089m629N17L012J628r56
1207A139k596j17L087P5n205k122N785O581o53q073p376M460J3319L819j2112
1222A1j0408M802J0346K236o493o360J282P272K337p470m722O578Q684j945j0404
1237d254n344P915J1805r10j3269o167Q008P866j866n330j895J196K806J169k797
$$ plain form
1133 -1801 -281 -426 43 1762 2397 -834 -6260 -7064 2187 11994 6888 -7640 -11640 -1016 9788
1148 9788 9863 359 -9310 -7732 3311 7983 89 -6846 -2995 4412 4049 -4002 -8467 -93 11675
1163 11675 8925 -6613 -13452 -2560 11329 11860 -830 -12923 -9288 5580 10747 157 -8474
1176 -8474 -3535 3901 3210 -2125 -3457 1227 6430 3849 -4328 -6725 -133 5915 5380 -293 -6473
1191 -6473 -6649 405 5584 2972 -1423 -2449 -3014 -1831 3120 5656 1567 -3062 -2545 467 2095 1139
1207 1139 -1457 -1574 1513 1588 -3617 -5739 46 6627 5974 -2099 -9475 -5015 8304 12123 11
1222 11 -10397 -5595 4751 6987 494 -5866 -4584 2688 5025 -2445 -7167 -589 8095 6150 -4254
1237 -4254 -9598 -1683 10122 9212 -4057 -10224 -2216 5650 3784 -1546 -3441 -2245 561 1730 -1067
1252a067j116M222K405l981m701J710N519K480m238n842P51N487K80l590N54K839
1268A712j513k933R15K975J992K42l644m322K457O751K26o658l378L783M794j741
1284A658n768j15P311K536p214m838N399O593j050m786l409P49M819L358m407
1299H36o004J702O181M54n307k781M308O021j938p680j249Q232M216n310n736
1314d055R06L889K591j589m758j339N380L070m927m519L947O245p44o163k979
1329e045M862O175k259o797j075M997K033k496k371l98J972K554j055m609P06
1344b806O296J287n793l192L624M762o47n113k437L704L509k768l778J401L339
1359A388J59k107j373L29L176K826l481n013K249N897k14n503k454L076L869n91
$$ plain form
1252 -1067 -2183 2039 4444 463 -4238 -2528 2991 5471 1233 -4609 -3858 1629 1909 -1681 -1127 1712
1268 1712 199 -2734 -1819 1156 3148 3390 -254 -4576 -2119 4632 4858 -1800 -5178 -1395 3399 1658
1284 1658 -4110 -4225 3086 5622 -1592 -6430 -1031 5562 4512 -274 -3683 -2934 1885 5243 836
1299 836 -5168 -3466 2715 3169 -2138 -4919 -611 5410 3472 -4208 -5457 2775 6991 1681 -4055
1314 -4055 -3149 740 3331 1742 -3016 -4355 1025 4095 -832 -5351 -1404 4841 4097 -2066 -5045
1329 -5045 -183 5992 3733 -3064 -4139 858 2891 395 -1976 -2374 -402 2152 1097 -3512 -2806
1344 -2806 3490 4777 -1016 -4208 -584 4178 3531 -1582 -4019 -315 3194 426 -3352 -1951 1388
1359 1388 1547 -560 -1933 -1604 1572 4398 917 -4096 -1847 4050 3836 -1667 -4121 -1045 2824 2233
1375B233m921j797M861L881l233m580J086M579K300k690m805k40N827K558n724
1390f65m495L776M478j459l816j068K636L260k26m052j361L708K938j721l133
1405a200r56K059K937j122m649n57N187J369m670k126L247K964m28k465j926J595
1421g41M056j83m810j399L697K147k192l144l98L664K487l317l987K790M859j214
1437B315l903q1K287J118L1j775k307J258L262p68l925o02L289K183j760l088
1453b466p4M500J950m051k851L204K813k024j984q8K31J344J188k383k838K402
1469a127L948j036l797m65L131K552j402l744P7L960M85l634j282K313R42o89
1485B32o15j368j94L087J639l164k328K724K728j506j895J18J300N52j737j356
$$ plain form
1375 2233 -2688 -4485 376 4257 1024 -3556 -2470 2109 4409 1719 -3086 -3326 2501 5059 -665
1390 -665 -5160 -1384 3094 1635 -2181 -3249 -613 2647 2421 -1631 -2992 716 3654 1933 -1200
1405 -1200 -2156 -97 2840 1718 -2931 -3488 1699 3068 -1602 -3728 -481 2483 2055 -410 -2336 -741
1421 -741 3315 3132 -1678 -3077 620 2767 575 -2569 -2967 697 3184 -133 -4120 -1330 3529 2315
1437 2315 -1588 -1669 618 1736 1767 -8 -2315 -1057 2205 1437 -2488 -3090 199 2382 622 -2466
1453 -2466 -2540 1960 3910 -141 -2992 212 3025 1001 -983 -1071 -840 504 1692 -691 -3529 -1127
1469 -1127 2821 1785 -2012 -2477 654 3206 1804 -1940 -1863 2097 2582 -1052 -2334 -21 921 232
1485 232 -383 -1751 -1945 1142 2781 -383 -2711 13 2741 1235 -660 -542 758 1310 -427 -1783
1501a783J443J757j478j987J184J078l30O71O97j832r10K676J009k409r18J750
1517F18M61j456j333M72J991Q92k403k061K059K550m55j460l08J8J004J348j202
1534G35k279J304J953j763k226R93K085j7j075q14o0J484J178o37p39K0l40J1
1552a87J114q0j539J09J006j172j006J668J205j149q81N96K62M28P79l33q37K40
1570B23l3p62L77R10l35j020m78m60P28K176m3k169n27J574O35l1N47q51j145
1589f84O26N33q58j69R46k20j082j30P2O05J425L50j508o72N92N35Q89Q27j814
1608B63k638J102K639l52j878j13L28K48M15j57l88J146R33r48j290L22N11R12
1626A055Q66j568k833K29L014O65j200j150p29M38K395P13j983q27J420P79j036
$$ plain form
1501 -1783 -340 1417 -61 -2048 -864 214 -116 555 1252 -580 -1490 1186 2195 -214 -1132 618
1517 618 1079 -377 -1710 -1238 753 1645 -758 -2819 -760 1790 1335 -125 -433 -415 589 1937 735
1534 735 -1544 -240 1713 -50 -2276 -1283 802 785 -290 -1104 -1164 320 1498 861 122 142 -198 -187
1552 -187 927 847 -692 -583 423 -749 -1755 -87 1118 -31 -912 -316 -54 374 1153 820 -17 223
1570 223 190 -572 -195 715 380 -640 -1118 -1578 -850 1326 1283 -886 -1413 161 796 765 1312 461 -684
1589 -684 -58 475 -383 -552 394 174 -908 -1038 -966 -361 1064 1414 -94 -766 -174 361 1250 2077 263
1608 263 -2375 -1273 1366 1014 -864 -977 -649 -401 14 -143 -531 615 1548 600 -690 -368 143 1055
1626 1055 1921 353 -2480 -2251 763 1428 228 -922 -1651 -1213 1182 1895 -88 -915 505 1284 248
1643B48o53R2O48R34q14k330l06K057J106Ro81j963q33K863L117j458l383o28
1661a975J950J760Jk331j551J548K062j255k174M68J948J253k94k409k052K731
1677c20M174n95m240j983J581K870J310k386l382J68L667J239k326j505R97J778
1693A047J014j500k608Q41L629M80l056k315O72K031K037o98l441j393K585K397
1709A722k23j355j159l9J725J366j418j757O17J398k9j059j534l36K265K400j901
1726F83l597J60L482K253p66k737k291J884L824j64l434j527J462J638M25j720
1742d25k107J211L306Ql428j458K526L028M48k883l381J138M589J003m157k499
1758c081J419K552L07j432j385O51K063J05j946k09J576O13j48o02j530o21K232
$$ plain form
1643 248 -405 -313 335 1269 455 -1875 -2181 -124 982 991 310 -1653 -2486 377 3494 2036 -1347 -1975
1661 -1975 -25 1735 1736 -595 -2146 -598 1464 209 -1965 -1497 451 1704 1410 -999 -3051 -320
1677 -320 3854 3259 -981 -2964 -1383 1487 2797 411 -2971 -2803 864 2103 -223 -1728 -731 1047
1693 1047 2061 561 -2047 -1206 2423 2903 -153 -2468 -1796 235 2272 1574 -1867 -3260 -675 1722
1709 1722 1499 144 -1015 -1054 671 2037 619 -1138 -521 877 848 -211 -1745 -2081 184 2584 683
1726 683 -2914 -2754 728 2981 2215 -522 -2813 -929 2895 2731 -703 -2230 -768 870 1295 -425
1742 -425 -2532 -1321 1985 1993 -1435 -2893 -367 2661 3109 226 -3155 -2017 2572 3575 -582 -3081
1758 -3081 -1662 890 1197 -235 -1620 -969 1094 1199 -747 -956 620 1233 1085 483 -1047 -1668 564
1775E64J247j659j660K42N83O47J063n54j115P8P83K75N84k44j369k11J433J46
1793H33j758j44J052L90j76o13j291N51K797R45k905k001J621K713N12k303k376
1810b153P93K909J8k940q71K226J242o44j532p19J125K787J98l446j454K713K319
1827B571j193k274r79J362J679o69k191K62K090J58j413k88O07Q69R71l83k318
1844a139j35K300O41j936r88Q02N65k13q00j03J301P37j171j307J589J642q23
1861I62j342KM83N62J15j393p49J599R70j922j308J465J821l8j483j236Q40K173
1879A521O81k422j458J534J296m96j106j010N69J840J88k493r65K639J955j443
1895H30j926j50J685J682q23k527n26K494Q63k068j473J100J352K43j213j104
$$ plain form
1775 564 1811 152 -1508 -1266 -683 -36 1027 473 -642 -564 219 494 1078 834 -535 -746 687 833
1793 833 -925 -1069 -17 373 197 -416 -1707 -1156 1641 2586 -319 -2320 -699 2014 2526 223 -2153
1810 -2153 -1360 1549 1567 -1373 -2244 -18 1224 580 -952 -1671 -546 2241 2439 -1007 -2461 252 2571
1827 2571 1378 -896 -1875 -513 1166 497 -1694 -1432 658 816 -597 -885 -278 591 1562 1179 -1139
1844 -1139 -1274 1026 1667 -269 -1257 -455 110 -103 -903 -1006 295 1032 -139 -1446 143 1785 962
1861 962 -380 -378 105 667 782 -611 -1360 239 1209 -713 -2021 -556 1265 1227 -256 -1492 -652 1521
1879 1521 2202 -220 -1678 -144 1152 656 -450 -1460 -891 949 1137 -1356 -2321 318 2273 830
1895 830 -1096 -1246 439 2121 1298 -1229 -1755 739 1602 -466 -1939 -839 513 756 -457 -1561
1911a561J108K232k19k334l22J736O11q35o97m19L52J101o66j538M25J778r8j321
1929f67l53Q53J206K23j444r17J342J376j205j477N02R48Rn83q72l12J664J239
1947A532j552j817J369K185jj844j070R13J737j74k173q83J833J116j318j133
1963a280M76Q56R71j05j840o40K500J476k083j770J049J676l12j593p65Q89J357
1980H62o08j535J04J560K99m61r4n63K8J578M39k257p66K097P23j910j200J006
1998f98J370r4j282r89J322J902o56j700L60J119J00j12o70j025R96J369j140
2015A72k197Q90K377j98j986l96J338J151k51j181m58J305P14j074p67K90L39
2032F8J26O2j038r44J760J810j886j955J389K097p2j531o59O50J303p6j935n61
$$ plain form
1911 -1561 -453 1779 1560 -774 -1096 640 1251 416 -281 -700 -348 753 87 -1451 -1026 752 654 -667
1929 -667 -1020 -167 1039 1262 -182 -1099 243 1619 414 -1063 -561 387 396 -187 -1059 -1371 293 1532
1947 1532 -20 -1837 -468 1717 1716 -128 -1198 -285 1452 1278 -895 -1778 55 1171 -147 -1280
1963 -1280 -804 52 1023 918 -922 -1562 938 2414 331 -1439 -390 1286 974 -619 -1384 -495 862
1980 862 254 -1281 -1177 383 682 221 127 -436 -408 1170 1609 -648 -1414 683 1406 -504 -1704 -698
1998 -698 672 578 -704 -1693 -371 1531 875 -825 -465 654 754 642 -28 -1053 -57 1312 172
2015 172 -2025 -1135 1242 1044 -942 -1338 0 1151 900 -281 -739 566 1280 206 -561 -271 68
2032 68 194 256 -782 -1726 34 1844 -42 -1997 -608 1489 1417 -114 -773 -123 1180 1104 -831 -1392
2050a392J538P97p99j295j79R95J690j54k398n65K687J207j843j444R54J132j15
2067H16r77j180M61J573P3j728n77J384R67j09q27n75O19J324k34j716K99J443
2085A036o21j122Q9N55K24K8n47q90O00J872k42j513j01J037Q04m28j337m17J614
2104F41Q28j711j765J269J882l58j401p06L99J818R88j858j473J126J948p32j614
2121g19l5J082M07n66j396k22J646O87j034o65M78L53N37N18j034q51J085R74
2139A245j231j254J226Q20j015q78K34J037O53n87j154L72J413Lr50n7L59L17
2157E53K61p59j386N70K102m01k627j22K086J082p97j148k01J052R36n36r88J27
2175a96M80Q1l3n54q58O03J341l19j913K61J638L14p20Jl08n4N59M38m59l28k91
$$ plain form
2050 -1392 146 943 144 -1151 -1330 -335 1355 1201 -1197 -1762 925 2132 289 -1155 -201 931 816
2067 816 -161 -1341 -880 693 766 -962 -1539 -155 812 703 -124 -699 -80 1244 1010 -706 -407 1036
2085 1036 415 -707 -618 -63 161 189 -358 -1248 -648 1224 982 -531 -632 405 1209 781 -556 -973 641
2104 641 1469 -242 -2007 -738 1144 786 -615 -1321 -922 896 1884 26 -1447 -321 1627 895 -719
2121 -719 -754 328 735 169 -1227 -1449 197 884 -150 -815 -337 16 553 1071 37 -814 271 1245
2139 1245 14 -1240 -14 806 -209 -1087 -853 184 837 250 -904 -532 881 884 -66 -123 236 553
2157 553 814 55 -1331 -761 1341 940 -1687 -1809 277 1359 562 -586 -787 265 1201 665 -323 -196
2175 -196 284 365 332 -222 -1080 -477 864 545 -1368 -1107 531 845 125 126 -182 -236 323 761 302 -26 -317
2196c17o9L87L07o76l10O56K15n86K61O53n06k84J246j20j270l45J125P54q09
2215C12j037o91Q06J514k01j544k92J073P53P1n14q43L43J525k16j700l91J115
2233H3N46m81n80o62Q7J495P38j280j029M11J163P53l08j470l75J297R00j136
2251A52j026M13M49O0R4p26o93J152J321m44j373o0Q41Q16L61j202j450N94J678
2270I57k60j144m42J25Q01Q79q71j402R05J785l71j356j02O06L90K98m25j174
2288h01q6J070L72o43m32j74J53J105J36r42j23P97J69l70K15k94p87O10R62q76
2308F1j161L34J030J49l25o54l95J009J263n57j106M7L14M99M71j020j400Q85
2326e56J658l09j977k65J417R82j35j219p61R82J909l53j894n48J057R95l8j383
$$ plain form
2196 -317 -386 1 308 -368 -678 -22 193 -393 -132 521 15 -269 977 857 -413 -758 367 1121 312
2215 312 -725 -1416 -610 904 703 -841 -1133 -60 693 764 250 -593 -250 1275 1059 -641 -1032 83
2233 83 629 148 -432 -1094 -1007 488 1226 -54 -1083 -672 491 1244 936 -534 -909 388 1288 152
2251 152 -874 -461 -12 48 142 -584 -1277 -125 1196 752 -621 -681 160 976 1337 135 -1315 -721 957
2270 957 697 -447 -889 -764 37 916 45 -1357 -452 1333 962 -394 -496 110 500 798 373 -801
2288 -801 -887 183 555 -88 -520 -694 -541 564 700 -242 -365 432 601 231 446 152 -635 -25 937 61
2308 61 -1100 -766 264 413 88 -566 -961 48 1311 754 -352 -305 9 508 979 -41 -1441 -556
2326 -556 1102 793 -1184 -1449 -32 950 815 -404 -1165 -183 1726 1373 -521 -1069 -12 983 945 -438
2344d38j274J132J702p52j507K28J447M4l62j78l83K55R20J6j136k38L70K93L9
2363A78j58p24O5Q95k75m43M94M53o04j44R31N9p03k60K69K06L6l07r06J23J326
2384E11K25j388m76R00J124K72j076j409J085J746k70j956k09J010O31l28r14
2401e22p50P10J552j64j710k85J492R61n05j076o57Q87J309n22j675n3J214J94
2419D00o00l36j88M66J056l66j321L94J350k8j073q4M95J98j67m57k79N98L63
2438D21q16m41Q28N61l86m10o8L02Q45J20j354l94J509N67j468r90P23Q50J88
2457E87r62p33L22J693J02j311m36O79Q09N6n67r58O3J352L78j870p45J365J063
2476H87n95r59k07Q14J300l70j523%J243K88n81o34J1L63M06m25j072N50J227
$$ plain form
2344 -438 -1712 -580 1122 370 -1137 -909 538 582 220 42 -341 -86 834 850 -286 -524 -154 139 178
2363 178 20 -704 -639 256 -19 -462 32 485 -119 -263 668 727 24 -236 33 239 275 -32 -938 -815 511
2384 511 736 -652 -1128 -228 896 1168 92 -1317 -232 1514 1244 -712 -921 89 720 392 -522
2401 -522 -1272 -562 990 826 -884 -1169 323 1284 779 -297 -954 -67 1242 720 -955 -1008 206 400
2419 400 -200 -536 -724 -258 798 432 -889 -495 855 827 -246 -330 165 363 196 -261 -540 58 421
2438 421 -395 -836 -8 553 167 -243 -311 -9 836 956 -398 -792 717 1284 -184 -1174 -451 399 587
2457 587 -375 -1108 -786 907 1009 -302 -738 -59 750 806 239 -719 -656 696 1074 -796 -1541 -176 887
2476 887 292 -667 -874 -60 1240 870 -653 -653 590 878 297 -337 -326 37 443 18 -1054 -504 723
2495G23l33j196K97J060Km97j77J22M32J71o34o22O52M85n37n77J31L8Q16L23
2515F79j157p20J248J418r28j239K97R31K95n40j021o7J171M83j258p57N57R81
2533C73K38m89p73l3J517O88j487j122J217Q70r11o92J30L67M13j89q15q4J198
2552D16O6n88j45K67K77K68r4q60J80R85l02j425N9J186Q4p10j58q1O57O61m08
2573C35q45K79J025j27o74l07L9M64N27q55j109O50J627n63j455K76R68L67n2
2592E70p12l07P44O70q56o60M76N29l52m91r8k3P17J89o99m45Q69O15n58n02N40
2613B16L4j5O1m93l58P20L75j027n68O76P32m7l47n61L81R27K53j264k55Q98K84
2634F22m34n82j57K06P03r5j088j37J307L27q09k15L63M02L3j51n09R2N57l58
$$ plain form
2495 723 390 -806 -509 551 553 56 -121 1 433 604 -30 -652 0 485 -52 -629 -498 -460 356 679
2515 679 -478 -1198 50 1468 540 -699 -402 529 824 284 -737 -804 367 850 -408 -1165 -608 373
2533 373 611 122 -651 -684 833 1521 34 -1088 129 999 88 -604 -474 -107 306 117 -698 -782 416
2552 416 482 -106 -251 16 293 561 467 -393 -213 772 470 -955 -896 290 374 -336 -494 -575 82 743 335
2573 335 -510 -231 794 667 -7 -314 -275 189 716 -139 -1248 -598 1029 466 -989 -713 255 622 570
2592 570 -142 -449 295 965 109 -551 -75 454 102 -389 -487 -510 207 396 -303 -748 121 736 178 -324 216
2613 216 250 235 296 -197 -555 165 540 -487 -1055 -379 353 306 -41 -602 -221 706 959 -305 -560 338 622
2634 622 188 -394 -551 -345 358 263 -825 -962 345 672 -137 -352 11 413 446 295 -214 -122 435 77
2654G7n43K38R9j38J8K45m96K64R24n08p89O54Q97n80p08K39M08j74P8n40k89
2675f24O20L14m72l99K64K97K31M01p92o15J124J002j158j232Q85Q23l38p16k70
2694f55K59L99J93n63j20N41L52j91l6k11k24N95L20q13m23O94N5o73O6N66l21
2715a90k85M36J73m9J3L7j33N9L78k18j90O1l39R0N47m35q26M33J124m98r78M03
2737c87P47K58j70n05n26O04P82l97r25M6L54R3K33m91n99P57P88l85p70N37K92
2758C36l0J4k10m15L1O48qp21j32K84M7K84M5n15n8P34L3l81J40Q6j61O3L95o63
2782a54k94M01K90m42m7Kk53M84N70j88q02J05P23J18J8o74l70M19O70l77q61
2803f62J07O26P2j24k97l38N34Q36m9j117Q9O95R2j48r1o21j31O30J67l86l64
$$ plain form
2654 77 -466 -228 -129 -267 -249 -4 -500 -236 688 180 -609 45 942 362 -346 -107 301 127 205 -335 -624
2675 -624 -4 310 -162 -561 -297 0 231 632 -160 -775 349 1351 193 -1039 -154 669 331 -385 -655
2694 -655 -396 3 196 -367 -487 54 406 215 179 -32 -256 339 659 -154 -577 117 172 -501 -435 131 -190
2715 -190 -475 -39 134 85 98 135 2 61 439 221 31 92 -247 -157 390 -45 -871 -438 686 188 -790 -387
2737 -387 360 618 448 -57 -583 21 803 406 -519 -473 -119 -26 207 -284 -883 -126 662 277 -493 44 336
2758 336 306 320 110 -305 -274 374 366 -355 -487 -203 -156 128 173 -342 -400 334 367 -14 126 212 51 114 509 -154
2782 -154 -448 -47 243 -199 -246 -244 -497 -13 557 369 -433 -328 395 513 531 -143 -513 -94 576 199 -662
2803 -662 -555 71 143 19 -278 -616 -82 754 705 -412 -323 372 464 316 225 -396 -527 103 270 -116 -480
2824d80J58J41N86q9p01l6R75K64q13l97M38J55J9K8m95m97M67N91j70l25j32
2845c13p7N95N36n13p19N53O07m12j37k50k79M33N55n65r45M74J035q6n94k38
2865c40J16L64M53k28n07M1L61j94J64j24l97l32P44K17p88%N41J08k14J73n5
2886A03m10N28L84m93k58k18P3M48J71o32m71N02N81l08j98Q7n2L10M47l57o70
2907d33J68R28k21o74l50J57O73J56n44p25L92J028j99n33o5J72L14L42l46p39
2927d99K05Q64m59n68J04K26j01K85j2l49J77M14o3k19L0R6r9K08l1m01L0L23
2949A61l37k95M94J34n66o7O83J46k48k52m4K37M36p6q74R6O14K22o01m79r2P34
2971B6O17n00r84L65J160l2r37M5K09L57J65l23p54rR56J0p47j88K25M89K87l57
$$ plain form
2824 -480 -322 -181 405 316 -385 -421 554 818 5 -392 46 201 220 248 -247 -744 -277 314 144 -181 -313
2845 -313 -390 205 741 228 -491 62 669 257 120 -130 -409 24 579 14 -931 -457 578 492 -102 -340
2865 -340 -224 140 593 365 -142 -101 260 66 230 106 -291 -623 121 338 -450 -450 91 199 -15 158 103
2886 103 -307 221 605 112 -146 -364 -291 157 328 -304 -775 -273 308 0 -198 -111 -163 147 594 237 -433
2907 -433 -265 663 442 -232 -582 -425 248 404 -140 -865 -473 555 356 -177 -242 -70 244 586 240 -499
2927 -499 -294 570 111 -457 -353 -127 -228 57 45 -304 -127 287 224 5 35 131 32 240 209 -192 -162 161
2949 161 -176 -471 23 157 -409 -476 207 353 105 -147 -191 46 482 406 -468 -372 242 464 -137 -616 -708 26
2971 26 643 143 -841 -476 684 652 -285 -240 -31 326 491 168 -586 -595 361 371 -376 -564 -339 150 437 80
2993H0n54J90Q86r7p48J60J38N6J9n6m57K6N86k64m77L90L93j89k78J97K71K1
3015B93k1l05j96O13K2p61k83O87L99o58l40M6J57P33K41j007j95P73O05m48p20
3036c65PM50L58k22r70R0Q58L03p53l97J93N56M65n5q54k75R39M38p39m70L50
3057i3L67l9l88m29K55O62j21o57P7N18J62l14J44r6j9K41k91j59K29N20n97n97
3079f25K15O06l7j19l44j83O79M36m88o04M75M52k57m01r4o1N87K80j047l51O52
3100b29P71j13p28j47K69O24L33q88m74Q54L30m96n34K06L29K45l60n82j6R70
3120C64J46o82k93N77K08r2j71j17q3M29j01o57K2P07P6o19j37J00O34P6l51m96
3142d60L19Q90k64q02P9M21l3o6k18n06M26P19k63q80R8Q16K32k58n91Q6O18L48
$$ plain form
2993 80 -474 -284 602 505 -243 -83 55 111 130 74 -383 -357 229 -35 -512 -122 271 82 -196 1 272 293
3015 293 272 -33 -229 384 406 -355 -638 49 448 -210 -550 -504 -347 386 627 -380 -575 198 803 355 -365
3036 -365 -358 92 450 228 -742 -652 206 509 -244 -641 -448 108 573 518 -336 -611 328 766 27 -443 -93
3057 -93 274 235 -153 -582 -327 335 214 -443 -366 152 314 0 144 48 29 270 -21 -180 49 569 -28 -625
3079 -625 -410 196 159 40 -304 -487 192 628 140 -464 11 463 206 -195 -289 -350 237 517 -530 -881 -229
3100 -229 542 429 -299 -446 -177 447 780 -108 -582 272 602 106 -428 -222 107 352 -8 -590 -606 364
3120 364 510 -172 -465 112 320 228 57 -60 -143 286 185 -472 -450 257 333 -286 -423 -323 311 387 36 -460
3142 -460 -141 749 485 -317 -238 183 150 84 -134 -640 -214 505 242 -638 -540 276 508 250 -341 -255 363 711
3164G11o06q92N85P63m10m78k26L63L07J61l48m77N76N60l78n35L01M07l6k16
3184A32l62r1N55J44p77k76O62K89l24k64J89O4M85J18p40j85O74L30m89n84J24
3205c26L96L50l78r17K70J113o6q67n8P20L97l89k80k37K22N17J23r75j33M92
3225b6K31k27l50p9M18M74m84l88M51P46m16o32J29L04k8Rj89n34K82N49j82m50
3247c92K37K68Q6j31k23QO81J27p94o23P60O24m10n88r2K00M45R1n31l30P50N30
3269F93n92n37J69N71L20l40p72j12R32K70q95l57M79K60m6j99r7N2M82Q4n99
3290b34r9N15K09k78o3j59k14L53N9l31l3M07o3k95J67L67K6j58j96j57L48L03
3312D74m03n55K73M69l12k88LJ20L41K08m54n20Q20N81k75o93m3J76M97R9o47
$$ plain form
3164 711 105 -787 -202 561 151 -327 -553 -190 117 278 -70 -547 29 589 211 -324 -23 384 348 132
3184 132 -230 -321 234 378 -399 -675 -13 276 -48 -312 -123 -59 426 544 -196 -381 293 623 134 -450 -326
3205 -326 70 420 42 -875 -605 508 442 -425 -483 237 634 245 -35 -272 -50 467 590 -385 -518 -26
3225 -26 205 -22 -372 -451 -33 441 -43 -431 20 766 350 -282 -153 151 123 132 -57 -591 -309 240 58 -392
3247 -392 -155 113 199 68 -155 -147 534 661 -133 -756 4 628 218 -370 -462 -262 183 274 -257 -587 163 693
3269 693 101 -436 -267 304 624 284 -488 -600 332 602 -293 -650 -171 89 43 -156 -253 -201 281 365 -234
3290 -234 -333 182 391 113 50 -109 -323 30 89 -242 -275 132 69 -226 -59 308 334 176 -20 -177 171 474
3312 474 71 -484 -211 258 -54 -342 -339 -219 122 330 -124 -644 176 757 482 -211 -254 -78 419 518 -129
3333a29n66N53M83l22m33J27L33n7J77k12l05L51O16l22m71p0L17K85j73k45m72
3354e35L02M49l73j02M15K6l21J90K13j32l3P6j35n5K49k43k83J88J29J7j97j25
3376b80M2M28M30n72o81M63Q71k90m56j55J53R8rl8m12J37M12j21l02MJ84L10
3398B16K72m58m94K99O99j46m95j81J14m3J70K25l99j00L94O7j64p6L20J3l4r6
3420A03l01J10M56k90j94J29k9m33L09M77k30l80L3L29J60J95k05l03k6L54r1
3441A73l33M6O4j35J20o6k76R5N63P4n51J67R2N8L15m8n88q2M24J05k90j64L5
3464b02K2J68m8k42P5M55o3l04J17K0K6J06J98l88l46M04J30j76N5j79j96K74
3486i4L50j79k96J05L23m0M1q6k31R9K79k53l49J72K59j94K0J59l25M4N57o7l53
$$ plain form
3333 -129 -695 -142 341 19 -414 -287 46 -11 166 -46 -351 0 616 294 -177 -247 70 355 182 -63 -535
3354 -535 -233 216 -157 -259 156 182 -139 51 264 132 99 175 40 -15 234 -9 -292 -104 25 42 -155 -280
3376 -280 -238 190 620 48 -633 -170 701 411 -45 -200 -47 51 42 4 -408 -271 141 20 -282 -278 -94 216
3398 216 488 30 -464 -165 534 388 -107 -288 -174 -217 -47 178 -221 -321 73 140 -24 -100 220 233 199 103
3420 103 -198 -88 368 78 -116 13 -16 -449 -140 337 107 -273 -240 89 249 444 239 -64 -90 264 173
3441 173 -160 -114 -50 -185 -65 -131 -407 -312 251 325 -226 -59 33 91 406 358 -230 -312 112 217 -73 -237 -202
3464 -202 -180 -12 -60 -302 -227 228 165 -139 -22 -2 24 130 328 -60 -406 -2 128 -48 7 -172 -368 -94
3486 -94 256 77 -219 -114 209 169 210 124 -107 -8 271 18 -331 -159 100 -94 -74 85 -240 -196 361 294 -59
3509e9K0J57l0J18O5k93l47L61J23m44K56j07nK41M1k68r8M35J72k15j63J48j26
3532a8J10J53k20m69J40M21j1o2j29k91K01O82k33m58P4L48M7nk35l52J69M17
3554B79j11n92n0N54J04k08L4j04JK74J67l25j40J47o6J47n1k65k81O61j94m05
3576d24J27L06M6n9mL1p1J16K73k31n6m7j74k3L70k5m38j6K35mK23K4l86K28L71
3601C92K7o49oM65J25l15j03j78J20K80M5m46j51M14L2R0k4k88M0N04Q6o26k4
3624a90J44J92j26j27l9j34L44J10l33k34M95J54m2q2p0m5K21q6j48l6K46l21
3646a07k11K15J12j90J14R1L7p5K02l0k36K93J44m89j65J72K58j76N4l99J70L36
3668A20Q8k88p9J31J57j03J62j66k33M63J10l26n16L81K28Lk83j39J64K08L40
$$ plain form
3509 -59 -39 118 88 206 271 -22 -369 -8 115 -329 -73 -180 -185 56 97 -171 -269 166 338 123 -40 108 -18
3532 -18 92 245 25 -444 -304 117 106 44 -85 -376 -175 507 274 -184 -110 238 285 280 45 -307 -138 279
3554 279 168 -424 -474 80 184 -24 10 -94 -93 181 348 23 -117 30 -36 111 60 -205 -486 175 -19 -424
3576 -424 -297 9 55 -4 -8 23 -48 68 341 110 54 7 -167 -190 180 155 -283 -299 -64 -68 155 179 -207 21 392
3601 392 419 -230 -236 229 354 39 -64 -242 -122 158 203 -243 -394 20 52 142 118 -170 -130 374 460 -166 -190
3624 -190 -46 146 20 -107 -146 -280 64 174 -159 -393 102 256 214 132 62 17 238 152 4 -32 214 -107
3646 -107 -318 -103 9 -181 -67 24 61 -14 188 158 -78 215 359 -130 -295 -123 135 -41 13 -386 -216 120
3668 120 208 -80 -159 -28 129 26 188 22 -211 252 362 36 -480 -99 129 132 -151 -290 -126 82 422
3689D22m44j64L71Q2o4k02N6j70L52j2l63k57L70N8j49L7P6r4n3K23q7J3J40k5
3713A16r5J32K1l27O4K66k57k31K43J47l48J34M26k40j67J94J08L1o3n5l42K05
3735c8K93l40j97K14m7N8K4j05j20L49K20l20j40J94K99l23l4p9j32K87Ok97r3
3758c21L10M7l49K50J00Q2q5J73j45j71K84P8l58K2P0j51jJ85j84o1L41Q3l95
3781a96J00L43M3l00P8J8j27M01j17l16j88L81p6j70oJ58q7P3Mj46O6L52q2l97
3805a91J09K98j99L6j8k27j4J52k7o8J03K36j89j22L04p3j16K48r1k68J67K10
3827B60k12j37n0J29n8J8j08qL03K5l76lM81Q4l10K8j5k54K91J87k88l38M76j0
3851A15k61j64Q0K12J28n7k48J48K66j21j09M0o8j92K43J56l06j98L83L4j84l7
$$ plain form
3689 422 -22 -186 185 267 203 1 57 -113 239 227 -136 -393 -23 35 -114 -77 -1 -95 -148 75 -12 1 141 116
3713 116 21 153 174 -153 -89 177 -80 -311 -68 79 -269 -135 291 51 -116 78 186 217 154 99 -243 -38
3735 -38 255 -85 -282 -68 -115 -57 -33 -138 -258 91 311 -9 -149 45 344 21 -13 -92 -224 63 69 -228 -321
3758 -321 -11 36 -313 -63 37 119 34 207 62 -109 175 253 -105 -83 -13 -164 -165 20 -164 -225 116 199 -196
3781 -196 -96 247 290 -10 68 86 -41 360 243 -73 -261 120 44 -126 -132 26 -61 12 16 -130 -64 288 206 -191
3805 -191 -82 216 17 53 35 -192 -206 -54 -81 -149 -46 190 1 -121 183 110 -6 242 151 -117 50 260
3827 260 48 -89 -139 -10 -68 -50 -158 -166 137 162 -214 -217 264 348 38 66 51 -203 88 275 -13 -351 125 115
3851 115 -146 -310 -230 -18 110 53 -195 -47 219 98 -11 29 -39 -231 12 168 -138 -336 47 81 -103 -140
3873a40K60L0j94R2j12J06O2J46l58J79r1j76J26Q8j00o5J67P8l00K67K65k01
3895A29k46J3K53o7r6k7j59J25J36l42j00N12K5j49r5M1N0O4K89k51l95K88J59
3918A57j88J2Qp3l8J97r1j77J80J48j49noR0N5L06l80l56K65K88l99p4K35q7j68
3943b50J50J01m7J54J09l37J86K18j84r7j3K3p6k8J38j92L3J38j34r7O5L24k08
3966b4P0O4l05J05L01l0k74J7J24l7j15Jj3K6J65K5j82K5J40mm0P3k15o2K68o4
3992C9k12j04L13j13J7J37j08n3O9P5j53J38k4M1L2Q5k73j60J57L32m14n0K05
4015b4j04l8L75m2l54J40M04j92m1k7j15K9J60l5l17O2J26l6j16K11k52o9N53
4038B98j48k60K2L18k1j29j32N8n6J18L2p7j73J19j39J34J45j78l8J92J74j25
$$ plain form
3873 -140 120 150 -44 48 -64 42 104 250 -108 71 -20 -196 -70 18 -82 -147 20 98 -202 65 330 129
3895 129 -117 -104 149 82 -14 -41 -200 -75 61 -281 -381 131 156 7 -88 -47 3 67 356 105 -290 -2 157
3918 157 -31 -19 -11 -84 -122 75 -16 -193 -13 135 -14 -19 -25 65 120 426 46 -310 -45 243 -156 -230 5 -82 -250
3943 -250 -100 1 -46 108 217 -120 66 284 100 3 -10 13 -63 -91 47 -145 -112 26 -108 -205 -140 184 -24
3966 -24 46 110 -195 -90 211 181 -93 -76 48 11 -104 -103 -116 -90 75 100 -82 -57 83 79 39 112 -103 -165 103 39
3992 39 -173 -277 36 -77 -60 77 -31 -84 -15 60 -93 45 21 62 94 179 -94 -254 -97 235 -179 -229 -24
4015 -24 -128 -166 209 167 -187 -47 357 165 124 97 -18 11 171 136 -181 -119 7 -29 -145 66 -186 -255 298
4038 298 150 -110 -88 230 209 80 -52 6 -50 68 100 23 -150 -31 -170 -36 109 -69 -107 85 259 134
4060A34k61J43K3l3J78j70k98K50J47j34o8p2J45M0Q6k6j24J53K03k80JJ35k12
4083d0O3P3j10j20j58L79Mq9p2qJ43O1Qk72J10J78l4j73K63j70k97K31J59j56
4107b7j54J39J32p0J3J54j42J0J11l7j76l7N1J8J33q1m08L03L33k41l07K71jJ14
4131A01K8o4k17J08J58P8l81R6l0J06M1j21o2r7M10j11o9j4M0j07K67J10j35l16
4155a81K61n0j54N4k0JN6J10j84m0K37p6r0J04J97l22J43Q2k13Ro2J40K8K2n6
4180dj83R8J73l3j31o4K41M4r2M4k28J20J71j45j65M9J1M2O7j17k06L9M81n4k40
4205h2M1Q6Q6j47JL5j93K65%j59j65K38n3j7Q1q0L0K06n2j84K95j28n2k78L03
4230G7J9j89j0J65q6j18j3O6J8K18L8l10P9J77r4Q7k6k90P1K50J8m32K01j5J52
$$ plain form
4060 134 -127 16 39 6 184 14 -284 -34 113 -21 -89 -161 -16 24 110 84 -40 113 316 36 37 172 -40
4083 -40 23 96 -14 -134 -292 87 91 2 -70 -78 65 126 134 -138 -28 150 116 -57 206 36 -261 -30 129 -27
4107 -27 -181 -42 90 20 33 187 45 55 166 129 -47 -84 -33 -15 118 37 -371 -68 265 24 -283 -12 -13 101
4131 101 129 65 -152 -44 114 192 -189 -93 -123 -17 24 -97 -159 -256 154 43 -26 -40 0 -107 160 270 135 -181
4155 -181 80 30 -124 -70 -90 -89 -33 77 -107 -147 90 14 -76 28 225 -97 46 128 -85 -76 -138 2 30 52 -4
4180 -4 -187 -89 84 51 -80 -144 97 141 49 93 -135 -15 156 11 -154 -105 -94 -52 15 -102 -308 -269 212 158 -82
4205 -82 -41 45 131 -16 -15 20 -173 92 92 -67 -232 6 -47 -64 17 -63 -33 173 121 -63 232 104 52 -226 77
4230 77 96 -93 -103 62 -24 -142 -155 -89 -71 147 185 -125 -46 131 37 124 98 -192 -121 129 147 -285 -84 -99 53
4255E3j38j35J18jJ72J85k80q6J70O0pn4k45r2M32r4l44Q4L06o1r2J00K0q6K47
4280B32j07j57m8J83O4k14J1j10R4R0q7j27J81P9l8j49J68K0n5K6R4j98k5J47
4304G4k5j25M3Q0j18P5j03P0J65P2k85j2J56N6o2j91J78%m5Or3j9J55J47m43k5
4330b69L51Q6j55j10J08N0J17k1l25M8J04k5j33k1Q8Q2Q6q0o8q5L39J07k69q3
4354g8J26j1J94j92j31m4J90J4k58J18j0R8j05K3J9J09J62l3m03K30K86j49k15
4377f0K5J22j48J02j72j12J75J99o2k54R9K23n9J06o0j62LK75l18j43K12K04k42
4400d7j98Q1K75O1p3j54p3L07Nj58l3P4k32J94n0j83J10J36Q2l64r8M22j8M0k
4425A04j82J95jJ06l78K5K54m4o0q8l8Q7J42k26j55J78L58rl94J32O6J19q7m1
$$ plain form
4255 53 -85 -220 -102 -103 69 254 -26 -112 58 118 111 57 -188 -280 152 58 -286 -202 104 43 -49 51 71 -15 232
4280 232 125 -32 -80 103 167 -47 -36 -146 -52 38 -49 -176 5 84 46 -103 65 85 30 56 150 -48 -73 74
4304 74 49 -76 -33 47 -71 4 -99 -29 136 208 -77 -89 67 123 61 -130 48 48 3 9 -84 -103 52 199 -244 -269
4330 -269 82 168 13 -97 11 61 178 157 -168 -120 -16 -41 -174 -195 -107 -25 61 -19 -87 -172 167 274 5 -78
4354 -78 48 37 231 39 -92 -136 54 68 -190 -72 -82 16 -89 -66 -47 62 224 191 -212 18 304 155 -60
4377 -60 -35 87 -61 41 -131 -243 -68 131 69 -185 -86 137 78 184 124 -38 -35 240 -78 -221 -9 195 -47
4400 -47 -245 -164 111 172 99 -55 -128 179 184 26 -7 67 -165 29 -21 -204 -94 42 124 -240 -338 84 66 106 104
4425 104 -78 117 116 222 -156 -131 123 79 19 -69 -107 -20 122 -104 -259 -81 277 268 -126 6 72 191 104 63
4449F3j35R3J36k57j04J68QJ9j4p9r0L38J54k44k33K76mj45k3R7j25N4K0j18j78
4474c23K73J05l8j69L4K35P6o2q4j42K51N2l40j9J68n3m0M5n0j43M33o8k83k2
4498a64K90J00r0m4L3j67R9j6j11k0O1K2j21n2K51n9j1R7k33J43J92k6l08J15
4522a9J55j32k31J83K4N6oj72l4J13J83Jj19q2O6R7J85k66j44R9J97j85k18K47
4546bJ53k49M1q7N1Q0J49m7k02J23O0o6J55r6j72j9K56m4l31K80J93k35o6R3o5
4571d7N9J24o1j14K05r2j59O7J28k2k15K6q3K22J41j47k43kM74k79L1O7l6L3n7
4596B0m4k34J50J67M0j60J5O0j02J59nj62N4K43k5k34o3K20n3Kl9p4o3K98j80
4621a0k4Nm1J08oJ27j35J0K77k37k26J71L0j41j43K69Rj69k4N7l5K11n3q3N6J29
$$ plain form
4449 63 -72 21 157 -100 -204 -36 -28 -9 -23 -102 -192 146 300 56 -177 99 95 -50 -73 24 -101 -47 -27 -145 -323
4474 -323 -50 55 17 -152 -118 117 193 131 47 -95 156 208 -132 -151 17 -36 -76 -31 -81 -224 209 141 -142 -164
4498 -164 126 226 136 92 125 -42 57 41 -70 -90 -29 -7 -128 -180 71 12 1 98 -135 8 200 174 -134 -19
4522 -19 136 4 -227 -44 -20 36 30 -142 -176 -63 120 121 2 -80 -14 83 268 2 -142 -43 154 -31 -249 -2
4546 -2 151 -98 -57 -144 -93 -13 136 89 -113 10 70 4 159 63 -109 -128 128 84 -247 33 226 -9 -75 18 -47
4571 -47 12 136 75 -39 166 74 -85 -18 110 88 -127 -101 -184 38 179 32 -211 -213 261 -18 13 80 44 77 20
4596 20 -24 -258 -108 59 99 -61 -46 14 -88 71 66 -96 -42 201 176 -58 -121 99 46 48 9 -65 -128 170 -10
4621 -10 -34 -29 -70 38 32 159 24 34 311 74 -152 19 49 -92 -235 34 43 -126 -150 -93 -128 83 30 -53 3 132
4647A32j12j37J0K80k07Q2j47L5k8J75m0k68J94K3P3J9Lk07J20R8K9k44l3J40
4671a0o9OL0j84O5K05P1k33O2J14j6J11m2p4l3N6K5k21P7N6j17j06K49lk03P7
4697a07K29j5o1N7j58J20J36j69j61R5J63j70m1M5r9j6K11qj40J57K2l5L0j3j12
4722d0J7Q9k6j48l0J03J09j84K21k42O7J53P1k67J24L3L1j08K1L9p8J08j4j48
4746i9J8K1j3o3J53j3k03K81J19j61JO6j41J29p4po2q9K58j12J5j38K0J1J80J0
4772A07j94P6J25j24L6J44j14q4n7K05l52k4M47p6k42J6P7R6M9j00j12J13K33
4795B45k38j18J35Qj84J77n3q5J6J61j74o9K06M6m0KJ52j95n4J68o0l8L0j68r2
4820b22J81R2qj16lJ57j76QK12r9KN8M5j82J4M5n2K6j7l5QJ37L0k19K8O3OJ44
$$ plain form
4647 132 20 -117 -107 173 -34 48 -99 -64 -92 83 43 -225 -31 -8 65 84 87 -120 0 98 127 -117 -150 -10
4671 -10 -79 -73 -43 -227 -162 43 114 -119 -57 57 41 152 110 36 3 59 84 -137 -60 -4 -121 -227 22 19 -184 -107
4697 -107 122 107 46 103 -55 65 201 32 -129 -34 129 -41 -82 -37 -136 -152 59 51 -89 68 90 55 85 72 -40
4722 -40 -23 66 40 -108 -138 -35 74 -110 111 -131 -64 89 160 -107 17 50 81 -27 -6 33 -45 63 49 -99
4746 -99 -81 -60 -73 -136 17 4 -199 82 201 40 41 107 -34 95 21 14 -48 -137 121 9 24 -114 -94 -83 97 107
4772 107 -87 -11 114 -10 26 170 56 -28 -85 120 -232 -256 191 115 -127 -111 -34 62 111 11 -101 12 245
4795 245 7 -111 24 32 -152 25 -28 -113 -97 64 -110 -179 27 73 33 35 187 -8 -62 106 46 8 38 -130 -222
4820 -222 -41 51 43 -73 -76 81 -95 -87 125 26 28 86 131 -51 -37 8 -44 -18 -35 -70 -62 75 105 -114 -86 -23 -17 127
4848A27j3j77l4L49j73j86k7L16j47j07K2j20J50R3Rk13J05Q7P4q1Pl2m7K45k24
4873Cj96J40J27j36J3k9J25n5P0O5k51J82N0p6rj3j17J16j8n6n6Q3K06l00OK22
4899I6R0k14m0J05N9P1m1k7j11nOm5j3O1N1j5K1j74K31J14pk12p5K53k30J69m8
4926G0pj12J1N9j82M9J51j40J87j11n8N0K3J58k73J03J76r9k75P1J15m8o0P5j0
4951g7j4J75j19n0l6J83M0N3j92qR6O8j77j12K80p1j29N6J9l8m5J97o7k9QJ26
4977A37j0k9mp5j1l8J7p3J63j79J0j2J39J2N4K5j21l6J35Mk21O2J38L3k24j4P
5004a11J05O5j75m3K8K08n3nJ8k3P9k6j11M5j46K65j10j27K9J21j28Q6P7N4j68
5029d6P8L5j38K20j35J03j32P4q3nL3j53K0O5J69o5q0J28O1j74J8j4P3q2K6L4
$$ plain form
4848 127 114 -63 -97 252 79 -107 -134 182 35 -72 -50 -170 -20 73 82 -131 -26 61 135 54 61 29 -18 227 3
4873 3 -193 -53 74 -62 -49 -78 47 -8 62 127 -124 58 108 32 23 10 -107 9 -9 -65 -121 -38 168 -132 -126 96
4899 96 186 -28 -68 37 96 167 126 99 -12 -17 -11 -56 -69 -8 43 28 49 -125 106 220 213 1 -74 179 -51 118 70
4926 70 63 -49 -38 21 -161 -112 39 -101 86 -25 -83 -33 -10 148 -125 -22 154 55 -220 -149 -34 -82 -142 -67 -77
4951 -77 -91 84 -35 -85 -121 62 102 155 -37 -45 51 119 -58 -170 110 39 -90 -34 -15 -53 -98 99 32 3 11 137
4977 137 127 98 94 19 8 -30 -13 -86 77 -102 -92 -104 35 47 101 126 5 -31 104 108 -113 -51 87 120 -104 -118 -111
5004 -111 -6 59 -116 -159 -131 77 24 19 37 14 93 67 -44 1 -145 120 10 -117 -88 33 -95 -9 68 122 -46
5029 -46 32 67 -71 149 14 117 -15 59 -24 -29 4 -149 -129 -64 105 40 -40 88 149 -25 -7 -21 52 -30 -4 30
5055C0j14k4J51o7J0r4R7N0J42k32j12L03L0k05O4M9j50l0m8K3R0R0p6nn1J57
5081G8j71J89Nj33N2Q6j42n2J71m3j59N4LQj62NJ96l5J7R4pj62K25J19k48O0J8
5108F6K4L0R8m01PK58l5r2m9J17P5J3j16P0j27J73q0l8OJ4lp2M4j26j0J19J65
5135A30j72j86J49J50p5Q1n2m7K0J31j21j52K8J45J8k3j51PJ18k7Rj8K22l8k51
5160a05J59L5l4j0M5j84R8p6N8r9pJ85j9k22K42j9k7Q7j14J4J00m8j53L4JJ3j5
5187f1J72j11j61J58J42k07%J31L7m7Mk7j17J93M6j10j77J8O1J15j05j2R2Q8P3
5212A95p0j4k5L2j44L9R0j35o1K17k03p0P1JO2J06J6k74J7L15k68J09J15K6j99
5237e2R2Mn1m7OM1p4R7jk3J0m5N9q3J34j2k1n8k4k11K21J30m8l11K48n7N7%m4
$$ plain form
5055 30 -84 -108 43 -24 -14 -108 -11 39 181 -51 -163 140 170 -35 29 78 -72 -102 -150 -127 -37 53 -23 -28 -79 78
5081 78 -93 96 101 -32 20 106 -36 -88 83 40 -119 -65 -62 -54 -216 -211 -15 -50 -33 61 54 -108 117 236 -12 48 66
5108 66 90 120 218 -183 -176 82 47 -45 -94 23 98 111 -5 65 -62 111 31 -7 -1 13 10 -62 -18 -144 -154 -35 130
5135 130 -42 -228 -79 71 -4 77 25 -22 -2 129 8 -144 -116 29 47 24 -127 -120 -2 -29 -20 -38 184 146 -105
5160 -105 54 89 55 45 90 -94 4 -72 -14 -113 -120 65 46 -176 66 47 20 107 -7 7 107 59 -94 -60 -59 -46 -61
5187 -61 111 0 -161 -3 139 -68 -68 63 100 53 57 30 -87 106 152 42 -135 -117 -56 59 -46 -58 34 122 195
5212 195 125 111 86 118 -26 13 103 -32 -93 124 -79 -149 -78 -77 -15 91 107 -167 -150 165 -103 6 121 147 -52
5237 -52 40 44 -7 -54 -48 -7 -81 16 15 -8 2 -43 16 -67 67 55 34 -24 -48 -259 -38 92 44 -267 -19 -76 -19 -19 -63
5266f3L4R0J1n1jk3L2N%o5p3RM0l3l9K2J5M9m7J19L9j41J05J0pk8Kp4K2l7Jj5
5298i2J88r4OM2l1m0n0K01p0j78J67k6o1N4P9k56P0K16k06j4N7J00k7RJ2j09P8
5325B5J37j16j18J19Jn5k7K3r6o8P3K04k45R2K1O6k5N0m1j09L26j09k87J18R9
5350E8j61J09j7j09O9Q4R1j40j7Q3j59J33N8Nq1R0q6M6k33J79Q0k03J80n3j78
5375a72K08R3j46r8L0N2q8K59j74n4K6R0j66L0Q3P9l8j7L0j11J03O6J4l1l3%k5
5402A0J31m8p9j40J08J28j76J35p6r1J13M3K1j27Q8J2q3J21j13O7m8J28k04J3
5426f7J40j62R5l4J0M7m2R2k4m9j05J33L0k8j63P0lJ12O2j66P5Kj13j1K70j48
5452B3j97K90k6j27L2J82j34q1k3R2j56Q3J8o8J30K0Ln8J2Pj27K35K8j64L5p0
$$ plain form
5266 -63 -29 61 72 21 20 -3 29 34 34 -31 -104 -95 -55 -88 -127 -105 -90 -41 -88 31 70 -71 34 44 37 9 11 -63 -41 -78 -77 -92
5298 -92 96 2 8 50 19 -21 -71 130 60 -118 49 23 -38 16 95 -161 -91 125 -81 -95 -38 62 35 44 56 -53 25
5325 25 162 46 -72 47 48 -7 -34 -11 -107 -175 -102 102 -143 -51 -30 36 11 61 20 -89 237 128 -159 -41 58
5350 58 -103 6 -11 -120 -51 33 124 -16 -33 50 -109 24 82 87 6 96 10 56 -177 2 82 -121 59 6 -172
5375 -172 36 129 -17 -115 -85 -33 -121 138 -36 -90 -64 26 -140 -110 -27 52 14 -3 27 -84 19 85 99 68 35 35 10
5402 10 141 93 14 -126 -18 110 -66 69 -7 -98 15 58 79 -48 40 52 -31 90 -23 44 -4 124 -80 -67
5426 -67 73 -89 6 -28 -18 29 -13 79 55 6 -99 34 64 36 -127 -57 -60 52 114 -52 23 25 -88 -99 171 23
5452 23 -174 116 90 -37 -5 177 43 -38 -61 31 -125 -42 -24 -92 38 58 61 3 15 22 -105 130 158 -6 29 -41
5478d1l0J48r2Q6k17Q6N1O1J6l3q0L7J38o2jK6j71r7J87L0q3p1J64l6j46J95j03
5505c8Q9R1j60P7m1j2M4n7L1Lk9K5rj11P0L5Q0k38K36m0P2j11j7LR6m7j03l7J16
5534A8p9p3J99j46PO7N3k9J8r9J41j02O9l3J16k35J11P8j62O6j2m6qJ22l4o7N2
5561hQ7q5RJ58j01J3Lq2p5J4R2r7L0K9J0j61K73j9j59J53m5l0j0lj8K6K1m9r4
5590a18J41R6j53j17J35O4q8J68J26k62p7J63J9K1j59m5J30j40kK6Q1k7J8p7J58
5615H1j33j31J24J69k5j03L9j4l2q5J07Qk74L18K4o1L6j40J62J5r1R2q8%q1l4
5641a17J54p2j0O4K5j19N2O2P6k07J15j7O5Kq0K7L4q2Q9n9j22K2J5qJ31J0m9L1
5669C2Q8j86J7J18j3j45O2K4j2J3J4J7j08J01K3j19J04L0r1J23j8k22K82j90P5
$$ plain form
5478 -41 -71 77 -15 71 -146 -60 -9 52 68 35 -45 -8 130 68 67 93 -78 -175 12 42 -41 -112 52 16 -130 65 -38
5505 -38 51 142 -18 59 18 6 50 -7 24 27 -2 23 14 -97 -27 8 88 -150 86 46 118 7 -10 -7 89 42 -61 -98 18
5534 18 -61 -134 65 -81 -74 -7 46 17 35 -64 77 -25 44 11 127 -108 3 81 -81 -15 -27 -73 -81 41 7 -60 -8
5561 -8 79 -6 3 161 60 73 76 -6 -81 -67 25 -72 -42 -13 -3 -164 109 90 -69 84 39 9 -1 -4 -22 4 25 -24 -118
5590 -118 23 119 -34 -151 -16 48 -40 128 254 -8 -85 78 97 118 -41 -86 44 -96 -98 -72 9 -18 0 -77 81
5615 81 -52 -183 -59 110 85 -18 21 7 -25 -110 -3 5 -269 49 73 12 48 -92 70 85 -6 86 -2 -2 -83 -117
5641 -117 37 -35 -45 19 44 -75 -23 39 115 -92 23 6 71 73 -7 20 54 -28 61 2 -120 -98 -83 -91 40 50 1 32
5669 32 120 -66 -49 69 56 -89 -27 -3 -15 -2 12 29 -79 22 45 -74 30 60 -31 92 74 -148 134 -56 19
5694A9k8J5N7j20j6J5J9J20n2j13j3P1O7j18J03j4j8J18n3j16PJ23j2j72QN4K3
5721b6P2k2j36J36M4R8j59M8q6Q3M3n4m2p6R1N3j13L4J08l6j2q0J45j67Q1m8J00
5748G9m6N2j07k4q5J52l3l9R1p4J03O4j97M1J06o7Nk5N4o5M4N8j25j10L9J45k7
5775Ij25P2o3K33q8p4J74n0L9p0l0R1k19J68k8k7o2R1L8n0j01P4j2J95l25J33
5801gOK8K6o5LN3j43nK24p1m3RP3j45kQ6l9r5J25K2J14j19r6Q1J02r6k11J82l2
5830c5O4om3P3j2O1j3j08QK8L1n2j11N9J43l2K4j56o7O4Q2L5Np4O3J43k06J37
5858A05j35L7M1l9nj38O7J53j6o2L8L5J0L0J6j33N7l5M8o9n0Ol1J57k72J13m0
5885a12o1J37J63j81qN3J72k11J38j65J10q2R3k6j22L4J12o2m8q9M0J33o3J46
$$ plain form
5694 19 -9 6 63 -57 -73 -58 -39 81 29 -84 -97 -26 41 -77 26 12 -6 112 59 -57 -50 73 61 -111 -103 -49 -26
5721 -26 46 24 -112 24 68 166 7 55 -31 52 95 41 -1 -77 14 67 -46 -12 96 60 48 -32 113 -54 27 -21 79
5748 79 33 85 -22 -46 -131 21 -12 -51 40 -34 69 133 -64 -23 83 16 21 -4 50 -15 29 87 -38 -148 -109 36 9
5775 9 -116 -44 -107 126 38 -36 138 88 127 57 27 118 -101 67 39 12 -50 41 79 29 -72 2 -10 185 -140 -7
5801 -7 -1 27 53 -12 -9 44 -99 -104 120 49 6 15 88 -57 -59 27 -12 -107 18 40 154 35 -61 20 122 26 -185 -3 -35
5830 -35 29 23 -20 53 41 102 89 -19 -11 17 48 -4 -115 -56 87 55 79 -77 -144 -80 2 37 42 -32 31 174 -32 105
5858 105 -30 7 48 9 4 -134 -67 86 70 8 46 81 91 121 137 4 61 26 74 5 -45 -39 -70 87 -185 -72 -112
5885 -112 -173 -36 127 -54 -62 -9 163 -48 90 -75 35 -47 46 20 -102 -68 44 -18 -66 -155 -115 18 -45 101
5909A01k89K14MO0j08j8P9k41K03k6J9l7O0K7m6lM4k9N3l6m3R5o4r8J39r8J6l
5937b5qJ09j74J27q0O2m9J01j30m8K08p5o9Q1j06n7M4R9k2k11K68q3J6oJ6R1k01
5964a22P4R6n9p1Q4L7N4q2q6r2K37k3j24J95j03q9J67kr8J4N5N6q5L1o4r3J82
5991H9n9j27Q6R3o8l8r2J09J1N0O9j41k4Q7k4j67J50n1J6l2J14p3j6K2J43j17
6017A0k2J86k91J63J0Jp3O2l8J1O8Kn4r5P7Jj38J39J37j04o8j6J55k56K71l2k10
6044a04N6j01N3Q5J5r4N2m6Q6N6j05J52k13J76n7rm1N6n9J7J38j14l2L7NL5K7
6071G1j42J61j33J6J25n1o0J42j67M8N4p1l1LJ9M0k2K3p2r3K27L6j11o6J5O4N0
6098G5j55J18j61K6J34q5l3q4K80k56K06j60P4j9K28j26q0O9j7M9o2r6J14n1p4
$$ plain form
5909 101 -188 26 30 90 -18 -36 43 -198 5 -21 -2 -39 21 48 2 -1 43 14 67 31 -12 83 19 -79 60 -38 -22 -25
5937 -25 -33 76 -98 29 -51 11 -38 63 -67 -115 93 18 -51 30 -76 -133 -89 10 -12 -223 45 -38 -22 -28 -12 79 -122
5964 -122 -48 48 -11 -82 2 39 93 11 -75 -167 70 47 -77 118 15 -74 93 91 -7 7 62 118 33 64 0 -93 89
5991 89 30 -97 -11 82 14 -24 -116 -7 4 54 123 -18 -42 45 21 -146 4 -47 -31 -63 51 -22 -38 -16 127 10
6017 10 -12 174 -117 46 56 57 -16 46 8 19 87 89 35 -60 17 18 -120 19 156 52 -16 -32 123 -133 138 106 -104
6044 -104 -48 -149 -96 -11 4 -90 -38 -84 2 58 -47 105 -108 68 11 2 -39 17 -42 -25 113 -1 -33 4 9 44 71
6071 71 -71 90 -43 -27 98 47 -13 129 -38 10 64 -7 -38 -35 -16 24 2 25 -47 -140 87 123 12 -54 -39 25 75
6098 75 -80 38 -123 -97 37 -48 -81 -165 115 -141 65 -95 -21 -40 188 62 -18 51 34 83 21 -75 39 -12 -86
6123h6J29n6n4O2k7J7J12j40L3P5mJ6rl6r0M1Mo3J71r9o8N9K8k3k5J82j38L5m7
6152aL6n8RJ9m0l0m4J31mj2N3m2L2j0J7j26J38R1k03N4j56J64j10K5m1J21j51
6179a38J3O3k1P4L0P3j19L6Nnj7n2N1k7k6LP9o5KRm9J58o2l0M8QMk0p4OJ0j1J27
6212H3P9j66O4j27k6J13N1p2n0P6J1p0Q7o0Q7J3j58J11J1Mj2o3n0lJ48q8o1M5
6240b3O2n0n7j8R0l9J03J8k00M3J45p4j35Q9J1m5K9k4O0nJ08j52J22J34j37m4
6266A1rl3o9J12KLj0J13j06K1l0J8O8k8j17J12j60J60j16qJ16Oj57P8M9j38Q0
6293c2O3m4m6j4L2J50j98Q7l2j9K7q9N0j6O3j0n1J89j03J29l2p4m8P5N0l1r1N6
6321D1m9q9Q3J8Jm0j09l0J14J39k01J87j83J70j67J68n0n5O7p8n1K4J11p5O2j26
$$ plain form
6123 -86 43 -13 -67 -5 -32 -15 97 -43 -10 65 61 77 68 32 -58 -17 -13 -76 95 -4 -72 -13 15 -8 -33 149 11 46 -1
6152 -1 35 -23 -14 5 -35 -65 -109 22 18 6 59 17 49 39 56 -70 68 159 -44 10 -146 18 -92 -67 -108 13 -138
6179 -138 -125 -62 -83 -9 21 94 -25 11 16 11 -6 -58 -7 -34 -60 -57 22 -43 -41 -32 -81 77 15 -15 33 41 45 25 -49 -43 -33 -44 83
6212 83 162 -4 60 -67 -93 20 71 -1 -51 25 36 -34 53 -7 80 93 -65 46 57 61 49 -14 -64 -67 81 -7 -68 -23
6240 -23 39 -11 -68 -86 4 -35 68 86 -114 -71 74 0 -135 -46 -35 -80 -51 -75 -15 -20 88 -64 58 192 55 11
6266 11 2 -31 -100 12 14 17 7 120 14 35 5 23 91 63 -54 58 -102 58 -58 -66 50 56 -101 -23 26 -112 -32
6293 -32 31 -13 -59 -73 -41 109 -89 -2 -34 -53 -26 -115 -65 -81 -18 -28 -79 110 7 136 104 30 -18 57 107 76 -15 41
6321 41 -8 -97 -14 4 5 -35 -144 -174 -60 79 -122 65 -118 52 -115 53 3 -52 15 -63 -114 -90 21 -54 8 -118
6347a18J04KJ2J8P5j73OK8k5L8J81l06M3J19J6k8MO4Q7k71J06l1M7p7J42q3j04
6374a24J36k3p5J12ko0J3m6O8j34J27Q9n5n1M0p6K1J09j00n6J08o5N9j24Lk7Q1
6401e2O5m3L1j2l0J7K5J11j71K4M2J3j2J0r8J12k9Ll1q9J47J8J1j01J18q9N4q5
6429d1N0m4k2Q4j3j60J78J5rOk2L1r9L6K4l3p2J29j52R6O1q5O9L2j12J04K9Nn7
6458B8k4j3l7RJJ19l5o5qm0O0l0Q6mq6o4J1M3L8Q8j86K64j76p0J11Q0J6j62n8
6487a04J35Pj0jp7k4J12J0o7J3qR1j13K41k93J39J3qn8j5m9J51j94R1m9N7q8J07
6515IQ5r8O1r7K0M4Qj50J49j79L24j73j14Q2O3J2Ko6j29J05O7J3j5j41j1J55q6
6542f0N2l4l4J6p3J88q5Q8K4n3J7J1m3N9q0lK3j2k2Q0o5o5l5K8Q7OK4R0j04Q1
$$ plain form
6347 -118 -14 -12 0 18 93 -80 -74 -46 -71 -33 148 -158 -115 4 20 -8 -4 60 147 -124 -18 -49 -2 -79 63 -20 -124
6374 -124 12 -11 -86 26 24 -36 -23 -69 -1 -135 -8 81 26 -25 15 -61 -40 69 -31 -87 21 -44 15 -109 -106 -133 -52
6401 -52 13 -30 1 -11 -41 -24 1 112 -59 -35 7 20 8 18 -80 32 3 6 -25 -114 33 51 62 -39 79 -10 44 -41
6429 -41 9 -35 -57 27 14 -146 32 47 38 44 22 53 -46 -10 14 -19 -91 38 -114 -18 43 -42 27 59 -53 51 80 85 28
6458 28 4 -9 -46 -37 -36 83 48 -17 -25 -65 -5 -35 51 47 -39 -103 -92 -49 -11 77 -109 155 -21 -91 20 100 116 -46 -104
6487 -104 31 38 28 27 -50 -74 38 48 -19 -6 -14 77 -36 205 -88 51 64 56 -2 -17 -66 85 -109 -18 -67 -10 -98 9
6515 9 94 -4 57 -40 -20 24 32 -118 31 -148 176 3 -111 -29 34 46 48 -18 -147 -42 25 38 23 -118 -129 26 -60
6542 -60 -8 -42 -76 -60 -133 55 -30 58 82 29 46 57 14 73 -7 -10 13 1 -21 59 -6 -71 -106 -78 9 15 39 129 25 106
6572A06j33n6P6L6o4o0O8J8M9q0J02q8j02J62K6j14J97r5L1j05Q9oN0j68R7o6
6598c0J6%jm2P2N3j69J46M3k7n7r7J5J22j3n4M4j43J49l3jj07R2j06o1J45O3q8
6626f9J34j50Q0o7k5O7P9l6L1n8N6j0q8Q9q6J55j17M8m1J3J50j91l6J24n3p7M6
6653c2J20j87J00m0J08j30K83k29K9k6K5m1l6O1R3Q7l55P8K3nQ3K8m9J28k17J97
6679I6p1m3q3LJ50j8j03O1pNK6O0p7R5M9k63Q1N6kR0k10J23j8l8J26k12Q9J31
6707I6j86J09q5J7J17m4k0J35j56K02j04j01m8J36m3n3J6L3r4RL9p0O4N6M4q2
6733a3j5K2qQN3o3k9PO7M0q4J3m0K4P0r0J20P3j07pp3M3M6l6j39P7N4J8pj08j8
6764a02j5J11J42j09k2p2O8j0M7L9m6m3Rj3J6k0j0L5j8m8M4j1M2j9n8K49j82l6
$$ plain form
6572 106 -27 -83 -7 29 -35 -95 -27 -9 40 -40 62 -26 -128 34 60 -54 143 48 79 -26 63 57 107 -61 36 -30
6598 -30 -14 -14 -15 -57 15 68 -101 45 88 61 4 -93 -78 44 31 -23 21 -122 27 -6 -7 -114 -22 -128 -189 -44 19 -69
6626 -69 65 -85 -5 -72 -97 -30 49 13 44 -14 42 32 -56 33 -53 102 -15 33 -8 5 155 -36 -72 52 -1 -78 -32
6653 -32 88 -99 1 -39 69 -61 222 -7 22 -4 21 -20 -56 5 98 185 -170 -92 -69 -74 9 37 -12 116 -101 96
6679 96 25 -18 -101 -98 52 34 -69 -8 -15 -10 16 76 -1 94 143 -120 -39 17 15 105 -105 18 0 -38 88 -124 -35 96
6707 96 -90 19 -66 -49 68 24 4 139 -17 185 81 -20 -68 68 25 -28 -12 21 -73 -64 -25 -95 -31 25 69 -13
6733 -13 -28 -6 -14 -6 47 -16 -45 -38 29 69 -15 -2 -42 -18 52 -38 82 155 48 41 -32 11 57 21 -118 -41 13 31 24 -84 -102
6764 -102 -117 -6 136 27 5 -67 1 -9 38 77 31 -12 -3 -16 0 -20 -30 5 -13 -61 -17 -28 14 -5 -63 186 4 -32
6792c2L7l9J35j28J6J5R5j32Qmm5k1J27m6O7r3jJ47k00J18O2p2KL0r9k8J16k10
6820a75J58K8m4l2R2J11n6o0o3R4K1p4J3l3M6O0j2j45O4J12j67J59r3o7K5J3j
6847b6J9j7J01q6n2j4J44R5j87k6N6N5p9J0R0q2n1q1J70p1p9P0mM6j20J35j7l8
6875c9k6O5j0M9n7J00j12K1p1J89p5N3j30M4j9M5pN4p4m9J10p6J8K5K4j36O3m5
6903f6R0K4n2mKk06K21%J4m3K0l2M8Po4J70r9M8j12Q2M9k00J1Q4oqm5J35m7k2
6933ap1J19m6K8M6j21R9j16OJ24k4j47J38m9N6q0J87j83j25K15M0j70J5J57j42
6958d5J12j07O7Jj09J00K4j01K8K1j2J4J0K6j25J42L7j17P4J11o6l8k2r6J02j7
6984A4p5Q2M2j23l9J34%r9MP4m5M6N1jj09L8j18N4J17j11p2K17r3K4j00J0J35
$$ plain form
6792 -32 5 -34 101 -27 -11 4 99 -33 -25 -29 -74 -95 32 -14 53 -40 -41 106 -94 24 86 14 16 46 -53 -81 35 -175
6820 -175 -17 11 -33 -65 27 138 82 22 -41 53 74 0 13 -20 26 86 74 -71 -7 105 -62 97 4 -63 -38 -25 -26
6847 -26 -7 -24 77 -9 -61 -75 69 164 -23 -49 7 62 -17 -7 83 1 -50 -131 39 -32 -111 -41 -45 1 -119 16 -1 -39
6875 -39 -65 0 -10 39 -18 82 -30 -9 -80 109 34 87 -43 1 -18 27 20 74 0 -49 61 -15 3 28 52 -84 -21 -66
6903 -66 24 48 -4 -8 -6 -212 9 9 23 -20 0 -32 16 23 -41 129 30 78 -34 48 97 -103 -92 -8 -14 -22 -67 68 21 -1
6933 -1 -72 47 1 29 75 -46 53 -63 -57 67 43 -104 34 -15 41 -39 148 -35 -160 55 95 -75 -60 97 -45
6958 -45 67 -40 27 28 -81 19 43 -58 -30 -9 -21 -7 3 29 -96 46 83 -34 40 151 85 47 25 -71 31 14
6984 14 -61 21 63 -60 -99 35 35 -64 -60 14 -31 15 66 65 -44 -6 -124 -70 47 -64 -136 81 -12 12 -88 -78 57
7011E7j23j4M7L1MJ7N9j54J19n0N9j97J60k1o1J06m8L6n5k8N1p0J87m6p7Q5m0
7038C4j05n6J95p6q6M5P6o2L1J1j21J64p1j6K5P6o7j1l0K7m0J15L2j35k6K6N4
7065IO2j08Q0J9j13J04n4n7J04p5L2l6J40Kj27q0J6J27n7l5l2Q4m3J12p1Q3j33
7092d7K4lOJ24o5j10J16j0O9j70J0R6m6Ko7J55j1n9N1k2Lj81P7M3kRL9J44k25
7121e0M0N6j38J42j71J40j16J22O1j04qP6m1J29j68n9J45r1J4j2J3O5r0O9j59
7146a35o1K46n5o7Q2M0j59k7P4N8J03j50NK5J6L6j41J25o4l7J4L2Q7k03O4K02
7172A10r9n0N5qo4K6K6JnJ0K9m8R6lj09Q0r0J6K7Q0n3k5k3QO4n2lR6j70J30Q1
7203A33k33J20p3P8k2M7p6l5N8j5Q4l0O9j52Q3J16j92J00j50k3J33j18Q4k8k6
$$ plain form
7011 57 -66 -80 -33 -2 2 19 78 -76 43 -7 52 -145 15 -6 -67 39 -9 27 -28 -56 -5 -75 112 66 -11 74 34
7038 34 -71 -127 68 -8 -94 -49 27 -35 -4 7 -114 50 -21 -37 -12 64 -3 -14 -44 -17 -57 58 90 -45 -71 -45 9
7065 9 71 -37 43 62 -51 53 -1 -58 46 -29 3 -33 107 109 -18 -98 -82 45 -12 -47 -79 5 -38 74 3 86 -47
7092 -47 -23 -26 -20 104 39 -71 45 35 104 -66 -56 40 -6 -4 -71 84 73 14 65 43 46 -135 -58 -15 -17 -8 31 175 -50
7121 -50 -10 46 -92 50 -121 19 -97 25 86 -18 -26 50 9 138 -30 -89 56 -35 -21 -33 -20 45 -45 24 -135
7146 -135 -196 50 -5 -72 10 50 -109 -136 -62 -4 99 -51 -46 -21 -5 31 -110 15 -49 -86 -72 -40 47 -156 -92 110
7172 110 11 -39 16 8 -56 -30 -4 -3 -8 2 31 -17 79 76 -33 47 -43 -27 0 80 27 2 -21 -13 51 -1 -4 92 -78 52 133
7203 133 -100 20 -53 25 3 50 -26 -61 -3 -18 66 36 105 -47 36 152 -40 60 -90 -113 20 -98 -14 -42 -68
7228f8J85j62J4N8n7P7j13J13qj47R5o8P0m7J35j89J64j04R7k1K1j4o1J12J3n3
7254D2j15Q5j6P2j49L5J11n0p7K3N2j56J13O2l5O5q8P0p8J1P3L2j77Q9j90K87
7280I1n9n6M3j3n1k0R2N9j59R5j9k0N6N4j18O3J33j69M6M0q5K3j1l6J6O2r3l8
7308g4O4Q5j16o6R1L2Lj3p7L2r5K15j4o0m5J41j98R2mM7K0q6K9J2j7q9J42j03
7336e2J18j12k1O8j5m4L8K0M1K5m2lJ41n4j90J11k0J11j45N8lpq3J06j24J23j13
7363f8O9R2l4j3k2j02J07n9Q7j60J90r2n3Q9n0J5K8M3j46J24p9mQ1L1q8K4P5j35
7391e0l0O2K0L9m1M6j27L2J32j09K6k8R0o2o9K4N7M3j04j3J25PO5o1l3q1M3O4
7419F7o0p0O9o0L5J4L2l5l5J9K1K1M5l0o5J00l9m0j03J61l6J2j07J56r1J9j09
$$ plain form
7228 -68 117 -45 -31 27 -30 47 -66 47 39 -108 -13 -81 -11 -58 77 -112 52 -52 45 24 45 31 -30 82 95 42
7254 42 -73 12 -4 68 -81 -46 65 15 -62 -39 13 -143 -30 32 -3 62 -26 44 -34 -23 50 82 -95 -6 -196 91
7280 91 32 -24 19 6 -45 -65 27 86 -73 22 3 -17 39 93 -25 38 171 2 48 88 3 26 15 -21 -5 57 -36 -74
7308 -74 -10 75 -41 -107 -16 16 19 6 -71 -39 -134 81 67 7 -38 103 -95 -3 -7 40 60 -26 3 15 -2 -91 51 -52
7336 -52 66 -46 -67 1 -14 -58 -20 0 41 66 24 21 162 108 -82 29 9 120 -25 33 30 23 -60 46 -78 45 -68
7363 -68 1 93 59 46 24 -78 29 -30 57 -103 87 -5 -58 31 -19 -4 24 67 -79 45 -34 -38 43 74 -14 10 85 -50
7391 -50 -80 -18 2 41 0 46 -81 -49 83 -26 0 -28 62 0 -69 -45 12 55 -49 -62 63 70 135 74 41 -40 3 67
7419 67 7 -63 6 -54 -19 -5 27 -8 -43 -24 -3 18 63 33 -32 68 29 -11 -114 47 11 23 -84 72 -19 0 -109
7446a09J99m7k24J70J7Rn7Q3p6k9Q0L3o9k7K2J42r0l7J30o9j23J30l7M9n1n6j
7473c8N0QL2r1n3J15l7p1O2L8n5P8n2KO0j35K01j89J40q0q4J44j20K9M3L8p0n1
7501h6J11k03J20Q1N1l8r2J6kk9L0l2K4L2M5q4qQ3k8O4n7p2Q9O8k1rl6R3p8j09
7531g7L7Q8j32J0pJ46j44Q9Qk3N9k0o4N8o0n7J8J65j99J26NK0j35J07j3L1K6k3
7559C9r5O3L0j27M5pP8M3k3L3n9q8p3J68Lk5q5J39j34J83L7j88J28j32O4j4k8
7586b5l3J31k3n0R3r1l1J2Nj2M6L2M3k35J60k2m9n3J64r6j7m2K4O6n1N7p5K0k3
7615g5P1o7N5R0p7j0R1j22Q7L4n9L5j6j36J75j04qK6q9J43j17Q0M4m2J8L3p3l7
7643e0M5pL1r6R5k3ql9L7J16j60JM1k0N8Kk8j6j6N5r5M6M7q3r1J53k9K4j0K7L8
$$ plain form
7446 -109 90 43 -181 -11 6 15 -42 41 -35 -64 16 49 -20 -47 -25 117 27 -10 120 51 -72 58 21 70 19 -37 -38
7473 -38 12 20 52 -39 -92 23 -14 -85 -23 15 -40 38 -14 -12 48 -87 114 -75 65 -15 -99 45 -75 -46 -3 35 -35 -86
7501 -86 25 -178 -58 23 74 36 -56 -40 -42 -71 -41 -73 -49 -17 28 -56 -64 19 -9 55 -2 -74 15 83 62 53 17 110 32 -77
7531 -77 -40 48 -84 -74 -81 65 -79 10 18 -5 54 34 -30 28 -32 -89 -71 94 -105 21 26 46 -89 18 5 36 62 39
7559 39 -56 7 37 -90 -45 -52 26 69 46 79 20 -68 -141 27 30 5 -80 59 -75 108 145 -43 85 -47 17 3 -25
7586 -25 -58 73 50 0 93 2 -29 -17 -12 -24 22 54 97 -138 22 0 -49 -102 62 -34 -51 -93 -69 -3 -54 3 -72 -52 -75
7615 -75 -4 -71 -16 74 -3 -13 78 -44 43 77 18 53 37 -99 76 -28 -36 -10 -99 44 -73 7 51 9 27 60 -13 -50
7643 -50 -5 -12 19 -77 18 -5 -13 -52 -15 101 -59 -58 -17 -37 21 23 -5 -21 -37 18 -77 -31 16 -67 -158 -5 -34 -10 -20 7 45
7674D5j37N2pj6Q0N8j37J16k5n7j0K0Pk5J7L5n8RqLn9R7L7r2R9j15Q6j01j0P9
7704a7n2J40o4j1l3L9L6o5o4J10l3N4o9j5k5Q2J3P5m6j11j0J41m0k2j0p9M1KN4
7733B1n4k5K7P0KJ5o7pO1R1j44j2J35j11N0r6RP5q2N1n0Q2k6j5o3J2Q1m3J44k40
7763a09N2K26k30r6J28P9n6q3n1J93l0m4K2Rj67J71J5n4l0J90j54m4OQ0m0OK8
7790A7K0l4j02R1M7j19m4K58j89J30j8m8p8J75mj04n8KJ9j7K00j85J07j18J53
7815A01j55P1m2L5N0ko6%J03k28J13J16j91J36q6L9j19J48j5o2k6J13Jj34J78
7840G8l2j17K8Q5m6N0q4K2Nkj8M3Pp0O7j15L7N1QK1M2l3Pq3n0K0m0J64j17P8r7
7871i1j0R1l1P6p4J35j47jJ1J27j30qR0j23%J18j07J42m1o5o4K6O6j34J39m8J19
$$ plain form
7674 45 -92 -40 -47 -63 17 75 -62 54 29 -28 -38 -18 -11 -36 -19 16 -42 -33 -41 -38 -97 0 37 -55 44 -71 15 -86 -96 -17
7704 -17 -69 71 7 -4 -37 2 38 -27 -91 19 -14 40 -29 -44 -69 13 26 101 55 -56 -66 75 35 13 3 -76 -35 -33 21
7733 21 -33 -58 -31 39 41 56 -11 -18 43 134 -10 -22 113 2 52 -44 -35 40 -42 9 -41 41 15 0 -63 -51 30 -13 131 -109
7763 -109 -57 169 -61 -157 -29 50 -6 -89 -140 53 23 -21 1 10 -157 14 29 -25 -55 135 -19 -63 -57 23 -17 -11 17
7790 17 37 3 -99 -8 39 -80 -124 134 -55 75 57 9 -69 106 102 -2 -60 -58 -39 -56 144 -41 66 -52 101
7815 101 -54 17 -25 10 60 58 -8 -8 95 -133 -20 96 -95 41 -45 -6 -125 23 8 -54 -80 33 34 -100 78
7840 78 46 -71 -43 42 -4 46 -38 -16 -11 -13 -31 12 19 -51 16 -99 -62 -11 -3 18 60 27 34 -49 -99 -79 -119 45 -72 6 -91
7871 -91 -101 -10 -41 35 -39 96 -51 -52 -41 86 -44 -52 38 -85 -85 33 -74 68 27 -38 -102 -76 -10 -144 -5 -53 66
7898F6j66M9r0Q1l3J03r2K1N8k2L6k6M7O2j40J26l1l0k7J0P2k06K4K33j31M8P7
7925A19j22Q0o0O0j17O3l6j11M2L3R9l0l9Q8j47J08m2L2j7l2K1k6J1nJ2j7L6q2
7953g9J49P3j85M1l1J24q7J3N4n3o9j2N8o5o6P3M0O2N2r7OP2r1Nj8Q1n2p8j6P3
7983b3j5N9J3r5J07p0N9K7j10O4j09K52j67k47K02r3J3J90J6j31M3qrN0L7J8j5
8010E8j41M2J3n8K06j29k6l2N8j3m2l8J68o2JJ67p4j91J20P9j97P8k9k8KM7Ll6
8038e4Q0j36J43J5q3M8pR2o7n2M1O4p8k0J7K3L3m3j40J56j05J23j42P4l8J25j18
8065d9J34j36L1P6r0L1j12P4JPO7m2k8J9PN6j03o9J48m3l7P9j69J26M5l5N0J00
8093A38p8J6j45P5M7r6K8J00j26J26j13J02j02j8rJ42j13jN2o3K0j21J00p3J40
$$ plain form
7898 66 -100 -51 -141 -60 -93 10 -82 -61 -3 -25 11 -15 32 94 -46 80 49 19 -8 2 74 -132 -108 125 -6 42 119
7925 119 -3 77 17 77 -40 23 -13 -124 -82 -49 50 20 -19 69 -78 30 -12 20 3 -29 -8 -34 -23 -28 -16 -33 3 -79
7953 -79 70 143 -42 -1 -32 92 5 18 72 19 -50 -62 -4 -69 -135 -62 -22 40 92 -5 1 73 -18 -13 -31 50 -2 -80 -96 -23
7983 -23 -38 21 34 -61 46 -24 35 62 -48 16 -93 159 -8 -255 -53 -146 -133 57 73 -58 -15 -23 -32 18 55 73 58
8010 58 -83 -41 -28 -86 120 -9 -35 -67 -9 -22 -64 -102 66 4 5 172 98 -93 27 106 -91 -13 -42 -70 -68 -21 -18 -54
8038 -54 26 -110 33 48 -35 13 6 98 31 -21 20 84 6 -14 3 26 59 16 -124 32 -73 50 -92 -18 -56 69 -49
8065 -49 85 -51 -20 56 -34 -3 -115 -41 -40 -33 34 -8 -36 -17 -10 46 -57 -126 22 -21 -58 21 -148 -22 23 -12 38 138
8093 138 60 76 -69 6 53 -43 -15 85 -41 85 -28 74 -28 -46 -55 87 -26 -27 25 -38 -18 -139 -39 -112 28
8118B8j14J16r6R7L9m1j67J35%l2m0Q7j76J25Q1k7o6j9K5J03m3J1q1O6P8k78J98
8145IL4Ok28J08Q0k4J3n0j27J68J4L7l8j9N4M7nMOj00J50k12P3L2j12J04o2L3
8173eJ24k22M1M7p0RJ07k1J0Q6m7k8j45J10j8l1j4Q8nP1r7m7M5N7l6K1n0R8j81
8202a03M1O0Q9j85J46p9p4R5O0m4Jn8J13K6p0K4Nj33O6M2Q1k9k07J41j28J45J7
8229D2q8J09j26n4O5M2P8p7q3RJ04k2L1j18M4o2R6o3J2J40K8N0j76l3p2P5M5j5
8257a9M5M5J1k36oK04n5J05j24j8J04l3J3R1j00j93Q0O3J7l8M1k1N5j02L7M6N5
8284F7j19j35K31J4j11J04j35J77l2o9O3nm9k2j5Q6pn7N1O2n9J56j75M4j16k9
8310h0J55p8Mln7J46j36J03r7Q7l4rQ6j57P5P2o9Q1j06j12N6q4J41pQ4l9j1o9
$$ plain form
8118 28 -86 30 -66 31 70 29 -138 -3 -3 -35 -75 12 -164 -39 42 15 -51 -70 -45 58 15 26 -55 11 89 -189 9
8145 9 43 49 -179 -71 9 -15 -2 -52 -179 -11 3 40 2 -17 37 84 79 83 89 -11 139 -73 0 32 -80 24 -38 -5
8173 -5 119 -103 -62 -15 -85 -76 31 10 20 106 59 31 -114 -4 -22 -53 -67 21 16 87 -10 -57 -12 45 9 30 -20 78 -103
8202 -103 -62 -2 87 -98 48 -31 -105 -10 50 6 7 -51 62 88 18 42 47 -86 -20 22 103 74 -133 8 -120 25 42
8229 42 -46 63 -63 -117 -52 -10 68 -9 -92 -83 21 -1 30 -88 -44 -106 -10 -73 -61 79 107 157 -19 -52 -124 -49 -4 -19
8257 -19 26 71 82 -154 -160 44 -11 94 -30 -48 56 23 36 127 27 -166 -86 -23 -6 -44 -3 -24 31 -71 -34 12 67
8284 67 -52 -187 44 58 -53 51 -84 93 61 -8 55 50 1 -21 -36 50 43 -14 37 99 40 196 21 65 -51 -80
8310 -80 75 -3 1 -2 -59 87 -49 54 -43 44 10 1 87 -70 5 77 8 89 -17 -129 -73 -157 -16 -23 61 22 11 -58
8338e8P8Q2p8N7j16p8J19n8J06L1j18Q5j33J81j61K1l4J09j02O6o9Q2Q3j31l5
8363g1R6n7M0j18nO2oM9J00j24m1J09n6pj8J27j47L9M0l5J1M3r4J2k0O4p0kM9
8392c0q0J11j0k6n2N1J15j49R1j3Q4K9n8k7j38N4J57Mm5O6k29J09O8j07o5R2L2
8419C4p4J18k23J50j30J06J7l6L7J16j40n4R6jj29O6K6rM2K4p1nj9J45p3n9J13
8446F7j0O0o5m9r8Q4M4m7n4J35j71N5Q5j2o2n2J44r2J35lq3j8j3M2r8L5l6J39
8474F2p7J2np9P2K9J1PLq9Jq5P6K2l9J89m9n1k2k5M5J23q1m7M3q0r0J64j64M7
8504g7N3k4jp3R2L0j25J41j2m3J50p6r3rN2K5P2j06L0N1j13n2P8L4j8j09K0J84
8532H1q0k4kk6kK3R9j29J0J45j01j40J53L6m4j6p6M3J6M1R5n5rk02K57j72J9M2
$$ plain form
8338 -58 20 102 24 81 -35 -113 6 -52 54 85 -33 52 -81 100 -61 -40 -74 35 -67 -1 -70 12 95 -36 -71
8363 -71 25 -32 8 -110 -115 -53 -59 -10 90 -34 -75 34 -22 -29 -47 80 -67 -28 12 -23 -12 31 -63 -51 -71 -7 -77 -79 -30
8392 -30 -110 1 -9 -35 -87 -36 79 -70 21 8 92 121 63 36 -102 -48 109 113 68 134 -95 14 82 -25 -90 2 34
8419 34 -40 78 -145 5 -125 -19 -2 -38 -1 115 -25 -79 17 16 -113 -47 -21 -30 12 36 -35 -40 -59 86 13 -46 67
8446 67 57 117 52 3 -95 -11 33 -14 -68 67 -104 -49 36 24 -38 -90 54 -38 97 94 11 -7 -20 22 -76 -41 -77 62
8474 62 -15 -3 -8 -87 -15 14 25 32 35 -54 -53 -138 -62 -40 -79 110 61 10 -12 -37 8 131 50 3 46 -34 -124 40 -124 -77
8504 -77 -24 -48 -49 -122 -30 0 -125 16 4 -39 111 35 -58 -67 -15 10 82 -24 6 57 -56 -108 -30 4 -14 -123 -103 81
8532 81 1 -23 -25 -51 -53 -30 69 -60 -50 95 -6 -146 7 43 -1 -17 -93 -50 -34 7 102 47 38 -164 93 -79 -60 -18
8560a8K9JR3j13P5n6J3o1J6j47J08L5J2R4q7J04n5M9j08P4o8Rl4pm9N9Q5j37J14
8589C0M4q0J10j2j79L2J66j63l5Q2M0j07R2q3q6J46J04j37L0J12m2K1j41J27J
8614G2j42J06k0n0j8P8J02k12kO3M7n2L8Jrl5l3R7n2Mm1J02Ol2j31N5MO2N7j12
8644d7N8k3Qn1Q1K38j40j6k2p7L4l9O2l1K2j38J29Mj38K06L9j13Qn3J23j45P5
8671E4p9j1J42j07L7n4P4l2O7j21O7o1q7J30o7J0J53p4r2J5l6M9K0M1p3m2J78
8698A01q4n3Q7r4Q6j8M2j39J03K7j45K9N2J2nQ5j55J27j9r1J20M3j12o2L5j1j38
8725a77K36RJ0p7lj6Lj2N5K7q8Q9q9K8lO6j10Q9l1J08m1j47L6J00j34P9K6k2K4
8754C5r3J13N9j21j21K04j16N1m3qP9r8J07j10o4J01r5O6K8jm1J55j8n1k1L6m0
$$ plain form
8560 -18 11 12 105 -8 67 11 24 -37 -21 -168 -60 -25 -13 81 -6 98 43 92 -16 58 -10 -1 -35 -42 -91 -32 53 -84 30
8589 30 74 -6 104 92 -87 -55 111 -52 -87 -5 35 -72 20 -63 -149 -3 101 -36 -6 106 64 85 -56 71 72
8614 72 -70 36 16 -34 -52 26 128 -84 -86 -23 24 -28 10 11 2 -33 -66 31 -21 -17 -58 44 50 18 -113 -58 -54 8 65 -47
8644 -47 11 -12 -4 -55 26 264 124 108 86 9 43 4 66 35 57 -81 48 52 -86 120 159 46 54 1 124 -21 54
8671 54 -25 -36 106 -1 36 -18 56 24 91 -30 37 -24 -111 19 -48 -38 115 41 -51 -36 -72 -23 -3 38 -35 -77 101
8698 101 17 -36 51 -43 43 25 67 -72 31 58 -87 -58 -6 6 1 86 -69 58 39 -52 68 111 -1 -63 -28 -39 -177
8725 -177 59 68 78 1 -2 -18 -15 -27 28 55 -33 56 -33 -5 -8 58 -52 37 6 114 73 -74 -38 62 -72 7 33 11 35
8754 35 -58 55 114 -7 -128 76 -40 11 -32 -40 39 -59 48 -62 -126 -25 -120 -54 -26 -27 -68 87 69 18 -3 33 -7
8781gM3Q2k0o3j06M0Q8L8q8K1l1j9p8J30L8j72R7k8L8j7p6O5J02k29J85l9J0o2
8809e8M6J16j02j02J04N2m1l0j5K8qr1J01J09j49M7k6j6LM3p3R3o1O5j1J2n5M8
8837B9j51L7J07j52Q4n2J49l3J1o4J0m8J38J8q0m8K2K5mj80J88j1j00j8O2K3l3
8864g1p2O7N9Q3j90J05Oo5P5J27j00j06J14p6R6O8m6j38J60m9n9Kn0J23J0J3j20
8891c4M3j2l8J2J44j6j78J04Mm7KO6m8M2k8q3Q2n1m7J22P6j01p4lK0L9M7M0j28
8920d5J11n7J4M5j43J89j89J01m3k1m3P4P0l7p3O2R3j36l1O6R2j33r6K19q8r0
8946h9J38q2j42J70pL3L8q3K2J0J9r0R4O7j50PJ99q3l2jnp3k6M4L9l4L1p1L9J19
8976A01j84J0R2j0Q9j07N2l0j10J5Q9l2J62p7L5k5r5P0j9j01P4Q7j12O4m9j15
$$ plain form
8781 -7 36 118 98 35 -71 -31 57 95 7 28 -3 -22 -100 30 68 -104 -7 -35 3 -14 -90 -25 77 -152 33 -6 4 -58
8809 -58 -12 104 2 -100 4 56 15 -15 -30 -2 -10 -101 0 109 -40 7 -19 -35 -32 11 -62 31 -30 35 24 36 -19 29
8837 29 -122 -85 22 -130 -46 -98 51 18 29 -35 -25 -73 65 83 3 -45 -23 2 -2 -182 6 -5 -105 -123 -61 -38 -71
8864 -71 -143 -76 -17 66 -124 -19 -13 -78 -3 124 24 -82 32 -44 52 120 74 -64 96 47 -12 -10 -60 63 73 86 -34
8891 -34 9 -3 -41 -29 115 99 -79 25 29 -18 -16 50 2 44 16 -67 15 -36 -83 39 115 14 -60 -63 -43 -4 43 83 -45
8920 -45 66 9 23 68 -75 114 -75 26 -17 -38 -81 -7 63 26 -47 15 108 -28 -59 7 99 -34 -130 89 1 -89
8946 -89 49 -33 -175 -5 -12 21 59 -24 -2 8 27 -63 31 98 -52 -45 154 71 39 38 33 -40 -66 -22 17 -17 14 -57 -18 101
8976 101 -83 -73 19 9 98 -9 43 13 -97 -82 7 -25 137 60 95 70 -25 45 26 -75 -1 86 -26 38 -11 -126
9002a26J48j05M4M6k2l5N1J6P0o0k3K2j7mq0O2l7J8n4K17k00J39j90J14Q7j73
9028i2P0n7L5nj8N4J55p0j23NN3KP0q5k6p3J02q5R6J52j19j96mJ25p1R2r6QR7
9057do4j6J41n4j06J99n3lq2K8J11q3j05L6P6o8j8K14j61J35j51j0J66j4j42o5
9083i3R0L4R8j39n7O0m6Q6k5P8m2l7k5p0P7J4j8N4n3O5j05J03m1j58K06j09J00
9110D7j54J08R1l6J6n2oK7p4N0K0J00j10j34K29j4l3m4l5OM1r8Q1R5o1n3p4N0
9138a7LM7O6j5j52J00L8j02n2J81p3l5m6J0n9K9R5l9P8j41Q0K0J7j9M5o3l6o9
9166a09P5n3M0J6nqQ2q3R1P7j51P0L6m2j7R0k3n0r5L1J1J14o6j08J9L7J3r8L2
9195g4M0P5j59K09q4j2j8L5p2K0N5N2j07j3J00j07J48j37L2oj7j3P0k3J21j17
$$ plain form
9002 -126 22 -83 -39 7 -15 -50 1 17 87 27 4 26 9 5 -75 -13 -50 -32 -86 131 -69 70 -120 -6 81 -92
9028 -92 -22 -79 -44 -49 -67 -13 142 72 -51 -46 7 9 79 -6 -32 -105 -3 -88 8 160 41 -155 -159 -34 -105 -13 -109 -101 -4
9057 -4 -68 -84 57 3 -103 96 43 40 -42 -14 97 14 -91 -55 21 -47 -65 149 -12 123 -28 -38 128 114 -28 -93
9083 -93 -3 31 129 -10 -67 -7 -53 33 8 86 44 7 -18 -88 -11 3 -15 39 -14 51 -54 49 8 -150 56 -53 47
9110 47 -107 1 92 56 72 20 14 41 -33 17 37 137 27 -107 122 108 75 31 -4 2 43 -55 26 121 60 7 -67 -17
9138 -17 -14 33 99 84 -68 32 70 -32 -84 97 24 -11 -57 -47 -106 -77 18 -21 57 -84 -4 16 33 14 59 -4 -40 -109
9166 -109 -34 -87 -47 -31 -36 -44 38 -45 46 123 -28 42 78 36 19 109 86 36 -59 -28 -17 97 31 -77 -58 -21 -8 -106 -74
9195 -74 -34 41 -118 91 7 -5 -23 12 -60 -40 15 67 -40 -53 47 -60 88 -49 -17 -23 -40 -53 17 -6 115 -2
9221bJ10q6r6R2k6l3Q6P7j18o5K6j23R2N5J22j72J86j84q5M3J68j15J66o7L1o8
9247A4k0O5n5jL8o1o4P5n6M6R0j48J3nO6m1N3k5Q1m1m5J39j70M6Ll6J03n3P8J3
9277A02j83J14K6J2m1OK5q9Kk3P7Q4j33PNR6o1q9JR1R7p3J12j98k3o9j1J36o1
9306f1N5J12j26j07MR0P2n6Lj0J2O7j87P8J83q5o3rp4J00J03r1n7N8nq7n2K3O9
9335d1RJ46j03%r0J79J1j79N8Q9j47L0J06j11M2R7j38k2P5Ln5N9m5J13j62O7j2
9362b1M4n1o2J11Jo5k4J83r1j07J28p5j8j3L5J6kN2qq3Q3r8K36k14jQ7n6j2L8
9391A3m0o0N6j2k8mJ5O3R9j38Q1j5Q0j5rn1j69J65N1j67Q6r0K6J06o1N1j4j06
9419h7n3K13o8m8Q3o0%lM0j7j9qk9J19N4r0m0o9L9P0j7m1q2O3J97j63p5K5P1k4
$$ plain form
9221 -2 108 22 -74 18 -8 -41 45 122 4 -61 -35 -158 -66 -11 111 -61 125 -59 -144 -101 67 -48 118 51 82 14
9247 14 -6 59 4 3 41 -20 -84 -9 -65 -19 71 -77 -64 -69 -3 -44 9 -16 65 24 -21 118 -52 -6 -3 -39 64 11 89 102
9277 102 -81 33 59 71 30 36 61 -28 -26 -49 28 112 -21 -14 -9 87 26 -63 -62 29 126 53 165 -33 -56 -125 -136 0 -61
9306 -61 -6 106 -20 -127 -123 -33 39 -17 -14 -24 -12 55 -132 -54 129 44 -19 -28 -102 -2 101 10 -47 11 6 -81 -133 -110 -41
9335 -41 -32 114 11 11 -79 100 111 -68 -10 79 -68 -38 68 -43 -1 96 -42 -64 11 14 -41 18 -27 86 -76 -9 -21
9362 -21 23 -28 -90 21 22 -43 -67 116 25 -82 46 -29 -47 -60 -25 -9 -11 41 33 -50 33 -65 171 -43 -44 43 -13 -25 13
9391 13 -27 -87 -31 -43 -71 -75 -60 3 102 -36 45 30 110 95 86 35 -134 31 82 -85 1 -89 -63 43 -18 33 19 -87
9419 -87 -140 73 5 -43 40 -20 -20 -23 17 0 -19 -27 -56 63 117 27 -13 -82 -43 27 10 -31 -113 -50 147 -16 -91 -66 5 -19
9449a9q1P9J5L8k9m4J01o6m3O8r7Q2o3Q4N0j40k2R8r0k1R1N0k3j21R7j21K01l0
9477D4j6j17NJ26q1K0q2K03q3k0J0%j20J67J3j75o6J65M3l0m0o1K0l2N9l1RK02
9505A32j99j00K24j19J67j48P6M6j3q7j8QJ7L0J09j65Q9k5o6J22m8j8m0L5l4K6
9531AnK7r7J3K2Q7q4j18Q6jk2J07j22J04N0q5K5j3j08J35J7j68J66j35O6M8m3
9558d7M7j1N8r5M0o2J40J4j74J66r6k9L9RN5n6ml6k3J03L2j45J58j68k2L0K04
9585A27l8k41J63m9P4k7k7n7J15j19J25j31M0N1J10n3k15J96m8k0J58j37k2j2
9609c7N3Oj97K22k1r9K4K9m8R3kq3jP8k4p6Q0M9r6N8k5M2j12P9qk3K1j9k0J05
9639D8Q7j9k46J80M1k20N3L9k3M5O9j52J06k2Q3j21M5K5M7o4J22j13L2q0m3L1
$$ plain form
9449 -19 -100 -21 -6 32 3 -41 60 -6 -49 19 -78 4 -59 25 75 -65 -87 11 -79 -100 -9 41 18 -103 -6 -127 74 44
9477 44 28 -89 -84 42 -39 -19 -101 102 19 -1 9 9 -111 56 69 -106 -172 -7 36 6 -34 -95 -75 -107 -48 -79 -70 132
9505 132 -67 -167 57 -62 105 -43 33 79 66 -21 -39 -31 -14 16 125 -40 49 24 -42 80 32 14 -26 9 -25 1
9531 1 -4 23 -74 -61 -39 48 -36 -154 -68 -69 -91 16 -106 -2 48 -37 -12 -25 -133 2 19 -149 17 -118 -52 -4 -47
9558 -47 0 -11 47 -48 -8 -70 70 84 -90 76 -20 -49 -10 -1 54 -2 -6 -42 -65 38 70 -75 83 -85 -107 -77 127
9585 127 89 -152 11 -38 36 9 -18 -75 40 -79 46 -85 -45 6 116 63 -152 44 -4 -24 134 -3 -25 -37
9609 -37 16 22 -175 47 26 -73 -49 -20 -68 25 23 -60 -61 17 -7 -83 -3 46 -50 8 -17 25 -87 -8 -16 -39 -18 -37 -57 48
9639 48 135 116 -130 50 91 -129 -76 -37 -60 -15 54 -98 8 -14 69 -52 -7 18 65 1 123 10 42 -38 -81 -50
9665e0j3J42o0J21n9Qj81Q3l3J68o3o5O2q3M6M4j14N4j70J84P1k15M2k9J31lr
9692Ik0Q8n3m3R9l1J3o5N6K4k5j08L4J8q7J45j08K24j84p1J55n1Jm4M4o2n9j8
9720a19J16j05J01QJ1M8n3L7j21Q9J1k8K0n2P1q2j9J69k12RJ40j41J40O1j61J06
9746D4qk0j12o5J81n7p2Q4O0q5J07Pj06M2L8q4J20q0m3O5L6j1n5m0l0OR1q4M8
9775b3J1j46N9N3N2K8j2k1l9M2n0LJ0J32j39R8j49O7q9K24j72OK6P6l4Mo8J32
9803H1j62K06o4J7o7j0J1J3n0o8J25PO4j06o9O6m9M1N5P8j24m4J40o4l1j01J28
9830B3Nj5q9K23k22J17j34J60j10M8Q7O3k03R2j5M6N8j76N6qm9P2q5R2L5k24m1
9857a94J49K3n1J6Q4L4p2P4j85K03j08J13j53n0M5P1l5K0j2P6k4p6Q3j18N6k4
$$ plain form
9665 -50 -63 79 19 140 81 89 -92 -9 -42 126 63 -2 60 -23 23 67 -47 7 -163 21 92 -123 -81 -110 21 18 9
9692 9 -11 77 24 -19 80 49 62 -3 53 77 52 -56 -22 -4 -91 54 -54 170 -14 -85 70 19 20 -24 20 -42 -101 -119
9720 -119 -3 -108 -7 1 12 60 7 44 -77 12 23 -5 15 -37 34 -48 -67 102 -110 -101 39 -102 38 99 -62 44
9746 44 36 16 -96 -161 20 -37 -109 -25 35 -50 57 64 -42 0 38 -46 74 -6 -49 16 52 41 -14 -54 -84 -78 13 -71 -23
9775 -23 -12 -158 -99 -46 6 34 22 1 -38 4 -46 -43 -33 99 -40 58 -91 -24 -113 111 -61 -55 -29 47 13 17 -51 81
9803 81 -81 125 61 78 11 1 12 25 -25 -93 32 39 103 -3 -72 -6 -55 -14 41 119 -5 -49 91 27 -4 -105 23
9830 23 28 13 -76 147 -75 42 -92 68 -42 6 93 156 -47 45 30 76 134 -42 14 6 -43 29 -56 36 71 -153 -194
9857 -194 -45 -22 -73 -57 27 61 -11 63 -122 81 -27 86 -67 -117 -72 -1 -36 -16 -28 48 24 -52 31 -87 -31 -55
9883e5mP4q4R7o2l9j4J43o9N2n8J7J34j53n1J52j13k8J70j49l7O4J8j2l0N5j1
9910Gm9P3k3M3K1l4p4J87n8q8j15R0J5r5J54q9J29q0M7m3j26J55o8%K4j2k1k4
9938e4qL2M1qj03L9J10j24M8q1L6R9l2J0p2K0M9j5Rpj4p1P7O7p9J12n9r3L1K7
9968a3j83J69L3j12J82p8o7R6K7j28J58j53PRL1J3p1L9k9M9J26q3p3J05o3J15
9994A06j99L5l4R4K8NJ05j30J08j50J37p4qk6q6k1J15m5P8j33R5on3J01L1j22
10020d9l8K7P4q8O5Q5o0J4L6%r2m2Q4p6J07K6q3j05J3J50n4j8K2r1O3k0J4k6R0
10049B8j0r0N8K3r4J09l8O9m1j56J16K4J9K1j74R5Jn8O2LJ32o9j27J19m6j7N3
10076A2j1Jj4km5pJ45j38J7k1J8PJ00p5j01P4M7m9j6J15n1J6JjPl1l3M9j95J00
$$ plain form
9883 -55 -59 15 -69 28 -34 -73 -87 56 -13 39 -19 -2 132 -21 -72 80 -33 -61 109 -40 -77 -13 5 -7 -37 18 7
9910 7 -42 31 8 51 72 38 -36 151 93 5 -110 -20 -5 -100 54 -35 94 14 61 18 -108 47 -21 -21 3 -9 -30 -54
9938 -54 -62 -30 11 3 -100 -61 49 -75 -27 -108 -72 27 -5 5 -67 -47 2 -13 -4 -11 -25 -96 -19 48 -31 81 22 -71 -40 -13
9968 -13 -196 -27 6 -106 76 -2 -69 27 54 -74 84 -69 -62 -53 -22 -9 -80 -41 -70 -21 105 22 -51 54 -9 106
9994 106 -93 -58 -92 2 30 35 140 10 118 -32 105 31 23 -3 -89 -110 5 -40 38 -95 0 -6 -59 42 73 -49
10020 -49 -87 -60 14 -74 -9 76 16 30 66 66 -26 -68 16 -60 47 73 -10 -115 -102 48 -6 -24 -2 -93 -30 -50 -36 -62 28
10049 28 18 -72 -14 9 -85 24 -14 55 14 -142 -26 -2 17 38 -136 -41 -40 -98 -36 -33 99 30 -97 22 -24 -41 12
10076 12 1 2 -12 -14 -59 -66 79 -59 -42 -63 -45 -38 62 -13 -114 -40 7 -42 -58 57 6 22 23 22 29 -2 -35 14 -181 -81
10106h1O5M2j07J03o6k3J07N8k5k15J78j9q7K2K06k40R8o3M0L4j81J32M1k8lm5
10132e7R0ML6p1K4k2n2pR8j07NL6N8Qk1lo7Q3j7m6N6p0M0jK2P8k49L05k32om1
10163a26N4L3K2j5l2L3J10o8j71J90j6k3n3P3N7j35M1o1R6m4m9P8j8R1m1k1R0
10190I5j53j33K41k9m3P1n1J09q7n3PM6J7n9N3J5m4L5p9N8k6p9P8K5r6pK5J65
10218A01m4j73Q7K4J6j05J56L8j14qQ2n2JK5k4mk2L9n6L0n0K6k5J16n9O0l8m6
10246a9k7M8MQ8J3j84M3pmNP7k7p1J26k7Q3j71J9N2Lj9j29j6P5P7M9kj00o5J37
10276C1m8R1j41N9J31k15Q7N0kq4M8K2Pj33J23L8Rj11M5j2p6N2J17o3l7o0J52
10303H0j90J07r7R1n3J04q5J43j04J8J4n1J61l5j08L6Jp6Q2o2m9J20j80Q3N1m5
$$ plain form
10106 -81 -16 26 -81 22 -44 -67 40 98 73 -142 36 17 -70 -48 158 -82 16 -47 -7 27 -154 -22 19 -9 -12 -57
10132 -57 33 37 73 2 26 4 -48 -55 43 -64 -59 -23 35 43 22 19 -48 35 18 -28 28 -42 -2 -3 19 97 -152 153 -79 -85 -126
10163 -126 -72 -39 -17 -32 -64 -31 79 11 -160 30 14 -9 -62 11 68 -67 -26 -87 9 -35 -84 -6 -24 67 26 5 95
10190 95 -58 -191 50 21 -22 49 -2 107 20 -33 -26 20 37 -22 31 46 2 37 -42 16 -10 -89 -11 14 -82 -89 -64 101
10218 101 57 -116 -29 -5 11 -94 62 100 -14 -22 60 8 9 34 10 6 -16 23 -33 -3 -53 -27 -52 64 5 65 27 -19
10246 -19 -46 2 6 94 107 -77 -34 -41 -45 -40 37 10 -61 65 38 121 -50 -31 21 24 5 -124 -140 -65 12 61 59 -41 -106 31
10276 31 -17 74 -67 -8 123 -92 -5 45 43 -41 7 29 36 -97 26 64 73 -38 7 -5 -81 -29 88 25 -12 -72 80
10303 80 -110 -3 -100 -9 -62 42 -43 100 -4 14 28 -23 138 103 -5 31 32 -44 38 -24 -73 47 -133 -50 1 -44
10329d4P6o1J24j4l9M8o2j02K24j93L6N6l7L0j21K01j37k2M7KJ8o8M5n3J9R4l5
10356C2L0m0J13q7j07J8J07rj59LJ92r1%j9K0j3J06m8n2q9J69j31R4l8q0J23j21
10383g7j9J1J02N6j59PJ37j82J22P0l7j42J41k2lLj16J16l9Oj7J56j4K6k04kJ55
10410G5j38J99j40n9N0J3j33J42oN9j07J38r0M2k8R6j80QM4OL1o5o8J14K7r3p
10437g0O4qj35L09r8j18PmL1j4k4J69j60P3j26R2N6n6K4j28M9N7r6J60K9Jr7R9
10465H6p2q5J02q9K06l2k38K33j72p1J70R5q5j57K05j28OJ05r7M6jk4m6L2n3R3
10491B9J6kj9j22P9J8J2K1J1q8k3J03kN2k3p3L8K2j9l0N8n3o1J10k4M9j37J7J29
10520H8o2m9L9K2r7O1P4o6k2L5k4J0Lk1J12j84J39j6m3j22K56j12m3M9j02J6O5
$$ plain form
10329 -44 32 -29 95 81 42 90 28 -74 150 -43 -7 49 12 42 -79 122 -15 -37 10 12 30 -38 7 -46 -27 67 32
10356 32 62 22 135 48 -59 -41 66 57 -102 -99 93 2 2 -17 3 -10 96 48 -4 -93 76 -55 39 1 -79 44 -77
10383 -77 -96 -85 17 73 -86 -79 58 -124 -2 68 31 -111 30 8 5 8 -108 8 -31 -25 -42 114 100 126 -78 -80 75
10410 75 -63 136 -4 -63 -13 0 -133 9 3 62 -45 93 3 45 17 113 -67 -59 -15 -9 22 -43 -111 3 30 -63 -70
10437 -70 -6 -14 -149 160 62 -56 -49 -53 -22 -36 -60 109 -51 22 -104 -12 44 -12 12 -116 -67 -10 -106 54 83 84 -13 86
10465 86 14 -71 31 -58 148 116 -122 111 -61 -132 38 133 48 -109 96 -32 -26 79 -18 28 27 3 -43 -11 -64 29
10491 29 45 43 24 -98 -19 -1 11 32 43 -45 -68 35 33 85 62 -11 27 49 30 0 58 5 -56 54 30 79 -58 -41 88
10520 88 26 -23 16 38 -59 2 76 10 -12 23 -1 9 12 -9 103 -81 58 42 -1 -123 133 21 -22 27 -75 -59 6
10547FOk9Q7k22J26r9J28L4n6P8k3m3q4m9P6P2M9l6q9J93j34j67J47N8P0k13N1
10574f3P8m1J0pm3KJ58j31j02J33n3PJ52j18N0N3j30J10o4k2J05j66LJ03j19J1
10600h4L2J3K8k2O2n6J7Pj45K55q9p7O0M9l7r6J61r1m3K1L4N0o2O2p3P8j4%k5
10629A5m1L1j6qp6RM4P9j7q3J15j26K22j4j07JJ8r1n2J06PL6j69J85J7j22K3n5
10657f9n9J61r7J38o7R9j32R8j07l1J52m3o5o7J37j2J00j37K0p2J7P4R5j25l1
10682b3J9j3Prl2M1J7Nj19J32m0N2J42j44j9L6N3q5k0L8M1M8j66qJ32o8k8LPl1
10712c2O5j23O0M4j8m4N2l5J6Nj3J28j43N9p5R8M6j60R0l2M5n1p2K8J09j45J20
10739B2J1j24Q7N4K2j26K1pR9p8OJ29j59J13q2J9j3K3P5n3j1j65J02L3k9L4J2
$$ plain form
10547 6 12 -17 70 -152 -26 -125 3 37 -19 59 36 -7 -91 -140 -64 8 57 21 -68 125 -9 -176 -29 29 99 -114 -63
10574 -63 15 -26 -16 -23 -66 -64 94 -37 -139 -6 -59 -52 100 -18 32 85 -45 65 1 -21 84 -82 -79 24 -95 -84
10600 -84 -52 -39 -11 -33 29 -27 -10 -3 -148 107 18 -59 1 50 13 -83 78 -13 -56 -35 -1 49 -13 49 -24 54 40 40 15
10629 15 -26 5 -11 -19 -95 -86 -42 37 20 -63 52 -74 148 134 27 28 46 -45 -97 9 16 52 -117 68 85 -37 -14 -69
10657 -69 -128 33 -64 74 7 106 -26 72 -35 -66 86 43 -22 -89 48 36 136 -1 19 -53 -36 38 133 8 -23
10682 -23 -4 -17 -10 -19 -51 -10 7 12 -107 25 -15 37 179 35 16 52 105 20 0 38 79 127 -39 -47 85 17 -11 -8 -1 -32
10712 -32 33 -90 -30 14 -4 -48 4 -31 -15 -10 -23 105 -38 21 -54 44 90 -70 20 -12 33 -18 -90 -62 47 -98 22
10739 22 33 -91 -4 50 72 -54 -33 -40 59 -19 -13 116 -43 70 -12 7 -6 17 92 39 28 -137 -35 -2 -31 3 15
10766A5j04N4K5L2L7j64J89m7N0j67P9p4j2N6M8k8J9O4q3M2j11J77j57nR1m3p8
10793i5O5PR6q8JjM0j28K01j56J4RN0j5Pp5J58j13j9L8L2j6J0N8l8k5k7j7N7q9
10823e9Q6j9j9J8j2N4m3M2R9j93Q6j53J67rk9N9R6k46Q8j9J32j21J3K6j24J52
10849G2k03O0J49j40q8R4K9K3k1p0N6r3J84M6l1pl9J7J7q0m9N5K3M5j39J34lp6
10877c5OO0r0L6p3L4J12L2r5J8L4j07M5r2%J60j17L4M5o9K8jJ71l1j48k9M1k9
10905f0N0j4r1P6Q0j4j42R7J8j55J52mk9N0N2r7m1j8R4M4j5j4j04k2J76j55P2
10932a4N2J6j3o2Pk0K1m4K3kj5M1m3M3O7m3P5j26m4O7M3o2k7j2N0K8o6L0J17j24
10962c7N0q4mL9L9k0J05q5m8P2mq7M6J02k7qM7j0j06L5o1L3J4P9r3K2k0J2N1j34
$$ plain form
10766 15 -89 -35 -10 22 59 -105 84 37 87 -80 -1 -75 -87 -31 17 -11 8 72 -11 31 -80 97 -60 -65 26 -17 -95
10793 -95 -30 -23 73 -15 -14 -15 25 -103 98 -58 -44 -35 15 0 7 -68 90 -23 -42 -4 28 12 22 80 42 17 -10 -27 30 -59
10823 -59 27 8 -11 7 -5 49 6 48 147 -46 40 -113 54 45 16 75 171 -75 13 -6 126 5 18 44 -80 72
10849 72 -131 -71 78 -62 -150 -56 -27 -4 -25 -95 -39 -132 52 98 67 60 21 38 55 -25 -74 -19 4 49 -90 44 41 -35
10877 -35 -29 31 -59 -23 -96 -62 50 82 -13 5 39 -68 -23 -115 -115 45 -72 -38 7 -62 -34 -35 136 105 -43 -72 -31 -60
10905 -60 -10 -24 -115 -39 41 27 -115 -18 0 -155 -3 -7 -36 14 66 -31 -72 -90 4 48 33 19 -85 -107 69 -86 -14
10932 -14 38 54 41 -21 -14 -34 -13 -57 -34 -36 -51 -10 -53 -10 57 14 89 -37 -81 -14 29 -33 -60 -72 -22 6 -60 -30 87 -37
10962 -37 13 -71 -75 -36 3 -17 88 3 -45 27 23 -64 -18 84 57 49 96 86 -20 15 -46 -13 1 80 -13 9 -11 1 52 -82
10992h2P1K2N9l8j6j65R8q3J01L1k9m3R5j27Q9n4J04r4J51l2k0j19Q7N0J5o1L9
11019D9j25P7n3o5J45J39j79l3J19n1J21o2m1n5L1j0L7r2L0j54K42j3p7KR8q0
11045@L2L7r6K8n2J11j15nM5k7R8j29K2K3j9n2J33j01rP3J2pkL8r1J33n8r0n9
11074a27J60j39J02R0j18L4J1r1P0P3L6j14j0k0l1N7J51j32j03kJ85j71QM8j4
11099d7N9j70J70J2l6j2J5l8J34q0J15ro8Po4r6J56J1r0j1K4L3n8k6qJ28r4P4
11127C1k9J8j41L1Q0O7N0k36J29J07j88J06Jr1m1J00L3JJq2J33j08k6l1R0Q0n6
11154B9o3m5oK27j07O8q2j7j9K2p6J53j1l3j5j47J29O5l9QoJ3Q5o5j7j18J12n
11182D0Nn3%K0J8j45P6j7Pk2k9J4J10o5J32k4l0lj09J08r5Q8k4j01P6M4k1p4N4
$$ plain form
10992 -82 -11 11 70 32 16 -149 -51 -134 -33 -2 -31 -74 21 -106 -17 -71 33 -61 90 58 38 -81 6 56 71 10 49
11019 49 -76 1 -52 -117 28 167 -12 -45 74 23 144 82 41 -14 17 7 44 -48 -18 -172 70 57 -20 -18 80 0
11045 0 32 69 -27 1 -51 60 -55 -60 -15 -42 56 -73 -51 -28 -47 -99 34 -67 -76 -3 9 2 0 38 -53 80 22 -68 -127
11074 -127 33 -106 -4 86 -32 2 13 -78 -8 65 101 -13 -23 -43 -74 -17 134 2 -101 -103 82 -89 -81 -33 -47
11099 -47 12 -158 12 24 -12 -24 -9 -47 87 7 122 113 45 52 -12 -108 48 59 -31 -42 -18 15 -43 -69 -77 51 -43 31
11127 31 2 20 -121 -90 -10 57 107 -129 0 107 -81 25 26 -65 -106 -6 27 28 29 -53 80 -28 -54 -85 5 85 29
11154 29 -34 -79 -85 142 35 103 21 4 -15 7 -69 84 73 40 25 -122 7 72 33 41 35 48 133 68 51 -67 45 40
11182 40 45 -8 -8 12 30 -115 -39 -56 -49 -71 -100 -86 24 -41 91 67 37 34 -75 33 -62 26 2 -99 -23 21 0 -74 -20
11211b0n5k1J86q0o3M1K3l2K3K2l2l2rrJ15Rj26l2J80Ok75L00j65J27j3j35J13
11238D6j20R8j11J11P7k19J57r9K07k39Q8J46k37M2q0J48N0j46%L9k6R1o9K5O
11263a5K5j0j1k9J50j31j7L9j9K9r5J32l3O2r0npK2k9m2K0J26M3k17Q2L4n2m1
11291g9L9n2j7J04p9Q4j50K31j30J04p4LJk4j2l8L2O3r6R7l1n0J83k21J39N9m3
11318D3q3J5J46j61J2P3k4J10m0r2R8j59l8l8Q0M4O2j4m5l7N1n4J24K2n6p6k6
11345f3L5l9L1p4rP8M2K6j1o1j2O3M4q2j9Q9O0j08N4l3Q7n3j02Nl6l9M9K2J06
11374E0o9N4q3K6M0l8j75L7R3N8M6o8M2k2k1L4J15r2j17J27o5P0J8j25j65J95
11400c5R9n4oj2nK0nQ4j06l6R9r3N7P0q6J28j31m0J0K0J24r9l0PJ33k13M0L4l5
$$ plain form
11211 -20 -75 -96 90 10 -53 -12 11 -21 2 24 -8 -40 -49 -58 57 66 -60 -92 88 94 -181 119 -46 81 68 -67 46
11238 46 -74 24 -87 24 101 -118 39 -60 147 -92 -4 142 -95 -53 -133 15 65 -81 -81 -42 -68 23 -46 -21 -15
11263 -15 10 0 -11 -40 110 -21 -38 1 -18 11 -84 48 15 77 -13 -18 -25 -3 -32 -74 -54 72 115 -102 -20 14 -38 -79
11291 -79 -40 -92 -109 -5 -84 0 -150 81 -49 55 -19 -16 -15 -39 -51 -89 -57 6 -90 7 -24 -74 109 -112 27 86 43
11318 43 -40 -25 121 -40 -28 45 21 131 91 -1 97 -62 -100 -138 -58 -14 48 34 -11 -48 3 -51 73 95 39 -37 -63
11345 -63 -28 -67 -36 -110 -119 -41 1 27 16 -45 -57 6 50 -32 -51 38 98 -10 44 11 98 45 -57 -52 -88 -127 -78 -56 50
11374 50 -19 35 -48 -22 18 -20 -195 -158 -65 -7 39 -29 13 -9 -30 4 119 27 -90 37 -28 42 60 -65 -230 -35
11400 -35 64 10 4 -8 -13 7 2 86 -20 -56 43 -50 7 77 -9 119 -12 -52 -42 -22 102 3 -27 -20 113 -100 -60 -26 -61
11429f1L6k3N5K2j91J31Q6j46J11l1j7RJ50k48O7L3R1k2n0R8j12N3j3J8j27J51
11455G0j5l9m2J58j78J98k28k2J70q0N1kJ3Lj02J5N6J8j00L0N2Mq5K0m4p7J08
11482d8l9R2k3m1O6M7k8mj8J6l5L5k3Pj25J50n8J9j44P7K59k19L7Q1k9p6q6O3
11510d7Qn1J66q4O7j39J9k0Q7l5Q9L5m4j95J19Mq6J55r2p7J27j09J53o7n1K3M6
11537ARk2j7M4m1q9J35O5j77J11JJ56k20J31j45l2j1J01J30k65J52r1P5JQ8j34
11563d4pk5Q3O4j12j7J09l6k1o9J28m1O6j0j04k7O9m8M7l5j6R8q5L8K3m7P4k9
11591B6j7j36J31m2J16j8J1l5P8m5n0M4q8l3Q5P6o1l2l8mL4r4N1M5j6j01J38k4
11619AM2q4Q3J1r1Op2J84p6l2m6R8Q4k14J32q0J15M5r9J00j70R7k1J7M8j45J00
$$ plain form
11429 -61 -25 -48 7 29 -162 -31 55 -91 20 -11 -28 -19 131 -117 -50 -17 74 52 2 100 -12 41 28 46 -81 70
11455 70 55 16 -26 132 -46 152 -76 -98 72 -8 43 41 54 57 -45 -30 26 44 -56 -26 26 30 -55 -35 -79 -156 -48
11482 -48 -87 5 -18 -59 7 54 26 22 4 20 -15 20 -3 4 -121 29 -29 -10 -154 -77 182 -37 0 81 52 -24 -110 -47
11510 -47 -39 -90 76 -8 59 -80 -61 -81 6 -29 60 95 51 -144 -25 -21 -107 48 -44 -121 6 -103 50 -17 -68 -45 1
11537 1 10 -12 -29 15 -26 -115 20 85 -92 19 20 176 -44 87 -58 -90 -101 0 130 -135 17 -74 1 2 90 -44
11563 -44 -51 -76 7 71 -41 -58 51 15 -6 -75 53 12 78 68 -36 -63 6 -42 5 -30 -46 52 -33 5 28 -19 55 26
11591 26 9 -127 4 -38 78 60 71 36 114 69 19 63 -25 -58 27 103 42 10 -28 -32 2 -92 -41 4 -12 -113 25 1
11619 1 43 -41 42 53 -38 -32 -104 80 4 -28 -74 24 108 -106 26 -54 61 106 7 107 -63 34 13 30 78 -67 33
11646C3n7P2J1k0m5M8o9J7k2K7l6L6qo2L1p3L9J20j02R6j6r2J72J0j01J03k79
11673a67J96l9k9J29j53J79j50J60q3M4j05K4J43q4j07J3k4J53j72N2K5P3r6m
11697b2j05J29lK5N5j18O1m7lO9K7j78K07j87O2l4Q2O5j64J13q7J4J1n9P6J2k4
11724b3R6j22M2k8K8o9J00k1P3J3j32PJ0%J9k1P1K2M2o0q0J57j34Q7p4r4J45p3
11752a9j61K21J07j08o6K3o5P5Kmk4K0kj09K0J05M6m7N0n7Q0j15J6M5n3P5j21
11779f6o3J58L1j44r6L00j20j27K08j35N8j5R6m0p1M3K6q1J75l0j63O1j6N1k9
11804A1J4J6j13Q5q6J05q0Q8r3l0K08m3r0j1L6O1j79R2n3J50j02l6m3J06Oo2k5
11831f8J29q1N6n9J0J24j38MQ1k1m5N4l5Q4j40m3M8J11n8p9J53o6p8Q0Q9m7mr
$$ plain form
11646 33 -24 48 59 39 -6 42 -27 -10 -32 -5 -41 -5 -13 -75 -44 -117 -78 42 -60 36 20 -72 100 110 9 112 -167
11673 -167 29 -10 -39 90 -63 116 -34 126 43 87 -18 6 149 65 -42 -29 -53 100 -72 -20 5 78 -18 -22
11697 -22 -127 2 -1 24 79 -39 22 -25 -28 41 68 -110 97 -90 -28 -62 20 85 -79 34 -53 -39 -28 -87 -11 1 -23
11724 -23 73 -49 -7 -35 -7 -76 24 3 76 89 -43 -36 -26 -26 -7 -28 43 65 107 47 -33 124 -10 77 3 -91 54 -19
11752 -19 -180 41 148 40 -26 -3 -68 7 9 5 -19 1 -1 -110 -90 15 61 14 64 7 87 -28 -12 33 -20 55 -66
11779 -66 -129 29 60 -84 -180 120 0 -127 81 -54 4 -11 85 45 -26 17 43 -38 137 107 -56 5 -11 40 11
11804 11 25 41 -72 13 -73 32 -48 40 -53 -83 125 82 -8 -19 17 78 -101 -9 -62 88 -14 -50 -93 13 19 -43 -68
11831 -68 61 -20 36 -23 -13 111 -27 -23 58 37 -8 46 11 95 -45 -88 -40 71 13 -66 87 21 -57 23 112 65 61 52
11859E2j7l6j6O4j03j4Q7p6J10J6j59J30j30J31o9J35o4j05L4p3rR8P0l6nK7n1
11886iM3j7N9j51N5k0P2n4Jk0N7j21J66p7j3R5n4M6j2o1q4Q1J56j76K9j17R7J0
11914a9m0O7k3J10p1K3n3m2L7k1PL7n5Q1J27k34M6J8Q2j50O2P6j93J39L3m7R2
11941H9o0J1p3O0L6r3L7Q4n4Kl7k7n2J32j83K4J27q6M1l0O0L8%q8O9J0n2O4p6
11970b7m2O9m9M6j58R8k9J41r0R0rj33N2J00k6j01P9qJ11p5J0p3L2p0L5MM1j06
11998h8Q4j44J85j31R5kN6q5k8J11j40P9l1oL6r0j4R3O5%j85J11j7Q2p0m9J3J7
12026e3J1Q0j14J33j49J2N9K9mo1M9rM6m9Q7j84J30k1K2k2k1Q1r8k6N4O2o5QK7
12055A4p5k1N1r4J36%kN2j03l9O5m0l3Q6m0m8oJ25J3n9%p3J26j33J20M2j94J22
$$ plain form
11859 52 35 -1 -17 47 -56 -70 17 -59 51 67 -92 38 -92 39 -30 105 41 -64 -30 -103 -112 -14 56 20 15 42 -9
11886 -9 34 17 76 -75 -20 -40 32 -22 -21 -41 16 -105 61 -16 -29 66 12 58 46 -15 -99 -18 138 -38 -9 -126 -29 -19
11914 -19 -59 8 -15 95 24 47 -6 -48 -11 -32 -25 12 -43 38 165 -69 -23 -5 77 -73 -11 65 -128 11 44 -3 89
11941 89 29 40 -33 27 63 -30 7 91 37 39 2 -25 -77 55 -128 -104 23 -63 -22 -52 8 46 46 -42 27 37 -15 49 -27
11970 -27 -69 0 -49 -3 -161 -63 -92 49 -41 49 40 -93 -41 59 33 -68 11 3 114 39 49 -24 8 -62 -27 -23 18 -88
11998 -88 -4 -148 37 -94 1 -1 55 -30 -58 53 -87 -8 -39 -45 -9 -99 -113 -20 45 45 -140 -29 -46 36 -34 -83 -70 -53
12026 -53 -42 38 -76 57 -92 -80 -21 8 4 -57 -8 -17 29 -20 67 -117 13 -8 14 -8 -29 52 -46 -72 -18 44 -21 -13 14
12055 14 -61 -82 -31 -125 11 11 9 61 -42 -81 -16 -56 -89 -3 -43 -91 -97 28 41 -18 -18 -91 35 -98 22 64 -130 -8
12083hj09M5J07M9j81J79j29L5M6l6p6M0J30M8j82J41j22J30j86Q3p8J01M7n9
12107A5k0J5K2q3RK4nK2K2Lj31J42j28L9O0n9J01j33P6O1j2p3R6n3J9N3j05P0
12135D7j22M9m1L3j5Q8K0o5j07Q5M7l1p3R9K8j73L2M7J5J14L0j07r1J08J12k03
12161g4J18n1Q2j06m4OJ9J15l9p2n2JO6M6Q6o2j56l0J85q5J08Jn4M0q2J31k6j2
12189E9j07J8J31j72J12j06P2m3J03m2j76J43n8J47j22J14k8n9j7j12N2P2P8j44
12213h5O4k7J72j48J51j44om0K5N5J01j74L2R3j72R1P9p3j00J04J7kj04J13q9
12238f7Q9j8M4M2l7l9l0n0j4Q0l6J8P4k8j51Q0kO3n4m7M6j8N6m7M4J09q6o6L0
12267a5P7r7P5L1m6j3p8J01j9nj85J69l1J00J66k78j3J00O9j35M9o9R5q4J40n5
$$ plain form
12083 -8 -117 -72 35 84 -97 82 -47 -12 34 -2 -78 -38 92 140 -42 99 -23 107 -79 4 -74 27 74 15
12107 15 -5 10 32 -51 -42 -18 -23 -1 21 24 -107 35 -93 -54 6 -53 48 -85 -9 52 40 -33 63 10 29 82 -23 47
12135 47 -75 -26 -67 -34 -49 39 59 -6 -113 -28 19 -12 -85 14 42 -131 -99 -52 -37 77 107 0 -91 17 129 -74
12161 -74 44 -7 75 -31 -75 -69 -50 65 26 -46 -98 -97 -31 15 101 39 -117 -147 38 -47 61 62 8 48 -34 97 71 59
12189 59 -48 -30 101 -71 41 -65 7 -36 67 25 -151 -8 -66 81 -41 73 45 -14 -31 -143 -91 -19 59 -85
12213 -85 -21 -48 124 -24 127 -17 -23 -63 -38 17 118 -56 -24 69 -103 -12 67 -6 -106 -2 15 13 -91 22 -67
12238 -67 22 4 48 90 53 14 -16 -66 -80 0 -36 -18 56 28 -123 -43 -45 18 -36 -83 -37 -55 1 -46 -2 107 21 -45 -15
12267 -15 62 -35 40 71 25 12 -66 35 16 11 -174 -5 -36 64 230 -48 -61 39 108 -27 22 -47 48 -36 104 49
12293D9m1j4J6Q5l2o9M0M7o4n7J7Rl7lJ6j49K05k0j9m8O6K7K3N2j56M2J63j54
12321fq8Q7j4l5N3Rj2P2n1k9K7J7m5j4JQj0O4Km9N0l3Nj5l5%QJ1R5j36O5Q3q8
12354cj0o8M6oK8K9j2p9K7K7J60j36Rq2Q3O2j2qo2n7P9Q0j59R3N8j97J29k8lO0
12384D8Pl5q3L3j3N8j3m4lJ37m7j54K1jJ07o8Q6J56j47K7q5M7p8r3J41K7k2M5
12412E4n6q1J73q9j3k6M7J9M5j10j4N3qL6k7O5l7N4j30J11p0j47J27k8J79j51
12438b4m8J69j04l7l0L1oo4J17j8J17j96J20qq8J87o6n7M3Pl5p8J05N4l4k7J9
12465D9j24J17QJ9o2L9n5K5M1q6P1m0L9l5mj0k4O2k15K05o2K4P9j22M0k8O3P6
12493I0n6j47J34o3k3M7n0J00J4j55K6J17o4K3L2R8j01P7j20NL2j9J9R1j42R7
$$ plain form
12293 49 8 -6 10 95 63 -6 34 81 17 -40 -23 -14 -51 -54 -38 -187 18 -2 -21 -69 -3 24 47 99 -57 -15 148 -6
12321 -6 -94 -7 -21 -56 -3 6 -6 66 15 -14 13 30 -15 -29 -28 -20 -30 34 36 -13 37 4 9 -6 -41 -41 -33 -22 73 -63 2 85 -3
12354 -3 -13 -81 -35 -41 -13 16 4 -75 -48 -21 139 3 12 -70 13 75 63 55 -7 -64 15 95 -64 29 87 -110 19 -9 -12 48
12384 48 55 20 -63 -30 -43 15 2 -42 -45 92 45 -109 -88 -89 18 -50 36 192 45 72 -13 34 -44 -137 4 31 9 54
12412 54 -2 -83 90 1 -12 -38 9 28 73 -37 -51 2 -6 30 3 68 31 85 -45 66 -4 -151 -24 -52 127 -24
12438 -24 -72 97 -7 -44 -74 -43 -49 -113 4 -14 103 -93 27 19 -69 118 52 -5 38 45 10 -68 37 91 57 30 49
12465 49 -75 42 50 69 7 46 -9 16 57 -29 42 2 41 6 2 -8 -32 30 -185 20 -42 -18 61 -61 -21 -49 14 90
12493 90 34 -113 21 -42 -65 -18 -68 32 46 -109 -83 34 -30 -7 25 123 22 99 -21 -16 16 -3 16 107 -35 62
12519F2p4J1l2Nl6M2j9k4L7M8N1j85J45J5p6K4L8M3Jk9n7J02p5P6r3m3N2Qn0J33
12549A00m3nj7oQ4l0r2Q1K3k3q2PQL8l3p1J61j24qJ92j26r8k5j6N0O7n3K5L1O8
12579H3j29J73k0n7j7k7J03P3r2k06O1l1J27l1KmL5m3O8j02K1K7Ll9N5j85Q8K1
12607d3P2l1qp4K11j23k3J8j1O7j06LO3j4l6P5k1o6QONL9M5j21J2J80j26J8j9
12636@J0J5L1p2L4j17M7N9q6M7n9J22k3m9O5m7o9L6O4l9P6p6O3j52P5R1n5j4p
12665c0M9nLq6NJ88j48j1J09p6p3Q2J1l3n6J00n9J00k3J3R3j37Ro1J4l8J61j32
12693c1j0J9J33j44J07J4o8k5r8J36o1K8Jj28K13q8K0m3O3j52J48J8m5N1j45R8
12719A1r7J73j01K6K5j09L1j7q1R3k0R5N5O1k40N9J0M5k9O5j5l2l6JRN0l5j59
$$ plain form
12519 62 -12 -1 -33 -28 -64 -22 -41 -65 -28 20 71 -114 31 46 -30 -6 32 75 76 47 -10 92 17 93 0 -43 9 17 -33 100
12549 100 57 52 35 29 113 83 -9 72 95 72 -10 -3 5 43 10 -61 100 -24 -32 160 34 -64 -89 -105 -55 12 -41 -16 15 83
12579 83 -46 127 107 50 33 6 109 182 90 -116 -55 -86 41 10 12 8 43 0 68 -34 -13 14 17 -22 33 -152 -64 -43
12607 -43 29 -2 -10 -84 127 4 -19 -1 -12 55 -51 -48 15 1 -35 40 19 -47 -39 -33 -28 11 56 -65 -53 127 1 19 0
12636 0 10 25 56 -16 18 -99 -52 7 -79 -32 -91 31 8 -41 24 -23 -92 -56 8 -31 45 -31 32 -120 -45 46 -9 -23 -30
12665 -30 19 14 17 -69 -64 124 -24 -35 74 -2 -75 7 18 -15 -71 29 -30 70 47 60 153 16 25 -36 -22 -60 101 -31
12693 -31 -41 -22 111 -33 74 88 20 -5 -103 33 -28 0 1 -127 86 -2 18 -25 38 -114 34 52 7 58 -87 11
12719 11 -86 87 -14 12 37 -72 -41 -58 -139 -46 -66 29 84 145 -95 -36 -26 19 -10 55 40 8 -28 -27 -18 32 -3 -162
12747a62J93l4o9K7j7K23j72l2K1n4L8m2J31q8M0n3M5L4NJq1J1J09o0o7J19o5
12774Aq0j7M1J7l5j18K60m8n6Q4j24R9o3J1N2j2o6R3j9k06J73m9j5J49p6j31J36
12801AQo1J06j41J61m4mr4R3j03J05q9J18l4q4J92q5q5J9M4j0j9L5o9r4L6K02
12828A04j30L3O5q8m5K0J51l7m5l8J04j06l6J33l0Nj46J17m0j1Q4k4j05L3J61
$$ plain form
12747 -162 31 -3 -72 -45 -62 161 -11 -43 -22 -76 -38 -80 51 -37 3 -50 -5 29 34 35 -46 -35 74 14 -53 66 1
12774 1 -79 -96 -55 -38 -73 -191 69 21 -35 49 -75 24 -39 -28 24 12 -54 39 20 -186 -13 -62 -77 72 -4 -135 1
12801 1 9 -52 54 -87 74 30 26 -68 25 -78 27 -62 56 22 -62 130 45 -40 -21 23 13 -6 29 -40 -134 -98 104
12828 104 -26 7 72 -16 -61 -41 110 73 28 -10 94 -12 -48 85 55 60 -86 31 -9 -20 64 40 -65 -32 129
$$ [...]
16383g3
##END NTUPLES=NMR FID
##END=
