##TITLE=abcd
##JCAMPDX= 6.0         $$ Bruker NMR JCAMP-DX V2.0
##DATA TYPE= NMR FID
##DATA CLASS= NTUPLES
##ORIGIN= UXNMR, Bruker Analytische Messtechnik GmbH
##OWNER= root
$$ XWIN-NMR		Version 3.5
$$ Thu Jun 26 19:17:06 2025 Russian Standard Time (UT+4h)  servis@DPX200
##.OBSERVE FREQUENCY= 200.131235884673
##.OBSERVE NUCLEUS= ^1H
##.DELAY= (6, 6)
##.ACQUISITION MODE= SIMULTANEOUS
##.ACQUISITION SCHEME= undefined
##.AVERAGES= 32
##.DIGITISER RES= 18
##SPECTROMETER/DATA SYSTEM= spect
##.PULSE SEQUENCE= zg
##.SOLVENT NAME= CDCl3
##.SHIFT REFERENCE= (INTERNAL, CDCl3, 0, 16.5164)
##AUDIT TRAIL= $$ (NUMBER, WHEN, WHO, WHERE, WHAT)
$$ ##TITLE= Audit trail, XWIN-NMR		Version 3.5
$$ ##JCAMPDX= 5.01
$$ ##ORIGIN= Bruker BioSpin GmbH
$$ ##OWNER= servis
$$ F:\spectra/data/av/nmr/H1/1/audita.txt
$$ ##AUDIT TRAIL=  $$ (NUMBER, WHEN, WHO, WHERE, WHAT)
(   1,<2025-06-26 19:13:47.35 +0400>,<servis>,<DPX200>,
      <created by zg, POWCHK disabled, PULCHK disabled
       configuration hash MD5:
       00 E9 B6 7A A2 85 ED C7 34 08 36 98 17 FE 4E 26
       data hash MD5: 32K
       31 1F 8E 99 15 57 6D CE 21 AC 99 D8 8B AB 80 F2>)
$$ ##END=
$$ 
$$ hash MD5
$$ FE FE 48 5E 3F 1B B5 8B 4F 47 52 B6 56 E8 88 1B
##$RELAX= 
##$RELAX= 
##$RELAX= 
##$RELAX= 
##$RELAX= 
##$RELAX= 
##$RELAX= 
##$RELAX= 
$$ Bruker specific parameters
$$ --------------------------
##$DU= <F:\spectra>
##$EXPNO= 1
##$NAME= <H1>
##$PROCNO= 1
##$TYPE= <nmr>
##$USER= <av>
##$AMP= (0..31)
100 100 100 100 100 100 100 100 100 100 100 100 100 100 100 100 100 100 
100 100 100 100 100 100 100 100 100 100 100 100 100 100 
##$AQSEQ= 0
##$AQ_mod= 1
##$AUNM= <au_zg>
##$AUTOPOS= <>
##$BF1= 200.13
##$BF2= 200.13
##$BF3= 200.13
##$BF4= 200.13
##$BF5= 500.13
##$BF6= 500.13
##$BF7= 500.13
##$BF8= 500.13
##$BYTORDA= 1
##$CFDGTYP= 0
##$CFRGTYP= 5
##$CHEMSTR= <none>
##$CNST= (0..31)
1 1 145 1 1 1 1 1 1 1 1 1 1 1 1 1 1 1 1 1 1 1 1 1 1 1 1 1 1 1 1 1 
##$CPDPRG= <>
##$CPDPRG1= <>
##$CPDPRG2= <>
##$CPDPRG3= <>
##$CPDPRG4= <mlev>
##$CPDPRG5= <mlev>
##$CPDPRG6= <mlev>
##$CPDPRG7= <mlev>
##$CPDPRG8= <mlev>
##$CPDPRGB= <>
##$CPDPRGT= <>
##$D= (0..31)
0 2 0 0 0 0 0 0 0 0.06 0 0 0 0 0 0 0.0002 0 0 0 0 0 0 0 0 0 0 0 0 0 0 
0 
##$DATE= 1750950826
##$DBL= (0..7)
120 120 120 120 120 120 120 120 
##$DBP= (0..7)
150 150 150 150 150 150 150 150 
##$DBP07= 0
##$DBPNAM0= <>
##$DBPNAM1= <>
##$DBPNAM2= <>
##$DBPNAM3= <>
##$DBPNAM4= <>
##$DBPNAM5= <>
##$DBPNAM6= <>
##$DBPNAM7= <>
##$DBPOAL= (0..7)
0.5 0.5 0.5 0.5 0.5 0.5 0.5 0.5 
##$DBPOFFS= (0..7)
0 0 0 0 0 0 0 0 
##$DE= 6
##$DECBNUC= <off>
##$DECIM= 32
##$DECNUC= <off>
##$DECSTAT= 4
##$DIGMOD= 1
##$DIGTYP= 9
##$DL= (0..7)
0 120 120 120 120 120 120 120 
##$DP= (0..7)
150 150 150 150 150 150 150 150 
##$DP07= 0
##$DPNAME0= <>
##$DPNAME1= <>
##$DPNAME2= <>
##$DPNAME3= <>
##$DPNAME4= <>
##$DPNAME5= <>
##$DPNAME6= <>
##$DPNAME7= <>
##$DPOAL= (0..7)
0.5 0.5 0.5 0.5 0.5 0.5 0.5 0.5 
##$DPOFFS= (0..7)
0 0 0 0 0 0 0 0 
##$DQDMODE= 0
##$DR= 18
##$DS= 0
##$DSLIST= <SSSSSSSSSSSSSSS>
##$DSPFIRM= 0
$$ [...]
##$SUBNAM0= <"">
##$SUBNAM1= <"">
##$SUBNAM2= <"">
##$SUBNAM3= <"">
##$SUBNAM4= <"">
##$SUBNAM5= <"">
##$SUBNAM6= <"">
##$SUBNAM7= <"">
##$SUBNAM8= <"">
##$SUBNAM9= <"">
##$SW= 20.6817932712277
##$SWIBOX= (0..15)
0 0 3 0 0 0 0 0 0 0 0 0 0 0 0 0 
##$SW_h= 4139.07284768212
##$TD= 32768
##$TD0= 1
##$TE= 0
##$TE2= 300
##$TE3= 300
##$TEG= 300
##$TL= (0..7)
0 120 120 120 120 120 120 120 
##$TP= (0..7)
150 150 150 150 150 150 150 150 
##$TP07= 0
##$TPNAME0= <>
##$TPNAME1= <>
##$TPNAME2= <>
##$TPNAME3= <>
##$TPNAME4= <>
##$TPNAME5= <>
##$TPNAME6= <>
##$TPNAME7= <>
##$TPOAL= (0..7)
0.5 0.5 0.5 0.5 0.5 0.5 0.5 0.5 
##$TPOFFS= (0..7)
0 0 0 0 0 0 0 0 
##$TUNHIN= 0
##$TUNHOUT= 0
##$TUNXOUT= 0
##$USERA1= <user>
##$USERA2= <user>
##$USERA3= <user>
##$USERA4= <user>
##$USERA5= <user>
##$V9= 5
##$VALIST= <valist>
##$VCLIST= <CCCCCCCCCCCCCCC>
##$VD= 0
##$VDLIST= <DDDDDDDDDDDDDDD>
##$VPLIST= <PPPPPPPPPPPPPPP>
##$VTLIST= <TTTTTTTTTTTTTTT>
##$WBST= 1024
##$WBSW= 30
##$XGAIN= (0..3)
0 0 0 0 
##$XL= 0
##$YL= 0
##$YMAX_a= 2980095
##$YMIN_a= -2608090
##$ZGOPTNS= <>
##$ZL1= 120
##$ZL2= 120
##$ZL3= 120
##$ZL4= 120
##$ABSF1= 10
##$ABSF2= 0
##$ABSG= 5
##$ABSL= 3
##$ALPHA= 0
##$AQORDER= 0
##$ASSFAC= 0
##$ASSFACI= 0
##$ASSFACX= 0
##$ASSWID= 0
##$AUNMP= <proc_1d>
##$AZFE= 0.1
##$AZFW= 0.1
##$BCFW= 1
##$BC_mod= 2
##$BYTORDP= 0
##$COROFFS= 0
##$CY= 19
##$DATMOD= 1
##$DC= 2
##$DFILT= <>
##$DTYPP= 0
##$F1P= 11.0000007629395
##$F2P= -0.999999237060547
##$FCOR= 0.5
##$FTSIZE= 0
##$FT_mod= 4
##$GAMMA= 1
##$GB= 1
##$INTBC= 1
##$INTSCL= 1
##$ISEN= 128
##$LB= 0.05
##$LEV0= 0
##$LPBIN= 0
##$MAXI= 10000
##$MC2= 0
##$MEAN= 0
##$ME_mod= 0
##$MI= 0
##$NCOEF= 0
##$NC_proc= 0
##$NLEV= 6
##$NOISF1= 0
##$NOISF2= 0
##$NSP= 1
##$NTH_PI= 0
##$NZP= 0
##$OFFSET= 16.51637
##$PC= 1
##$PHC0= -274.4733
##$PHC1= 1.101538
##$PH_mod= 0
##$PKNL= yes
##$PPARMOD= 0
##$PSCAL= 4
##$PSIGN= 0
##$REVERSE= no
##$SF= 200.13
##$SI= 16384
##$SIGF1= 0
##$SIGF2= 0
##$SINO= 400
##$SIOLD= 16384
##$SREGLST= <1H.CDCl3>
##$SSB= 0
##$STSI= 0
##$STSR= 0
##$SW_p= 4139.07284768211
##$SYMM= 0
##$S_DEV= 0
##$TDeff= 0
##$TDoff= 0
##$TI= <>
##$TILT= no
##$TM1= 0
##$TM2= 0
##$TOPLEV= 0
##$USERP1= <user>
##$USERP2= <user>
##$USERP3= <user>
##$USERP4= <user>
##$USERP5= <user>
##$WDW= 1
##$XDIM= 8192
##$YMAX_p= 0
##$YMIN_p= 0
$$ End of Bruker specific parameters
$$ ---------------------------------
##NTUPLES= NMR FID
##VAR_NAME=  TIME,          FID/REAL,        FID/IMAG
##SYMBOL=    X,             R,               I
##VAR_TYPE=  INDEPENDENT,   DEPENDENT,       DEPENDENT
##VAR_FORM=  AFFN,          ASDF,            ASDF
##VAR_DIM=   16384,         16384,           16384
##UNITS=     SECONDS,       ARBITRARY UNITS, ARBITRARY UNITS
##FACTOR=    0.0002416,     1,               1
##FIRST=     0,             0,               0
##LAST=      3.9581328,     0,               0
##MIN=       0,             -2608090,        0
##MAX=       3.9581328,     2980095,         0
$$ Real data points
##PAGE= N=1
##DATA TABLE= (X++(R..R)), XYDATA
$$ [...]
9071d4J50j49K7j02P3m3L9j0l0J34k9L6n3q2J08q3N8M2rk02J68j3J2j15J59n8
9097a6j1lO6N0m6K4j51J29J2k6j28J06r6J15P3q3LM3N0K8r6p4L3kRJ10j27l4Q6
9126D4k2PP2k4j62Q0j08J84k2r8J13j52P7M4Km8l5J17r8P8q7R3j48K2J38j20L6
9153a7O2J6j27J10n4j5j4J7j0J12L3L4j72k2J2J1jpJ24L5j83J86j7j28J28j26
9179a3K4n1O1O7j12lN8m3J7O9M1j87Q0j3P4no0k0j2M3J9OK5j32J03L3j4j39M8
9208c6N0k3K6p0j10J43Q8j26L8j5Pk8K6l5O2n2l0J01n8M9J6J14q8j05Rp5Q9j0
9236d3L6Q2p0Lm1P9m4O0l8j45O7O3K4r6Q9J1j8p9N1P9q6%N1J3m7O6r8n1j4J83
9266H7j45O1O6Rp0K0o0J17j12n4J55j49R0j38J06j5M5l3K3r5P2J2O0k7q3O6l7
$$ plain form
9071 -44 106 -43 -16 -118 -45 -88 -49 -59 -89 45 16 52 -1 -83 25 -58 0 42 33 -169 -1 -14 -2 -117 42 -16
9097 -16 -27 -30 36 86 40 64 -87 42 54 28 -100 6 -90 25 98 15 18 61 111 139 43 -31 2 0 9 119 -8 -42 44
9126 44 22 29 101 77 -85 -5 -113 71 49 -49 64 -88 -11 33 35 -13 -48 69 -29 49 -38 55 -93 -71 67 -53 -17
9153 -17 45 61 -66 44 -10 -25 -39 -22 -32 80 113 147 -25 -47 -35 -24 -25 -32 92 127 -56 130 113 -15 113 -13
9179 -13 11 -40 21 88 -24 -27 31 -12 5 74 115 -72 8 -5 69 64 4 -16 -28 15 34 40 65 -67 36 69 55 -84 -36
9208 -36 14 -9 17 -53 -163 -20 68 -58 -20 -35 -28 -56 -30 -65 -3 -55 -85 16 -42 7 23 137 49 -56 -47 -122 -33 -43
9236 -43 -7 75 5 8 -33 46 2 62 24 -121 -54 9 33 -63 26 37 19 -60 -9 70 -16 -16 35 48 1 67 -31 -82 -96 87
9266 87 -58 3 69 78 8 28 -32 85 -27 -81 74 -75 15 -123 -17 -32 13 -20 3 -92 -20 -8 52 25 -58 8 -29
9293b9M4j59J32l1P2j35J39l7J05j55N0Ro2M9k3M1O6n2J9Pj28J54j29J4l2J0N4
9320gl5L3l8Rj2N7o3P3ll0K6J0pj02K06j30N8K1p4m8O7L4L0o3LM8n3l4m5R9j02
9351g2Q4r3J50j35M2R1j6k0j50J59L5l5q0J14k12P0K2k0N7N5j81J34j2O8r3N3
9377A5J01j24r1J8%J2K3O4k4o7J76r4qM4k06R3l0K04n6K3m4M5o4j34J27N9m7j07
9405i2J16Qj29Q7m3K1KM1o6Q7m0n9J04p6M9q0OJ30j07OJ9L1L3q5j3R5r9n1J63
9434E8m6j9J65k3o1j40L6J03p9J44j21n6M4jr0J03O8j28O0qO5j26J05o1j11J51
9460C2j98K35O2j00Q1j23o9PL4k9K5L4k4rJ05%j50J5k1J10l4n5R5p2L1K7k5J3
9488cr8O3o2M1O6Km5P2k7p2R9k9j6n6J56p8m6q2J09Q8Jj70Q1Lj6O7j69J48r8J22
$$ plain form
9293 -29 15 -144 -12 -43 29 -106 33 -4 101 -54 -4 5 -57 -8 -31 10 76 24 43 50 -78 76 -53 -39 -71 -61 -7
9320 -7 -42 -9 -47 -38 -50 7 -56 17 14 -16 10 20 13 -89 117 -13 45 66 -8 -56 11 45 75 12 15 63 10 -24 -69 30 -72
9351 -72 12 -81 69 -66 -24 67 51 31 -119 40 75 40 -40 74 -138 -68 -46 -66 -9 46 -135 -1 -13 55 -38 15
9377 15 116 -8 -99 -81 -81 -69 -46 18 -6 -73 103 9 1 45 -161 -68 -98 106 50 73 29 74 10 -124 3 62 15 -92
9405 -92 24 32 -97 -10 -53 -32 -30 11 -55 32 -8 -67 37 -39 10 -70 -64 66 -41 -35 -16 15 48 -37 -50 45 -54 -105 58
9434 58 12 -7 158 135 74 -66 -30 73 -6 138 17 -39 5 4 -86 17 85 -43 17 9 74 -52 53 -8 -119 32
9460 32 -166 69 131 31 112 -11 -80 -73 -39 -68 -43 -9 -33 -42 63 63 -87 -72 -93 17 -17 -72 23 -49 -18 9 -16 -3
9488 -3 -101 -38 -100 -59 7 9 -36 36 9 -63 36 7 -9 -65 91 13 -33 -115 -6 82 83 -87 -6 -3 -19 48 -121 27 -71 51
9518E1j50J28M7j14j13R9J50r7o8P3Nm6J42K2j13m8K02k28J03j3m4QJ9JPj2Lj03
9546h9R4j7M3m2m1P9n0ol7LQ0O0l6o5J00n2r1K4%M9j5LM9o6o4R0m4l7J25o8K0
9577aK2J2K0j5L8k7m4M0r6j00J16J28j75J13J2j51J38n8P8q3O6m6J5o4J45L9p0
9604E2Kj3M5j16N9j47J47Kl6k1O2No8j2k5mJ1%nJ47j62R0j27Q2r7O8J57j43N8
9633A1N2r0J8N1N9q7o7K0okJ3N7o9L9OML0j02J08M3j37O8o1P9p5M1j9P8j58oK54
9664A52r0j20J45j21R0j07P9J9k18K27j00j4M9PM2l4J33j20m6J1PL5M1j12L8j9
9690b6J18j2k53J92P1q6j57K12ll9m1j5J15j9l1Rp2N7o3J6L1j1k9J02m2j37J85
9717G2oj01j1j9P3k1J28j33K6m9l5j7J34j25J82n0j41L2j8J8J07j04j6O3O2lp7
$$ plain form
9518 51 -99 29 76 -38 -151 -52 98 1 -67 6 11 -35 107 129 16 -32 170 -58 45 32 -12 -4 15 16 23 11 14 -89
9546 -89 5 -12 31 -11 -52 27 -23 -29 -66 -63 17 77 41 -24 76 24 -67 -43 -43 6 -9 -6 43 -23 -87 3 -41 -78 47 -21 -1
9577 -1 21 33 53 38 76 49 5 45 -51 -151 -35 93 -82 31 43 -108 30 -28 50 -33 33 -13 2 -62 83 122 52
9604 52 54 41 86 -30 29 -118 29 31 -5 -26 36 41 -27 -39 -64 -68 -57 -57 -62 85 -77 13 -114 -32 -129 -61 96 -47 11
9633 11 63 -27 -9 42 101 14 -53 -33 -39 -41 -28 29 -40 -1 5 9 39 -63 45 88 -49 19 -42 37 -38 3 -16 62 -96 -102 152
9664 152 62 -58 87 -34 56 -51 28 47 -171 56 -44 -58 -9 -2 40 6 139 19 -27 -16 -9 26 67 -45 -7 -26
9690 -26 92 80 -173 19 90 4 -153 59 56 17 -24 -39 76 57 26 35 -37 20 -43 -27 4 -7 -36 66 24 -113 72
9717 72 66 -35 -46 -65 8 -13 115 -18 8 -41 -76 -93 41 -84 98 48 -93 -61 -79 -61 46 -58 -74 -11 51 48 -29
9744b9oJ41j61J05m7M8r1O3j9J03qj08%M1qM4r7kJ18k3n3j06J65j00J9O8J7j20
9772d6P5q9O6O7n0o2l7N6N1J05j57M5p0j0O2o9J44n1q2k3J96j99J6J63j32nM3
9799GK4K9j3P7j48R9M6j41J7j2M4P8r0K0L1j72J07Rj9o9Q9J7j54K53j37lO3K3
9827G5o2j5K5j3n9K08n7j67j3N6L4J00r9M1l3K8K1j08M3LJ3P4j20O6m6jK8o5k
9856d5Q7O1L6j52M2P2q6J36j07k7r6J4R3q9J70k9q3j24J89m6r4J67j36R6j33J61
9882G7l0k2K8m3J7M2n3r4N5Q1k75K03O7qj77J49n4M3k5o1Q2qJ4K0O3j91Q1j14
9910a33J21k4k7J18R9j37%r9O1ON8J35j07r4M0k6J16r4JJ7N6j16kKP7l4o6R2j90
9939a50K6M5P6k8Q3m7M1J5Q9j56M6R6j03j40K08j48J51j06p4R8R7j67P7l0O8P5
$$ plain form
9744 -29 -35 106 -55 50 3 51 -40 23 4 107 99 -9 -9 32 24 68 -29 -31 87 64 11 -95 70 -30 -11 57 74 -46
9772 -46 29 -60 6 73 23 -39 -76 -20 31 136 -21 24 -46 -56 6 -63 81 30 -52 -75 121 -78 -62 101 -31 -36 7
9799 7 31 60 47 124 -24 75 121 -20 -3 -15 29 107 17 37 68 -104 3 12 -7 -76 13 30 -124 129 -8 -11 52 75
9827 75 13 -2 23 10 -49 159 102 -65 -78 -22 12 112 13 54 21 49 70 -38 5 8 21 95 -25 41 -5 -6 22 -43 -45
9856 -45 42 103 139 -13 29 101 15 151 44 17 -79 -65 28 -61 109 80 -3 -127 62 16 -78 89 -47 49 -84 77
9882 77 47 25 53 10 27 69 16 -78 -23 58 -217 -14 53 45 -132 17 -37 6 -19 -80 2 -6 8 28 91 -100 -19 -133
9910 -133 -12 -36 -63 55 154 17 17 -82 -21 -15 43 178 71 -23 17 -9 107 13 14 31 87 -29 -31 -29 48 14 -52 40 -150
9939 -150 -124 -79 -3 -31 52 5 46 61 150 -6 40 136 33 -107 101 -47 104 -2 -76 22 119 -48 29 -1 67 142
9965A42j48k8O5Mr0Q7q3J27j37J22r9j4L8Lm0L6J11q9r6J08k3N6o3J1R5n3j01
9992e9R2p0Q9j22j5J45j58J82r8Q8q2L3m9O8m6M3nm7o7J30j7JQ9jrj70J01k08
10020a62L7J17n1R1m5RJ5M4j4r5J01J3j54O9j6J57J0o7j04J0Q3rq7J03l8Jj5J3
10048A6olj05R7m9K2J5J2n5K5KJ7L0j11k2J25j16O6J12r3J33q2l6j0M7l5j4M0
10076B2rl8J42j39pj0Q3p4K5Q8o9n9N1j1p9J24K0K6k5j0p2N0q9o6O5M4M9K1q1
10105b8M9j37J61j19O0R7k1Ll2J09j89J28l5Q1r3K4m3J1m8J08n9o9J52m4J7p8
10131EP6l0k4Q2j9j10p4L0JJ50p8J0O0l3N7p5j15R1p1Q6J20j42j4O1o5J19q9l9
10159c0J0K1k3n4Q9o7m1J31j35Q7Oj30J52p8M0K9k6oln4J13P0r3Ooj33R7n5MJ18
$$ plain form
9965 142 -6 -34 31 35 -55 32 -51 76 -61 61 -38 -52 -14 -11 -51 -15 96 7 -89 19 -4 52 -11 0 95 42 -59
9992 -59 33 -37 52 -70 -85 60 -98 84 -14 74 -8 25 -24 44 -2 41 36 -11 -78 52 35 36 125 124 115 -55 46 -162
10020 -162 -125 -8 -59 32 -13 -4 11 55 41 -54 47 60 -94 -25 -41 116 126 59 -45 -35 48 39 -48 55 17 18 3 16
10048 16 10 7 -98 -1 -50 -28 -13 -1 -56 -31 -29 -12 18 -93 -115 10 -106 -40 72 -21 112 30 -6 -16 31 -4 -18 22
10076 22 13 -25 117 -22 -29 -39 44 -30 -5 83 14 -45 6 -5 -84 40 60 86 61 51 -21 29 -60 -126 -61 -17 32 53 -28
10105 -28 21 -116 45 -74 -14 83 62 65 33 142 -47 81 46 127 34 58 15 26 -22 86 27 -42 110 66 83 5
10131 5 81 51 27 109 90 -20 -94 -64 -63 87 9 19 79 46 103 28 -87 4 -67 19 139 -3 -17 44 -21 98 9 -30
10159 -30 -20 1 -22 -76 13 -54 -95 36 -99 -12 -6 -136 16 -62 -22 7 -19 -25 -28 -82 31 101 8 14 8 -125 -28 -83 -79 39
10189C9J27j30j3M0m3J02k29o7J93o4R1j05M6R0J4j27k6J22r8J4O4k42L49l7j55
10214d5J06r6M8O9q0J8L5m3q3J45q6J33o0j03Q5J03j93Q0l8J8k8m3J31o7j2J3
10240Gq9k3J68j14J43r8J3K3p1N5k0l0K2N4q4J17m7o0J02Rj50J49Pj00M0j33J69
10267E9j25R5Q5r5j08J23p6O8j13P9l0L7L1q5J08k8j16J77p1N8j14lr7J78j4J7
10293D0l9L7j09P0N0j6k9j6J19j57P0Q4mk33P1O7m3j17K74j74J26j61J34n2N1
10318D3M0K8l0L9r2O9mj49J71q8q3M5L5ml8Q8j67L7Q2lj89K43o3J9K2j5m4P4l9
10347B7M4n9M1o8K2K9r5Q7n4J35j00L0O1k16J35N9o1K9j10J90j64r8K21j06O4
10372D3L1Or5KO1r0m4Q6J64k16qM1J03K0j52J0k1k9Q6o1N3j1L7o9L9J2n5m2Q5
$$ plain form
10189 39 166 36 23 63 20 122 -107 -174 19 -45 46 -59 -13 77 91 -36 -62 60 -38 -24 40 -202 147 110 -45
10214 -45 61 -35 13 82 2 20 55 12 -71 74 -12 121 61 -42 43 146 -47 33 -5 13 -15 -58 73 6 -6 7
10240 7 -82 -105 63 -51 92 -6 7 30 -41 14 -6 -36 -14 40 -44 73 26 -34 68 77 -73 76 83 -17 23 -110 59
10267 59 -66 29 114 19 -89 34 -42 26 -87 -8 -38 -1 30 -55 53 25 -91 86 15 73 -41 -44 -141 37 23 40
10293 40 1 38 -71 -1 49 33 4 -12 107 -50 20 104 100 -133 -62 5 -38 -155 119 -55 71 -90 44 -8 43
10318 43 83 111 81 120 28 97 93 -56 115 27 -56 -11 24 20 -18 70 -97 -60 22 19 -170 73 10 29 51 36 -8 66 27
10347 27 71 12 53 -15 7 36 -59 28 -26 109 9 39 100 -116 19 78 17 46 -64 126 -38 -136 85 -21 43
10372 43 74 80 -15 -13 48 -42 -86 0 164 -52 -60 -19 84 104 -48 -38 -59 -88 -2 -63 -10 -21 16 -53 -14 -2 -57 -99 -14
10401a4N3L1n4p3RqL8J35j09rj06J13o8L3KJ13p9J07o5j91K6J34j22J03j9o6l1
10428a17K15l2j46K6N1j8M0M3R8m7j39J55j17L0m2j8J43o4q5M9K0p2Q0k4N8r9
10454a2J03m7r2O9k9Q0j33L2j6J6N5J2rRK3p6l9K7rj6L8J10m2j70J7J21M5j3p1
10483a7l5K7Q7p9J6M6j51R9l2J5K1r2J23j5L0J3j86K94j87Q5k0n0n6Q6n3J2J54
10510A35j22nl5l2PP2L6p5j08J25M3k6j08J03R6j47Q6n4P6r8K5J09JL7j21NJ52
10537A77j24o8q3J05R0o7l1k2P7j05mO4j62R5P3pj19J24j38J5P4k6J77k86J05
10562f6R3j0r4R8j16J86j03K1J5p4J2J30m1m5k%j20J76j1m0J2K0m7L6nq1J15r1
10590c2m2mJ5j0K3q8J69N9j02kM4j36J02K0K7o3J40m5p8jk8M9o0M6Ln9M6J75k59
$$ plain form
10401 -14 39 70 16 -57 -48 -56 -18 117 8 -1 -107 6 -62 -29 -27 86 7 114 49 -142 -116 18 -104 -1 -20 -86 -117
10428 -117 98 66 -80 -54 -3 -21 19 62 160 113 -26 129 12 42 0 -18 125 61 -24 25 45 -27 53 29 87 -12
10454 -12 91 44 -48 21 -8 72 -61 -29 -45 -29 26 38 29 38 61 -15 -54 -27 -36 -52 -14 96 54 -116 -99 22 67 54 -17
10483 -17 -52 -25 62 -17 -1 45 -106 -7 -39 -24 -3 -95 28 13 43 56 -130 164 -23 62 42 -8 -64 22 -31 -19 135
10510 135 13 8 -27 -59 -52 20 56 -19 -127 -2 41 15 -93 10 106 -41 45 -9 67 -31 -6 103 104 141 20 25 177
10537 177 53 -15 -98 7 97 30 -1 -23 54 -51 -55 9 -153 -58 15 8 -111 13 -125 -110 -36 -62 115 -171 -66
10562 -66 27 17 -77 21 -95 91 -12 9 24 -50 -38 92 51 6 4 4 -116 60 49 9 21 41 -6 30 25 -56 59 -32
10590 -32 -74 -78 -63 -73 -50 -138 31 90 -12 -14 30 -106 -4 16 43 -20 120 75 -3 -4 -32 17 -43 3 6 -53 -7 168 -91
10619i1J16L2nl5l0L5J6r3J02q4L6J9m4p3K6J6R2q8J32j00M8j31O5R6m0k8j58
10646a69J73J23k22Q0J7l7J54j57K1J2qn0n8J7R1j3L6p3O1j42J66l2J68k34RJ54
10672H7k05K09o6o9k1O4r3J43l9l8R9j6l2J00j28PJ16j67q8J16j5J35p2j26J30
10697C1L6j33K3N4m6O2r1j2j7J87j82m3P5R3p3K8m9m7J04k8j3L6Q4j07J1N9Q1
10724A23j88R2K3o4L7r1J20k3J1l2j6R2k6k2j38L3j2L8N3P7j33K6m6K1J03j06
10750d8K2k3q7M1J41q7L4n6O2l6KJ12L3j95J49l0O4m9n3kl0M0k3k7P0J37k29k0
10778h8J20o1R0k21J44j8j40P0O3k1J43j9L7j23J8j02J28Jl4Q9l8p1J6qJ7k9R
10805b8j11J37K8o5m8J15q6J3O3O9j1mm2o5O2q8Q4L6j39LQ7q5P9N1l5j14O9J03
$$ plain form
10619 -91 25 57 52 17 -13 22 38 -55 47 -37 -1 18 -26 -99 -73 -57 35 -53 79 -21 27 -104 -39 57 17 -11 -169
10646 -169 4 127 -95 -15 2 -35 119 -38 -17 -5 -13 -63 -121 -104 -13 -26 10 -63 -2 -144 22 -10 158 -76 -67 87
10672 87 -118 91 25 -44 -65 -1 -94 49 10 -28 71 55 23 123 -5 2 118 -49 -137 -21 -36 99 27 -99 31
10697 31 67 -66 -43 11 -35 27 -64 -76 -93 94 -88 -131 -56 37 -36 -8 -57 -104 0 -28 -41 -5 79 -28 -17 42 123
10724 123 -65 27 50 -14 23 -68 52 29 40 8 -8 84 58 36 -102 -69 -81 -43 10 87 -46 -20 -66 -45 58 -48
10750 -48 -26 -49 -136 -95 46 -41 -7 -63 -1 -37 -35 77 110 -85 64 34 98 49 -4 -6 -36 4 -19 -46 24 161 -68 -88
10778 -88 32 -29 61 -160 -16 -34 -174 -104 -41 -62 81 62 99 -24 -6 -108 20 21 -13 76 38 -33 -17 -25 -8 -37 -28
10805 -28 -139 -2 26 -39 -87 28 -58 -45 18 87 76 72 30 -35 27 -61 23 59 -80 -77 10 -75 4 55 20 -94 -25 78
10833G8j41Q9j7J19j84r4J28L5j3N2p4R1j5m3l1M1Q2l7m2J8J21j76K5j4r8J21
10859B1R1o1n3j28J61o0O8M7k67J92J09j02l2j8O4j6K0j90K03l6j33J56m0p1N8
10884a7o8J23k2L4K9j16L6M3l0m4l3k4K1J00k4J4o5K9k7L7o1J52j12q2J66o1l5
10911c7qL2p1J29o9o3O0K0q3N4m4Q2J3kl2J2M7j42MP1j9K5j1L4P9j75O5o6M6n
10941e4L9m4N9o6K09j01m9q3J55m4OQ1j20l0k2K09j59k2R9j31J95j11j46J12n
10966b3jK6P3j17J09j6nm2Qk5m0NK9J7p5k3L6P9m9J4l5n4K18o4j83%J55l5j14
10995a32K56j43J3J8n2j7J0J49n5r8R4p9l9Q0Mj2L9K5k9m1o7k4J16N9J13l1k15
11022e8J38l5o2o1J18L4o2n2J12m4n2N0j08N3n8J28Q8k09R8O6k5j9p4P8j54%N5
$$ plain form
10833 78 -63 26 9 128 -56 -150 -22 13 0 52 -22 69 54 11 -20 21 103 66 24 42 163 -13 12 -2 -100 21
10859 21 112 51 -2 -130 31 -29 39 86 -181 11 120 18 -14 -32 32 16 36 -154 49 13 -120 36 -4 -75 -17
10884 -17 -85 38 16 50 79 -37 -1 42 12 -32 -65 -89 -68 32 8 22 -43 -14 -41 -4 -65 87 -25 -107 59 -2 -37
10911 -37 -45 -13 -84 45 -24 -87 -27 -7 -90 -36 -80 2 15 13 -19 -7 40 -102 -98 -27 -46 -21 -32 2 81 -94 -29 -95 -49 -54
10941 -54 -15 -59 0 -66 143 42 -7 -90 65 21 27 108 -12 -42 -64 145 -14 -36 63 -68 127 16 -130 -18 -23
10966 -23 -24 2 75 -42 67 51 46 4 12 -13 -53 -48 -19 -2 -77 -100 -64 15 -34 -20 -55 -109 109 45 -138 -138 17 -18 -132
10995 -132 124 -19 -6 12 -40 -57 -47 102 47 -51 43 -36 -75 5 9 -3 36 61 32 -9 -76 -100 16 75 188 157 -58
11022 -58 80 45 -17 -78 40 74 12 -40 72 28 -24 26 -82 -29 -87 41 129 -80 18 84 59 40 -34 44 -110 -110 -55
11049e5n9J1J28o5M4q4K1J03p3j3n1J31j00N3l6J64j57jL3Qp8J12r6LM9M2q3j9
11077f8m1O1p8J36m3O6J7j5l9rK4o0J61j97J06O7Jq5n7J4O2k1L4J25j51Q7j0j53
11105f6R2J8m5p3KJ6R0m8K0j04L4J04l7N3m5lL2j44Q4J36k30N9J16p4pnn9R8K2
11134C6k06J47J9R4j97K15j3k5j57J04pj05J17r2N4k2J0m4L7q5l1K22j36O1p6
11159h0M0J83j49J5j4o7J87Mj42J28n2pL6j06l8M9j8m0K0J00J06k14l1P2N9k6
11185A5K5L0p9O3q9K5O9o0P0oj15R4J6p4o1PJ41j03j6J57m4o2m1N3p0pR3J0j79
11214a38R0Q2k8N2r7OR5n3M1j79J57k1l8j6J03j60J19pJ24r6j8K8q5j9L8P1j26
11241g5M1OJ7o1J17o5Q5n0P3j91Q0J12j10n8Q0j27M0J06L2k12J84j06O1o9Q4Q7
$$ plain form
11049 -55 -114 -103 25 -40 4 -80 -59 44 -29 -42 -93 38 -62 -9 -45 119 -38 -39 -6 2 -76 36 -60 -57 -8 34 -49 -68
11077 -68 -109 -48 -126 10 -33 33 50 35 -4 -13 11 -49 112 -85 21 88 89 4 -53 -39 23 2 36 161 10 97 87 -66
11105 -66 26 44 -1 -74 -72 -56 34 -14 6 -98 -64 40 3 56 11 8 40 -104 -20 116 -114 -55 61 -13 -20 -25 -84 14 36
11134 36 -170 -23 -4 90 -107 108 95 70 -87 17 10 -95 22 -70 -16 -38 -28 -72 -35 -120 -151 71 -65 -4 -80
11159 -80 -40 143 -6 9 -5 -72 115 119 -23 105 53 46 82 -24 -62 -13 -31 -71 -51 49 155 -59 -90 -18 41 15
11185 15 40 70 -9 54 -35 -10 59 -1 69 63 -52 42 58 -16 -77 -70 71 -32 -48 109 65 3 -38 15 -55 -62 31 41 -138
11214 -138 -48 34 6 58 -39 -33 62 9 50 -129 28 7 -31 -47 56 -104 15 8 132 36 18 46 -39 -58 -20 51 -75
11241 -75 -34 -28 -11 -72 45 -20 65 15 88 -103 -23 89 -21 -79 1 -126 -86 20 52 -160 24 -82 -21 -90 -6 81
11267H1l2n2p4N5K5rJ05j25k1j2O6K2j10J62j25P4n9J08n4N1j57RJ30j30KK04
11293A34k52L1P4k9kR9j9M7k4q0J71j35lnj5m5J1m5o1K50l7q0N1j10O9m9P8o9
11321d5J8j4l5Q8mN2j07j7J8J3J12j54O7K7n6L1NPK1L4R0j74K1l5p8J62l6j0j33
11350a32J12q8Q8Q9j28J4R2j9n6l9L0p0J29k2N3n9j03J35mP5j92N4M0j35J24R9
11376H7p1R4k2j63J68j7J3q9K5p7nl2J41p7J45p3L5j6q0j8O9K4l3O8j2j22J01
11403F3p2Q4o5l9j07J01j7l9P7Q5k6r5O2k1j8K1J9J8K9l4r3N4j4J35j53Q7q2J72
11431A32j01l1k3m2J73j60K4J1O1o9lk4J26j01ROP2n1R3n7j49O2R1K0p4n7K9R3
11459F0k8po0J44n0j8o0j7K1l9K9j3J10p2J28k31J45m6%L2m4L2J6j27J65p1Jq
$$ plain form
11267 81 49 -3 -77 -22 3 -6 99 -26 -47 -59 7 29 -81 81 -44 30 -29 79 25 76 -81 -72 58 -72 -70 134
11293 134 -118 -87 -13 -42 -44 55 36 83 59 -21 150 15 12 7 -8 -53 -42 -87 -148 102 65 -15 36 -74 -5 -54 24 -45
11321 -45 -27 -41 -76 12 8 60 -47 -64 -46 -33 79 -75 -8 19 -37 -6 -1 6 27 61 151 -23 -2 -37 -115 47 11 1 -132
11350 -132 -20 -108 -20 69 -59 -45 47 28 -28 -67 -37 -107 22 0 53 -6 -109 26 22 97 -95 -41 -1 -136 -12 87
11376 87 16 110 88 -75 93 76 89 0 25 -52 -57 -89 52 -25 120 47 82 66 -14 -32 37 61 28 96 84 -38 63
11403 63 -9 75 10 -29 -136 -35 -52 -91 -14 71 45 -50 12 -9 -27 -6 13 31 60 26 -67 -13 -27 108 -45 42 -40 132
11431 132 31 0 -23 -65 108 -52 -28 -17 44 -25 -28 -52 74 -27 -18 -12 60 9 102 45 -104 -42 49 69 -5 -62 -33 60
11459 60 32 25 -35 109 59 41 -19 -36 -15 -54 -25 -38 72 0 128 -103 42 -4 -4 28 -16 16 32 -95 70 -1 0 -8
11487hN0j41J04qn7Q3p1RJ1m9O3J4O8l2k1p2J04q3%Q8kq9K1J04n0j26K05j6j82
11516h3J26j03Km4R9q8N1J9l1J24q7r6J33K6j68J14K1p0J03K1n5N6p4n7K9J05
11542G3j11lP5q3N6Pm5JM6q4O4L7J18j43j04kJ01n8J1L9pP1j07M%M8j51J21j47
11571a73J69Q7j62J39n8N7n8J05o5p2N9o4N4P9Nj29R5l6k00J09jk1P9M2mq8M8
11598dj15R2J8Q6j71J10n0O2j05p3R5k3J5O5l1m2J33j85J08k1K9p7J20n7j53K01
11624B7k8r2J56j69nQ8N2j69J36K0m6J17Q6j49k7q1O0Q6r7l5J15pk3M1j4j7r4
11651f9l6J37q3m4K8R1Rj9mj3Q6j02k9J15n8K3j14j5Q9O6J9q3j7k0J6K0j16M1
11679h2J32k1k6K0O6j08P5r1L5O2j12J2J18j90M9Q2k5j4j11N6M3mQ3l9k7R5o5
$$ plain form
11487 -8 42 -99 5 -3 -60 23 -48 -39 -28 -77 -14 0 68 36 15 -57 47 -36 -36 52 50 -39 -18 86 36 -90 115 99 -83
11516 -83 43 -60 -58 -102 -3 -91 -40 -21 -52 72 -15 -111 22 48 -120 -6 15 -55 48 69 14 70 -4 -61 -32 73
11542 73 -38 -41 34 -49 7 14 -31 -30 16 -68 -4 33 151 8 -96 -98 3 -55 -44 -5 -12 59 -48 -44 -44 4 -147 -26 -173
11571 -173 -4 83 -79 60 2 59 1 106 41 -31 28 -36 18 97 102 -27 68 32 -168 -59 -60 -81 -2 40 36 -52 -4
11598 -4 -119 -27 -9 77 -94 16 -34 28 -77 -150 -55 -78 -63 2 -29 -71 62 -123 -15 -36 -7 -84 36 -21 -174 27
11624 27 -1 -93 63 -106 -111 -23 29 -140 -4 16 -30 87 173 24 -3 -84 -24 62 -35 -70 45 38 15 56 42 25 -69
11651 -69 -105 32 -51 -95 -67 24 33 14 10 -3 83 -19 -48 67 9 32 -82 -97 -8 58 77 -6 -23 -43 -27 -7 -123 -82
11679 -82 50 29 3 23 89 -19 56 -35 0 62 -50 -38 80 -110 -61 21 -4 -18 -129 -73 -30 -34 49 10 -17 78 13
11706A3P3oj9j07L6j00O5J16l5q5m6j9J30r0L9k5J11j27J8K4J14r1J38L8k61N3
11732d3oq3O3J11nQ4j65j08J82r6P0R2j33R3k5L5j8nlj76R5M4rM6r7O9L7J3j77
11761a15O3RO5l3LrnK6M8Ln5K6L1p4J3P2j30j4K00o1r1O2j02oM7O1p6O8l9J23
11791A10j28mnL3m6j11P7Q9k1N6N3j14o3R6k3k2l1o7JJ08N8j14R7mPj16O1J37
11819A14p2j44M5L0nL5l9J6l1J4M3j5J32j15L1o8q6%R5J3J5j15M4Q6q6o5J92j86
11847a22J55j25J26j80J97n2k5L9m1j14J98n6k2J80j44O1j54J58j55N3N1L9j9
11870D8k8J6j33J81k1j30J84o2j7j67J75j09p0K26o3j03N1O5j0j4j7j1pP2m8P2
11896H0j02J7l8J8QJ2j07P4K1O9j63Q0K7l3J00j24P7ll5L0R4j30k5k5J38j62J
$$ plain form
11706 13 86 80 61 -46 -10 -110 -45 71 36 -49 -95 -114 16 -74 -35 -60 51 -76 -58 -34 80 -11 127 165 -96 -43
11732 -43 -49 -132 -69 42 37 121 -44 -152 30 -66 4 96 -37 56 31 66 48 43 40 -136 -41 3 -6 40 -57 12 49 62 -115
11761 -115 -52 -43 22 -11 -8 -17 -22 4 52 55 0 26 57 -17 -4 68 -62 -76 124 63 -28 34 -68 -74 -27 34 -42 26 -13 110
11791 110 -18 -22 -27 6 -40 -151 -74 15 -6 50 103 -11 -74 22 -1 -23 -54 -121 -120 -12 46 -68 29 25 32 -84 -23 114
11819 114 42 -102 -57 -27 -32 3 -36 -20 -51 -37 6 -9 123 8 39 -29 -115 -115 -20 -7 8 -107 -63 23 -63 -128 64 -122
11847 -122 33 -92 34 -146 51 -1 -26 13 -28 -142 56 0 -22 158 14 75 -79 79 -76 -23 28 67 48
11870 48 20 36 -97 84 63 -67 117 55 38 -129 46 -63 -133 93 30 -73 -22 43 33 19 2 -9 -16 56 8 80
11896 80 -22 -5 -43 -25 -17 -5 -112 -38 -17 52 -111 -31 -4 -37 63 -61 16 13 -22 8 102 -28 -53 -78 60 -102 -101
11923a01J88l4l1P9m8j39pJ18m7q3J45j65K83j47p9o1J59K7qN8k03R9J8m3L7j44
11949a29J71N4l2k2q8M6r3Q9k8J8j06P3k1O6j08J97j00O1n7j1K2L2l9n8Q4o1K8
11976a2j75J53J5j5n3M3J20p0q2Q1R4q6Om5R0kn5l0J42j19l6O5p6j3J6L3l4N5
12004A0q9P8q3M2M3J3p2J03j22J04J3J8p5m1O2l9J84q0k05K59o3j01K7q0J02j19
12030a11J32N4o7j02L7J2J28j19N4j27Q9n7J01K2j58J57L1n7r3J13m5n3l0lJ19
12055B7r8J55l4o1J3o2oKJ07L4N3j36n6N6m8L0o5P8Pn5J22o6l9O2l0J28k40P7
12083d5R6q7K42k37j5Q2O9p5M6j11j2N7o8Q0L2q0J7O0M3r9Q9p8p2Q5KR3l3o1l7
12112a7Q8j40kL4N7j30J23R6j12M8%r1k8N6j1Q5K5j44J93j20K1p5N0M1j58N7J34
$$ plain form
11923 -101 87 53 22 101 53 -86 -93 25 -22 -105 40 -125 158 11 -68 -129 30 57 49 107 -96 3 21 -22 15 -129
11949 -129 42 96 64 42 -46 0 -93 -4 -32 -14 -120 -47 -68 -2 -110 87 -13 48 -9 -20 2 34 -5 -63 21 -40 -12
11976 -12 -187 -34 -19 -34 -87 -44 76 6 -76 5 99 13 19 -26 64 62 7 -23 119 0 -36 29 -47 -60 -44 -11 -45 10
12004 10 -79 -1 -84 -42 1 14 -58 45 -77 27 40 58 -17 -58 4 -35 149 69 -136 123 60 -41 -14 -94 8 -111
12030 -111 21 75 8 -94 -57 -45 83 -36 18 -109 -20 -77 24 46 -112 45 76 19 -74 39 -6 -59 -89 -92 27
12055 27 -71 84 50 -11 2 -60 -66 -64 43 77 130 -6 -62 -6 -54 -24 -89 -11 -4 -59 63 -3 -42 20 -10 118 -122 -45
12083 -45 51 -36 206 -31 -46 36 105 30 76 -35 -47 10 -58 22 54 -26 -9 51 94 -5 84 6 -66 19 21 114 81 20 -17
12112 -17 71 -69 -71 -37 20 -110 13 109 -3 45 45 -46 -74 -18 -29 56 81 -63 130 10 31 -44 6 47 -111 -54 80
12139H0r9m5N5J9pQ1j69O7P9j71K24k49N5P3J70j46R6p8j52R2m3L9j25L4Q0j00
12165a40K6J41p1oJ46m3r2R6l9m8Q7j19qJ58o8j94K41J07k96J9J70K0j31l7J67
12190H6j30n7M1L4P0k5n6m5P5N7p9Q2n8OQN7r4N1K2j42J22O1q9K8KOj16J84j28
12219b7J22k11j6M9Q8J8k5L1O5K1j18N7m7J5K8j83O0N3m8k3J01o1R7p3l8M4p4
12246i5M4J0M5Q2n9n0j7R9j43J60j46J11J06j37N6r6O9k5N5R5k43J16K7q2Oj43
12272a55J96l8m0J9n2Q4O2l2l1K2j13R6l9J9o3J4m3J61j90J02K4j3PJ6J9qm3J5
12300dK8q5m9O8K2J0j9k7L6J8Q2j41J60r9p0LJ7J26q8K05k36O0M4Pk8j0R5k01
12328g6N8j21N6j1J90j74J03o1rJ33j07J10M3j00mm2q6M8J40k36M9K23j81J34
$$ plain form
12139 80 -19 -64 -9 10 3 84 -85 -18 61 -110 114 -135 -80 -7 163 17 113 35 -117 -25 -68 -29 -154 -120 -40 -140
12165 -140 -114 27 -44 -50 96 53 -39 57 18 -30 57 -62 -70 88 20 -174 67 174 -122 -103 67 87 -44 -81 86
12190 86 -44 -101 -60 -26 44 19 -37 -82 -7 50 -29 53 -5 1 9 66 -28 23 45 -97 25 86 -3 25 27 33 -83 101 -27
12219 -27 95 -116 -132 -83 5 23 -2 29 94 115 -3 54 7 22 50 -133 -73 -20 -68 -91 10 -51 46 -27 -65 -21 -95
12246 -95 -51 -41 4 86 27 -23 -40 59 -84 76 -70 41 147 10 66 -30 39 14 69 164 -79 37 64 -18 -12 -155
12272 -155 41 3 -37 -18 -70 14 76 44 13 35 -78 18 -21 -2 -65 -51 -94 67 -123 -21 3 -10 -3 13 32 24 -19 -4
12300 -4 24 -61 -110 -42 -20 -10 -29 -56 -20 -2 80 -61 99 0 -70 -67 -50 76 -12 193 -43 17 61 68 40 30 125 -76
12328 -76 -18 -139 -83 -94 96 -78 25 -36 -45 88 -19 91 134 34 30 -12 -98 -50 90 -146 -97 126 -55 79
12352G9j44J48p1oQJ4R5j36J13j16M6qm7pQ3j52Q1L9L2O6m3J0n1J0J8M9j85J87
12380A12p4L0j05P7j4J4Lr1P1k8p9J6J02r0L1nP5j0ko6N2m2J25n6P8k36P7P2n1
12409a4o8M4J18o9k0K1O9j45K4M5j00J54j8J2L8r0M3m2J18o8o1k0j13J34m1N7
12435Hn0L7J10j73J34l4k9m2L7N9o7j5p5K3n8J82k7k3l8l5j3M5m8J12p6J20j45
12462h1N5j4OJ54j46N6o1K4J2j43Q6N9N3j20k7O6L1o1N4j5k1O4o8oJ4K8O6j49
12490h4j8P1Jn4P2p5J87j66P8l2j3mJ19j08L7L8q7J18p4J8p7K4L2p2J1J54j78
12517h2J85p7j00J02P6j0o7j6Pj29K01j87J50q4L6L8l3n7P1L8r7l5P5j5k7MJ0
12544b3rj8L6P0j4j47O6j9l2J3R8L2p2J7m5O2j04J89j91L6L8N2j02P2Q6p7p8K02
$$ plain form
12352 79 -65 83 12 6 14 28 123 -13 100 -16 30 22 -25 -32 51 -101 -20 19 51 117 74 84 33 43 61 110 -75 112
12380 112 38 68 -37 40 26 40 43 -48 23 -5 -84 -68 34 -56 -25 -30 45 35 33 -33 19 -23 102 46 124 -112 -35 37 -14
12409 -14 -82 -38 80 11 -9 12 81 -64 -40 5 -95 59 41 53 91 1 44 2 120 52 -9 -29 -142 -8 -49 8
12435 8 -42 -5 105 -68 66 32 3 -39 -2 57 -10 -25 -100 -77 -135 47 20 -3 -41 -76 -89 -44 -92 20 -56 64 -81
12462 -81 -26 -40 -34 120 -26 30 -31 -7 5 -138 -52 7 60 -60 -87 -21 10 -51 3 -12 -33 31 -37 -43 -29 -1 65 -84
12490 -84 -102 -31 -30 -84 -12 -87 100 -66 12 -20 -33 -37 82 -26 11 49 -38 80 6 24 -53 -29 3 -69 -58 96 -82
12517 -82 103 26 -74 28 104 94 27 11 18 -111 90 -97 53 -31 5 43 10 -47 24 62 -35 -70 5 -10 -37 -33 -23
12544 -23 -32 -50 -14 56 42 -105 -39 -58 -90 -77 21 53 -19 -2 -47 15 -89 100 -91 -55 -17 35 -67 5 91 14 -64 138
12572A38j23q3M1P0J39k24L4j5L3lj2j04N4k8J51j09N5m5k6L5%L5m1K4L7Q3j81
12599f5J03q2M4L4P1p7Ko2P1j02J27L5r7k3L5k4K2o6J24m2M3q5o8L7O6J5Nj81
12627a40J64p8L7M5m6j4J5L6rJ06k39J32m6N7p8%J92j82J21j06J02j42M7Q4j26
12652f8K9K8mJ4rK3K6o8j4K3O1J10j84J54k61P2O6l4mJ5Q5k1m0n3J03p5R1k3n5
12681a3J62j44n7l0K8M0Q0k7J2p6M7K6j11J18q7J7r5J54r9L6m2mJ69j12q6Q5l8
12708d7K0N8Mr1J24j29J57K8j89Pj4N6o9J66r9j32J39l0p4K31j10j8K3M8j21N6
12734fQ6j02K0r6J59j04L7Q9j34J07k0K2m3j28J87J13j34k7j8j17J13J0j16L8
12758f4J05M4j50J63n8k9j6N4j25J43j72O3J39N2j18J8K2j64J43j9r9J21l2o6
$$ plain form
12572 138 15 -68 -27 43 182 -42 -8 -23 10 7 -5 -109 -55 -83 68 -41 14 -31 -57 -22 -22 13 -28 -4 33 116 -65
12599 -65 38 -44 0 34 105 28 30 -32 39 -63 64 99 2 -21 14 -10 12 -54 70 28 71 -14 -82 -45 21 36 41 -140
12627 -140 24 -54 -17 28 -18 -32 -17 19 10 116 -123 9 -37 20 -58 -58 134 -48 73 -33 69 -73 -26 58 -68
12652 -68 -39 -11 -15 -1 -10 13 39 -29 -43 -20 41 151 -33 121 -140 -68 -2 -36 -40 -25 60 39 -1 -54 49 -26 65 42 -13
12681 -13 149 5 -52 -82 -54 -14 66 39 51 -25 22 48 -63 55 -32 -15 -110 44 -55 -19 -61 -65 104 -8 -94 -9 -47
12708 -47 -27 31 35 -56 68 -61 96 124 -65 -58 -72 -16 -85 81 -18 -150 -11 -41 -115 116 6 -12 11 59 -62 -6
12734 -6 80 -22 -2 -98 61 -43 -6 83 -51 56 36 58 15 -113 74 187 53 26 8 -109 4 14 -102 -64
12758 -64 41 85 -65 98 40 11 -5 49 -76 67 -105 -42 97 149 31 49 71 -93 50 31 -68 53 21 -45
12782d5N2j0J63j27l7J06r1l6o1J62J6j30P4Qn8N7n5l7J4L5m8P4p5J50p9m7L2
12809GL0Q4j33K7l4%J40jr3j9k4MJ13j09R3K4j76K6MQ1q9R5n1n0P2Q2k07M6J1
12838d7O7K2j34J63J16k20n7J13J4J03j68J8j8mP3n3j0N2j22L6R4r3Lq0P0M4J13
12865I5j09Q6j2j48J9J04rQl7Q3j62kO7N4P4r2n2J35j29j3L6J12n9J7j46J44p3
12892ij52J59O5q5j4N0Mk3q1M5J32j29P1J6j99O4R1o4j00J67J29j74M8mo7k7k3
12919a10R1r5K02Mo9j9O0ol8J7Qo9qQ6k0L1k3q2J29j04Q8j23j13J57K0n8p7J36
12947A5n7Q0k1m0j41J10j38P8R8o8O1J70k22J15o8P%q5J53j8N9q3k1kKk4Pq6N4
12976f5N4R0j31O7O4l8n9k2m8k5Q3n1J51r6Q3l5p0K6Kj0k9J03j10K4Q9j16k1P2
$$ plain form
12782 -45 7 -3 160 33 -4 102 11 -25 -86 76 92 -38 36 44 -14 43 -12 -49 -35 0 -48 26 -49 101 22 -25 7
12809 7 37 121 -12 15 -19 -19 121 120 27 8 -16 -12 101 -8 85 109 -67 -41 -37 44 -45 50 -1 -51 21 103 -104 -58 -47
12838 -47 20 42 -92 71 187 -33 -90 23 37 140 -28 -10 -28 -32 41 -12 -22 30 -92 -56 38 -55 -52 -132 -62 -18 95
12865 95 -14 72 60 -88 -69 35 26 34 -3 80 -82 -84 -17 37 111 19 -33 102 -27 -40 -4 108 49 66 -80 64 -9
12892 -9 -161 -2 63 -22 -36 14 18 -5 -86 -41 91 -38 33 49 -150 -86 5 -59 -159 8 137 -37 11 7 -60 -87 -110
12919 -110 -19 -114 88 92 23 4 64 58 20 37 45 -24 -32 54 34 65 42 -40 89 -15 73 -50 -163 -6 14 -44 -121 15
12947 15 -42 38 17 -23 -164 -54 -192 -114 -16 -84 -23 147 -75 40 -28 -21 -21 -106 47 29 88 5 -16 -18 -16 -40 -33 -119 -65
12976 -65 -11 79 -52 15 79 41 -18 -40 -88 -113 -30 -81 70 -26 57 22 -48 -22 -20 -30 -59 44 -66 -42 47 -69 -90 -18
13004a8k0j62J34n1J41R2r8J6M8j47oN8O3l5J3m8J32j03k3JJ0o9J38j17J38j21
13030c4M7nj7k1o7J07j61J35O0n3nO1j54J51J0j2j31k6J09k5J8q5O0P8oj05J94
13057A23j51Q4j74J67L1j42J75j45L4m3MK5k9M0p0J62q6j77K25j45J06o6J2o0
13081a00K5l5R8J11r0P2n3p2m8J40M9j53J07l2m5J3n1J01n1l8k1J78r3K3Km0J22
13108A19q8L4Qj41j0P3L6J1j02J1L8N0J4p1J5j0J93j28k6L0k10K10j8P1k12L5
13134f8J85k00J54K1l3J4J7p3K6r4J16o6J32j62LM2p8P3M8j88R3K9Jo7J07q4Q3
13161C1P3k32J49QO9k81J98l7M3n6K0kJ0J14r9P7n7J56q0r0N0N0j20l8N4J20j96
13188f6j9J63m4Mj08J00j00M4J20n5m5N5j07R8j22R3j0M1l1j08R0J4n3Qk0J68
$$ plain form
13004 -18 -38 -200 -66 -117 24 116 18 34 82 -65 -71 -13 50 15 28 -20 112 9 -14 -13 -3 -72 66 -51 87 -34
13030 -34 13 8 -9 -30 -97 10 -151 -16 44 -9 -14 47 -107 44 54 42 -89 -115 -6 -31 -13 -98 -38 40 34 -71 123
13057 123 -28 56 -118 49 80 -62 113 -32 2 -41 -37 -12 -41 -1 -71 91 5 -172 53 -92 14 -52 -40 -100
13081 -100 -75 -110 -12 99 9 81 28 -44 -92 48 97 -56 51 19 -26 -13 -64 37 -14 -52 -73 105 12 35 37 -3 119
13108 119 31 65 73 -68 -78 -5 31 42 -60 -49 -11 39 53 -18 -3 -13 180 52 26 56 -154 56 38 109 -103 -68
13134 -68 117 -83 71 92 59 73 90 17 43 -51 65 -1 131 -31 -28 14 -64 9 57 -131 -38 -9 -8 -75 32 -52 31
13161 31 104 -128 21 29 98 -183 15 -22 21 -35 -15 -17 -7 107 8 85 28 184 104 14 64 114 -6 -44 10 130 -66
13188 -66 -85 78 34 38 -70 30 -70 -26 94 39 -6 49 -58 40 -82 11 1 42 11 -97 -7 7 -46 -38 -58 110
13214A10k0j92R9N5n8o3j4J36k0M8n1k3JK1n3N0l3K4N7l0l0n6O8OJ0J3L1j58O3
13243iJ06j60L8J6j2R6n2J0Pm8K4n6jO5m0r4J31l8k5P3k4j14J05oMk8j6J5R3l8
13273B2P4j27K6O6j52M2o7M9Q9q8Q9J7k0l7mMM0p1N2P6q4m1R%M9L7Nq7R3n2k8
13304a9P5Q5j82j0P1q7J25k0q3n4Q1M3o2JJ09j26PM2l7J26r4J53j77J8j5k0R8
13331D8p2o1O6mn6N2L0R5j8n8rm1nR7j04J01J11j51J21k12L4oJ0R5j38J58j28
13358d5k8J10Lm0j05N8J21O8p9j59R9K9q3R7q2J16K2j93P9q0J54n0Nl8M8n1M3
13385A9l8oo7J0P9jRL5j59J59L0j04o7M2P9jJ6q5N6N9L7j44L1K3J94k76J0L6N1
13414B7l5l3k5N8N3l3j45O4N1J38j95O2mM3l0j3P9k20L5J79m3qj8n5N6p5R2j0
$$ plain form
13214 110 90 -102 -3 52 -6 -69 -83 53 33 81 30 7 8 29 -24 26 -7 17 74 44 14 -42 26 32 42 55 86 -72 -9
13243 -9 97 -63 -25 -9 -21 75 23 33 40 -8 16 -40 -41 24 -16 -110 21 -17 -42 31 7 -107 -2 -8 -4 -32 -48 -33 60 22
13273 22 96 -31 -5 61 -91 -49 -116 -67 22 -66 23 40 20 -17 -21 -17 23 -48 4 80 -4 -45 -36 -36 13 50 55 -32 61 9 -19
13304 -19 56 141 -41 -51 20 -67 58 38 -45 -99 -18 25 -37 -36 73 -53 -46 -4 -41 85 -9 144 -33 -15 -30 -50 48
13331 48 -24 -85 -19 -23 -79 -27 3 98 80 22 13 -28 -33 64 -40 61 172 21 142 -70 -36 -42 -32 63 -75 83 -45
13358 -45 -73 37 40 0 -105 -47 74 142 63 -96 3 32 -51 46 -36 80 102 -91 -12 -92 62 12 17 -21 27 -24 19
13385 19 -19 -25 -92 -82 -3 -4 5 40 -119 40 70 -34 -101 -59 20 19 35 -50 6 65 102 -42 -11 12 206 -70 -60 -24 27
13414 27 -8 -41 -66 -8 45 12 -133 -69 -18 120 -75 -13 -17 26 -4 -17 62 -158 -123 56 13 5 -13 -68 -12 -87 5 -5
13442eq1K5l2J04p3O8j6J42j31J4r8N7J05r2K1JrL5m1J3j7k0Q0k9q5j0J6N1O6
13471E9k19J79J2j29nJ02j02J00OL0l2Rl0O2k3l0NJ3M9m6l2N2j30J81o2J4L4L5
13499A02j10n3Q9N2p2k1n4QK1M5O9n6q6O5o4L3N3o0L2q9J38ORJ6m0j7k3K3J03
13528A19j75L2M8o1ONJ02j18M3m5j4L1p0J54M6p0n0P1L5m4m2J4o2O5l1l8P4K6
13556E1p3r6P8Q5K2Pj19M3p7J09j02M4J94k18m8Q1n0QP0M2q6p3J21R2m0r0J7p4
13584h2R8no1R2M0l7K0M4r6K2j34K31o0qj62O7O3m9m6rQN4nK8p8J47m3m8K0Ll
13615A1RJ5M5J3q4J2l2N7j13MlK3l9K0J4PL7l5L7J8o0NK8q4J66o7j3j2j06M1J30
13646D4p6PR0k8m7J60j56K0Po8M2l3N0qo6J4N9p6k4J05o0j3M3q7R2n2J00o1m8
$$ plain form
13442 -5 -86 -61 -93 11 -62 6 -10 132 1 15 -83 -26 79 -13 8 9 0 35 -6 7 -10 -30 50 21 -64 -74 -58 -7 59
13471 59 -160 19 31 -98 -103 -1 -103 -3 3 33 1 10 -20 42 19 -11 -6 7 56 10 -22 30 -100 81 19 33 67 102
13499 102 -8 -61 28 80 8 -13 -67 -59 -38 7 76 20 -66 -1 -65 -32 21 -39 -7 -96 42 48 57 73 33 16 -7 16 119
13528 119 -56 -24 24 -37 -31 -26 76 -42 1 -44 -58 -27 -97 57 103 33 -17 54 89 45 3 17 -45 20 -11 -49 25 51
13556 51 -22 -118 -40 45 67 74 -45 -2 -79 30 -72 -28 166 -52 -100 -19 -69 -61 9 51 -35 -108 13 105 65 -25 -8 -82
13584 -82 16 11 -50 42 82 45 65 109 13 35 -99 132 72 64 -98 -31 32 -17 -63 -72 -64 -10 -15 13 -65 82 39 -9 11 14 11
13615 11 20 35 80 93 9 21 -11 46 -67 -63 -66 -43 -82 -62 -48 -41 -4 -39 -2 16 -44 -39 -11 -95 71 4 -9 -21 -127 -86 44
13646 44 -32 -25 65 37 -10 150 -6 14 21 -47 -5 -38 12 4 -62 -48 11 -65 -89 16 -44 -57 -14 -101 -9 -61 39 -22 -70
13675g0N7O1j26m3K49j48M1R1j54m2P0J50j35J1j70K49q1O2p8j1K3n0N4P5j56
13700g1J32Ll7k7l1P3L5j59O0j15jJ73r6J39j54J08j51L6qJ03m9KM9%j4jj3J14
13728A00q6j08r2J52q7N2R1n2qP5L6J4l1jj31N5K0n0Jj0J75j22K0J1p9r4J41N2
13756D4p5Q0jOk5j18J33l3o1m4p9K30m0L9k11K46j16qN6N2n1n2J24k00O2K3Q3
13783F4n2J09k35J27j49J54j0o9P7Kj52J01J43j94J60j27P1n5P6j21P3j5J10o7
13807B1K7r7NN4k8l6m2M3k5J24j04O2Pm3Q9j64J99m7P3p3J8K3p8k4j4K1n8J05
13835C8j12RJJ61k94J75O7J5Qj78J37r7Mk8rJ21J9j4n1L5j9J67j92R8p3o9O8j8
13863c1kL3K3oP1j03j2N5L0k1l9L7j9L6q3J04p0P8n7j6l3Q7Lj37K4J15kj03k2
$$ plain form
13675 -70 -13 48 -78 -121 128 -20 21 112 -42 -84 -14 136 1 12 -158 91 10 72 -6 -17 6 -44 10 85 -71
13700 -71 61 64 27 0 -31 42 77 -82 -22 -137 -138 35 -61 78 -76 32 -119 -83 -91 12 -37 -35 14 14 0 -1 -14 100
13728 100 14 -94 -186 -34 -121 -69 22 -30 -38 37 73 87 56 55 -76 -21 -1 -51 -50 -60 115 -7 13 24 -55 -149 -8 44
13756 44 -31 49 48 54 29 -89 44 11 -50 -94 -173 57 17 56 -155 91 -25 -33 23 75 24 -28 96 -104 -42 -19 64
13783 64 12 121 -114 13 -136 18 8 -61 16 18 -134 -33 110 -84 76 -51 20 -35 41 -80 -7 -22 88 21
13807 21 48 -49 -44 10 -18 -54 -96 -53 -78 46 -58 4 11 -32 57 -107 92 45 118 45 63 86 8 -16 -30 -9 -67 38
13835 38 -74 -65 -64 97 -197 -22 45 60 68 -110 27 -70 -66 -94 -103 18 37 23 -28 7 -12 155 -37 61 -12 -81 -13 -31
13863 -31 -33 0 23 17 88 -15 -27 28 58 37 -2 35 16 52 -31 73 3 81 24 8 -25 62 65 -72 -48 67 65 -38 -60
13892f0R8j62R9M1l1Q2q3n4P7p6K8N2oK3l8l8Q8p3j3J58K1k13N3KO4r8J8J34j00
13921gP3p5m6J02j46M9M0j0K1K4j3m5N4n3O9j30J04qM6k6J6L3m3PN2p8n1K5J4
13950bN8M0j73J58o1P6q5o2N5J2m6K3M0o3J23j91O1m3oP6N6n4m8k6Q5P7j42N0
13978a2OJ35q5L0o9J5o5Q7q5M9rM4P8j26l3KL8O3Qj46nQ9Jn6J04k2r4n0J3J36
14008D1Oj00R1Nj48K18o9l8NJ01p7n0J16Kk43J79M2N0r0n5J03j21N2j01J07p1
14034d5L5L2l1j7M0j45J75k0M8m6O5j29NL5j40J12j7J04n3k2r3Q6K4J43j93m8
14060i5Q1n6L9N7q2P6n9M6K0o1P4j57K11r9J7j01R2K8m0%k2J04K1j55J72j35J10
14087H6j13n9R5J4J5k69L18Mj07P8j55J17k5J07j4j09J34j87N0n0M0K8Q2j66J72
$$ plain form
13892 -60 38 -124 -25 16 -15 67 -16 -70 7 -69 -41 11 5 28 -10 -48 40 -33 -46 112 133 -80 -27 -25 39 -59 -41 93 -7
13921 -7 66 -9 -55 47 -99 -50 -10 -20 1 25 12 -33 21 -32 37 -93 11 3 49 23 39 72 29 36 88 10 -41 -16 -2
13950 -2 56 96 -77 81 20 96 11 -51 4 16 -30 -7 33 -30 93 -98 -37 -80 -86 -10 46 -8 -56 -82 3 80 -62 -12
13978 -12 -6 129 44 74 5 20 -45 42 -43 6 -3 41 119 -7 -40 -38 0 63 71 -75 -80 9 10 -46 58 36 -58 -108 -95 41
14008 41 47 -53 38 43 -105 113 44 6 11 112 35 -15 101 103 -140 39 81 131 41 -14 89 -32 20 -81 26 -45
14034 -45 -10 22 -9 -26 14 -131 44 24 72 26 91 -38 -33 2 -138 -26 -43 61 8 -14 -107 -21 3 146 -47 -95
14060 -95 -14 -70 -31 26 -56 20 -39 7 27 -34 40 -117 94 -5 12 -89 3 31 -9 -9 -31 73 94 -61 111 -24 86
14087 86 -27 -86 9 23 38 -231 87 91 -16 62 -93 24 -1 106 92 -17 117 -70 -20 -70 -30 -2 80 -86 86
14112H6l9j15R2%J01p2r3k0M0PN8m4O7l8k5K0JJ22k18P4k9j7J8l2QR1o3K9q2N1
14142b2Qj4K92k79m5P6o7O2J1J6k3J0p0m8J55j07J07j62N2L4L9p9n3K27j02O3
14168H1j16J62j44O1J5O2l6j01j8J15j00p2M4j13K54j25RL0K3n9M8q4J06R4L5
14193A71k44Q7k7P9J7j25L8k0j9P3LQ7j67Q0j69J39O8j40J49j49L8q2L5L5M3k7
14219b7P4n9P1pj53J2L2k6N6J9J06r7n9J8OJ32j70qJ25j4m6q4J38K5l1k4j90m
14247a85K11q9O1J23j78N2N4K7o3o7kP4m1J29j00l7QN6m4J20q2j42m5R4N8Kk8
14274c4J14m8j22l1K10Kl5R6q4j54N0L4m4P4O2r3P7p3r4J37j22NN1j7j01P0L6
14301c4R4j56R7j5k1L8mmJ9J6j84J71p1O3L4o3M8p0N3nq5J45k8l3J3m2pON2o8
$$ plain form
14112 86 47 -68 24 24 125 53 -40 -60 -20 -13 45 1 68 30 5 25 26 148 -70 4 -25 -42 -24 -56 -48 43 -20 9 -73 -22
14142 -22 -14 -28 264 -15 -60 16 -51 11 22 38 15 25 -45 -93 62 -45 62 -100 -48 -14 25 -54 -107 120 18 81
14168 81 -35 127 -17 44 59 121 85 -16 -34 81 -19 -91 -47 -160 94 -31 -22 8 31 -28 20 -64 42 136 171
14193 171 -73 14 -13 66 83 -42 -4 -24 -43 30 33 120 -47 33 -136 3 71 -69 80 -69 -31 -113 -78 -43 0 -27
14219 -27 47 -12 59 52 -101 -89 -57 -83 -27 -8 98 1 -58 -40 -34 98 -72 -80 45 31 -15 -99 39 64 33 9 -181 -185
14247 -185 26 -63 -2 121 -57 -5 49 76 13 -54 -56 18 -23 106 6 -31 -23 33 -11 109 27 -115 -160 -66 -8 -6 -34
14274 -34 80 32 -90 -121 89 91 56 152 68 -86 -36 -2 -46 28 90 -3 74 1 -93 44 -78 -73 -22 -39 -140 -70 -34
14301 -34 60 -96 1 -14 -35 3 -1 -5 14 30 -154 17 -54 9 43 -20 28 -42 11 6 -79 66 38 5 18 -24 -31 -25 27 -41
14331d1J02k9J8q6P5j9r8J06r5M1J09m2q7M6j10J17nK6p7R2j20N4k1j3P6L3p4
14358b2nN6q3J76q2j65K19j11Qj1Q0q0J62o2j04j16J42o9J2%N5j31J91N9k67K92
14384A44o0j37J06q6k3O6j21J70N6k32J03k1m7N0K2k2n6J54j29N2M2K7n7K3J5
14409C9Rj7k13J23J77j14o4J18j30j9J20j10j1O1J19j04J17n9jq2K0N4q1N7n3
14434d4M2Q0l5pJ4j36Q2l1J46r1k9j7o2P0J09j15r8N2l9Q7j7Q7l1p2p9J17J13
14461I6j10K3m7o5J09M0j25J35j9j42J63m4m9N0kqR7j03M8j31J19r9J04j10M8
14486b2%k9j9O1n9nM6J26l5j37L0k1R6q7o1J00P6m9P1o2P9Ko3Q5j05l3j7J6o5
14515h1L8O8J4n7O8p1j43K07j3o1O4l4o7N1QJ03q5j6k0jj12K27k10J50P6j24L2
$$ plain form
14331 -41 61 32 50 -36 39 20 -78 28 -67 -26 83 41 -46 0 -110 7 2 28 -49 43 -77 -23 -44 -57 19 52 -22
14358 -22 -27 29 -54 122 40 -125 94 -17 -9 -20 60 -20 142 80 -24 -140 2 -67 -55 -55 0 -131 60 119 -148 144
14384 144 84 -53 53 -33 -56 10 -111 59 115 -117 -14 -35 -82 -32 -10 -32 -88 66 -63 -11 31 58 1 24 39
14409 39 48 31 -182 -59 118 4 -60 58 -72 -91 29 -81 -92 -31 88 -16 101 42 41 -41 -21 33 -48 9 -44
14434 -44 -2 78 43 36 50 -86 -4 -35 111 20 -9 -26 -88 -18 91 -24 -122 -70 -109 -22 -39 48 17 -55 -134 -17 96
14461 96 -14 9 -38 -103 6 46 -79 56 37 -105 58 14 -35 15 13 5 102 -1 47 -84 35 -64 40 -70 -22
14486 -22 -22 -51 -70 -9 -68 -73 -27 99 64 -73 -43 -64 32 -55 -116 -16 60 11 82 20 99 101 38 123 18 -15 -32 -16 -81
14515 -81 -43 25 39 -18 50 -21 -164 43 30 -31 33 -1 -68 -17 -9 94 9 -7 -27 -28 -140 87 -123 27 103 -21 11
14542A1J00kj19jr2N7Q7L0j12K6oN7q1J0RJ10j08J16J4r3R5j03Q7j05J31k9q7
14569BR2j04m8R3j04M0Q0p4j0m0j8K12r1N7m5r4R1p6rrJ3O2o4QL5N4L5j18pQ3
14599D6j41L6N7JJ73j82Ko1k1J09R8q7lp5J01m1l5n3J59k5lj50M8L2m0J50o1j3
14627B1p9K7P2n3P1j2K9j50J41p7k7K3L5qJ15k21M3K8l5Q7j3j8O4j51K14q8o0
14654b2k9O9lr8P6P9l9J33q0o7J2lm1m9L2N0K1k0n9N3j37O7j16J57M9n2l9J1N8
14683A3N6o0j0l4J3J06j97J7J67M6o9l6o6M5L0o6L1K2n1J5M6L2q9k1M6K7j9K5
14711A9J05j20J0K9n4K8L8k5p5J13q3O0j80J91m1j32K17m3n2Kp9J21j41j0Q6L3
14737A7L4p6Q4p6L2KM9P8j12k8m4Q5J3j20j5J02j4r4R5O5j52N8J03Rr7j8L9q2
$$ plain form
14542 11 111 109 -10 -11 -103 -46 41 71 -41 -15 -21 36 -45 -35 -26 84 -24 92 106 13 108 5 92 -13 118 89 2
14569 2 94 -10 -58 35 -69 -29 51 -23 -33 -73 -91 121 30 87 42 -52 39 -37 -46 -55 -42 20 -44 -36 -1 53 88 -30 -37 46
14599 46 -95 -59 -2 -1 172 -10 -8 -69 -90 19 117 30 27 -48 53 12 -23 -76 83 58 55 -95 -47 -15 -55 95 34 21
14627 21 -58 -31 41 -12 59 47 76 -74 67 -10 -37 -14 21 13 128 -93 -50 -22 -57 30 17 -1 63 -88 126 38 -22
14654 -22 -51 18 15 -83 -7 72 33 166 86 19 31 28 -13 -62 -30 20 41 21 -38 15 -122 -55 -171 -14 35 -17 -56 -45 13
14683 13 69 9 -1 -35 -22 84 -113 -96 71 117 48 12 -54 -9 21 -45 -14 8 -43 -28 18 50 -39 -60 -14 13 -6 19
14711 19 124 4 14 43 -11 17 55 30 -45 68 -15 45 -135 56 15 -117 100 57 5 7 -72 49 -92 -102 -16 17
14737 17 51 -25 59 -17 15 17 66 144 32 4 -40 45 58 -62 -77 25 11 -83 12 77 -75 -17 86 95 -2 -20 19 -63
14765f3J15K4q0J4p5J12r3rJ25p7k9P1m2n4l5K4Q9N3k8p3Lj5O6J8o6R3n5r0J72
14794I5j20J7j43J71jn3Q4j78J41O7q0Q4m4j0K2m9kL7kK9o4k9m2J05q1J48n7j19
14822g4Q8L0nj20PJ5M5P9j19P6lJ4j2k8J3q1J18l1j9n9jM1J67j69nM9m6P3j7j62
14852a36K02n6o2L9M3rQ8k20J38nJ25j67P1J5K9M4j36L7j5j61J59J2j7l7j25K79
14878A35r6l6o0J32q4J35l7j37J86p4j43J24L3j18K9k5Qn0J27m2p2J06o5nJ01
14903G2j32%J24l5j56J32j07Q6J9N8m3r7J02m1k8N3J3J1p0P3l2o2j1J12J8nq5
14930c1L2M5j58J02J1k3L1nK7j45K19j54M7r3M1J69j66J10j07MK9p0k5R9l5L1
14956a5O3M7ON1j16L8j07M7p1P6Qj49J79J6j01N2J42j81MR3j21M9l6m5l7J48j56
$$ plain form
14765 -63 52 76 -4 10 -65 47 -46 -55 70 -7 -36 35 -7 -61 -96 -72 17 70 42 -31 -28 -43 23 41 -25 68 13 -77 95
14794 95 -25 -8 -151 20 19 -34 50 -128 13 80 0 84 40 30 52 3 1 38 36 65 1 -28 -70 35 -46 102 45 -74
14822 -74 14 44 39 -81 -74 -59 -14 65 -54 22 19 33 21 -7 6 -75 43 12 -7 -66 -67 -26 141 -28 -33 16 -30 43 26 -136
14852 -136 66 10 -52 -13 30 21 109 -111 27 22 147 -20 51 66 95 139 3 40 25 -136 23 35 18 -19 -144 135
14878 135 39 3 -57 75 -9 126 89 -48 138 64 -79 45 78 -40 -11 -36 -28 -78 49 7 -65 41 -24 -29 72
14903 72 -60 -60 64 29 -127 5 -102 -16 3 61 18 -79 23 -18 -46 7 20 31 -39 34 2 -60 -71 41 59 54 -31
14930 -31 1 46 -112 -10 1 -22 9 4 31 -114 105 -49 -2 -95 -54 115 -51 59 -48 -44 -15 -85 -110 -11 -46 -15
14956 -15 48 95 101 152 36 74 -33 14 -57 19 27 -122 57 73 -28 24 166 -15 -11 82 -39 10 -26 -71 -108 40 -116
14983a16O8J48o1j2o2p2P7jJ5j3j07J23M4q4m8J47p7J6j27Q8J47r1N0j79O6L0
15009c1R1j81K22j60O7mj4L5L1P1j78J99j70K8L0j66P7R3l4q3P9O4n7QR8r1j1
15036A3m3P9L6j85J52L4K0j61J4l8Q6Q6j10LJ5K5p3j06K20m0j16O7LR5j41P9k0
15063fNNq2M3r5J44Qo5K9Q8j04J2R8j13P3J3r1K3J03j42O4om9P8L4l8q3J01l7
15092A0l5OQ3j20k9J68j33L3K1L2k3R8k26J70k2o3J11j76O4O9j90K18o5m5n9J36
15118C3j07J42j25L8rkL7O7oj10R3Lj0o3R1o0K6l4M8r8lJ61j18l7j0R7m7Mk1m1
15148f1P5N2p5JJ15ql4o7m9Q5j11J00k5L1n7J3O3n5j12K45J1j13j12Q0R8j07J34
15175A17j01q9J8M4n2M2qM7P6m6n0j35Q6r5J05J4K0J2N3M6J09k17J6n4L1PN4j9
$$ plain form
14983 -116 -48 100 39 27 -35 -107 -30 -31 -16 -29 -136 -13 31 -53 -101 46 -31 -15 -142 -54 93 2 52 -127 -61 -31
15009 -31 60 -121 101 -59 8 4 -10 25 56 127 -51 148 -22 6 36 -130 -53 40 6 -77 2 66 9 17 115 24 13
15036 13 -30 49 85 -100 52 86 106 -55 -41 -79 7 93 -17 -14 1 26 -47 -153 67 27 -89 -22 -19 76 -65 14 -6
15063 -6 -1 4 -78 -35 -130 14 22 -43 -14 74 -30 -18 80 -33 40 53 -38 -15 88 -54 10 4 -45 33 67 29 -54 47 10
15092 10 -25 -19 64 -56 -85 83 -50 -17 4 36 13 111 -115 55 33 -30 81 -95 -31 38 -152 66 1 -44 -103 33
15118 33 -74 68 -57 -19 -28 -30 7 74 68 -42 51 54 44 -19 72 12 38 4 52 -46 -49 112 -6 -43 -53 44 -3 1 -20 -61
15148 -61 14 66 -9 -8 107 99 65 -2 -51 34 -77 23 -2 29 -28 -15 48 -7 -119 126 137 24 -88 -8 90 -17 117
15175 117 16 -73 -55 -11 -63 -21 -29 18 94 48 -2 -137 -51 -146 -41 -27 -7 5 58 104 213 -4 12 -42 -11 -4 50 31
15203C1M2j10ok7J91j7k0p0r2Q2m9N3l7J68j40jo1K6Q0J1l8P8j85J15q5J28j38
15230g1Q7kj16K34j32l4nk9K22j06m6OL9M0Q7j62L8o6O2l2j3J0J0P2j15J01o8
15257A1j27J84k2kk53K86j66O3j3J40j01j61J25j51L10M2m9j22Qp0k2N3J4j08
15281a31J38o7J67r1j0j06L1O4j30O5O8o4R9p1k1J12j31J22j15K8O9O9r9n7Q6
15306B5j1K3lL5n4O5j19J5J27j30m2K17j28r6QQ7O2k7j75J27K0r6J53k5k9N7m1
15333D5J27j26j23l6Q8O9k4n9M2J2Ol8J28j59m3J02l1m5O6m3O5L8j01m6J19j10
15359g7J08N5j00K0N3M4n3j62J28P4j56Q9n6L7Nn8Q2m3M1Mo6K1m3q4J91p5N4J1
15387D4n0n2J3k2J37m5J18j54Q1M4j42M1j7j3oj10Q2N3q6J91k7p7p1J61j13L6
$$ plain form
15203 31 73 -37 -43 -70 121 104 84 14 -78 4 -45 8 -29 139 -1 -2 -63 -37 43 54 16 94 -91 24 -61 67 -71
15230 -71 16 14 -102 132 0 -34 -39 -68 154 48 2 8 47 87 174 12 50 -16 46 14 1 11 21 93 -22 79 11
15257 11 -116 68 46 44 -209 77 -89 -26 -39 101 0 -161 -36 -187 123 165 116 -6 2 -68 -90 -37 -23 -131
15281 -131 7 -60 107 16 6 -100 -69 -5 -135 -70 -2 -66 33 -38 -59 53 -78 44 -71 -43 26 95 -4 -61 25
15306 25 14 37 34 69 15 80 -39 -24 103 -27 -69 148 20 -76 -68 19 81 54 -121 6 26 -70 83 58 29 86 45
15333 45 172 46 -77 -113 -25 44 20 -39 3 15 21 -17 111 -48 -91 11 -20 -65 1 -42 23 61 -40 -86 33 -77
15359 -77 31 86 -14 6 59 103 50 -112 16 90 -66 23 -33 4 9 -49 33 -10 31 35 -31 -10 -53 -137 54 -21 33 44
15387 44 -6 -58 -45 -67 70 25 143 -11 70 114 -28 13 -4 -17 -23 -133 -51 2 -84 107 80 3 -68 93 -20 16
15413A6J03p9K5j06K2K7p8J78j47RJ53k1j20K3R3j92O4j3J1J8P8j81J8R9J02m4
15439E8r0R0j64L0O6l0j20L01k39l3J43J1J8K7j65O3l7rJ20p9N3Q0j12O6p5J11
15465H4o5j4j5QPN6p3Q5j84J60Lq9M4l3L9R0k8j51J49L0j33J2k2J36m2o6K4p9
15493f7R0n2l9L6Rj07J42m6Q3n5L2j7o0N5m1R5j26P9j9M8J00j74Q8r3l9O7j31
15520a42J15P8l6m9J07j82Q7P7m8j3jo7R7r9M5j6J22k7q0rq2J1M1J45j64J79m
15547H5r3o2J25J1r9P7r8J28J4L1k20J8J29j03O3k8M3q5j1J65j03O3l7Or8J84
15573A05j37J6P3q4K6m6J19j32K62j93p7Q6K5P6j78PJ51j47K8l0R6n9l9Q2j18
15598h8O9N8k3NN6nj94J21J17k75J81k5j9N7Lp4K4mR4k1l8Mj09P8m0K3M0P3j48
$$ plain form
15413 16 119 40 65 -41 -19 8 -70 108 -39 -30 123 102 -18 5 98 -94 -30 -43 -32 -14 64 -117 -99 0 102 58
15439 58 -32 58 -106 -76 -10 -40 -160 141 -98 -131 12 23 41 68 -97 -34 -71 -80 40 -39 14 94 -18 48 -27 84
15465 84 19 5 -10 -2 5 61 -12 73 -111 49 52 -37 7 -26 13 103 75 -76 73 103 -30 -18 -40 96 54 -12 12 -67
15493 -67 23 -29 -68 -32 -23 -130 12 -34 49 -6 26 9 -51 4 -37 58 -68 11 -8 40 140 -34 54 -39 -78 -11 -142
15520 -142 -27 51 15 -34 73 -109 -22 55 7 -6 -7 -74 23 -76 -31 -47 75 48 -32 -41 -123 -112 -71 74 -90 89 85
15547 85 -8 -70 55 66 -33 44 -54 74 88 119 -101 -83 46 -57 6 -22 21 -64 -75 90 -13 50 13 19 -79 105
15573 105 -32 -16 57 -27 -1 -47 72 -60 202 9 -68 18 43 119 -59 -52 99 -48 -20 -50 46 -13 -52 30 -88
15598 -88 -19 39 16 21 77 72 -122 -1 116 -159 22 -3 -22 35 38 -36 -12 -16 78 57 19 23 -86 -8 -48 -25 15 88 -60
15627f0J67j07m7J19N0j01J00j54O7j35K03j39k6n1P0K0k4R9m3o9J6N5n3J22o7
15652A2p5J01j64J61jj26J42L3N3r9l7LQ2o7J7k9L8M3j24j4k9J28q1M3l2J2ok3
15680c9jL3n5J9Q2O3j00n4L5l9k5M7M5m3OJ16J8q7n4Q0n0P8j45R3m2l1L1J3J1
15709Ek6L0o0j0Q6k3%j8L7rJ8o3j1J7J1n5N1M2j3j5Q8p5kl5P7K4o7N7j48J44j12
15740e5J06l5j15N9J7JJ8L5Nj31J38r7k7J13M4n4p4jm5J01m5P1m9no1R5K7q6J81
15769A31j71rjj9J43q1K4j9Kk0J17p1o6L2P9q4j32P0J20m4l2RK2k3P4j04Q7j54
15797a20J50k9q3Q2j30J51j20J01p0j1N8J16l2J8m7on1Q9j22k6l9J30l8l2R0l0
15823al0R0KQ8o5J2o1j00J06Q2r8K1o4JM3J2l5L1O7n4j7j70J06j7J63j35R0K9
$$ plain form
15627 -60 107 0 -47 72 122 21 121 -33 34 -101 102 -37 -63 -114 -44 -24 -48 51 8 -61 -45 10 -43 79 12
15652 12 -63 38 -126 35 34 -92 50 83 136 37 0 3 85 18 35 6 44 87 -37 -51 -80 48 -33 10 -22 -10 -16 -39
15680 -39 -40 -7 -62 -43 39 102 2 -52 -17 -56 -81 -34 11 -32 -26 90 108 21 -33 47 -3 75 -70 23 -19 -50 -19 -6 5
15709 5 -21 9 -51 -61 25 2 2 -16 21 12 30 -33 -44 -27 -16 -71 -20 22 9 -6 82 7 5 -30 47 71 4 61 -87 57 -55
15740 -55 51 16 -99 -40 -23 -22 -4 31 36 -95 43 -54 -81 32 76 22 -52 -53 -98 3 -42 29 -20 -25 -86 9 36 -50 131
15769 131 -40 -49 -50 -69 74 -7 17 -2 0 -20 97 26 -40 -8 71 -13 -145 -75 45 1 -31 -22 0 -23 51 -53 34 -120
15797 -120 30 1 -82 0 -130 21 -99 2 -68 -79 -21 95 63 81 34 28 -23 66 -56 -82 -121 9 -29 -61 29 -1
15823 -1 -31 59 61 149 84 96 35 -65 41 123 25 46 -18 -17 26 38 3 34 101 47 30 -140 -34 -51 112 -23 67 96
15851I6k31O7J46j15l6J0q6O4R3J8m4K1l3J38j30%j11J45jJ2L5j01N7o5LN3mj8
15879a7O0K3Po0o6ORrJ19j67J05q1J36j6q8PJ9n4j0P3N1J1n6j3O1j32nJ05j15
15908i7J04oN4j18l0J50ok07Q5P6L1o6K1l0J00l6P5p7mJ3m4O5K1l1n0j5J01n1
15936B8j03P1J2mJ04j42O6n2R3r6n7O8M7o4Kj5N4n7L5O5r9L0O3j8NJ7o3n3L3J51
15966A21r5Nj12L4q3J97j12k3O6o9K18r0j39pJ05K0m3Nk8mm0N9pK3k4O2m8j15
15994a24J91M9k11K4ql4N5M3l4M4p1Q9m0J8K8O9K4j24No7OJ36j35J20n9N0k1k7
16022dk5J87m5j94J60p6L5P0l6j94J16mK7l2j6j1j0Q3k7M8K0Jq1k6K2J1Q5j17
16050c3L4P6K7p6J23k4j90J09j18q1J28j09N5J36j13M9n8n6K26j08n3n7J11K8
$$ plain form
15851 96 -135 -68 78 -37 -73 -63 -149 -85 8 26 -18 3 -30 108 -22 -22 -133 12 11 23 58 -43 14 -51 -48 5 1 -17
15879 -17 43 66 73 13 -53 -47 -38 -47 72 -95 10 -71 65 49 -39 -32 -13 -67 -77 -4 47 58 2 -11 50 -82 -87 18 -97
15908 -97 7 1 55 -63 -93 57 51 -156 -71 5 36 -30 -9 -39 61 25 100 23 19 32 -12 53 74 43 -7 -22 79 28
15936 28 -75 -4 8 4 108 -34 32 -20 73 -23 -80 -12 35 -29 -27 -42 12 -45 -10 55 -44 -14 49 31 36 53 -10 -63 -30 121
15966 121 26 31 -81 -47 -130 67 -45 -68 -2 -71 147 57 -82 -89 16 36 -7 -2 -30 -34 -74 -15 -22 1 -23 39 -9 -124
15994 -124 67 116 -95 -71 -79 -113 -58 -15 -49 -5 -76 13 -27 -9 19 88 112 -12 -7 -74 -68 68 -67 53 -6 44 23 -4
16022 -4 -29 158 113 -81 79 3 38 108 72 -122 -6 -10 17 -15 -31 -42 -52 31 4 52 72 73 -8 -34 -12 -1 84 -33
16050 -33 1 77 104 28 151 127 -63 46 -72 -153 -25 -134 -79 57 -56 -7 -65 -121 105 -3 -56 -113 -2 26
16074B6l4On1r4J93p1J51o5n1rLm8M8O4j63J04K2Kq8J32r9O2j38N6J13r9J54j46
16102b0L0O5pr9M8q3n2J43R0o2n7Q0o3m8Q8L1l6o8qn5j5J45k1n2J6n6M8k6J48
16131A04k4Qj79N6J03j38l8Q0J90k43M5J51k13J46q4l9J96j92oQ5M9m8on7J11
16156E7M2o8j33Q2J6Q6L3j23l1J44o6m1JJ33j15M4J3k04J33R9q8pj1ML5p6K5N1
16184C5K9J18k18n6K00j70O6j10N2jk4P7l6M9j16n4K33Jk4n6j7q0J62r6r1PJ09
16211a1j4O2j24J50n2j45J45L4o9p0P9q4MN3O0j3l2M0K6NJj05K2J49j79P4k9L2
16239IQ0j06l1m2J66K1q9JM2n0Q6K6n5K1p9kl7J25m0j22k1%J41p1K6k2n6P5J3
16268Ij41Q3K6J49l7m4L0k8q9N8q2L6J44j05l0o6J32j03J8k4J01n7Q9o9n4j06
$$ plain form
16074 26 -8 -2 -53 -147 46 -25 126 61 10 1 4 -44 4 68 -95 9 31 33 -55 77 -22 40 -98 -42 71 -28 126 -20
16102 -20 10 75 68 -31 17 -66 -118 25 115 53 -4 76 13 -35 53 84 48 -20 -28 -83 -98 47 26 -26 -10 -66 -18 -44 104
16131 104 80 88 -91 -35 68 -70 -108 -28 162 -81 -36 115 -98 48 -36 -75 121 -71 -77 8 57 9 3 -54 57
16156 57 99 31 -102 -20 -4 82 115 -8 -39 105 39 -2 -1 132 17 61 74 -130 3 102 14 7 -4 0 35 -41 -16 35
16184 35 64 182 -36 -92 108 -62 4 -106 -54 -55 -79 -2 -38 11 -105 -159 74 75 51 -5 -22 -102 60 -36 -127 -120 -11
16211 -11 -25 37 -87 63 11 -134 11 45 -24 -94 -15 -99 -95 -42 18 5 -27 13 39 44 45 -60 -38 111 -68 6 -23 9
16239 9 89 -17 -48 -90 76 97 8 9 51 1 87 113 58 79 0 -2 -39 86 46 -76 -97 -97 44 -27 -1 -23 -79 -4 9
16268 9 -132 -49 -23 126 89 45 75 47 -42 16 -66 -30 114 9 -21 -87 45 -58 -40 -64 37 -20 69 0 -54 -160
16294a60J88L8j04r1J56m0o5J61j29J38j61J38j24mJ42q4O0j79J84j08M0O9o6
16317aKq9M1R2k8J26j71O5Q1j14j58M5OJ41P4n1l3j22J6K4J81p4n0j0%k4M8L4
16345E1j47R0L1j9p0nqJ26m5j43J95Lj07O0n9k4J14L3j67R1L8m1M8j24J13n7M3
16372B0j30J41L1n0l5p4J32k3M8j43L3
$$ plain form
16294 -160 28 66 -38 -129 27 -13 -78 83 -46 92 -69 69 -55 -59 83 -1 59 -120 64 -44 -4 65 -1
16317 -1 1 -88 -47 45 17 143 -28 37 118 4 -154 -109 -103 38 112 61 28 -94 -78 -54 127 53 3 -7 -7 -31 17 51
16345 51 -96 -6 25 6 -64 -69 -77 49 4 -139 56 59 -48 12 -47 -71 43 76 -91 0 38 -3 45 -79 34 -23 20
16372 20 -110 31 62 12 -23 -97 35 12 60 -83 -50
16383e0
$$ Imaginary data points
##PAGE= N=2
##DATA TABLE= (X++(I..I)), XYDATA
0@%%%%%%l0O2l2L2o4R6j28J60k01K43l30M16m80N76p04Q64j024J184j408J657
26H89j913K209k561K944l361L841m384M963n604O329p110P964q913R959j1090
41e838J2336j3708J5188j6797J8563k0502K2616k4923K7465l0260L3329l6730
53a9261M0520m4741M9485n4876O1032o8142P6483q6418R8487j13528J32876j58811
65h6894J95605k52309L51974n78022K001592L7078m061932k5190K028215K515879
75B125996o96504j540702m88171N4532J10235L19824K96831J077161l46899j592196
85f79893q81711P00549J873601P38599j607949j178033J19638Q68673N87155l46422
95A94207p9564J86054n84591l93192J48318P91606P12846p23549j012459Q5141
$$ plain form
0 0 0 0 0 0 0 0 -30 32 0 32 -32 64 -64 96 -105 138 -192 224 -256 320 -384 480 -544 640 -768 889
26 889 -1024 1185 -1376 1568 -1793 2048 -2336 2627 -2977 3352 -3758 4206 -4707 5252 -5838
41 -5838 6498 -7210 7978 -8819 9744 -10758 11858 -13065 14400 -15860 17469 -19261
53 -19261 21259 -23482 26003 -28873 32159 -35983 40500 -45918 52569 -60959 71917 -86894
65 -86894 108711 -143598 208376 -369646 1631946 1669024 -2392908 -2418098 -389883 2125996
75 2125996 1429492 -111210 -599381 -544849 -434614 -114790 182041 1259202 912303 -679893
85 -679893 -1561604 -861055 1012546 1751145 143196 -1034837 -915199 -46526 540629 194207
95 194207 114643 300697 -283894 -677086 -528768 262838 975684 252135 -760324 -675183
105f75183O95116N30896n19607n07744O26598L33863o44426p07521L13796J378566
115H24354K82097j359250r50089M86813J363675M83678j114439q76374L64057
124d95478Q66500K38951p75305l01368O97883K50699n93375n52773M90312J039585
134H65631k14979j179579l85213Q29709J039278k09073j150877m03288N99805
143b08586P53215O5709o17380k86470J29871M1465J12690K53663K27247k53630
153B17794p55457j49772P60731O88365j65527r02675m73209N39699O50297L1668
163D41914m62689k63782K77617R2327l30087m6022M72738M04031m20177q23999
173f58129K5275Q03176M71591l65334o57459l5984M51460J43367k13060j22951
$$ plain form
105 -675183 19933 550829 31222 -476522 150076 483939 -160487 -868008 -554212 824354
115 824354 1106451 -252799 -1202888 -716075 647600 1131278 16839 -859535 -495478
124 -495478 371022 609973 -165332 -466700 231183 481882 -111493 -664266 -173954 865631
134 865631 650652 -528927 -914140 -84431 954847 745774 -405103 -808391 -208586
143 -208586 544629 610338 -7042 -293512 -163641 -122176 -9486 244177 471424 217794
153 217794 -537663 -687435 73296 761661 596134 -306541 -779750 -240051 410246 441914
163 441914 -20775 -284557 -6940 85387 -244700 -290722 182016 586047 165870 -658129
173 -658129 -632854 170322 641913 276579 -380880 -416864 34596 177963 -35097 -158048
183a58048K46198K53106l36471n25124R4380O64401M31816m25969p23323n2405
193e31439N08227L73129p8576k60967n5945k6114j59506K7547L50509L51692j66588
204C31969o56293k99835M71609O39507N2868n48488l87835J64716K88308R8807
214A55333j0157l477n5600k36859j62458K26191L92050J04375l73257m51671P7144
225c38386M94333K61673k72925m16875K8998L46963Q2238k16189j11076J60040
235A8794J39229j57549j87669R0183K09714L6763j91753j34909J32766J53127
245A08696o3732j55164R291J93398M9147k16323j40065J54477K45977j1013k72199
256i7510j32911J65749K02706m50j76381r0831R9036P9741m4533m2709P3871Q0114
$$ plain form
183 -158048 88150 341256 4785 -520339 -425959 238442 670258 244289 -479034 -531439
193 -531439 -23212 349917 271341 10374 -45571 -71685 -231191 -203644 146865 498557 331969
204 331969 -324324 -624159 -152550 486957 539825 -8663 -396498 -231782 56526 155333
214 155333 145176 141699 86099 -150760 -313218 -87027 305023 409398 36141 -415530 -338386
225 -338386 155947 417620 144695 -272180 -243182 103781 186019 -30170 -141246 18794
235 18794 158023 474 -187195 -97012 112702 149465 -42288 -177197 -44431 108696
245 108696 44964 -110200 -100909 92489 141636 -74687 -214752 -60275 185702 174689 -97510
256 -97510 -230421 -64672 138034 137584 -38797 -129628 -30592 49149 4616 -38093 35778 115892
268A15892j22119j74671Q5835K53904P0041k30579k27243R4625K51853P2501j40824
279D9215j51373J1328J03211L6797j8211n374J9914k0415j04564k7622J53210
290D6116J36349q3336k21588o2094J91705J62233p0865j69918m2944J14157O9999
301F9814o0550m5307M0010M4246m0372q2155K3548J06261K2638r1177p7090N1372
313c8762R4271j8856q1295j1983O6823N0924n5849q7856K0457J05230N1426q2303
325A2227j10414K5773J11948L5515o8442o1116L3828M3286l5135k3126N3594M7048
337F4986m7021r2871M873J07167O1121n6229j01936j8605Q6046O3362k7448o1220
349a7775k0692L4717K2737j7793l156K4466Q694l9583m3237L5381P4267M962p1204
$$ plain form
268 115892 -6227 -180898 -95063 158841 228882 -1697 -228940 -134315 117538 190039 49215
279 49215 -102158 -90830 12381 49178 30967 25593 45507 25092 -79472 -107094 46116
290 46116 182465 99129 -122459 -184553 7152 169385 98520 -71398 -114342 -185 69814
301 69814 9264 -36043 3967 48213 7841 -74314 -50766 55495 78133 -13044 -90134 -38762
313 -38762 55509 36653 -44642 -56625 10198 61122 5273 -82583 -62126 43104 94530 12227
325 12227 -98187 -72414 39534 75049 6607 -54509 -20681 22605 -12530 -35656 17938 64986
337 64986 17965 -74906 -70033 37134 98255 42026 -59910 -78515 7531 70893 43445 -17775
349 -17775 -38467 -3750 18987 1194 -1962 22504 31198 -8385 -51622 -16241 58026 62988 -8216
362h216n7533L7686P9558q8o5610k7772L8413L4721k7787l1821K3717L1021j1596
375A4693l6892p087L8501K0614k5586k8113M215L0826J0870l0045k3549J7655
387a3898L6050J299m5175j8996L8965L2710j7518l8392M58L6904P840k6904j2904
400a9561J7732J8793j4121k2354J0934K1556k766k2827q798K7016K3817j7829
412A1592l4029o570L3774L3974j1225l7883k1123J4737L3028J1214j3512j4820
424h43j1336o908L786K4684L2962q467n2466l2420K7933N6141J7038l4126l4655
437a8677r502Q135J8898K2378J2948j8128m1789j9323K2495M2808K6424j8328
449B8339m6782k9321J8040M7695K2293k1368k9078j1463K581N607J2199K4026
$$ plain form
362 -8216 -65749 -28063 51495 51407 -14203 -41975 -3562 31159 3372 -28449 -4732 26289 14693
375 14693 -22199 -29286 9215 29829 4243 -23870 -19655 11171 22041 -8004 -31553 -13898
387 -13898 22152 23451 -21724 -40720 -1755 30955 13437 -24955 -24497 12407 20247 -6657 -19561
400 -19561 -1829 16964 2843 -19511 -8577 12979 10213 -12614 -21412 5604 29421 11592
412 11592 -22437 -29007 4767 38741 27516 -10367 -31490 -16753 16275 27489 13977 -843
424 -843 -12179 -19087 -15301 9383 42345 33878 -18588 -51008 -23075 33066 50104 15978 -18677
437 -18677 -28179 -20044 -1146 21232 34180 16052 -25737 -45060 -22565 20243 46667 28339
449 28339 -18443 -47764 -29724 17971 40264 18896 -10182 -21645 -19064 -13457 -1258 22768
461B2768P295l0283l7826j994L8621L6850k372l1030k8440m227K1621K5163J0456
474B6602j0689k6359j5594Q819K0042J2424j699p282j0035j2053P68J7027J7341
487A9312J848j6867j8375k768J1780J8486P540j5959k1165K256K2840O577k2510
500g005j1757K2339K3856r346l3855j6069K3079L3906Q254k3918l1228p218J9770
513i192K3993N303j2844j0586l704q583m409J6660L0349J1858l0242m7592j2916
526e1905M1269N6058J1189m6129n5962j4077M1466N6332J3840l6299m4319j2524
538d1061J9944K6108J8695R479r791l5130l8526L133N5709N5840m318o5265o6818
551g2001L10P3146P2734l544p3747o2639Q118N7247M5824R66k9799l1079k0047
$$ plain form
461 22768 30063 -220 -38046 -40040 -1419 35431 33059 2029 -26411 -30638 -9017 16146 26602
474 26602 15913 -10446 -26040 -17221 2821 15245 13546 6264 -3771 -15824 -15056 1971 19312
487 19312 21160 4293 -14082 -16850 -5070 13416 20956 4997 -16168 -13912 8928 15505 -7005
500 -7005 -18762 3577 27433 18087 -15768 -31837 -8758 25148 33402 9484 -21744 -28962 -9192
513 -9192 14801 20104 7260 -3326 -7030 -15613 -20022 -3362 26987 38845 8603 -38989 -51905
526 -51905 -10636 45422 56611 10482 -45480 -59557 -18091 38241 52081 15782 -28537 -41061
538 -41061 -21117 4991 23686 33165 23374 -11756 -50282 -47149 8560 64400 60082 -5183 -72001
551 -72001 -71691 1455 74189 70645 -3102 -65741 -57623 -376 45448 46414 16615 -14464 -34511
564c4511k030K6386M4167K3983k8883o4852l7745L4522P8057M1412m0829p9572
576c9895l5503M2542P3291K5466m3433n4772r009L0925K5418M48p582l610m873
589e87j0837q600P821K4393J8582j0956l7083k3875K4439M7148R519m0611l5317
602c5964J4795L7715P728k7401k1929J3651L1214M749l0635k7352J3972M0929
614B1472J5158l0127l5195L516L2711J6188j7301j9772M832J8044L52k1805j1224
627b3151K2123L1150k043l7926k9135J5026M1921K2778j8341l8506j8472J6592
639a7984L0081J2204j1607j5632n363k593m530O554K4434K0215j4993m3009k7173
652d9396K3234N6550L1362l2570o6218k8784M1910O4159J5361m2848m5580m205
$$ plain form
564 -34511 -36541 -10155 34012 57995 29112 -35740 -73485 -38963 39094 80506 39677 -39895
576 -39895 -75398 -32856 40435 65901 22468 -32304 -41313 -10388 15030 15478 7896 4286 -587
589 -587 -11424 -20024 -12203 12190 30772 19816 -17267 -41142 -16703 30445 39964 -647 -35964
602 -35964 -21169 16546 24274 -3127 -25056 -11405 19809 24558 -6077 -33429 -19457 21472
614 21472 36630 6503 -28692 -25176 7535 23723 6422 -13350 -8518 9526 9878 -11927 -23151
627 -23151 -1028 30122 28079 -9847 -38982 -23956 17965 40743 22402 -16104 -34576 -17984
639 -17984 12097 24301 12694 -2938 -8301 -10894 -15424 -8870 15564 35779 20786 -22223 -49396
652 -49396 -26162 30388 61750 29180 -37038 -65822 -23912 40247 55608 12760 -32820 -37025
664c7025K6049K2078P178P76o850j9977k2757K60L4101L8457o39m6841m6234O077
678d5347N3429M1949j3113m7693k9333J1965L1827K1404j030j7180j9282q299
690b0703O975J7225J4272Q40j3339j8794r865Q888K3576J7647p258k7329k1182
703b9047Q369L1008K0176j2791k8827j1639J3979J8259K721q597o249L53l36m134
717f755O07J1093R719o860j9007p063J7291K0055n030k2740q191J5689J3905o261
731F452j3423j899Q651O364k385o255k798K252M566K550p00k523k546k097J91
746c600M794N733k585r138l358N924N403q13j688J061q34n121k731O592J0075
761I714M48j2569j0052N381J3453M187r250q660K672O953j056m783K785P174j119
$$ plain form
664 -37025 -10976 11102 18280 19056 12206 -7771 -30528 -30268 3833 42290 41651 -5190 -51424 -45347
678 -45347 8082 50031 36918 -10775 -40108 -28143 3684 25088 24058 6878 -12404 -20703
690 -20703 -13728 3497 17769 18609 5270 -13524 -23389 -14501 9075 26722 19464 -7865 -29047
703 -29047 -20678 10330 30506 17715 -11112 -22751 -8772 9487 12208 3611 -2638 -2285 -2621 -6755
717 -6755 -6148 4945 14664 7804 -11203 -18266 -975 19080 14050 -8690 -16881 -1192 12713 6452
731 6452 -6971 -8870 -219 6145 3760 -2495 -5293 -3041 1525 4075 3375 852 -1694 -3791 -3600
746 -3600 1194 6927 4342 -4796 -8154 -2230 3173 2360 672 1733 899 -4222 -6953 -361 9714
761 9714 10162 -2407 -12459 -7078 6375 10562 1312 -7348 -4676 2277 1221 -3562 -777 6397 5278
776E278q865m659N551R426K413p415q054J03O706L213k558j155J960j597o616
791f269r51J0561Q790o638j3601j939J0477P723k246o362l450M16K032K030J298
806A871Q47j499m640k702M304P689J263q122o536M429Q404L5p197k515M252K887
822B770k817l658J739M622K74n103k181M661M362k928n121J326N208O18n397k524
838d149M002L961k123m673o37L497K800j003l039o83K643J828k107k208K582L162
854C853k725n315R18O384J802n704n104L186N807L66m187k064K217K371o29j786
870f10N77J707o96k592m31K760J561k294k788L03L410J464k055k696R57L467O90
887B734l081k290K388L387j411l931j91L226Q21k709j180K168J630j368j989R56
$$ plain form
776 5278 -3587 -8246 -2695 6731 9144 1729 -6325 -6222 484 3697 1139 -16 1944 347 -6269
791 -6269 -7220 3341 12131 5493 -8108 -10047 430 8153 5907 -455 -3905 -3489 -1457 573 1871
806 1871 2718 1219 -3421 -6123 -1819 5870 7133 -989 -7525 -3096 5308 5343 -1854 -4369 -117 2770
822 2770 -47 -3705 -1966 2656 2930 -2173 -4354 307 4669 1741 -3380 -2054 3154 3772 -1625 -4149
838 -4149 -147 3814 1691 -2982 -3619 -122 2678 1675 -1364 -2047 596 2424 317 -1891 691 3853
854 3853 1128 -4187 -3269 3115 4917 -787 -5891 -2705 3102 3468 -719 -2783 -566 1805 1176 -610
870 -610 -33 1674 978 -1614 -2045 715 2276 -18 -2806 -2503 907 2371 316 -2380 -1423 2044 2734
887 2734 -347 -2637 -249 3138 1727 -2204 -2395 831 1652 -1057 -2237 -69 1561 193 -1796 -840
903h40K625N30k530j809J303K940L15l149k371J811L045m39k793o59K067Q97r53
920a0n80R85J126r27j811j3K504J647k334l238J70L215J515j966j959N70J124
937A8j95R8J254M04j448j417K33J357J715l41k697j950J914K896m13k779m05K195
955D39Q72j861r85K209J647j568k169M77J649K73q52q38r3R19m0j068k72J697
973D36J310j216k021J14K131J250j015j660M9R33Lr60j12J034J114j337k331J71
991b107L127J612j874k277Q74J659n61j017Q37J265n77k241j090J207K324O92
1007A853j253k219r03J749K168M55r29n53j015j294P73K818J493k231l207q95
1023c190K011K427N03j045p73j052o95N21K420K424p35m202k979K187N042J416
$$ plain form
903 -840 1785 2315 -215 -2024 -721 2219 2534 -615 -2986 -1175 1870 1431 -1362 -2021 46 943 -10
920 -10 -590 395 1521 594 -1217 -1230 1274 2921 587 -2651 -2481 734 2249 283 -1676 -1106 18
937 18 -177 -79 1175 1579 131 -1286 -1053 304 2019 1678 -1019 -2969 -1055 1841 1428 -1351 -1756 439
955 439 1311 -550 -1535 674 2321 753 -1416 -939 710 983 131 -707 -800 119 79 -989 -1261 436
973 436 1746 530 -1491 -1377 754 2004 989 -671 -622 311 314 -646 -758 276 1390 53 -2278 -2107
991 -2107 1020 2632 758 -1519 -645 1014 453 -564 273 1538 961 -1280 -2370 -1163 1161 1853
1007 1853 600 -1619 -2522 -773 1395 1850 921 368 -647 -1941 -1168 1650 3143 912 -2295 -3190
1023 -3190 -1179 1248 1751 706 -67 -1119 -1814 -1293 1127 3551 2816 -1386 -4365 -2178 2864 4280
1039D280l566l658qK521J476l72n49M33K51j735j437J723L646R59l664m068O32
1056c136M284K240j759k952r10R62J157P69N51n28q86o10K2R23J054K14j116j003
1074g24k37L89M85O62M80o48j896p40K417K274p96l056q23K650K338j163l365
1091a753p38L093K167j958l482J6L544J386k103k236J151K379J32k384q52J839
1107B01K414p00l551j534K409L471l29l491j776J549K171K43m88k97l37o85J9
1124g11J220Q64l72j184n41R4KK60O86Q25m28j936j447J417L444J368k893l511
1142b843L63L570J906j827k568P0J545J71j400j71J965J451j877l254J67M002
1158A270K793k199l938q25K810K368o37j872q37M07K30O3K78O42J12r12j076L65
$$ plain form
1039 4280 714 -2944 -2952 -431 1045 673 124 557 808 -927 -2364 -641 3005 3964 300 -3768 -3136
1056 -3136 1148 3388 1629 -1323 -2233 -1271 -114 655 1206 678 -208 -818 -796 127 1181 1395 279 -724
1074 -724 -961 -572 -87 575 1055 407 -1489 -2229 188 2462 1666 -1390 -2213 437 2775 1612 -1753
1091 -1753 -2491 602 2769 811 -2671 -2655 889 2275 172 -2064 -913 1466 1598 -786 -1638 201
1107 201 2615 1915 -1636 -3170 -761 2710 2381 -1110 -2886 -1337 834 1077 589 292 -45 -730 -711
1124 -711 509 1373 1001 -183 -724 -630 -628 -368 318 1143 715 -1221 -2668 -1251 2193 3561 668 -2843
1142 -2843 -2480 1090 2996 1169 -1399 -1329 216 387 -1013 -1184 781 2232 355 -2899 -2732 1270
1158 1270 4063 1864 -2074 -2899 -89 2279 1642 -230 -1067 -660 -430 -367 -89 553 665 -247 -1323 -958
1176i58J762P22q92j183J9N28j01K54N37n6j461q84P50K086L44j712j461R50J969
1195A213L93j532j488J083J699l94j899m56J630J035j238j679M66K024O56j651
1211a38j519Q93K003O08j716j389P41J406j66j253j83Q94J54r12l39Q69R73l87
1229E39j078k38Q40P99j28p80j79L05j47m94K01Q12J79j230r29Q23J606L54j299
1248d4r46L45J433J11o87n26O22K98j026q03P44J468J06j803r96J159J587Nj141
1267i4n28O40M51j23m71K6M78J08j093n63Q19J174j96j354m54J024R32l48n98
1286a70L28L43k09o72L5P65J95m77r60nQ08P98o32j036K79J106k3o16r7P84K00
1307G44q07m42L09O91J08r19o30M22Q38J65p70m59O93P61l29p81M10P97j84j007
$$ plain form
1176 -958 804 1526 634 -549 -530 -2 -103 151 688 632 -829 -1713 -963 1123 1467 -245 -1706 -756 1213
1195 1213 1606 74 -1414 -331 1368 974 -925 -1381 249 1284 46 -1633 -1167 857 1513 -138
1211 -138 -1657 -764 1239 1847 131 -1258 -517 889 723 -530 -713 181 335 -577 -916 -47 926 539
1229 539 -539 -777 63 862 734 -46 -225 80 -67 -561 -360 452 631 -599 -1528 -705 901 1255 -44
1248 -44 -990 -645 788 899 212 -314 308 606 -420 -1223 -479 989 1095 -708 -1704 -545 1042 1047 -94
1267 -94 -622 18 469 346 -125 -99 379 487 -606 -1169 -350 824 628 -726 -1180 -156 776 428 -170
1286 -170 158 501 292 -380 -345 420 615 138 -822 -827 -19 779 147 -889 -610 496 473 -143 -240 544 744
1307 744 -63 -505 -196 495 603 -316 -946 -524 314 479 -291 -750 -57 704 375 -406 4 801 617 -390
1327c90j92P98L53l83q54K2L68Q01p7q31j80P46N68o09o57O02Q71n64j133K18
1347e23R38P8o81n37J92N73K88m04l25J74P72k00p94J10R63L45j197n87P54N45
1367D84k34p13j10M59J87q4k91jO28L27o51m76M05J022l00j290k76J143M57o62
1387B4o56L30O31p9n48j35N31N46j89o95l62R17P10r31q36K23R36l8p92k22O36
1408AM97m01n81L31M60J21k73m24L57M66o8q85l62P25N95o52p76M62P46J12p72
1429c21j40N83O04l67o59n3N25M57n33o70J98P55J4r99j28P99N79n26p10L64O83
1450D55K21o43n70L04P55k9p18l91O44L85m14o92L44O24K4n18M7K79L64L1n48
1471d6j55K69L84k87p01k1J011m4q07k65Q29L38n40n10N92N79j51p13k18N85J15
$$ plain form
1327 -390 -582 216 569 186 -668 -646 -278 523 446 -385 -565 181 749 140 -517 85 956 392 -741 -523
1347 -523 415 493 -188 -725 -533 40 328 -76 -401 -227 545 345 -449 -339 624 969 -228 -815 -61 484
1367 484 250 -463 -573 -114 73 -11 -302 -303 325 652 1 -475 -70 952 652 -638 -914 229 686 24
1387 24 -632 -302 329 250 -298 -433 98 644 455 -240 -602 315 1025 94 -742 -519 417 379 -413 -635 1
1408 1 498 97 -484 -153 307 428 155 -269 88 554 486 -399 -761 -36 559 -93 -869 -407 339 451 -321
1429 -321 -461 122 726 359 -300 -353 172 629 96 -574 -376 379 393 -606 -734 65 644 118 -592 -228 455
1450 455 676 33 -537 -233 522 493 -225 -616 28 413 -1 -693 -349 275 299 -219 -172 107 471 502 -46
1471 -46 -201 68 452 165 -536 -557 454 410 -397 -662 167 505 -35 -545 47 626 475 -238 -456 129 244
1492B44J06o61k95M27O24l69o88K65Q90J2q89k05O54O86m06p25j55N73K45k34
1512I9m98NO12R4n90m62P50Q32o36q30L35Q83m6o85J36J30r5p1j90M7L32J06l26
1535f8o16K82Q79K73q51n19P77M22l76n37K58M77j95n32k21L76M57r1n44j75K39
1556b85P63l0p05j11Q04K4p38l05P69L66m98m74m3N87J5l8j41j94N25pl71q2M09
1579B40L69l96o26M8O72J63p87k30M66L14m22j62J89M17L36m31n23jO98L04n68
1600G0n68M08L80j23m70l0N40J54n60l33L55O44Nm64k69L1O62j86k76P7K01k84
1622c6m06R8O67N0m41m49K67N39M8p6j91J1O1J04n72o1O47M19p93r72N22R12L62
1645G10p34p27L20P18K01l73j72K03K85l79n28lP31K65n46n62K03N79J16j83m4
$$ plain form
1492 244 350 -311 -606 -179 445 76 -612 -347 543 555 -334 -539 115 801 395 -330 -485 88 333 99
1512 99 -399 -394 218 312 -278 -740 10 842 206 -624 -289 594 548 -137 -1 129 34 -37 -227 -180 152 258 -68
1535 -68 -684 -402 477 750 -101 -620 157 579 203 -334 -76 401 206 -326 -547 -171 286 195 -349 -524 -285
1556 -285 478 448 -257 -368 436 460 -278 -583 186 552 54 -420 -463 124 139 101 -40 -234 291 284 -87 -169 240
1579 240 609 213 -413 -365 307 470 -317 -547 -81 233 -189 -351 -162 255 591 160 -363 -364 334 638 70
1600 70 -498 -90 290 167 -303 -333 207 361 -199 -532 -177 467 472 8 -261 -230 432 246 -30 47 248 -36
1622 -36 -442 -344 323 373 -68 -517 -250 289 337 261 70 81 142 246 -326 -387 260 679 -114 -1086 -564 348 710
1645 710 -24 -751 -431 287 488 115 -57 146 431 52 -476 -479 252 517 -29 -591 -388 191 307 124 80
1666H0j33j0O0K70m5M6k19l58R0L01J10j66l28J85L50j37m77J31P41J02n83n90
1688e80N87N37K0p51k26K02O20o7o87m06O68P11l42q22N1P68N09o26o36K40M46
1709B16J00m88j10J34L30j42l47p5M21K97j40k81Q0J51n6J45m5m1k76j61N8L82
1731A52J73k11n61K0N05J93k29l44L56N60l73n90l4P64K62m69r28K73Q37J58m69
1752D5p07K02O03M8l17j77M34L44k80o16K00P34K7m41o46J59N36J55k31l45J87
1773h6K51j26k15K85L72k30m48l1N04J36j84n10J06L56k10k44k7L95J32l17m02
1794d93K16N71L12o21n87M94N69r2p31j1L25M43l66m59J19N93J81n92k79K96P33
1815F21k2p02l67N08O62n03p28K06M61K01m72l20M85N37l00m78k8N13J42l46n11
$$ plain form
1666 80 -53 -63 -3 267 222 268 49 -309 -219 82 192 26 -302 -117 233 96 -381 -250 491 593 10 -580
1688 -580 7 544 564 -187 -413 -211 409 342 -345 -751 -83 628 286 -536 -485 283 792 166 -470 -230 216
1709 216 316 -172 -282 -148 182 40 -307 -382 39 336 196 -85 -5 146 90 235 190 149 -127 -288 -230 152
1731 152 325 114 -447 -427 78 271 42 -302 54 614 241 -349 -383 381 643 174 -754 -481 356 514 45
1752 45 -662 -460 143 191 -126 -303 131 475 195 -421 -221 513 540 99 -547 -388 148 303 72 -273 -86
1773 -86 165 39 -176 109 481 251 -197 -228 276 412 228 -282 -176 180 -30 -274 -301 94 226 -91 -493
1794 -493 -277 294 606 -15 -602 -108 461 369 -362 -373 -48 395 29 -430 -311 282 463 -129 -408 -112 621
1815 621 599 -103 -470 38 700 197 -531 -325 136 337 -135 -455 30 567 267 -211 -239 274 416 70 -441
1836d41J83N93j04n06k54N33K31m31k58K46P04k93m09q4O13K05l99l01j01M00
1856A27K08l75m30J17O37L5q41J8O98N08n15p90L81Q45K7p46m42M54M13j58m89
1877c18p1L83L15k45o76K13R01K9o69l46O52K05k84m68J73L14J93m31k40K22L00
1898A52K5m46j40N11N78m56p49K59Q05pp92j95N91L54l96n23J81N06J70n60l34
1919d66L86L75J75o02j61K66N73k75q20J87P38k9n12m58N23M99k33o03j46P21
1939A38L08k58m22J03M33j2m67k84N65K96l84o63K08O87J28m86l09L85L99m0m05
1960h0k29N66L01n58m31K66N64j00o20k20L85O41m00n14J31N13K60m71m06L65
1980c7L77M5o59j74M84L34l45m05J03L72J11k96j90J98M24R1o16j27M64M74m71
$$ plain form
1836 -441 -258 335 231 -275 -529 4 235 -196 -454 -208 496 203 -206 -290 323 528 129 -172 -273 127
1856 127 335 -40 -470 -353 284 319 -522 -504 194 702 187 -603 -222 623 650 -96 -538 -84 329 171 -318
1877 -318 -389 -6 309 64 -612 -399 502 531 -138 -484 168 373 89 -379 -206 108 301 -130 -370 -148 152
1898 152 177 -269 -409 102 680 224 -525 -266 539 532 -260 -455 136 490 94 -429 -248 258 428 -132 -466
1919 -466 -80 295 470 -132 -293 -27 546 271 -549 -362 376 347 -165 -623 -100 399 166 -437 -583 138
1939 138 446 188 -234 -131 302 290 -177 -461 104 400 16 -647 -439 248 376 -110 -419 -34 365 325 -80
1960 -80 -309 257 558 0 -431 -165 399 299 -321 -541 -156 485 85 -429 -298 215 475 4 -402 -37
1980 -37 340 385 -274 -448 36 370 25 -380 -277 95 206 -90 -280 -82 342 433 -183 -310 154 628 157
2001A57p10L65N44r9n50o3N78O5l20k82K11M00q5j90j72O4L06J49o20o7M61N4
2023A96k94k96L01L53j19m81O7M91J45k26j78k49L79K91k59o14K32N70M1p44j95
2044e89P52K77l94n84M35N26k00l30p7J69L64j71j70l63K13M65j71m73J04M39
2064B22K03n72k17M92Q1k65k01L49J16j40r2j8j26J99N9k64r9L03K27j91m54L48
2086d0L28q9m74l1M82J65l67k89Q8L57J9j41j92p3N65j7m04k56N66K46l63k45
2108a65J06L10n2k94r5J34R7mj03n7rJ37M8l2j99L93N6m32Q9K23J67m80p6K09
2132b9J87j51j80J4J77J48o8l34n3L72K26j29n29L05K70On20Q7K65l8J23r1j47
2155h9J35J20m9j19j49L78Q8m29j45K65K14j60l84K13J53n3k19Q3K03R9j15r6
$$ plain form
2001 157 -553 -188 356 257 -293 -356 222 287 -33 -315 -104 296 211 21 -151 -87 219 368 -252 -319 142 196
2023 196 -98 -394 -93 260 141 -340 -273 218 363 137 -41 -290 89 380 121 -493 -261 309 350 -394 -589
2044 -589 163 440 46 -538 -103 423 223 -107 -184 -15 349 178 8 -355 -142 323 152 -321 -217 222
2064 222 425 -147 -364 128 209 -56 -257 92 208 68 -24 -42 -168 31 90 -174 -273 30 257 66 -388 -40
2086 -40 288 199 -275 -306 176 341 -26 -315 -227 130 149 8 -184 -257 308 291 -113 -369 197 443 80 -165
2108 -165 -59 251 199 -95 -190 -56 41 37 -66 -123 -132 5 53 21 -178 215 271 -161 -72 151 318 -162 -238 -29
2132 -29 158 7 -173 -159 18 166 98 -236 -289 83 309 180 -349 -44 226 232 -288 -201 64 26 149 58 -89
2155 -89 46 166 117 -2 -151 227 315 -114 -259 6 220 60 -324 -111 42 -11 -230 -147 56 155 40 -56
2177e6m0K45L2k48j74L43J55no05J25K99Q9k07l24K44K05L4j35j97L06K32n1m02
2200a35j55M20K45l02m42L04K02j46l6K5L4P5j05J11p9m0K07k7l00N0K81j07j33
2223e3q8K23q6k06R2K45J10k22k64K02K92r9m8k13M9J73N8l11l6P9L67j22l76
2246b34nN04Pj31k32J39J24J37j93k22k2K24N2l65j04K94L96l29l36J14M42k22
2268C8m4q2J24j15P1L9J32j45p7r6k5J64N0j02j16N8L09K3l29n1L06R0j56k86
2292b20J37O8J63k79j23J2M14J45l82k46L22K62o8m02j2L24P4o7k91R2J60p7K3
2315B9m1r2L24K2k78k19L14J01j27j04J43Np2j53K04l1Oj46n6J19J92j52j80M3
2339a49J57K28k15k16J34L06l3l51m1K40J69k85k05R8K50R0j13k08J61M9J70k97
$$ plain form
2177 -56 -96 149 181 -67 -241 102 257 252 -353 -228 71 160 -47 -371 -127 78 112 -23 -220 86 318 267 -135
2200 -135 -290 130 375 73 -369 -65 137 -9 -45 -20 14 89 -16 95 16 -24 183 156 -144 -94 187 80 -53
2223 -53 -141 82 -4 -210 -118 127 237 15 -249 -47 245 146 98 -115 -66 107 165 -146 -182 -103 264 142 -234
2246 -234 -239 265 272 141 -91 48 172 309 116 -106 -128 96 148 -217 -321 -27 369 40 -296 -182 260 38
2268 38 -6 -88 36 -79 -8 31 163 18 -59 -155 -180 -16 34 -68 -184 -126 183 206 -123 -174 132 222 66 -220
2292 -220 -83 -15 148 -131 -254 -242 172 317 -65 -311 11 273 205 -197 -209 115 189 122 -169 -77 83 6 29
2315 29 -12 -104 220 242 -36 -255 59 160 33 -71 72 77 5 -148 56 25 31 -115 -171 -52 140 -12 -192 -149
2339 -149 8 236 21 -195 -61 245 212 -139 -180 60 229 -56 -261 -163 87 177 64 -144 17 66 236 -61
2361f1j56L23J15j4n05J67K29p4r4m3L0J09M6j74J23N9o9P5j12k4J32J00k41j02
2385a61K30mj13o6R1K34j14j53J9J16O7P4k65j81L22J11n2m43J68L63m4l65l7
2408b03K13J44k57J7N2R4J58j95j25J28j07J13p6j40Q3K72k30j55J02J53M7j31
2430d3r8M9J53j31o2J19J81p0j31j55O9K72r9q4j86L06o8j33J0R7K16k2k44j47
2454b01J33K33K3l90J41J40K9j06j16K4J71R0j99j47J45K28o4q1j46O6J18k5k21
2477a55J67k5Q2q8j96K37N7j27n9J03P3J30j32k00K17L1l8l60J90K46q9o4j83
2500a83K41J37o1j64j42L00J69k35j18o9L14k1k25j79J88M4J7j86j41L65J3r2
2522b8n0J51J43j16k00L3J53l3j59o7L7K8J84p9j34J47OJ3r2j2J42O9q7k20J82
$$ plain form
2361 -61 -217 106 221 207 -298 -131 98 24 -70 -113 -83 26 72 -102 21 80 11 86 -26 -50 82 182 -59 -161
2385 -161 69 65 -48 -114 -23 211 97 -56 -37 79 146 220 -45 -226 96 207 155 -288 -120 243 199 -166 -203
2408 -203 10 154 -103 -86 -34 60 218 23 -102 26 -81 32 -44 -184 -101 171 -59 -214 -112 41 88 -43
2430 -43 -141 -92 61 -70 -132 -13 168 98 -33 -188 -119 153 54 -30 -216 90 22 -111 -101 -4 212 190 -54 -201
2454 -201 -68 165 188 -202 -61 79 108 2 -114 -90 81 171 -28 -175 -30 198 134 53 -93 -27 91 66 -155
2477 -155 12 -13 69 -19 -215 22 79 -48 -107 -4 69 199 67 -133 84 115 77 -283 -93 153 64 0 -183
2500 -183 58 195 134 -30 -172 128 297 62 -56 -125 189 168 -57 -236 -48 -4 13 -173 -314 51 64 -28
2522 -28 -78 73 216 100 -100 -67 86 53 -106 -173 -136 -108 76 -3 -137 10 16 29 -63 -75 67 136 49 -171 11
2547A1J72m6j93j24J71P5j75LLK15k9r2j7K6J22j05o7J1J15N8j52j20L3J41o7
2572c1p7N3J62M1n2l44K82R6K9j91J9l2K90o8k28j21J88J20j87j15K10R5o8n8
2596A3l7L6M2J04k18M0J52Q5k10q2J9J22j04p2J04M5n4R8o5o0O1p5J4p0J92j1
2622F9j07l9L6K5M4k0r6L0J06K1j65p4K92j0o3k30J44R6l7r3l5K5J67m5m1j29
2648a29N5J41j18j8J01J37L0k38j46J93n3N9ml6OJ02m8j42P6R0m4j46L1J51j0
2673D0j06L1M2L6j1j65O3N1N3O7j43lK5J68m2m4m2R0j34p8R5k1J14J1k98Q2J70
2700E1k8m6j65K10P5j9n3j46K11j90J22%p4J01k1q8m8N4J08j12lj9J73o3j17J21
2726C4J6J28k17Qj9O8O2n2k9o3J11k7K5j71N3K88j45j49K2K02j1r9j27k7J48p0
$$ plain form
2547 11 183 137 -56 -180 -9 66 -109 -106 -103 112 83 -9 -26 0 122 17 -50 -39 76 134 -18 -138 -105 36 -31
2572 -31 -108 -55 107 148 96 -248 34 130 159 -32 -13 -45 245 177 -51 -172 16 136 -51 -166 44 139 71 13
2596 13 -24 12 54 158 -60 -20 132 217 7 -75 -56 66 -38 -110 -6 39 -15 83 18 -42 19 -56 -42 -112 80 69
2622 69 -38 -77 -41 -16 28 8 -88 -58 48 69 -96 -170 122 112 49 -181 -37 59 22 -71 -106 -81 86 41 0 -129
2648 -129 -74 67 -51 -69 32 169 199 -39 -185 8 -45 14 10 -26 -20 82 34 -108 -32 58 14 -132 -101 50 40
2673 40 -66 -35 7 43 32 -133 -70 -19 34 101 -42 -45 -20 148 106 62 20 110 -24 -102 -7 -28 86 97 -201 -119 51
2700 51 23 -23 -188 22 97 78 25 -121 90 -100 22 22 -52 49 28 -60 -108 -54 54 -58 -61 -80 93 30 -87 34
2726 34 50 178 -39 -31 -50 18 80 28 -1 -64 47 20 45 -126 -73 215 70 -79 -57 145 134 35 -92 -119 29 -41
2752d1j03J39J11q0Mm8l0P0k7R1j42JJ9Lr5J22M4o1n9k5J44L9m0j12J28Q7j35
2779DJ13k90J63J29l9q7p6P5n3P0j32n5K16L1O0k58J64K0n7k3q2l3K3M0O8k22
2805b31L96j78r0J24j9Jn5N8j1M0p6jJ34k15J14o2J3R4j11N1N1j11P2Q0kO2j09
2832A9l9N4N6r5kQ9j85J41m8m3o7K45q3p7J14r3N8j31J1J03j8K0j03Q0J6j10N5
2859c3r1J62m7k9m0J58m1jr0P6Q7j66jJ9p6Q6J06J0k13L9P5L4J6p8J7J13r3K9
2887B8j02J9J17r6p1N3J19j01j2K1L7j00J75j44L1P5m4j14%J03O0Pj38rJ15p0
2913d1Q6k44K26J7qj50O7N8J03j19p7J33O6j2r0K4p6J62j20Mn7O1J6rj10J06k7
2940a1J19j8j46P2M5J3k48J10J73j40l8jo3J09j1K2n2RJ23p1k8O3j08J26p9J18
$$ plain form
2752 -41 -144 -5 106 26 30 -18 -48 22 -5 86 -56 -55 -36 -33 -128 -6 38 -23 -82 -107 37 76 36 -76 52 139 4
2779 4 117 -173 -10 119 80 -7 -83 -8 -61 9 -123 -178 38 69 129 -129 35 55 -2 -25 -107 -140 -117 -77 -9 -231
2805 -231 165 -13 -103 21 2 3 -52 6 -5 35 -41 -42 92 -123 -9 -71 -58 36 -75 -24 27 -84 -12 68 66 128 19
2832 19 -20 34 90 -5 -7 82 -103 38 -10 -53 -120 125 42 -35 79 -14 44 -87 -76 27 9 29 -74 6 22 -88 -33
2859 -33 -124 38 -9 -38 -78 80 39 38 -52 24 111 -55 -56 -37 -113 -27 79 89 -124 -85 -10 24 40 -38 -21 92 -1 28
2887 28 -74 -55 62 -34 -105 -52 67 -34 -46 -25 12 -88 87 -57 -26 49 5 -109 -109 -6 54 61 -77 -86 29 -41
2913 -41 45 -199 27 44 36 -114 -47 11 114 -5 -82 51 117 105 15 39 -37 125 5 9 -48 13 29 20 -90 16 -11
2940 -11 108 90 -56 16 61 74 -174 -64 109 -31 -69 -70 -133 -24 -35 -13 -65 -56 67 -4 -32 31 -77 49 -30 88
2966H8r8J7n5P6j37N5l8P7lK8O2rn6j7J65l0j32l4L4O2QMj02n6J26Ro8Rk5L8p9
2997h1K4RO1r1L4O9o3Q3j43k6N0P3L4j47M3J2P7l9m2O2R0j20M3k0Q2l5j27mn1
3026a43J50L9q1P8p8k1J57j32R3o7m1LN1p9N0m1J15j99J50K0J1q6k4R7J8q3R8
3053E5n4N0n2M1n4j14J08j2j3k4J45n4Mj15K03l6j20J22j6J0k3o1M9j08J50j77
3079i6K23j51J20K0j42K2M4p2Q1j34M4K01q7m1l6Kk5l7L0l2j0J51O0q4p2Q7J4
3106H0k0j16Q2n1j30K34n3J40j67Q6o7j61R8%N2k3q2K19j67J5M6J29q6j45J43
3131E6m4k3q0J03k3n0j0J59m4n0L7l7R9j58nJ83j68O0N6p0r8L6PJ27r7O6nj26
3159i9Q5k9K0L8m5K31l10J13O0M5j8j10K9Q3j08J03m2j44M7JM0Lk8M1p0J9Q8p8
$$ plain form
2966 88 -10 7 -48 28 -109 -54 -92 -15 -18 10 72 63 7 -10 155 125 -7 -41 -7 55 63 67 -35 -91 35 44 -24 -15 -40 -2 -81
2997 -81 -57 -48 13 -78 -44 25 -38 45 -98 -124 -74 -1 33 -114 -71 -59 18 -21 -63 -1 89 -31 12 -8 74 39 -88 -92 -143
3026 -143 7 46 -35 43 -35 -56 101 -31 62 -5 -46 -43 8 -71 -21 -62 53 -146 4 24 35 -51 -75 22 40 -43 55
3053 55 1 51 -1 40 -14 -128 -20 -32 -45 -69 76 22 26 -89 114 78 -42 80 64 74 51 -10 39 -69 81 -96
3079 -96 127 -24 96 116 -26 -4 40 -32 49 -85 -41 160 73 32 -4 -2 -27 -64 -34 -66 -76 75 135 51 -21 66 80
3106 80 60 -56 26 -25 -155 79 26 166 -1 85 18 -143 -45 -45 7 -16 -98 121 -46 -31 15 144 58 -87 56
3131 56 12 -11 -91 12 -11 -61 -71 88 44 -6 31 -6 93 -65 -70 113 -55 5 61 -9 -107 -71 -64 63 -34 32 27 -99
3159 -99 -14 -43 -23 15 -30 201 -109 4 64 109 91 -19 10 93 -15 88 46 -98 -51 -50 -10 -7 -35 6 -64 -45 43 -35
3187c5j1N8N4j5j8J0j15J15k2M7N4l3j21K9o9N8N5j33O0k0P3qol2J40k6m4R2l3
3216A04j37j3K9Qj9J01m8k3L4L0m5O7j4Qj67J6J57m8m1N7j30M7m7jK0k9J04m8
3244b8J35j34pK7M7o4K0J8M0J1r6M4n7R0Q3j41KM8p9J2K7o3J13m6J7p7L8JP2n8
3274eO3J3j1j38L5p4J72l0K3J5Rj8n4J5P4k29K21j56l7k4j1J97j19p6J23l9P7
3301A6j6Nj64K32j07O2M9p5K7nQ3p2n6J22k2j53J55n7M5q4Q8j96O6O3k2m0q0J58
3329B2R4j45m4r9K11j07L7jn1M7P6o8K11k07p2R7K6k9k5J7L1j59K39l1j65J06
3355A1K2j04O0J24j26P2j23Q7P8Qk10J76qo4o8NO7q1ON3N8m6k4L2Om7M0j7j3J56
3385A30j35n2J53k4Nm2j02P6o4J83j60N1m2m3O9j4j1J05K5p5j63J04LR2k6pq5
$$ plain form
3187 -35 -46 12 66 51 33 43 -72 43 21 68 122 89 -32 -3 -72 -14 41 -92 -32 -52 21 13 7 -25 115 89 45 137 104
3216 104 -33 -46 -17 -9 -28 73 25 2 36 66 21 88 74 82 -85 -69 88 40 -1 56 -74 -27 -74 -75 -55 -84 20 -28
3244 -28 107 -27 -34 -7 40 -24 -4 14 54 65 -31 13 -44 46 129 -12 -10 38 -41 -29 -2 -65 48 2 19 -58 -20 -19 53 -5
3274 -5 58 71 60 -78 -43 -117 55 25 48 63 72 54 0 15 89 -140 81 -75 -112 -136 -147 50 -69 -145 -22 -61 16
3301 16 0 5 -159 73 -34 28 77 2 29 24 107 35 -21 101 79 -74 81 24 69 -15 73 -123 -57 6 -16 -56 -136 22
3329 22 116 -29 -73 -172 39 -68 -31 -32 -83 -36 40 -28 183 -24 -96 1 27 -2 -27 -10 21 -138 101 70 -95 11
3355 11 33 -71 -11 113 -13 59 -64 23 101 109 -101 75 67 3 -65 -60 7 -74 -68 -15 43 -3 -27 5 11 -36 4 -13 -26 130
3385 130 -5 -57 96 72 77 35 -67 9 -55 128 -32 19 -23 -66 3 -11 -22 83 108 33 -130 -26 -23 69 43 36 -49
3412d9O3JR8k01R4j8M3j5j31J25j24R7n7J19m7JM4O5k00Q7N0l5K4k6L0L2l6p0
3440c6m3M0L7L1l6r6%J09J1J8m6k05L25lq4p6M5O0r3J59n2k5j44M7J8N5k8J52
3468A40L3j58j1P7o9n8r5R9j3l5mn1J42p0J00J7j28L8Q6l0j27J36l0k3Mo9J07
3495Hq4J6l3Q6L2oO6o3k9K3N2j2o9n4J74j17j2OQ8p5J7j9k9J58k62J18L6O6n6
3524B6M6j15NL2k1j0L6K6m3N3j16J34j32P0M5j09J43j74O7M0j2K3q0O3N5j12J61
3551A01j94J26J36r9n5n8P6m6O8p2K5j0Q3l2J2j4MN2j00J5j08O9J73j54j42J45
3577Aj8r5J90j21j0k1p4J62j16K1K3oJ05j58Q1J5J41k00O4p2O2O4o7J02J81k81
3603b7N8q8J34j00J0j6r4J42Q4p0RJ29j67m6j06J42O8j2q5o6Q0l8O7Pj03J9O7
$$ plain form
3412 -49 14 15 113 -88 6 -12 31 16 -115 10 -114 -17 -74 45 -2 -1 43 108 -92 -5 45 10 34 8 38 70 34 -36
3440 -36 -79 -39 -2 29 -7 -103 -103 6 17 35 -11 -216 109 106 22 -54 -9 51 -42 117 65 40 -104 -57 -39 16 -12 140
3468 140 173 15 4 81 12 -46 -141 -42 -55 -90 -94 -145 -3 -73 27 44 -84 -46 40 10 -117 19 -11 -34 -30 -99 8
3495 8 -76 -60 -93 -7 25 19 85 22 -7 16 68 56 -13 -67 107 -10 -22 -16 72 -3 14 -5 -34 124 -138 -20 16 82 26
3524 26 72 -43 -38 -6 -27 -37 -1 25 -18 35 -81 53 -79 -9 36 -73 70 -104 -37 3 -9 14 -66 -3 52 -60 101
3551 101 -93 33 169 70 15 -43 33 -13 55 -17 8 -2 81 49 61 47 51 103 3 18 -90 -21 152 -2 -144 1
3577 1 -17 -112 78 -43 -53 -74 -148 14 -102 -81 -58 -64 41 -117 -36 -21 120 -80 -16 -88 -26 38 -29 73 254 -27
3603 -27 31 -57 77 -23 -13 -29 -123 19 103 33 42 171 4 -42 -148 -6 62 50 -35 -101 -21 -59 8 15 -88 -69 -2
3630bo2M9K2L5j67J15O3j73O2J76r6k3On7O4KJj5p5J65k58K85o0o4N6j18L9N8
3658B8j9R0k8j2j27R7l3r1J22j10K9J3q9N7M8m1P5Q8j09qR3j47P2m9rJ09j93J59
3686A5j1J2K8l5qJ04j15J92j34j40J10J60j82O9j24M1J82k00J51j64J9N0p3M6
3710gO1q0l3J18j30J62j48P8j05OJ39j26Q6j00J14j4Q0j30pj28J23K0m1O7NL9
3736D9j58J32r0Q2j73J25N6j00J49k39J82Q8o0j15N9k1J06q6M0j12J12o6j0J18
3760F8o6r9Q6L9n4N6k0L9J00k82J75O6j78J58j27m7J62j12K6j7l6J2P9l3j3L1
3786A3o9R5k22J44J2pm7L8l4J38j34J22olk6LL2j25L5j4J33r7J35j16r8J58m6
3813A4L0k8p9J23m7N3k60J81J0o0Q0m7P2q9l7J17j18M1m8J62j26O4j04J15p3K0
$$ plain form
3630 -2 -64 -15 7 42 -125 -10 53 -120 -58 118 22 -1 5 -52 12 14 15 0 -75 90 -168 117 57 -7 49 -69 -30 28
3658 28 9 99 71 59 -68 29 -4 -95 27 -83 -54 -41 -130 -73 -25 -66 9 97 -12 -20 73 -74 -2 -51 -60 49 -144 15
3686 15 4 16 44 9 1 105 -10 182 48 -92 18 178 -4 65 -59 -18 164 -36 115 -49 -30 20 -53 -7
3710 -7 54 -26 -59 59 -71 91 -57 21 -84 -78 61 -65 21 -79 35 21 101 -29 -36 -164 -41 -21 -62 5 10 49
3736 49 -109 23 -67 15 -158 -33 23 -77 72 -167 15 103 43 -72 -13 -34 72 -14 26 -86 26 -40 -50 68
3760 68 2 -97 -11 28 -26 30 10 49 149 -133 42 108 -70 88 -39 -86 76 -36 -10 -27 -63 -51 28 -5 -18 13
3786 13 -56 39 -183 -39 -27 -34 -81 -43 -77 61 -73 49 43 40 14 17 49 -76 -41 -55 78 -19 116 0 -98 60 14
3813 14 44 16 -63 60 13 66 -194 -13 -3 -63 17 -30 42 -47 -84 33 -85 -44 -92 70 -56 8 -96 19 -54 -34
3839c4K8K1m1J9p3J45k2n5L5r8J03l8q7K13q3j6M6j47J34j08J00m7o5M1o7R8n1
3866d9Q5J1o1KN6o2M5K1k8Mq8K6O4l5q9K76r2p7PO3r3m4k1R4O2L7l5r6k1P1j23
3897i0J38p3K6O5p9n9n0K8K8P7j01O8N0LL0q4j66K17o5RK7L7k7r3O4J2r5J37M
3926C8p8k1J0PR1k3Q1r5O4Kj01Q1r2J8n3P3J05m2p9O0p4j6O1j24J90j24N9k2q9
3955i3J54p0K1j8N1r2mj3r2P1P5L8p7j74K45Nr5J06j46Lk7J25O0L3j44L5P7j7
3983C7n0K1n9M1Q2p4l5j5l0J27K5q2m1L4J16j05l0O4j30J56l6r6N1P3j3j77K05
4010E9k3l4m7Q5j22J31o0Ql5L4J7JQo0l3kk6J34J2j55J34o3j5p8J77Rm1K2j42
4039a05J04L8o5R7n8n6J72p6J1l3r2P2L2J30j59J1L3K0l6J4j82l4%J89p3j9M8
$$ plain form
3839 -34 -6 15 -26 -7 -80 65 43 -12 23 -75 28 -10 -97 116 33 17 63 -84 50 -58 42 -5 -70 -29 -96 2 -49
3866 -49 36 47 -14 -12 44 -18 27 48 20 24 -64 -38 26 -9 -98 178 86 9 16 79 -14 -58 -79 15 77 114 79 -17 -38 33 -90
3897 -90 48 -25 1 66 -13 -72 -122 -94 -66 11 -90 -22 28 31 61 -23 -189 28 -37 -28 -1 36 9 -84 -20 -8 -103 34 38
3926 38 -40 -61 -51 -44 47 24 105 10 74 76 -25 56 -36 -18 -71 2 107 65 -14 46 -28 -44 17 -107 83 -41 18 -4 -93
3955 -93 61 -9 12 -6 45 -47 -51 -64 -156 -85 -10 28 -49 -223 22 27 -68 38 -108 -105 -132 -7 53 86 -58 -23 54 37
3983 37 -13 8 -51 -10 72 -2 -37 -52 -82 45 70 -12 -53 -19 97 -8 -38 26 -104 52 16 -80 -29 44 31 -146 59
4010 59 36 2 -45 40 -82 49 -11 -3 -38 -4 13 14 22 -38 -71 -73 -99 35 47 -108 26 -37 -52 -130 47 56 15 37 -105
4039 -105 -1 37 -28 69 11 -45 127 51 62 29 -63 9 41 171 12 23 56 76 40 54 -128 -162 -162 27 -46 -65 -17
4066a7M4K9p2k1P6M9Q7k17o0P0j3M4J1rK1j6j97K55p6k2r5J53K4k3o5Q2pL4j2
4095E7j1j61J26Nr0Q0O7Ro5j4o5P0j02J27K2n8l8m6J36j86LJ56o9j5J03m1j02
4122a02J07J3k4l8J46j74J11l8M8K5N9j28K1m7L9K4l9M8N2j4j06MN4mK7p3r2J26
4150B5K0N8p6m5m0J14j88o6J60O8n3M1p9J6P6l3J0p9J49j52K9rJ64O0k58K6J1
4177e1J55m1p7k6M1J7R7q1p6J07n1J7m4Q6j07N1RJ5j40J12m0n8J53j0o1p9K4J06
4205D8n1p8n6M2P9K7q7L0L3M6k0ol2oK0K8K9p5m4J58j58L7o9J35j09M4M9k9J34
4234A19p0k6K9q7Kqom7Q9q9J91o4P5n7j09J01p7Q7O4j20j57J69q5J2N1K3n0n8
4262i8J32p2Q1m5r3J39Ok7%mj8K8l8J10n9j56j1J33r9M8L0K4KL2J6o2j9N9l3N4
$$ plain form
4066 -17 27 56 -16 -37 39 88 175 -42 -102 -32 -45 -1 10 1 22 6 -191 64 -12 -34 -129 24 48 25 -40 42 35 69 57
4095 57 46 -115 11 16 -74 6 73 82 17 3 -62 8 -94 33 55 -3 -41 -87 49 -137 -134 22 -47 -62 41 0 -102
4122 -102 5 18 -6 -44 102 -72 39 1 49 74 133 5 26 -21 18 42 3 51 103 89 -17 -13 41 37 64 -9 -101 25
4150 25 45 103 27 -18 -58 56 -132 -198 -38 30 -23 18 -61 -45 31 -2 8 -71 78 -74 -45 -54 110 170 -88 -62 -51
4177 -51 104 63 -14 -40 1 18 115 34 -42 65 14 31 -13 73 -34 17 26 41 -99 13 -27 -85 68 58 -3 -82 -58 48
4205 48 -3 -81 -137 -95 -16 11 -76 -46 -13 33 13 7 -25 -31 -11 17 46 -29 -73 85 -73 -36 -105 30 -79 -35 14 -15 119
4234 119 49 23 52 -35 -33 -41 -47 -94 -5 -94 97 33 108 51 -58 43 -34 53 117 -3 -160 9 -76 -64 -13 10 -40 -98
4262 -98 34 -38 43 -2 -95 44 50 23 23 19 1 29 -9 101 42 -114 -125 8 -91 -43 -13 11 13 45 61 -1 -20 39 6 60
4292F0o9p1J01k2j16L1O3M7k3Qo9J8M8K6n2Jl3l3P2J6P0j52N7k4O7M6j33J5L6
4321a5N5j89J85j4j05J30k7K1j11K10j53k4O6k9R9q4j23K22r1j08J36p3j2j0N2
4346HJ35j08M3Rj44L0m9J64j1j12m8K6n2Q3o9K11j93J1K8K3k7j1n3J02j28J50
4372A8k3q2nN2J25l0k6K4M2j35R3j02RL9N2j47J10q2r3J49oK5O3nq3j31N0J08
4400Ip8P2N0o0Ml6l3j3N9J1Q8j68J96j81M7K5j62K15o1Pj09J8J22j47J65j2l2
4427drK4L0lj6K0o3j82L00q6M3m9j22P8O0k0l5J75q6m3k3l9J02Op3p0J21r0l4
4456h8M9K6jn0K3J6m2R4J41k63J12l3p9Q0p7J7R1o7J37j63PJ18p2m7L4J65n5r0
4484a7j05P2P6k3O0L5j3j05J3m4kJ80j28M5r9o7J03NR9p9n3O9j53%R8M9j0k4N0
$$ plain form
4292 60 -9 -80 21 -1 -117 -86 -23 24 1 9 -60 -42 6 32 -20 -19 -52 -85 -13 3 73 -79 -22 -46 21 67 -66 -51 -15
4321 -15 40 -149 36 22 -83 47 20 41 -70 140 -13 -37 29 0 99 15 -108 114 23 -85 51 -22 -34 -44 8
4346 8 143 35 78 87 -57 -27 -76 88 77 -35 -83 -57 -109 -26 -95 116 -77 -66 -38 -15 -42 -53 -106 -4 -132 18
4372 18 -5 -87 -92 -40 85 55 29 53 95 -40 53 -49 -40 -1 51 -96 14 -68 -161 -12 -18 7 70 65 -18 -149 -99 9
4400 9 -69 3 53 -7 -3 -39 -72 -85 -26 -15 73 -95 101 -80 -33 -8 -170 45 -16 -9 -118 -100 22 -125 40 28 -4
4427 -4 -13 11 41 38 22 42 -21 -203 97 11 54 5 -117 -39 21 1 -34 141 55 12 -11 -50 52 58 -15 -85 36 -54 -88
4456 -88 -39 -13 -14 -64 -41 -25 -67 27 168 -95 17 -16 -95 -15 -92 -75 16 -51 86 -77 -70 48 -24 -71 -37 128 73 -17
4484 -17 -122 -50 26 3 63 98 85 -20 -7 -51 -53 127 -1 44 -55 -122 -19 -14 85 6 -47 22 -131 -131 -33 16 6 -18 32
4513C2Nm1mj24J21K5p5k5OJ67r3n2L3K8M4l7l7n5L4o3O8J05j08M5L6on2j8Q5M3
4543H7p2j12K03j42pP3nj3J5j07K0k2J94j19o6j5M3J35j49Q2m9N5j7m2j1P1k5
4570EN3o4R5k53J90m5j4p4J07j6L9N1j51J27q4L2q3J38m5p6K4k2P7R0j50J24j16
4597d1P6K1p3p5J05J7M2p4pN1k14J56P0o8J13n7K3q7k0j4J35j75K03j10j8L8n7
4624d0K59k96P1O0m5n5Q5q5N6J3J4N4m4k3r4K4P1n8j15J55q1l8M0J03m6M8M0k03
4652a30J53j1NOK1n6k3J8j29M8N5k8J14q4j5P0j25J87L9k0j64K0K1J74k11J02
4678C7rJ37j36k5Q1j73J21J63j81r1L9J4J0K3j08J29j52J41l5q8Q8K3N1l0O0r8
4704iq3J24k1n0P9p4N0Qj76K15k5n9pK9j5j0N2M2n5n6l6lL6O4N9j43M7j0r8M4
$$ plain form
4513 32 37 -4 -8 -132 -11 14 -61 -86 -80 87 -6 -58 -25 3 47 10 -27 -82 -48 -111 -43 62 -46 -1 35 29 -23 -41 44 87
4543 87 15 -97 106 -36 -43 30 25 12 27 -80 -60 -82 112 -7 -73 -88 -45 90 -59 23 -26 29 12 -30 -41 30 5
4570 5 58 -6 89 -164 26 -19 -33 -107 0 -16 23 74 -77 50 -34 -2 -85 53 8 -68 -44 -66 11 101 -49 75 -41
4597 -41 35 56 -17 -92 13 30 72 -2 -9 42 -172 -16 54 -14 99 42 65 -22 -42 -56 79 -96 107 -3 -21 17 -40
4624 -40 219 -77 -6 54 9 -46 39 -46 10 23 37 91 47 24 -70 -46 25 -33 -148 7 -74 -112 -72 31 -15 33 73 -130
4652 -130 23 12 17 23 44 -12 -35 -17 -146 -98 -43 -71 43 -41 -56 14 -111 76 115 95 -69 -49 -28 146 -65 37
4678 37 28 165 29 4 85 -88 33 196 15 -76 -37 -23 -13 10 -98 31 -121 20 -15 -103 -15 8 59 29 89 -9
4704 -9 -92 32 11 -39 40 -34 16 24 -152 63 38 -21 -28 1 -14 -24 28 70 15 -41 -77 -80 -44 20 79 -64 -17 -27 -125 -81
4734h1J74j36j5O8j13J20K0j2j64J4J93j15J0Jl8J66j29jk8O0l9K0m9N9J7J6R5
4761A13j61k1LP3m6j9J07k14K06j04m5J9K02p9j01J38M7n6J04k41l0J51p0N0N1
4786G7j9k8N5j7l4n0p7J5Q4j48J74K7j19N2J04q7qJ43k17J16m8N7o4Q5j99J67
4812D1m5j1R2j08J8J6j2L4J3m3o1N9K2L2p2M0M9j05Q5k8l9M2p3o2P0J0L4j2j15
4841a29P7J44j78J77j9k8L8o6o5L5l2J9n1J28j5pj4J5l3j05J47o1r0N3J33k00
4867a27K43q4K3p1j15J28O7Oq1r5K10Mj24P4mp0j3J9m2J2j06J49M3p9J45qr0j06
4895i2J44p0p8J44p8Q5j33j5P9O1j1R0j62k7o0J55l5P3M0r8M4q7J35l6j08L1K8
4922A9m1l2k1J44L3p4nj03P6J9l1J8J07k16Q0O6j51J18pm8J18j26O5N7j47m3J95
$$ plain form
4734 -81 93 -43 -58 10 -103 17 37 25 -139 -125 68 -47 -37 -36 -74 92 -37 -38 -66 -6 -45 -25 -74 -15 2 18 113
4761 113 -48 -69 -66 7 -39 -58 49 -165 41 -63 -108 -89 113 34 -67 71 118 62 166 -75 -105 46 -24 26 77
4786 77 58 30 85 68 34 -16 -93 -78 6 -142 32 59 -60 -8 96 9 1 144 -73 43 -5 52 -12 73 -126 41
4812 41 -4 -15 77 -31 -13 3 -9 25 38 -5 -66 -7 15 47 -25 15 64 -41 44 16 -23 19 -54 -116 -46 -36 -2 -14 -129
4841 -129 -52 92 -86 91 72 44 82 16 -49 -14 -46 -27 -78 50 35 28 14 29 -4 -109 38 -23 -113 -60 73 -127
4867 -127 116 32 55 -16 -131 -3 64 70 -11 -106 104 108 -16 58 54 -16 -29 -10 -52 -40 -146 3 46 -33 112 104 14 -92
4895 -92 52 -18 -96 48 -30 55 -78 -93 -14 47 36 126 -36 -63 -123 32 -3 70 110 12 56 -31 104 68 -40 -9 19
4922 19 -22 -54 -75 69 102 28 23 -80 -4 15 -16 2 109 -107 -27 39 -112 6 -1 -49 69 -57 8 65 -82 -125 70
4949G0n3k6N0n6P4q3m2j1J06l6P3j6kq9M5N5M2K1o4l1j47JK62j77O5o9K9l4J2
4978c1Q3k3j9p6j7k2J27R1k60J82j06PL4J2r8R2J54k22J19l8m7L5m9J67K4J1j03
5005B7p3J8m6P1M9j20J00n5L9R5p4n0M4R3j1l5k5j45Q4l8N7N3k7p8J18l1q1J3
5033b8m9QO9j1q0J40p0J5JL2k5j8k7J6n7K7R0M4j06j7J50j58J52j24M5r7R3o6
5061e1RO5L4p4k3m3N9P1L8j27l6J06p5K5N8L6l7k5m0J0J04j09J8q2J57p3L3L5
5089F3j16P3Nj14JR2o4O5m5J28j82J02j09%P0P3o1N2o6r5J26P2k3p4O1j07O2M
5117gl8J75o2n4mj07J3J10j32Q9Q3J5l7o2J37j10r3M7q7J48q1O7K6J33j90l1l1
5144h3J16o1N0O5j12p6Q8N0%n8J17j15QM0O8q0Q8j83l1J67p9k6L3o5J12m5K8n9
$$ plain form
4949 70 17 -9 41 -15 59 -24 -66 -77 29 -7 66 50 48 -41 4 59 101 122 58 27 -120 -119 143 -34 31 -38 -9 -43 -31
4978 -31 52 29 10 -66 -83 -105 22 113 -147 35 -71 -64 -30 -18 -116 -24 130 -92 27 -11 -58 -23 -72 95 119 130 27
5005 27 -46 -28 -74 -3 46 -74 26 -29 10 105 31 -19 25 118 107 72 47 -98 -14 -52 5 58 31 -47 71 40 -41 -28
5033 -28 -77 -69 0 -11 -91 49 -21 -6 -5 27 2 -16 -43 -27 -84 -57 33 77 -29 -46 104 -54 98 -26 19 -78 15 -51
5061 -51 -42 23 57 -17 -40 -83 -24 47 85 -42 -78 28 -47 -22 36 72 35 10 -30 -20 84 -25 -7 -89 68 -5 28 63
5089 63 -53 20 25 -89 -88 4 -60 5 -40 88 -94 8 -101 -101 -31 42 -19 33 -33 -128 -2 70 47 -27 34 -73 -11 -7
5117 -7 -45 130 68 14 10 -97 -84 26 -106 -17 66 81 44 -18 119 9 -84 -37 -124 24 -57 10 36 169 -21 -52 -83
5144 -83 33 -28 22 87 -25 -101 -13 37 37 -21 96 -19 -11 29 97 17 105 -78 -109 58 -21 -47 -14 -79 33 -12 16 -43
5172d3N9K1N8n4q3M1l1k3J11q3q0P0J03p3l5L7L2k7q3J32q1K1p5P3J8j1P6r1M
5201a7Kj6j5Q5J03k5q2q2R1Q0r0n7N2L9j07L6P0n1O5p1J07q6Or9l8N1l1oL6R3
5231D3q8j4J24j61K9l4P6k0J8k7P4P3j54J23o9N2p2O5k8l2j8Q0KPO0m0j4p3O4
5260D6n9O5k9k7J06o3r2J16j21O8k8L1j54K21k5o1o7L9J03j8Pj2q3L3n2J0J59
5287A13j95M7O4l7J48j04j6r1J22j0r1J57m9q8K0J30j79Q0N3j41m9J51k5k0l0
5312d0l1K18j99J32R3j14l5K6ok3J3j10J19j24J10j64M3K9r6J10j2q4N7L0J01
5337D3p3q5J45j07J39l7J9Mj3N7j78J35j9O4k0k9j11J86j27M3l7N4M1j36KJ15
5363G5qp4N4l5j24J57n6J0nK0j61R2O5l7Q6l9p5m2J60o7O7q8L1k06K08J0Oj28
$$ plain form
5172 -43 16 37 95 41 -42 -1 -32 -55 56 -27 -107 -37 66 -7 -42 -5 27 0 -83 49 -32 -11 -86 -13 5 -6 70 -21 -17
5201 -17 -15 -31 -46 39 142 117 35 -47 44 124 34 -23 29 68 -39 -3 67 16 81 10 117 31 37 -62 -100 -49 -80 -86 -50 43
5231 43 -45 -59 65 -96 -67 -101 -25 -45 -27 -54 20 93 -61 62 -7 45 -27 38 10 -22 -40 40 42 49 109 69 55 -18 46
5260 46 -13 52 23 -4 102 39 -53 63 -58 10 -18 13 -141 80 55 -6 -73 -34 69 51 58 46 -37 -4 -56 -46 113
5287 113 -82 -35 29 -8 140 36 20 -71 51 41 -50 107 58 -30 -10 120 -59 21 74 -67 -116 35 10 -10 -40
5312 -40 -71 147 -52 80 173 59 24 50 44 21 34 -76 43 -81 29 -135 -92 -63 -159 -49 -61 -145 -88 -58 43
5337 43 -30 -115 30 -77 62 25 44 48 35 92 -86 49 30 94 74 45 -66 120 -7 36 -1 53 94 -42 -40 75
5363 75 67 -7 47 12 -112 45 -11 -1 -6 14 -147 -55 10 -27 59 20 -55 -97 63 -4 63 -25 6 -200 8 18 24 -104
5391a04J3J56l5j7k4J15n3j36K2J34J1q2J42r8p3Q0Om5M3j14J5J21j60N9p8N3
5417d9M4Rq2J81j68R3L9k8n4N0l5p1Q3m0k5O6n1p7J59j45L6O0J34m5j9p8M6l5
5445br0Q6K4J16p7Qj34J23j22K8M8q2K19j24N7j19nN0j4J22j39k5J06j51J24j25
5471i8J23PJ6p6J10j09j72K12l6j48J60q5P1m6m0J36L4J16p1o0r4J93j51M4m4
5496hN9r6j3j8J51j29O8j18O9J58k31J42L6o7n1L3M8n8L6j7n3Q9n7K6nM9j49J8
5524h8J31m1R5Qj73O3Kl0O1n7L1p7O5O8L4k0n3M1L7j13k2K1K9mMl1pM7k0k9oK6
5556hl8J08l0k0J9q9L4n4K0j1O3j1n7Q3j64Q7Pq3Q6o8J2L3O1M8j01l1Q3N7j11
5585g5k6R9M1r4R9j34J70j18K0M0K2j09J74L7j07J7o5j16R5L3OQ4k19R7J36j14
$$ plain form
5391 -104 -91 65 30 13 -11 104 51 -85 -63 71 82 0 142 44 -29 51 57 12 55 -59 -44 77 -83 -24 -102 -49
5417 -49 -5 4 -78 103 -65 28 67 39 -15 35 0 -71 12 -28 -53 13 -38 -115 44 -101 -65 -5 129 84 65 -13 33 -2
5445 -2 -92 -6 18 134 57 65 -69 54 -68 -40 8 -74 145 21 78 -41 -46 4 -10 112 -27 -52 54 -97 27 -98
5471 -98 25 32 48 -28 82 -27 -199 13 -23 -171 -11 -96 -25 -71 -111 25 59 175 104 44 -50 143 -8 36 -8
5496 -8 51 -45 -58 -76 75 -54 14 -104 -35 123 -108 34 70 3 -48 -15 33 -25 11 -6 -59 30 -27 -1 -6 43 -106 -88
5524 -88 43 2 97 105 -68 -5 -3 -33 28 -29 2 -75 -10 58 92 72 19 60 97 -16 -38 -17 12 8 12 -19 -26 21 1 -28 -34 -8
5556 -8 -46 62 32 12 31 -58 -24 -78 -58 -69 -6 -17 -74 9 -155 -68 -61 -144 -58 -126 -114 -81 -20 28 -73 -104 -21 36 -75
5585 -75 -101 -2 39 -55 44 -90 80 -38 -18 22 44 -65 109 146 39 56 -9 -125 -30 3 9 93 -126 -29 107 -7
5611go9J1j4R9j4o0L3r8K20k08K8k1P8n9J25j35K1O3j0nL9r5R3o6M4m6K5Q0q9
5640c7o0O2J06r6J16j01L1M4n9j8J63j54P3q9nj7rj1J32r9kk0R6k7l3P7k39Q8
5668h8Q6J1Lm6J1j2J05j17P3l9l5j3J7LJ01j56N7M1Lk9j0M1Qk4J39k19K2J59j58
5697f6K77j16P0j77kq1J80k8J5k3r3J5L9n6jP5m8J9kj50J61p7J6OR6K4q4M6p3
5726c8r3K18Rk9j49R4q6L0lQ7j09N0j5P9K3r2Q2o1N5J3r3N5Nj07N0J0m9j1J87
5755A12j34Q6j25qJ41j36k0K06k36Q1k6Q2n6J47j69p6J67j49O0L3K6j4P1J9j71
5780h9R8MjK7j4j21K7J39j18J35o8j7J16j93l4J48j9rk6N8K3J0k89K60j10n7J18
5807bpO6L5j55R0j17R2K2j26Q2L0qn2M0M9K1j41J47p4O3k7j02J22%j46qJ70Jl0
$$ plain form
5611 -7 -76 -65 -79 20 6 -54 -21 -119 101 -107 -79 -100 -22 -81 44 -91 -70 -7 -17 -22 17 -78 15 -51 -7 -53 -28 52 -37
5640 -37 -97 -35 71 -25 91 -10 21 65 6 -12 151 -3 70 -19 -24 -41 -50 -61 71 -28 -30 -50 46 19 -14 63 -176 -88
5668 -88 -2 9 12 -34 -23 -35 70 -47 26 -13 -48 -61 -44 -41 60 -96 -39 2 5 -24 -34 7 15 -9 130 -89 -67 92 -66
5697 -66 211 95 165 -12 -14 -95 85 57 72 49 -44 -29 10 -46 -47 28 -20 -1 -3 -153 8 -69 -53 -47 49 73 -11 35 -38
5726 -38 -131 87 96 67 -82 12 -74 -44 -47 40 -69 -19 -34 45 68 -24 58 -3 52 65 -28 27 32 -75 -25 -15 -64 -75 112
5755 112 -22 64 -61 -69 72 -64 -84 122 -114 -33 -59 23 -33 114 -55 -131 36 -113 -53 -20 6 -8 63 82 -89
5780 -89 9 13 12 39 25 -96 -69 70 -48 87 19 2 118 -75 -109 39 20 11 -15 43 66 76 -213 47 -63 -120 -2
5807 -2 -9 57 92 -63 27 -90 2 24 -102 -20 10 2 -50 -10 39 60 -81 66 -8 55 28 -74 48 48 -98 -106 64 65 35
5836C5q7J37k5q7J41j08k9R7P3j20jL1l4o1OM4l1kL6l0r1J60k34K32j31O6N7p8
5864c4L8O4M2j28M3k2L1j36J17M2l8q4R4N3lL6j9j25J28j04J11K0j84L6J4M5n5
5891a8Kl5J07m4J3K3k8j47J89j75J82L7j67P5o3L7k7Q0o1N0j21J07nqO6j35J85
5918A19j65L8L4m1q3P2o1M1J80j20L8J4j26J1O6j31J3J22o5J0N9n2J5r7J39Q9
5944A19j29MK7l5N5O6J6j48K9l5J06L2j02l0PMN8j34K1K3j8J62q4m1Ll5k8P1M5
5973B9m3k8l7R6Q4j49o5J66j88L6K03r0K7p4M1L8n5l7J9K5o3J6J1N8o6J0m7N4
6001b9n7P6p7L0q4K11MM0j20R7Qj69J07J0n9m3k3N5k8k6Q7rL0m0J4j13J77q1P3
6030F1o5Kq9K85k54P6M2NR5j78K7L4j9j27J53j18J62o7q4L5l0P1Np5L2L7q0P3
$$ plain form
5836 35 -52 85 60 -27 114 6 -23 74 147 27 26 57 23 -38 -32 12 -19 -21 15 -15 -106 54 -180 52 -79 -13 44 -34
5864 -34 4 68 110 -18 25 3 34 -102 15 57 19 -65 29 82 79 115 96 -29 99 -5 106 126 -58 -22 -8 37 -18
5891 -18 -16 -51 56 12 25 48 20 -127 62 -113 69 106 -61 14 -49 -12 -39 41 -20 30 -91 16 11 3 69 -66 119
5918 119 -46 -8 26 -15 -98 -26 -87 -46 134 14 52 66 -60 -49 17 -114 -101 21 -44 -34 25 -27 -12 -109 30 119
5944 119 -10 -6 21 -14 41 107 123 -25 4 -31 75 107 5 -25 -18 -14 44 -90 -69 -46 -64 98 14 -27 -24 -59 -87 -16 29
5973 29 -14 -42 -79 17 101 -48 -113 53 -135 -99 104 14 41 -33 8 46 -9 -46 -27 -2 -65 -49 -38 20 -46 -36 -83 -29
6001 -29 -86 -10 -87 -57 -141 70 74 114 -6 91 99 -70 37 47 -12 -55 -78 -23 -51 -77 10 1 31 -9 5 -108 69 -12 61
6030 61 -4 -2 -91 194 -60 16 58 63 158 -20 7 41 22 -105 48 -70 92 25 -59 -24 -54 17 22 -53 -21 16 -64 9
6058Ij3p4l5P4O4j0k1j5N3j00L9j1J0j6J96J5k22J26J8Ll8j7q5J31K9k53K09k3
6086D3N1o5j7j04J68p5J21j03p8m2oJ29j7jL7j2j4Or2J45r4P1m5K2O5j53J27m5
6114B2P5p8l2J1m5J23j83K69j94J18p5j38K17k39J13R0q6Q1q1K0K6l8N7k0L3R
6140E5J7o6o7J6J39j41J19j17J2J70j86j4O4p0P9O5j80J01q2L3JL7L3J9r6m0N5
$$ plain form
6058 9 -4 -78 -113 -39 25 15 -6 -21 32 -68 -29 -40 -30 -46 150 165 -57 69 87 90 52 35 -50 81 110 -143 66 43
6086 43 94 29 12 -92 76 1 122 19 -59 -101 -107 22 5 4 41 29 15 21 -71 74 -20 51 6 28 93 -60 67 22
6114 22 97 19 -13 -2 -47 76 -107 162 -32 86 11 -127 90 -149 -36 54 -32 49 -32 -12 14 -24 33 13 46 55
6140 55 72 6 -61 -45 94 -47 72 -45 -33 137 -49 -63 1 -69 10 75 -105 -4 -86 -53 -52 -15 18 37 -59 -99 -44
$$ [...]
16383a6
##END NTUPLES=NMR FID
##END=
