##TITLE=abcd
##JCAMPDX= 6.0         $$ Bruker NMR JCAMP-DX V2.0
##DATA TYPE= NMR FID
##DATA CLASS= NTUPLES
##ORIGIN= UXNMR, Bruker Analytische Messtechnik GmbH
##OWNER= root
$$ XWIN-NMR		Version 3.5
$$ Thu Jun 26 17:42:38 2025 Russian Standard Time (UT+4h)  servis@DPX200
##.OBSERVE FREQUENCY= 200.131235884673
##.OBSERVE NUCLEUS= ^1H
##.DELAY= (6, 6)
##.ACQUISITION MODE= SIMULTANEOUS
##.ACQUISITION SCHEME= undefined
##.AVERAGES= 32
##.DIGITISER RES= 18
##SPECTROMETER/DATA SYSTEM= spect
##.PULSE SEQUENCE= zg
##.SOLVENT NAME= CDCl3
##.SHIFT REFERENCE= (INTERNAL, CDCl3, 0, 16.5164)
##AUDIT TRAIL= $$ (NUMBER, WHEN, WHO, WHERE, WHAT)
$$ ##TITLE= Audit trail, XWIN-NMR		Version 3.5
$$ ##JCAMPDX= 5.01
$$ ##ORIGIN= Bruker BioSpin GmbH
$$ ##OWNER= servis
$$ F:\spectra/data/av/nmr/H1/1/audita.txt
$$ ##AUDIT TRAIL=  $$ (NUMBER, WHEN, WHO, WHERE, WHAT)
(   1,<2025-06-26 17:40:27.23 +0400>,<servis>,<DPX200>,
      <created by zg, POWCHK disabled, PULCHK disabled
       configuration hash MD5:
       00 E9 B6 7A A2 85 ED C7 34 08 36 98 17 FE 4E 26
       data hash MD5: 32K
       C0 BA 64 0E 28 5C C6 6C 3F 96 DA E5 8F 4A D2 F1>)
$$ ##END=
$$ 
$$ hash MD5
$$ C7 AB 8B F2 F2 20 DF C4 EF 5D D7 D5 6E D8 FD 1B
##$RELAX= 
##$RELAX= 
##$RELAX= 
##$RELAX= 
##$RELAX= 
##$RELAX= 
##$RELAX= 
##$RELAX= 
$$ Bruker specific parameters
$$ --------------------------
##$DU= <F:\spectra>
##$EXPNO= 1
##$NAME= <H1>
##$PROCNO= 1
##$TYPE= <nmr>
##$USER= <av>
##$AMP= (0..31)
100 100 100 100 100 100 100 100 100 100 100 100 100 100 100 100 100 100 
100 100 100 100 100 100 100 100 100 100 100 100 100 100 
##$AQSEQ= 0
##$AQ_mod= 1
##$AUNM= <au_zg>
##$AUTOPOS= <>
##$BF1= 200.13
##$BF2= 200.13
##$BF3= 200.13
##$BF4= 200.13
##$BF5= 500.13
##$BF6= 500.13
##$BF7= 500.13
##$BF8= 500.13
##$BYTORDA= 1
##$CFDGTYP= 0
##$CFRGTYP= 5
##$CHEMSTR= <none>
##$CNST= (0..31)
1 1 145 1 1 1 1 1 1 1 1 1 1 1 1 1 1 1 1 1 1 1 1 1 1 1 1 1 1 1 1 1 
##$CPDPRG= <>
##$CPDPRG1= <>
##$CPDPRG2= <>
##$CPDPRG3= <>
##$CPDPRG4= <mlev>
##$CPDPRG5= <mlev>
##$CPDPRG6= <mlev>
##$CPDPRG7= <mlev>
##$CPDPRG8= <mlev>
##$CPDPRGB= <>
##$CPDPRGT= <>
##$D= (0..31)
0 2 0 0 0 0 0 0 0 0.06 0 0 0 0 0 0 0.0002 0 0 0 0 0 0 0 0 0 0 0 0 0 0 
0 
##$DATE= 1750945226
##$DBL= (0..7)
120 120 120 120 120 120 120 120 
##$DBP= (0..7)
150 150 150 150 150 150 150 150 
##$DBP07= 0
##$DBPNAM0= <>
##$DBPNAM1= <>
##$DBPNAM2= <>
##$DBPNAM3= <>
##$DBPNAM4= <>
##$DBPNAM5= <>
##$DBPNAM6= <>
##$DBPNAM7= <>
##$DBPOAL= (0..7)
0.5 0.5 0.5 0.5 0.5 0.5 0.5 0.5 
##$DBPOFFS= (0..7)
0 0 0 0 0 0 0 0 
##$DE= 6
##$DECBNUC= <off>
##$DECIM= 32
##$DECNUC= <off>
##$DECSTAT= 4
##$DIGMOD= 1
##$DIGTYP= 9
##$DL= (0..7)
0 120 120 120 120 120 120 120 
##$DP= (0..7)
150 150 150 150 150 150 150 150 
##$DP07= 0
##$DPNAME0= <>
##$DPNAME1= <>
##$DPNAME2= <>
##$DPNAME3= <>
##$DPNAME4= <>
##$DPNAME5= <>
##$DPNAME6= <>
##$DPNAME7= <>
##$DPOAL= (0..7)
0.5 0.5 0.5 0.5 0.5 0.5 0.5 0.5 
##$DPOFFS= (0..7)
0 0 0 0 0 0 0 0 
##$DQDMODE= 0
##$DR= 18
##$DS= 0
##$DSLIST= <SSSSSSSSSSSSSSS>
##$DSPFIRM= 0
$$ [...]
##$SUBNAM0= <"">
##$SUBNAM1= <"">
##$SUBNAM2= <"">
##$SUBNAM3= <"">
##$SUBNAM4= <"">
##$SUBNAM5= <"">
##$SUBNAM6= <"">
##$SUBNAM7= <"">
##$SUBNAM8= <"">
##$SUBNAM9= <"">
##$SW= 20.6817932712277
##$SWIBOX= (0..15)
0 0 3 0 0 0 0 0 0 0 0 0 0 0 0 0 
##$SW_h= 4139.07284768212
##$TD= 32768
##$TD0= 1
##$TE= 0
##$TE2= 300
##$TE3= 300
##$TEG= 300
##$TL= (0..7)
0 120 120 120 120 120 120 120 
##$TP= (0..7)
150 150 150 150 150 150 150 150 
##$TP07= 0
##$TPNAME0= <>
##$TPNAME1= <>
##$TPNAME2= <>
##$TPNAME3= <>
##$TPNAME4= <>
##$TPNAME5= <>
##$TPNAME6= <>
##$TPNAME7= <>
##$TPOAL= (0..7)
0.5 0.5 0.5 0.5 0.5 0.5 0.5 0.5 
##$TPOFFS= (0..7)
0 0 0 0 0 0 0 0 
##$TUNHIN= 0
##$TUNHOUT= 0
##$TUNXOUT= 0
##$USERA1= <user>
##$USERA2= <user>
##$USERA3= <user>
##$USERA4= <user>
##$USERA5= <user>
##$V9= 5
##$VALIST= <valist>
##$VCLIST= <CCCCCCCCCCCCCCC>
##$VD= 0
##$VDLIST= <DDDDDDDDDDDDDDD>
##$VPLIST= <PPPPPPPPPPPPPPP>
##$VTLIST= <TTTTTTTTTTTTTTT>
##$WBST= 1024
##$WBSW= 30
##$XGAIN= (0..3)
0 0 0 0 
##$XL= 0
##$YL= 0
##$YMAX_a= 637154
##$YMIN_a= -595843
##$ZGOPTNS= <>
##$ZL1= 120
##$ZL2= 120
##$ZL3= 120
##$ZL4= 120
##$ABSF1= 10
##$ABSF2= 0
##$ABSG= 5
##$ABSL= 3
##$ALPHA= 0
##$AQORDER= 0
##$ASSFAC= 0
##$ASSFACI= 0
##$ASSFACX= 0
##$ASSWID= 0
##$AUNMP= <proc_1d>
##$AZFE= 0.1
##$AZFW= 0.1
##$BCFW= 1
##$BC_mod= 2
##$BYTORDP= 0
##$COROFFS= 0
##$CY= 19
##$DATMOD= 1
##$DC= 2
##$DFILT= <>
##$DTYPP= 0
##$F1P= 11.0000007629395
##$F2P= -0.999999237060547
##$FCOR= 0.5
##$FTSIZE= 0
##$FT_mod= 4
##$GAMMA= 1
##$GB= 1
##$INTBC= 1
##$INTSCL= 1
##$ISEN= 128
##$LB= 0.05
##$LEV0= 0
##$LPBIN= 0
##$MAXI= 10000
##$MC2= 0
##$MEAN= 0
##$ME_mod= 0
##$MI= 0
##$NCOEF= 0
##$NC_proc= 0
##$NLEV= 6
##$NOISF1= 0
##$NOISF2= 0
##$NSP= 1
##$NTH_PI= 0
##$NZP= 0
##$OFFSET= 16.51637
##$PC= 1
##$PHC0= -274.9141
##$PHC1= 1.101538
##$PH_mod= 0
##$PKNL= yes
##$PPARMOD= 0
##$PSCAL= 4
##$PSIGN= 0
##$REVERSE= no
##$SF= 200.13
##$SI= 16384
##$SIGF1= 0
##$SIGF2= 0
##$SINO= 400
##$SIOLD= 16384
##$SREGLST= <1H.CDCl3>
##$SSB= 0
##$STSI= 0
##$STSR= 0
##$SW_p= 4139.07284768211
##$SYMM= 0
##$S_DEV= 0
##$TDeff= 0
##$TDoff= 0
##$TI= <>
##$TILT= no
##$TM1= 0
##$TM2= 0
##$TOPLEV= 0
##$USERP1= <user>
##$USERP2= <user>
##$USERP3= <user>
##$USERP4= <user>
##$USERP5= <user>
##$WDW= 1
##$XDIM= 8192
##$YMAX_p= 0
##$YMIN_p= 0
$$ End of Bruker specific parameters
$$ ---------------------------------
##NTUPLES= NMR FID
##VAR_NAME=  TIME,          FID/REAL,        FID/IMAG
##SYMBOL=    X,             R,               I
##VAR_TYPE=  INDEPENDENT,   DEPENDENT,       DEPENDENT
##VAR_FORM=  AFFN,          ASDF,            ASDF
##VAR_DIM=   16384,         16384,           16384
##UNITS=     SECONDS,       ARBITRARY UNITS, ARBITRARY UNITS
##FACTOR=    0.0002416,     1,               1
##FIRST=     0,             0,               0
##LAST=      3.9581328,     0,               0
##MIN=       0,             -595843,         0
##MAX=       3.9581328,     637154,          0
$$ Real data points
##PAGE= N=1
##DATA TABLE= (X++(R..R)), XYDATA
$$ [...]
9006A05k8j23O4m4k5n3J76p2kP8j0o0o3J12p6L9K5j00o7O3M3J3lR4m1j20Q2J01
9034A08o6m2J50j5j11j6N2J6m3j14O7j0J18O1j03j16l4O7l4J21rp6Jn5J05N8j08
9061b8J6M2l7J4r2J30j03Q5qJ01j14q1J28Oq4Q4k9Q8j04o5K0M9J33j35Q7k9j6
9088E8pn7J65j03k02J55K8j%m9j6Q3q7K5j31N9K13r7J3j4n6J76j62o1J4J65r9
9115A2p3n3K04p6j91K80j36jJ11jj62J57k6m2J3k6O1n4M6o4l0J39Mk27R3l7N4
9142b5kK6M9j05Q0KJ03j99K27j87j59Q2J50m1l8J79k05M2J13j5q7J0J5m9P7k5
9168A8J0n1o9P4J9K7m4l9lJ85l9j03J6j5P8j00J25j50K2P1J5k3j54J64j33J01
9194BJ00j36n2J44M7n3qk1q4N9J5j12L0k8J30o0P3n8q3M4J28j47J11K2Rq2J30
$$ y = [105, 77, -46, 18, -26, -51, -104, 72, 0, -2, 76, 66, 6, -57, 55, -21, 18, 43, -57, -124, -61, -18, -5, -8, 86, 45, -75, 7, 108, 42, 0, 150, 135, 24, 8, 60, 76, 33, -81, -14, -24, 94, 155, 52, -64, -98, -31, -65, 56, 47, -29, -28, -83, 22, 80, -28, -12, 30, -7, 7, -85, 45, -58, 27, 19, 120, 6, -75, 53, 59, -25, 59, 30, 118, 14, -51, -31, 18, 151, 16, 103, 74, 58, 51, -6, 159, 56, -146, 9, 37, 36, 36, -13, -29, 54, -33, -8, -139, -80, 133, 36, 49, 35, -21, 155, -7, -68, -54, 111, 12, -61, -114, 90, 14, -177, 103, -33, -34, 77, 76, -86, 71, 45, 3, 16, -10, 51, -3, 43, -21, -51, 88, 92, -135, -42, -79, -25, -27, -1, 48, -57, 23, 25, 128, -71, 156, -31, -190, -108, 42, 1, -37, 142, -63, -21, 92, 77, -10, 0, 15, -34, 43, 18, 28, -23, -92, -18, 1, 28, -16, -55, -58, 127, 88, -15, 1, -14, 64, -36, 89, -61, -39, 32, 47, 24, -130, 34, -99, 2, 102, -34, -86, 58, 105, 52, 44, 23, -61, -2, 13, -99, -69, -97, 33, -27, 46, -12, -95, -51, 77, -70, 41, 63, 72, -10, 120]
9221A20j48J6j33J98l2j9p0L9N2J0k6j04J27o2j9lk8K24j52l5O1L1j90J33J85
9246A75k72Q7J53j04o3K0L0p5R5r2K14j70R4m4k4l7o3MK2j7r5J46p3Q8J22q4j5
9273B2l6P8o9M1n9P3M0j70J02L1j37K1J12L6Rj09k2pj5J25q5R0q1j06O6l9K30
9300A41j99K7KP8J3r2q5J39k0J7oL4Pp0J8k3l1J15p5k1N6Po7L9l4O7K7o2M8O0
9330A10mk02J68j55O0qj32K23j40J37k5J0q7Q8L0j8k8j6J4J8n1Q9j22M1RM7j8
9357C8r9J03o9mJ05r9Q1j29K04r0l6J15j07Mk4j69J60rq4K29p5j37J50mP5j00
9383B9J22r0n8K4K6KK5m8M9j5n4k8O1k1j2p0J73j61R8l0n5Q2p1J7j14Q7L1M4k3
9412B0M7j81O8O2J8l1lJ00oj5k70K61J3J7m0o9o2J68l5j45J29K8j43J76j0j03
$$ y = [120, -28, -12, -145, 53, 21, 2, -68, -29, 23, 33, 7, -97, 30, -32, -51, -54, -82, 142, -10, -45, 16, 47, -143, -10, 175, -97, -10, 143, 39, -24, -4, 26, -49, 46, -46, 168, -2, 92, 48, 24, -13, -76, -72, -50, -67, -162, -16, -89, -1, 121, 37, 22, -14, 64, -5, 36, -23, 50, 90, -80, 22, 53, -84, -63, 49, 85, 94, -15, -37, -44, -59, 66, -19, 71, -10, -116, -50, -89, 141, -58, -31, -29, 49, 62, -30, -115, 24, 4, 21, 15, 49, 56, -14, 4, -19, -50, 65, -10, -31, 25, 32, -35, 4, -30, 37, 64, 2, 50, 110, 106, -96, 72, -83, -23, -31, -163, 60, -80, 57, 32, 42, -45, 43, 73, 55, 27, 11, 25, 43, -8, 81, -41, 0, 9, 56, 38, -61, 42, -27, -31, 74, -25, 56, -73, 131, 41, 5, 120, 13, 17, -7, -176, -16, -25, -109, 120, 45, -92, 58, 54, 129, 29, 151, 61, 3, 27, 53, 55, 80, 32, 81, 66, 12, -16, 45, 24, 12, -58, 115, -46, 52, 22, -33, 49, -22, -5, -119, -32, -1, 43, 20, 67, -114, -46, 16, 34, 3, 0, 100, 94, 79, -191, 70, 83, 100, 60, -9, -71, 97, 62, -83, 46, 74, -69, 107, 97, -6]
9438fK9j28J54j01N5O1j02Q9O3k01k7J28pP9j63K03j10j61K13j27J06k8o4j09
9462a54O5N8Pj57J16Q8L6qp3J20j54J70jk4j60j5L0J40l4j71J26N3k29K02J22
9487A53j87P1o7J30j89J39K2m2j16P1N4j08k4M2nj9R9Mj7P2J9l6j02p7J76j3n5
9514eQ4j17k2J20j2j03L3K8J8p5Q5q2J92n2q2P3m9o2Q5p4%J58m6n7p7l3K7O8j16
9543i3L3M2qj29J97M1j29J29N1n3j48j13J09M9k2k1oJ58j49k4Q8r5Q8l2J17o0
9569B0P4j14KN0j23K47j82j6J19j13LL5R1j24M0O3q2M8n6NJ19r2M5j21o1J29J3
9596A9N8k8j68Q8J8L4q6J30l0j42Q9l5J40j64n2J2R0%j8L6n4R2m4l9J41n3j8O0
9624G6n5Oq5O8N5K4k95J40N0o4M3P3j1j7n3K3J66Nj06j59J35q9N3m5J12j24M8
$$ y = [-6, 23, -105, 49, -52, 3, 64, -38, 51, 114, -87, -114, 14, 7, 86, -77, 126, 16, -145, 68, -59, 47, 19, -45, -154, -89, -31, -24, -181, -65, 23, 59, 51, -22, 98, -56, 114, 113, 89, -71, -86, -56, 84, 50, -121, 5, 58, -171, 31, 153, -34, 37, -30, 100, -89, 50, 72, 30, -86, -15, 39, -69, -93, -51, -56, -75, 24, 28, 11, 83, 102, 66, -36, -113, 63, 50, -5, 79, -38, -60, 60, 48, -55, -22, 6, 24, -51, 34, -48, 144, 92, 10, 83, 34, -28, 57, -17, -17, 141, 95, 38, -39, -72, -45, 23, -93, -60, -18, -26, -155, 42, 83, -46, 83, 134, 81, -67, -180, -71, -22, -44, -65, -71, 87, -62, -86, 2, -93, -5, -37, 80, 20, 94, -20, -18, 32, -91, 156, -26, -42, 77, -36, -33, 2, 93, -31, 9, 72, -10, 38, -18, -13, 106, 14, 59, -62, -123, 6, 19, 77, 49, -119, -31, -13, 21, -65, 65, 35, -107, -18, -53, 87, -77, -129, -117, -27, -27, -45, -9, -63, 29, -15, -54, 87, 34, 16, 76, 21, 27, -58, 10, 65, 89, -206, -66, -16, -80, -37, 36, 25, 8, -45, -22, 144, 149, 43, -116, 19, -70, -17, -62, 50, -74, -26]
9651b6j6O7j04J77P9j48j1J33k11M6m1R4j41J40q7o6J84l0q1J09m0l3n7O0J36
9676A33j03Nj7J20k82P2N1O2L4J1n6j82K21o1n5Q4p6O6j6J29j03o0lL8j55J94
9702E1O1j59Q7l8Qp2R7m0lKJ63p6m2o9N1O7q8N8m3M1J3j57Q1K3j99J33RK0R2o3
9732Ho2L6pM0j33N5J3j55J86L0j05J30q7K5k5Q0rN2j13rN8j4k06J81Q2n6%l7O
9761c6NJ22k26J33P4N6j63Q5m8J4r8J01j28J12j9Q6j37KR7O0nK1q6pj3J6LJ44
9789A65l05J17RJ7P4j08J55j55j05J68J2j14L4kQ9l3k7Q9j55J6M0n9R4O9K0j96
9815i1Q6j2L3o5M3j0Q7l5J5q3PK4P7q7O9o8q4M2M2RP1j12M5Q6Qj10j0J14p6q0
9845f5J12r2Nn8Jk4J30n3J7Q9r6J42O7j43M1k7ORO3q7n1OM8q5n3R4j23J92Qk10
$$ y = [-26, -42, 25, -79, 98, 177, 29, 18, 151, -60, -14, -55, 39, -102, 38, -49, -115, 69, 39, -42, 67, 27, -6, -63, -3, 133, 30, 35, 18, 138, -144, -72, -21, 41, 75, 86, 30, -152, 69, 8, -47, 37, -39, 27, 11, 140, 37, -23, -26, 12, -143, 51, 112, -47, 40, 2, 10, -62, 35, -5, -8, -6, 157, 81, 39, -30, 21, 88, 0, 58, 15, 56, 69, -88, -7, 16, -183, -50, -41, -21, 71, 8, -54, -18, -25, 15, -118, -63, -50, -205, -19, 11, -94, 36, -51, -26, -51, 29, 20, 72, -41, -50, 8, -6, -212, -31, 51, -5, -5, -42, -36, -31, 91, -135, -2, 72, 128, -35, 50, 2, 16, -82, 19, -109, 3, -16, 70, -67, -65, 32, 92, 87, 108, 22, 15, 2, 18, 21, 165, -140, -23, -14, 3, 77, -31, 124, -31, -136, 32, 44, -70, -36, -38, 51, 18, -9, 80, -75, -59, -19, -78, 16, 85, 105, -91, -5, -17, 16, -49, -6, -16, 71, 36, 51, -32, -25, -1, 76, -11, 58, -10, -94, -52, -10, -1, 70, -42, 3, 89, 97, -13, -23, 91, 15, -65, 47, -45, -40, -98, -97, -121, 9, -44, -27, 62, -34, 108, 175, 32, 73, 46, 52, 61, 124, 37, -14, -8, 40, -45, -98, -4, -127, 65, 73, -137]
9875a37J68J4N7j20N2j06k0R2N1p2l8NM3j6O4n0k1O9Qj0j17J13l0r1r8K04j2j50
9903a48Q5P8m0J03nj60O8J60j12L3Km8L7k3k8j30K16j12k3J55q9P8p0j26J71m3
9929B9m7l7O0J0l2Mp8Q9n9N5q5pK15j32Q3R2k18K07j76L5N7l1j4l1J10j3j68J11
9957B9j30J23k0K7N1j29Q5Q7l7p4jn7J92ll2j37n4J04P4j26J9p6J9r3K80r5MM1
9985G1p7l0K20m7j54N0plp1K7K7j49J33q2Q2M0M2q4p0Q3L3n9m0M3P8M7j05l2P0
10014C6L0j62p4J11P3R3LOj0j16k6O5j01k4J18q2L4J74j98MJ36k12J79q2Q9j2
10040E2K9J6k2m8r6J41p6J8n7O6L1m1N8q1R7j19j1J3J14k11J08J45j16m8p7J77
10066F2j07j3N5n0l6M1K07j45l7r5Q4M2J03k42P1N2m7L7J2R0n2o2K7n2J06L1k1
$$ y = [-137, 31, 45, 102, -18, 34, -72, -92, 0, 51, -21, -59, -54, -11, -27, 37, -13, -34, 35, 43, 33, -84, 29, -1, -92, -190, 14, 2, -148, -63, 15, -25, 78, 73, -87, -19, 141, 29, 62, 64, 16, 53, 30, 2, -128, 88, -24, -47, 108, 19, 97, 27, -99, 72, 29, -18, -55, 5, 15, -17, -13, -91, -2, -61, -6, -91, -98, 117, -15, 68, 160, -58, 149, -27, 8, 65, 34, 20, -11, 99, 86, -82, 29, -101, 22, 2, 29, 80, -49, 36, 123, 86, 12, 11, -46, 146, 143, 111, -26, -80, 24, 98, -28, -9, -85, -66, -159, 121, 26, 30, 71, -6, -36, 184, 137, -17, 33, 26, 23, -48, -21, 6, -143, -10, -92, -10, 30, 72, -12, -82, 1, 34, -25, -65, -22, 56, 103, -2, -34, 36, 66, -96, -170, -59, 14, 107, 110, 116, 106, -10, -36, 29, -72, -96, 22, -60, -26, 148, -50, -46, 90, -122, 57, -25, 64, 52, 81, 97, 75, 27, -69, 72, -4, 14, -43, 23, 54, 13, 71, -10, 87, -32, -43, -30, 84, -127, -19, 126, 10, -38, -115, 62, -45, -58, -3, -53, -89, -48, 159, 14, -23, -118, -34, 8, 111, -131, -60, -8, -55, -18, -6, 84, 32, -30, -3, -55, 51, 82, 61]
10093F1J0j75J27j03M4P5Oj2Mj09k3m4K00p5L9L4J8kK2n7L0m7j0N8o6L2j54J80
10121F3Np7K0r5J50q9K9%o3o0K05O0j64N0p3n9O4M1J7oj05K5Q4j63J89KmL6l3
10150D9jM9j4j47J07l2M7j32J24J6J7j06rP9j08J18L7N1k47Q9j08J37m0Q2n2j9
10176a3O8q3O2Q8o4j03K1n3q9K08M0q3%l5Rk7J07K7J1l1j11j1j3J32j36O4k5J82
10204A42l71L24k78J49M9l8J13j49l5P1l6Q2k3j3Km2J85j94J6L7Rj37J19L4q6
10229g0Q1J31k82J86o3n7P3%l3p1Q8K9o2j92L53r7n3J46k2r6J9J34j89K1Kq8J49
10256C7m4M2NP7k43J73n7N2p6K7o8J02K4n2o9J07J44j92r1J40p5r4J35j9n6J90
10282A19o6o0l4J40j28l8K5LN4r0N4J30j42m2J17MJ0p0r0J24j2n9O5j09P0O2q0
$$ y = [61, 71, -104, 23, -80, -36, 39, 45, 33, 37, -72, -95, -139, 61, -14, 25, 59, 77, 75, 97, 40, 70, 23, 13, 71, 5, 37, -117, 63, 68, -9, 11, -84, 66, -23, 6, 6, -57, -117, 88, 148, -16, 34, -39, -98, -34, 7, 24, 18, -87, -62, 22, -141, 48, 50, 46, 82, 49, 48, 97, 83, -64, 43, 11, 58, -74, 50, 66, 83, -23, -32, 47, -61, 57, 94, 145, -102, -13, -121, 16, -24, 58, 6, -13, 55, -28, 34, 122, 58, -45, -24, -77, -166, 42, 82, -1, -1, -36, -27, -54, 53, 80, 91, 60, -51, -62, -75, 57, -79, -15, -40, 142, -229, 95, -183, -34, 15, -23, 90, -59, -94, -23, -59, 23, 0, -13, -11, -53, 132, -62, -46, -9, 0, -137, -18, 16, -70, 11, 142, -140, 46, -17, -74, -1, -1, -34, -105, -17, 12, -50, -242, 111, 14, -39, 107, 85, -11, 8, 142, -47, -26, -24, -112, 37, -7, 35, 40, 117, -126, 47, -10, 42, -34, -7, -75, 27, 51, -1, -70, 37, 181, -11, -102, 38, -37, -131, 4, -15, -71, 119, 53, -7, -41, 99, -29, -67, -42, -39, 15, -75, -21, 109, -33, -75, 42, 46, 56, -14, -104, 20, 8, -51, 14, -95, -25, 37, -43]
10309d3O7j30J98j01o1J22o7O9j61J49j6k7j18J14p5k5O6O6L8L0j44mM8J6R5J1
10335A17q7R0m2k3KP6j32pK9p4J6j74K05m9P5J15j26r8J35qPq5j1J68k71J85j06
10362g3P5N7q1N3j65J12j5J00N5j61M2l3J6k8K5J01r7p1MmJ14k9Ll0j8k3J13k3
10390A9L5N1m9j22J19p8O6J06k49J35n4J4K4jM3pq7J62k08K22r1n0m9K6L5L5o9
10417b2j12K04j12J00l3N9r0m1R9l8j22O0K7M1j17J13l4L1l2l7k1J11p4j15J98
10442D3Lm6M4r3L1K8mK8LO7J5p4q9O5N6j9j17JP4R0o7q5R0j8n7K2j70m2J27J13
10472A9M8j29K7Q4M4j33L5M3N5P9j86O6J4M6j35N3k4o3k6J00Qm9rQ9j01J28k7
10499E6M3o3o8P0r0L2Q8p8r2N0k0J20m1N5k46K72q0o1NM8L2r8P9J1q8M6n2J08
$$ y = [-43, 24, -106, 92, -9, -70, 52, -15, 54, -107, 42, 26, -1, -119, -5, -80, -105, -39, 27, 65, 95, -49, -53, -5, 11, 106, 117, 30, 120, 78, 55, 57, 133, 1, -6, 23, -51, -35, -209, -4, -53, 22, 137, 11, -87, 48, 40, 47, -38, -49, 119, -152, 33, -73, 2, 59, -22, 31, -134, -22, -37, 63, 118, -43, -1, -34, -18, -46, -21, 80, -17, -88, -84, -88, 26, -3, 0, -30, -48, -71, 42, 19, 54, 105, 56, -66, 53, -25, 41, 147, -102, 33, -21, -7, 17, 16, 59, 52, -35, 127, -81, 141, 50, 0, -49, -23, 12, 47, -22, -134, 70, -42, 58, 25, 84, -6, -47, 52, 14, -108, -48, -21, 20, -97, 16, -18, 13, -19, -56, -77, 34, -40, -155, 43, 46, 0, 44, -49, -18, 10, 6, 34, 37, 104, 119, 45, -44, 21, 77, 58, -59, -58, 16, 106, 39, -46, 44, 26, -31, -9, -179, -221, -94, 19, 67, -62, -35, 49, 93, -40, -5, 38, 93, 172, -14, 52, 66, 112, -23, 30, 6, -57, -83, 17, 25, -24, -33, 56, -45, 83, 56, 99, 36, -32, 38, -52, -20, 68, -10, -102, -52, -72, 48, 7, 62, -184, 88, 8, -53, -48, 0, 32, -66, 13, 24, -64, -18, -70, 38]
10527C8J8k3l2K1k5l1m2m9J03M9j25P1J84j27N6q0o4M3K4K2o3J0j19O9L7P0m9
10554a4kP1l1j39O4Q6o5L7o6J8o0J08m8k03J96P4r0J97k30J79q5L9P2k32J24j01
10580a01R8O8M4k01J60n4k9l5R6OJ0r0J78j61j14K27l6n9m9M6m2J26j12j13J65
10605B8q9N4kp2J41J5l4p3OJ6O7r1JM8n0m0m1J53P3j55QJ62j24q0J74j38N7pL4
10634D1j46J68o8J08j62J16r7R6j3M6j12M9J26j10m1J6J9n2l0M4p4R5qN9j29l6
10660i5N8QL3J15j42J6p2J05n9J20j15K2p0J49K3r6O1m6r0P3J72k74R8R4j60K05
10686A33r1j36J9lJ01j05L2M5j05J70j46k3J37Q4r3j02J7Q2J01j20j5P4p4L5m2
10711b5M0K2m6q0J48K7k20J39M1K0j05Q1M8o5o0M6l6o3R3J27j16r1R6k2JpJ3J8
$$ y = [38, 56, 33, 1, 22, -3, -34, -76, -125, -22, 27, -98, -27, 157, 30, 86, 6, -58, -15, 9, 31, -32, -22, -141, -72, -35, 35, -14, -16, 55, 24, -115, -51, 35, -30, 7, -59, -41, -101, 7, -41, -244, -48, 26, -64, 133, -97, 82, -3, 36, 108, -124, 0, -101, -3, 65, 109, -92, 68, 14, -15, -50, 46, 52, 62, -28, 150, -11, -125, 102, 66, 7, -42, 4, -38, 88, -24, -137, 28, -61, -7, -9, -81, 60, 75, 41, -32, -26, -10, 57, -34, -33, 15, -35, -75, -116, 37, 110, -45, -37, 125, 1, -79, 95, -43, 14, 7, 41, -105, 63, -5, 103, -59, 57, -40, 56, 43, 89, -23, 26, 152, 42, 1, 17, 36, -16, -46, -2, -76, 19, 11, 70, -59, -95, -37, -29, 4, 119, -23, -7, -79, 26, -33, 87, -28, -6, -76, 73, 96, 0, 61, 15, -75, -2, 170, -104, -6, 88, -72, 133, 42, -94, -75, -78, 23, -82, -50, -5, -110, 60, -86, -109, 28, 112, 19, -83, -66, 16, 117, -3, -18, 56, -18, 17, -25, 15, 37, -9, -89, 59, 86, -134, 5, 46, 66, -39, 42, 90, 25, -35, 11, -25, -88, 5, 132, 16, -75, 21, -1, 0, -7, 6, 24]
10739B4jNO9M7j45p4mP8n2O6M8K4r9O0p5R4q8J08L6n6M5k4j39mJ07j28K7k0J54
10768H3m7jJn0r8N2J26o7p9P6J51k10J63j02j1j0n3L4l8R1J4k9J0j4Oo2J91k32
10796a05O7N2O%pl7p3J70P2k39J29qpK8K2j43J23o2l3M6M0n3L8M3M1j43j5k1J02
10825C3r3J18M2m8J4J83l29LJ33O3k09J4Q4O2j55m3J12j05J33l4%kQ8j43J15j3
10851B3q2J4P2m9j0L2L9n9Q4rk9n0J4R8n4k1q6J04j9p2J13q6kl7J18j43J80j41
10879e8k1J05Jn3K8l3O5j92J86j4K4K8k9o1N0p1MJ02%K6l0j09J00Lr6J66j93L3
10907c9N5N5j20J11j19J38j30l5L3R8j32J17J7j09J54k1j15M3l6j4N8o0M0P7m8
10932A8q3Q9j88K68j88K58k47P2Mlm7o9J65r6qj00M1QJ17o9P9p3O4j18K27q0n3
$$ y = [24, 23, 28, 97, 144, -1, -75, -79, -1, -53, 13, 61, 85, -14, 46, -29, 65, -23, 85, 121, 65, 110, 86, -53, -57, 50, -78, -51, -71, 83, 36, 35, 36, -14, -112, -60, 66, -1, -80, -4, 147, -63, 100, -2, -13, -23, -76, -42, -80, 11, 25, -4, 6, -8, -2, -64, 127, -105, -38, 14, 20, 20, 13, -24, -97, 73, 145, -94, 35, 27, 20, 48, 70, -73, 50, -12, -45, 1, 41, -12, 26, 69, 110, -33, -48, -69, 33, -60, 58, 100, 52, 66, 249, -80, -77, 56, 119, -90, -76, 8, 70, -85, -128, -16, -121, 12, -22, -22, -24, 64, -79, 36, 23, -59, -45, 27, -22, -32, 0, 39, -20, 64, 55, 26, -24, -10, 88, 34, 13, -73, 31, 12, -60, 53, -33, -35, -72, 46, -97, 83, -58, -79, 26, 27, -26, 2, -31, 34, -158, 28, 14, 38, 66, 37, -24, 26, -45, -41, 61, 61, 87, 57, -52, 48, 51, -45, 121, -72, -39, 16, 71, -49, 62, -57, 81, -49, -84, -51, 47, -85, 32, 49, -60, 94, 73, -42, 1, -35, -49, 9, -51, -11, 66, 18, -65, 24, -164, 104, -84, 174, -73, -1, 3, 0, -47, -116, 49, -47, -55, -155, -114, -106, 11, -58, 21, -52, 12, -106, 121, 41, -12]
10959a2J23l4j27J95k05O0L0MR6r2j91Q4K1l3J84j73P8PJ10j47J38j75J0M5J9
10984A5M1o3j03Q6l2J5J45j19N2n9qNJ04o2k1P8n8o3O2j5p7j2P5J34j24J8j04
11011i0J15L4M4q7O0O2k30J46L1j00k0j53J74R7k42J89j5qL5N0p3L8j27R6L5M0
11037A01o5j9q0l3J8M4PL2L5Q0p9j4m4L9k08K29l0j26L25j84j71J11q6jpJ42J0
11064B6j3L2rk3j3J22r8j05Q8J0j0j02J57lm2N9j10J34j43qJ40p0R5K6j65k8N9
11091Fr2J36%j26L5j05J68LM1k08O0N9j2l7J0J05j28Q1j23J88l9p9M6k1J6k0j4
11118e0MK4j8N6Q6j54J00n3Q8p5m4j3j0J6L4J79k41KQ7n5N2K0p1lj6O5J51j27
11146C4l7m7JRn8Q8J13j02J15q0L6J3j37J25j49O8J66k35M0R9l19K44M0p4Q1o0
$$ y = [-12, 111, 77, -50, 145, -60, 0, 30, 34, 130, 38, -153, -69, -48, -81, 103, -70, 8, 15, 125, -22, 116, -59, -49, -4, 15, 56, -7, -110, -24, -56, -41, 104, -15, 37, -22, -30, -25, 79, 17, -4, 74, 16, -47, 15, 0, -77, -89, -14, 120, -4, 14, -90, 25, 59, 103, 16, 76, 138, -92, 54, 85, -15, -35, -188, -14, 83, -159, 30, 15, 7, 42, 92, 19, 57, -70, 26, 61, 101, 36, 17, -63, -96, -78, -34, -27, 5, 40, 120, 41, 27, -17, 22, -186, 43, 13, -113, 212, 28, -143, -32, -118, -119, -126, 16, 26, 13, 45, 36, 13, 0, 122, 24, -81, 7, 17, 7, -95, 62, 59, 17, 76, -34, 100, -43, -51, 89, 19, 114, 140, -25, -53, 6, -86, 50, 50, -76, -41, -146, 22, 25, 66, -142, -82, -23, -35, -72, -62, 43, -85, -4, -127, 61, 22, -57, -11, -32, -16, -36, -50, -46, -22, -40, 16, 102, -52, 48, -5, 83, 8, -36, -49, -59, -43, -9, 170, -71, -69, 18, -37, 15, 35, -36, -39, -55, 10, 161, 34, -3, -50, -49, -40, -98, -10, 103, 1, 116, 36, 72, 85, -52, 73, -76, -8, 158, -77, -37, 62, -257, -13, 27, -47, 34, -26]
11172b6J4M2m4P2k07J56r2N7Q8K5k30M4R9l5j01J39n4L8m5k7J05o1k3K5J4J33
11198A06o4J3j38J42n6n8L7n6M5K3K3K7l7K0o6m0J75rn3m7p5PJ57M7j59j1NJ05
11226F3n9m4N2j41R3m0jnJ19K9k06R9O2r9J30j0n9o3J7lJ7P0K6j87K99j10o8J4
11254ek7K0M7k9J10k37J09N6r5P9j8j03J08M6K0Oj59N9R2j90K49k11J3M8N8k6
11280B0j27P4Nj05J28O3k7r2L5J7j43J73j9J2pK4j35J23o3N7j6n6P9o2J22o8r0
11307g8M4J15m4r0r1J23o2RJ43j03k5O0K1l2J44j13n3J91j05n9Jl8o1Q5O6o1J1
11334bP9l5j77R7N2p5j0K52l29J20l0R1Ol7J99j30q5j7J65j08n6j15K29l3k1o3
11360c3o7R2nm6J41n3j74K41j02l4NJ7O8j17lJ28j14k0O1R6l8n5j30K07p1j2j4
$$ y = [-26, -12, 30, -14, 58, -149, 7, -85, -28, 60, 85, -145, -101, -2, -37, -138, 1, -53, -15, -60, -87, 18, -43, -66, -41, -27, 106, 42, 55, -83, 59, 3, -55, -18, -74, -29, -6, 17, 44, 7, 27, -39, -79, 96, 87, 34, -13, -88, -81, 76, 123, -36, -47, -42, 63, 4, -40, 12, -129, -36, -76, -77, -82, 37, 66, -140, -41, 21, -78, 52, 42, -17, -80, -63, -66, -49, 21, 47, -140, 159, 49, -19, -5, -32, -12, 35, 6, 116, -121, -12, 44, -51, 28, 10, -93, 15, 61, 81, 87, -72, -13, 79, -111, 138, -73, -60, -12, 46, 20, -107, -33, -28, -133, -5, 58, 31, -61, -26, -9, -152, 21, 2, 14, 7, 31, -104, 19, -44, 13, -3, -59, 20, -42, 80, 12, -78, -34, 81, 37, -53, -144, -21, -83, -74, 69, -34, -59, 1, 22, -10, 134, 21, -32, 159, 54, -5, -4, -42, -103, -18, 48, -13, -2, 77, 42, -135, -38, 14, -61, -71, 181, -148, -28, -58, 33, 39, 2, 201, 71, -14, -31, 134, 26, -30, -145, 84, 51, 30, -33, -100, -8, -13, -59, 82, 29, -145, 96, -6, -40, -35, -18, 50, -67, -70, 58, -56, -76, -15, 81, 43, -12, -142, 65, -6, -18, -32]
11387c2J1q8J27k9q2J08j14J44o6J6N8r6%J40L6j32Q2j28J2P2q2p8K00j95J13
11412cK4J40l8k27K25p3n5N4q8P8j54J57m9P6r3lJ1n4rP0N2q4r4J56M7q6l2J13
11440F1j44P9P2j37L1Nk5J29k34J49J22j00Q9p4Jr5J65j15l2J42q4j58K04j66
11464a15J38L9k3J4n3l2mn4J34P5j05P2j03o3q8K26k6j8%L6j22N7J12j09J12j39
11490c9N8L4pM4q9k6p5K12l5%p1o2mK7K2J0P0q9m8R7kj5J4j7n1o2N9R1N5q8j0
11521Co0M4j2K8K7Q7k04P5J0p4K7pO1m3K1K0J12j35J24j82M8q3J66k5k1j4j1l1
11549d9J23J0p7N0k8l8q3k5P5Q6p7l4O4m9n3J3J12l9O4j54R1J7q3R0p8J31K0l8
11577D1K8n1q1l6J01o3J64m3p1m9J06j88jQ7K0Q4K3r8N2l4K0o7N9K9P7k20J89
$$ y = [-32, -21, -109, 18, -11, -93, 15, -99, 45, -21, -5, 53, -43, -43, 97, 133, 1, 83, -45, -33, 39, -43, -121, 79, -116, -3, 21, 161, 123, -104, 121, 48, -7, 47, -41, 37, -117, 40, -9, 67, -26, -29, -18, -72, -81, -11, 41, -43, -137, 19, 66, -20, -52, 61, -83, -4, 68, -69, -38, -33, -58, 71, -163, -14, 108, 8, 97, 23, 24, -71, 94, -21, -53, 89, 5, -153, 51, -115, 23, 62, 39, 53, 0, -32, -36, -90, 44, 119, 14, 86, -17, -80, -168, 58, 32, 14, 14, 50, -72, -15, 97, -12, 100, -39, 19, 53, 46, 90, 1, -25, -100, 112, 77, 77, 6, -56, -60, -33, -11, -1, 69, -20, -68, 29, 27, 12, 26, 9, -42, -104, -45, 46, 101, 13, 3, -57, -13, -25, 3, 30, 117, -87, -12, -2, -76, -49, -56, 5, -38, -17, 3, 115, -20, 104, -78, -30, -113, 53, 28, 7, -7, -18, -49, 74, 84, 7, 57, 29, -9, -92, -117, -42, 44, -33, -67, -3, -52, -105, -92, 20, -19, 45, -109, -18, -1, -84, 6, -72, 59, 79, 41, 69, 18, -63, -99, 2, -61, 103, 60, -11, -60, 46, -142, -143, -56, -36, 48, 71, -27, 25, -9, 11, -56, 3, 32, 109, -111, 78]
11604G8q2j73K94j35J62r4j1K0r5P9P1j59L0J33j9j29L4j1j2K0PR2r2K1l1Km3
11631d3O6j0k8M3J04j05jJp2J90j37oP0j16K81j26j87J22m8J4l0L1M6P3j86N0
11657dP8j11N3j8R9j25k5M6m9l4Q8m7J1R2k1p0J0O4m8j35J37n6m6J32n2P0j61
11684a22J15j8M3M2m2JP0j21Mj11K13jj99K39j9j5j92J36n6J5kO4O1k38Q0N7O0
11711F4j02l4l8K0J62j83O9N2k0K3k5n2j3J3O0QK6k5n4Q7K5Q6j91K45j18k58K35
11738F2n6j0q3J26j49J73j15R7%j24J52n3J6J5j10O2N1j26L0nJ06p6P4j24R5j4
11764A4n5J08j8l9M9j7m8n2k4J2L3J7p4J69k7j10P9p4M2J07p6Pm7n5Q1p9J39j38
11792g6J86j61k4J47n9oJO9j08ko2N7P9Np4JL5l8j6M3K6j25M1QJ00lm2jOj3N2
$$ y = [78, -4, -177, 117, -18, 144, 50, 39, 59, -36, 43, 114, -45, -15, 118, 99, -30, 4, -7, -19, 1, 8, 100, 8, 29, -2, 0, -43, 23, 13, -15, 28, 132, 27, 26, 27, -45, 145, 8, 2, 72, -44, 237, 111, -76, 46, -2, 12, -18, 13, 59, 132, -54, -4, 74, -37, 16, -2, 97, -28, -53, -7, -56, -90, -2, -49, -38, 54, 33, -37, -27, 37, -11, -146, -9, -65, -111, 21, -31, 39, -122, -7, -25, 18, 60, 18, 19, 89, -32, -28, -139, 74, 73, -126, 113, 94, 79, -113, 23, -33, -18, -20, 44, 105, -133, -53, 4, 64, -38, -72, -110, -90, 72, -111, -42, 10, -10, 13, -12, -64, -77, -64, -4, 4, 30, 5, -49, 38, 63, 149, -42, 203, 85, -173, 62, 6, -4, -87, 39, -110, 63, -52, 45, 45, -79, 73, 20, 36, 51, -59, 3, 54, -72, -42, -47, 59, -17, 57, -67, 28, 14, -41, 67, 49, 10, 59, 42, -6, -58, -82, -70, -37, -20, -94, 75, 48, -62, 17, -57, -15, 92, 16, 23, -24, -79, 2, -77, 62, -76, 110, -51, -75, 72, 13, 7, 8, 77, -31, -33, -95, -38, 41, 46, -28, -27, 8, -30, -46, -3, 23, -102, -61, -53, 47, 44, 2, 1, 7, -6, 46]
11823D6j02K1O7j15OL6J2M8K9j7O8r1j07K49k03O2J0k0R1j16J78k38QN1l8J14
11849D9R4j68J6P4j42P2l4J39o7j6L9m5r1L5N8r9K3L5J66j82o1J41r6PK6P0m4
11876aM8q1k1n8K67l19J56J8j05J13j5L7p5R9q5j0L6L0Qn7J46j40k6lk7J87r5
11903B7p2j8Q7j45O4J19l0j34J28P1l8K4j48K2nj11J63n0O8m7j16J01K7Q9R8j46
11929B8k57K38n3J4J60j45LJ4kJ00q4J08j90J3J36k46K33j07KP6l5rlK0r5J23
11955D2j7q1J3m2q0J69j01J41j1p9j8N5P2p8O4L7k57J80m9J63j51M3rN7j02M3
11981Dk4n1J63p1o4R4K2j09L5l3M8Kk4J27j31r2%J29l6J45j26j77K22n3l7J0k9
12008e6J13l8p1O4k4N6N8q8j32P7JL9LN7rj09K9Q0N2j78J98j53K3K6N3p6J08r0
$$ y = [46, -56, -35, 32, -83, -77, -41, -29, 19, 48, 31, 99, 8, -99, 150, -53, 9, 19, -1, 90, -26, 152, -86, -78, -27, -65, 49, 143, -25, -9, 65, -77, -5, -39, 100, 33, 17, 56, 11, -80, -45, 13, -86, -63, -28, 138, -44, -105, 36, -60, -53, -27, 43, -1, 47, -34, -55, -113, 154, -165, -9, 9, -96, 17, 2, 39, -36, 63, -22, -32, 4, 34, 42, -15, 131, -9, -35, -38, -65, 122, 27, -45, -63, 24, -121, -57, 62, 32, -102, 26, 97, 59, 83, -65, -43, -48, -159, 4, -46, 22, -25, -141, -40, -13, 76, 174, 28, -229, 9, -44, -30, 130, -15, -12, 2, 0, 100, 16, 124, -66, -53, 83, -163, 70, -37, -35, 41, 6, -3, -6, 14, -81, 42, 25, -56, -43, -85, -165, 4, -97, 44, 33, -46, -64, -9, 63, -15, 49, 86, -171, 9, -40, 123, -28, 15, 6, 63, -39, 4, -20, -71, 92, 21, -43, 51, 73, -36, -1, -34, 14, 16, -8, 119, -12, -104, -104, 25, -11, 134, 8, -169, 53, 0, -37, -27, -56, 57, 19, -52, 12, -12, 44, 102, 14, -118, -41, -40, -1, 2, 59, 50, -59, -30, 50, 102, -76, 122, -31, -8, 18, 71, -5, 103, 13]
12036A3p0J4j29K25j13J06R0n2j29%LR1K0Lq5J9k8j9O2n9J7M3q0m5O5j6R8j98
12064a54K53j70J09j06jR0m1n7LK30k34N4J37lj59J21k10K25j02q8K13k62J88
12087C6j11R7J1K9m6p9J54j16Oj09K11j36L5m6N8o3p7J22kP8j34J37j01Q9ol2
12113Eo2M5j61K16J1o1Q4j08M7p9O0KL1n6p4R7K6l9K9J3p8Q9k8L3q9J02M5j17
12141a7l5L7pL5p9J9P5j03J28j5l4n4OM6p3k4J11R9L9j41K5K9j79M5R9m5p1J60
12169G6J7j78K04n4l4p0P6k45K69J5k7q8MQ4j28K3J18k3j7NqJ5J2Kl5n5J5O1j81
12198a47J52m8q7J29l8q5J07Q9j0j08M9%j5J59k70k7K22p7R8J5n0k8k1K9o0Ol0
12225d6J5Q3N0j00mPOM0j00K3O9r8M4J12q8k6J5K1K2k7q0K4K04j48m6L7L1n6K7
$$ y = [13, -57, -43, -172, 53, -60, 46, 136, 84, -45, -45, -42, 49, 69, 72, -13, 6, -22, -41, 21, -38, -21, 22, -58, -103, -38, -54, 44, -154, 99, -71, 38, -68, -69, 21, -20, -77, -74, 156, -78, -24, 113, 110, -49, 72, -138, 87, -15, -103, 110, -152, 36, -75, 22, 33, 62, 16, -63, 91, -25, -19, -128, 83, -53, -18, -64, -6, -69, -146, -24, -26, 52, -82, 55, -46, 43, 37, 5, -57, -12, -173, 43, 54, -7, 77, -31, 16, -63, -3, -1, 30, -26, -100, -3, 23, -16, 13, 26, -52, 37, 9, 42, -47, 55, 100, -17, -52, -15, -22, 13, -66, -47, 28, -75, 53, 38, 4, -50, -44, 2, -71, -95, 16, 115, 154, 13, 38, 67, -112, -67, 32, -13, -84, 76, 93, -85, 119, 65, 31, -39, 37, -208, 61, 76, 49, -39, -35, 49, -79, -56, 62, 39, 22, 27, 19, 34, 46, 48, 13, -42, -27, 34, -147, 5, -43, -130, -1, -39, -124, -17, 72, 62, -46, 3, 3, -12, 147, -123, -150, 72, -5, 93, 108, 58, 30, 9, 38, -22, -16, -46, -31, 52, 102, 2, -2, 5, 11, 51, -49, -26, 43, -55, -11, 101, 13, -13, 2, 23, 45, 18, -62, -38, 166, 18, -28, 9, 40, -16, 11]
12254A1l0m4L9OK1l4j8N0n7Q1j0m6N0k1M3m2L6j3r1K7J75q9P2J2j11Lqk4L8m2
12284a6m0N5N8o1q8o7J50L0j36J61l9J0O6o1N1j68P1P3p6qo8j1K50k18L7J16p
12311F4n5M3k2j19J63j20J30jr6N6l0L4j71J82o1K8o0L9K0lM0q2onp3J28n3k0
12339e0N2J17j43O7j24J08P8j00L2p4M3M1m7RO9K6j24p8J68j10J9q1L8Q0m5J06
12365G7p8r2N5OJ16j44K5m2O8R1l5m0L8Lrj34O2j3J02J8m8nr6J4l7J30o8J29j82
12394h9%J55j73J24k2O2M7j51J1Q3j97J91O7q1rJ8o9N6l9O9l8n4Nr2kJ78j4J8
12422E4p9Q8j02L8J1N9j5o4q4J24nn1N9L6j15O1j40J04P5k0j52K20j27J7J08j01
12448aK5j3o2o7R1j01J52j11J05O6M5j52PO0n6N5m5J59p3j52O1j40K02Qn7l6R
$$ y = [11, -19, -63, -24, -18, 3, -31, -49, 1, -56, 25, 15, -31, 19, -2, 41, -1, 35, 22, -69, -42, 133, 44, 116, 128, 17, 20, 12, -12, 26, -16, -56, -1, 57, -4, -92, -159, -9, 21, -115, 46, 7, 17, 83, 22, 73, -95, -24, 49, -27, -35, -103, -114, 136, -82, -45, 71, 64, 9, 52, 30, -89, 74, -46, 84, 83, -13, 43, 13, 47, -124, 58, -3, 25, -35, 4, 24, 21, 61, -21, -27, -32, -105, 23, -30, -50, 2, 119, -24, 43, -81, 27, 105, 5, 37, -37, 6, 47, 0, 9, 78, 104, -20, -98, 70, -40, -21, -102, -64, 16, -29, 77, -1, -93, -38, -32, 84, -60, -35, -77, -9, 82, 47, 7, 45, 48, 39, -95, -33, -46, 56, 74, 26, 21, -75, -61, -98, 32, -36, 93, -89, -89, 66, -107, 17, -5, 57, 104, -47, -36, 47, -150, 41, 108, 27, 18, 36, -33, 23, -16, 53, 15, -39, -34, -126, -128, 50, 36, 54, -25, 63, -39, -1, 10, 69, 54, -10, -94, 30, 25, -26, 33, 69, -46, 15, -125, -21, 54, 34, -118, 102, -25, -8, 100, -1, 24, 11, -51, -118, -27, -128, 24, -87, 18, 84, 129, -23, -16, 44, -12, 43, -2, 157, 84, -68, -7, -147, 55, 63, 6, -30, -21]
12475b1n2k4J26n4Q9p7p3J15j4K3q1L6K7N5j02l6J74j00m6K6l3o6N9O5N7j29R6
12502D0j49J25M8o7m4p4J16Mj03J12L4M7r7p1j9J74p0R6j70jo6J61q4l0J31p0
12528b7Q8p6N6r1N7j67P1P6J02q6Ro4pQ3p4K6OJ8Nj00J09l9M1p7O8N0r4Q3j00
12557e4K1L4K2m8K8m0R6j8K6m2rJ5K5r5J00K6j00lm3N6k8l9Qj47J27J90k84J50
12585b6k0O0J07j61O3n9o7J48j32J6J9J12o1N6q6J08p4L2j14m3J52m6J8Q8m9m2
12611aJO9J1n0mr8R7Nj08R3O9o6J3l6L3m2J0J4k8L4q2j8P0q3k1J26k7N0M5j00
12641b4k8Q6l6M6J9n2m1N2J6j46J19j1m4J10r5M6j0M8K3l1j27Q0J36j08l6m7K06
12668A51q2p8j38R8Q5M0j54L2L7l9l5M3J1o9N0J1j08K25m6l4p6P4Nm3pJ21j87
$$ y = [-21, -73, -97, 29, -25, 64, -13, -86, 29, 15, 38, -43, -7, 20, 75, -27, -63, 111, 11, -35, -9, -42, -108, -49, 16, 73, -56, 40, -109, 16, 64, -3, -47, -121, -5, -1, -104, 8, 42, 89, -8, -79, -98, 76, 6, 102, -68, -69, -135, 26, -58, -88, 43, -27, 61, -15, 41, -50, 7, -160, -89, -13, 89, 3, 12, -52, -59, 24, -50, -24, -18, 0, 5, -95, 14, -25, 16, -61, 7, 57, -37, 46, -54, -33, 1, 23, -25, 3, -37, 59, 41, 67, 25, 16, 31, 56, -39, 61, 87, -13, -16, -59, -3, -31, -70, -62, -209, -82, 108, -176, -26, -46, 14, 121, -40, 23, -36, -103, 45, -87, -71, -52, 60, -1, 55, -31, 77, 3, 35, -79, -122, 30, -16, 2, 90, 41, -1, 0, 69, 80, 30, 26, -72, 25, 30, -78, 15, 84, 18, 31, -5, 28, -14, -4, 10, -18, 16, -66, -84, -14, -97, -118, 8, -19, 31, 76, -24, -52, 34, -2, 44, 63, 11, -30, 22, 38, -108, 11, 0, -44, 66, -29, 17, 7, 55, 78, 47, -80, 0, 136, 28, -8, -55, 151, 69, -9, -147, -49, 36, 76, -78, -46, -9, -48, -83, -40, -29, -98, -48, -37, -145, 80, 34, 0, -76, -2, 3, -40, -47, 74, -113]
12695a13M0N4P7P2j65J14j43l5R4L7Mo6j5N6R4q6o6O0K2N9p0L7L6j78J40m9j09
12722i9O4M4K2j1nq1km7J51k9QK5l0l2k5M0k5J9kJ4j19J90qj27J27o4NpJ06o7
12752C5L1n2o2J25j58J4J23r8L8J3QK0M2j36K13k23M0K6M4m6K7J55k02K1N3j47
12778i6J4Q0qoM8q0K4l0O4l9P5q7J36j75N1j6M6p6J05j23M7M6L6P5p1m3j25J15
12806a3J55r7Q9j71N9j69J36k0j1P2q7j7K4l5J93n0j04PJ9J05k7j7r2l3J19j69
12832a34J35p9O5r0J48j3l8J0J1k2j07J49m9N0l8J11k4j27L2L4j2k8l1n8J00r
12858a4k9R7QN0j66R7M1j02M5k6J23j03o7J0K8kJ02j84JJ32j75J28N1l0N5q7M4
12885B7lPk9N0j35N3O7j01l6K15jm7J7o6K7j3J57l6k88K41n2m2J22j66l4p6J28
$$ y = [-113, -73, -19, 58, 130, -35, 79, -64, -99, -5, 32, 36, -30, -45, 11, 105, 19, -47, 13, 35, 94, 24, 61, 97, -81, 59, 10, -99, -35, 9, 31, 20, 15, -66, -68, -115, 36, 7, 15, 40, 10, -22, -47, -7, -32, -13, -15, -1, -120, 70, 62, -65, 62, -2, 3, -4, 102, 35, 66, 14, -48, 77, -81, -67, 56, -42, -4, 9, 17, 37, 79, -57, 156, -67, -27, -1, 43, -3, 24, 179, -23, -2, 51, -96, -82, -2, -10, -16, 32, -48, -24, -54, 10, -29, 46, -41, 95, -80, -29, -45, 1, -75, 30, -93, -46, 0, 36, 111, 40, -3, -128, -13, 142, 45, 134, -37, 22, -147, -11, -31, -42, 30, -57, -74, -50, -85, 108, 58, -46, -39, -20, 85, 58, 41, -51, -84, 35, -134, 1, -78, -13, -103, 45, 32, -6, 4, 15, -7, -114, 35, -14, 36, -2, 109, 85, -42, -10, 24, 12, -16, -47, -105, -5, -14, -43, 54, 62, 112, -54, 43, 84, -18, 27, 1, 124, 21, -46, -36, -8, -10, 92, -92, -91, 41, -134, -6, 45, 15, 70, -17, 27, 24, 31, 2, 52, -83, -30, 37, -64, -100, 115, 114, 67, 84, 18, 45, 32, 189, 153, -135, 106, 54, 12, 134, -32, -66, -142, -14]
12912a4J59j06j06N9k5l4J33r7J20n9lm0o8l3K19j82l9K01j52J19J04k36Q6l0
12936b4p9N8P1r2J4R5j3r0K1O5K1j1J20j10r9J2Q5n4J49l6o3k7l0l5M5M2r3Q4
12964B6N9r2k4M0rL6n1j3L9pM9n6N9p8J25q5m2P4j9p7M2J19p4p8J13j9q0Q0j12
12993e5J09pn6K3J1J33j36n4OJ06q6m2j1k3R9J93j26n8m9K7k3m4L0j7O1m6J4l7
13021e8Q7j17J26m8O5j65J65l8N2j07O8J15k00J96j84P8k4p3rJ43r0M2J01o1r4
13046c0j7M0J9Q2Oj12J08q5rm2O7j1k6K9J1L0m7j41J07J12j17k5J25J2j36k1O8
13073cm8K1L0J21j78M1m9J40j41K6J18j25QL8j57K26m5L2R2p1r2N3j61K29r0N8
13099G3o8J03j25J35n7o2N6J24j84K4J8J7n0r1J0oJ34m4l4J04j14JJ27n5J12k64
$$ y = [-14, 145, 39, -67, -8, -33, -67, 66, -31, 89, 30, 27, -13, -81, -114, 105, -77, -116, 85, -67, 52, 156, -80, 6, -24, -103, -45, 26, -66, -52, 43, 30, -60, -39, 26, 47, 36, 156, 46, -53, -41, 44, -10, 139, 103, 40, 13, -17, -52, -7, 35, -58, 26, 85, -7, -31, 9, 0, 36, -15, -28, 11, 4, 53, -3, 56, -22, 103, 18, -24, 50, 31, -46, -4, 115, 41, -37, 76, 57, -23, 57, -55, 54, 47, -9, 14, 25, 158, 22, -32, -26, 80, -6, -48, -59, -82, 17, 210, 84, 26, -23, 4, -19, -63, -33, -50, 11, -35, -21, -58, 29, -88, 38, -10, 55, -110, 55, 17, 69, -38, 30, 145, -55, 141, -43, 35, 11, -62, -71, 72, -18, 24, 125, 64, -30, -47, -7, 12, 94, 100, -12, 96, 11, 2, -40, 27, 16, -10, 19, 30, 60, 13, -128, -21, 91, -26, -51, 74, 86, -50, -71, -3, -51, -30, 0, 121, -57, -16, -65, 75, -66, -40, 78, -47, -39, -1, -158, 68, 23, 55, 147, 76, -16, 37, -124, 105, 15, 73, 5, 108, -17, 118, 61, -1, 55, 179, -5, 19, 37, 54, 4, -87, -77, -83, 51, 7, -27, 77, -37, -36, 91, 36, 148, -116]
13125a16J47R4j42p2J1J02J00j54J14o3p1J4K6P4P1k61P4N2K9p8J0O9j1j22J12
13150IM9q9Q1K3j3l9N7j45J26L7j74J21o4r9M5lL3J06o6k9m0pJ13lr4Q4K1Ro9
13179b0J52p1r7J4J7oO1J7n7nn2Q0J0N3j03J25j76qK2m8J40n5m2J57j91R5mj7
13207iK8K5n9k8N0ll7K1J1RK3j1N4j28J12Q1j65o0N0J4J21m4j18J22P0j65J5j8
13235c9P2nm8J19j15j9NL9J03j85RJ59j29Q3o4M0j1l7J30j51qj2K4M3j9M5J2j44
13263a03K21j66o6O1o8Q4k3K4O2nM1j12j3M1Q5J0o0j2l6J27j50MR6K0l2J07j82
13290d5J60j37L9k0P0m4p9J18o9J01q9Kq6J62k38J85p2L1J9K8k3l8J3j91J68K4
13316a1k8p5R4l0k4l4Q9r7Q5L8O4j15k4J04m5j4J9l5J14K4m7k7k5nMl8P4j29J33
$$ y = [-116, 31, 125, -17, -89, -78, 24, 124, -30, 84, 21, -50, -36, -10, 64, 135, -126, -52, 0, 29, -49, -39, 30, 19, -103, 9, 58, -31, 50, 73, 60, 21, 78, -67, 59, 96, -78, 43, -21, -120, -75, -78, -45, 61, -5, -34, -74, -81, 32, 29, -65, 19, 40, 49, -20, 132, 61, -36, -22, -5, -11, 50, 67, 10, 5, -47, 33, 43, 96, -7, 118, -58, -66, -44, -92, 48, -7, -49, 108, -83, 12, 8, -9, 19, 44, -15, -43, 7, 4, -33, -12, -1, 8, 31, 20, 74, -54, 58, 139, -26, -86, -36, -22, 99, 55, -63, 59, 129, -36, -21, -39, 33, 28, -20, 99, -16, -35, -30, 9, 112, -73, -64, 95, -34, 49, -15, 25, 14, -23, 107, -44, -52, -64, -40, 3, -16, 29, 41, -103, 118, -48, -114, -53, -121, -37, -60, -36, 26, 21, 62, -50, -63, -22, 63, 73, 13, 1, -35, 92, -58, -54, 42, 62, 30, 137, -45, 115, -22, 17, -3, 67, 23, -56, 62, -7, 94, 5, 7, -79, 83, -155, 30, -42, -11, 8, 36, 13, -25, -12, -203, -35, -11, -39, -114, -20, -50, -74, -108, -19, -116, -31, 7, 71, -44, -68, 36, -9, -23, -4, -39, 75, 99, 52, 25, 0, -5, -1, -39, 35, -94, 39]
13345C9o0j0N4o0k8l6P5N7j54O5J47m8j3j22J70j27PN8K0K0j6Ll5O6q8RJ33j06
13373B0K4j9Nn2j7P5M7n5K8q3R4n7L5p6J03k5r3J2N4K0r1Q8l7K7j00M8j8Q1m1
13402cm6lM7m9R8k1n1m1N9p4P8Rq3J34pl8N4q4J12n4R1j50L5j2N2n5P9L8P8j35
13432E8j10J03J3P3j15O6j10N2l7Q4n4M0k7j13P4O9j34M1J22j84Q9j25J02%q6
13457a09J63j77N3J23j9l3r9J44o1N1p6J18j1q9M1m0M4j55M5L6K10j53L4j56J03
13482a3o7K5J44r9K2m9m6J00J3p8l0n4J79j9j43R5%q1N5P1jj11R5Q0n7m1o1lP8
13511DqM3l2j04J84n5O2q9o6M9o0J0J21L8o2Kk2L3J0R8j44p4J55r0j69K05j43
13538a04J18O4m6q3O6m4k6j58J40LJ0NP2j71M2J85j01q2M6J03j30J38l5J4m5%
$$ y = [39, -21, -31, 23, -37, -65, -101, -26, 31, -123, -58, 89, 41, 28, -94, 76, -51, -44, 14, 34, 54, 38, 41, 6, 72, -16, -7, 126, 20, 44, 25, 30, -22, -39, 36, 83, 28, 56, -27, 67, 10, 45, -31, 72, 47, -46, -34, 20, 40, -51, 37, 0, 27, -73, -25, -43, 38, -3, -49, -52, -5, -54, 44, 23, -28, -69, -10, -84, -6, 3, -80, 54, 47, 9, 63, -21, 91, 37, 128, -22, 13, 1, 53, -2, 77, 115, 193, 58, -52, 51, 64, 137, 22, 88, -22, 30, -7, 77, 23, 63, 36, -77, -3, 66, -68, -27, 95, -89, 0, -125, -23, -23, -109, 54, -123, -70, 53, 34, 1, -98, 46, -15, 36, -40, 78, 67, -22, 19, -21, 23, -132, -87, -51, 159, 6, 40, -116, -13, -80, -55, 89, -10, 12, -37, -83, 17, 30, -48, -78, -132, 47, 28, -115, -20, -20, -101, -46, 25, 24, -87, 8, 88, 31, -10, -71, -74, 4, -4, 39, 7, -97, 87, 32, 94, 5, -61, -12, -72, -62, 59, 97, 35, 37, 15, 48, 58, 156, 12, -62, 93, 3, -166, 39, -104, 14, 78, 32, -51, 15, -29, -55, -213, -73, -70, -60, -55, 17, -154, -112, 73, -28, -110, -64, 39, -91, 47, 12, 26, -19, -19]
13564a9J8jL8K4K8n6J1p1L5Q8J8K4j36NM2lQ8j17j51J16Q0k53J75R2n3K2Qr0q6
13593a24M6K7K4n4J00M4o8M0l0n8P0j11J4R5l6J4o4J13k4o8J03J5N5j42k8N9R1
13620A03o9p3J16r3J4O2n6P0Nj58J48m4m3J55p2j6j08m1J18r7jn2Q2o9P8l5q3
13647a59J16J4n2J08l0p4J42Q9j84%nN8J5J0k36N8J56J07j21j9n4m0J65q3mJ2
13673a1L0J4q3M5M7j7j20MK7j1QK4l8M3kO8l0m4J47k11R5q8K21j23p8P9r9J12
13701Im4J18j28j0R8n5j7J6L3Q1j31l7Q5oJ8j21Q6r6K15j27kO0p2J4mJ89j25o2
13729a5L9Q9j18L3M%j0n8n8l8J41j8q9J56k46J33MqL9L0p5N6p3J29n1n3R8O5p7
13758B9Nj28K04o9o0P4o8K9n2J30j53M9m0J12k8n6LR5r4K9K0J3j10Q7nP7l3m6
$$ y = [-19, -1, -2, 36, 60, 88, 32, 43, -28, 7, 95, 113, 137, 1, 6, 48, 45, 133, 16, -135, -19, 61, -192, -17, 75, 22, 44, 52, -38, -124, -78, -51, -27, -81, 19, 63, -5, 35, 5, -53, 17, -94, -80, 15, -21, -7, -71, 42, 18, -50, 53, 68, 123, -19, -47, 12, 103, 34, -39, 77, -16, -2, 60, 4, 74, 79, -79, 69, 25, -18, 137, 65, 49, -59, -100, 18, -79, -80, -132, -50, -119, -41, -76, -159, -43, -29, -81, 27, -3, -77, 65, 154, -30, -30, -35, 23, 38, 48, -188, -130, 26, 133, 12, -7, -61, -101, 64, -19, -23, -11, 19, 33, -50, -5, 42, 25, -95, -91, -64, -75, -67, -43, -81, -38, -40, 28, -2, -46, 101, -110, -15, -103, 118, -5, -83, -4, -103, 9, -35, 83, -45, -55, 43, -12, -29, -13, 20, 101, -30, -67, 18, 12, 30, -91, -5, -101, 114, -13, -15, 45, -27, -13, -17, 172, 47, -15, 24, 113, -5, 28, 32, 32, 22, -36, -94, -132, 9, -9, -98, 58, -188, -55, -51, -59, -20, 10, -65, -9, -82, 47, -4, -57, 41, 106, 29, 34, -94, 110, 41, -19, 55, -13, 16, -36, 94, -59, -10, -50, 62, 34, -22, -19, 76, -18, 11, 31, 44, -66, 21, 16, 93, 60, 14]
13786A4L3Mk1j14O0J00J8l2o1n2k3L3m1Q5j1l7P7j33LO2N5k2N4j18J04j21J08
13813B4o7P0L0o5o7O2m3j9J36m8P9j88O2o0J11K5q2q8R8P7o1R1j14R5q5j3M8j11
13841a03j8O7L1m3O7Mj4l9O2J8j24M8O4K2j2k7M4k5J31j45r5J4J58j19O5j01Q0
13868A0k6O2q6P4j18J43l3q7l8J2J22L1o3n5M9k9m3mJ27j88J57M0l2K9j32q7J79
13895A4k3q3n9J53r0O2k2K9M6J1j57J03M1p7LR6Q6j62l0R3J6L1o3j28L4R2m4O1
13923C3q3J40j49L5M9nJ66j86Mq9L8O2q9j8J08n0r5K13q6j24P9J56p8J1L8j28
13949d8K0RR4j50N3J54k04J30o1J9l5K5L6jj1Q2r1Q2l5p0k4N5j30J90n2j69L5
13976i7R4L6j28J06N2k4o5O7%nm3Kk1j9O3m0J74n8p3L3p4P7l8m0k2NO6R6n5j13
$$ y = [14, 47, 51, 30, -84, -24, 76, 94, 62, 1, -51, -74, -41, -82, 3, -8, -45, 32, -101, -98, -36, 19, -3, 51, -67, 37, -84, 24, -43, 27, 57, -8, -75, -13, -56, -75, 61, 13, 92, -96, -34, -94, 17, 42, -40, -128, -30, 47, -14, 77, -37, 58, -27, -40, 8, -103, -121, -54, -23, -66, 1, 5, -9, -48, 14, 32, -92, -44, 20, 42, 30, 3, 47, 22, 153, 8, -87, -73, 85, -34, 31, -70, 10, -16, 46, -40, 34, -84, 59, 26, -61, -99, -87, 35, 66, 3, -52, -3, -32, -75, -79, 48, -140, 17, 57, 25, 54, -78, -165, 14, -9, -92, -151, 2, -88, -26, -48, -19, 27, 38, -119, -16, 25, -52, -49, 47, 133, -29, -59, 34, 50, 81, 18, -110, -76, 16, -28, 33, -50, 90, -59, -24, 25, 20, 186, 0, 4, -85, -47, 15, -74, -92, 16, -34, -129, 84, -2, -126, -47, 109, 31, 42, 80, -48, -28, -19, 75, -75, -22, 132, -72, 58, -3, 16, -19, 6, 42, 41, 30, 112, 21, 103, 68, -2, -26, 29, -101, 89, 37, -132, -97, -3, 33, -95, 11, 63, 39, -26, 41, 41, 36, -7, -5, -26, -45, 18, -22, 152, 94, 21, 54, -20, 57, 19, -21, -43, -38, 28, 124, 69, -44]
14006d4j7K2j8K2J2p1K3PQ5r8j48K81rm9Jo1M1o1M0L8j16J26o8rm4J1J65k6j93
14035a58J76J3j77J59Q7j38J1o2J32J3m3m9J25m7Kr5qK14j33O1k9p2k2J18k33
14060a55J07K0oJ20j74Q4P8j33J9J14p1J40j31J10q7j12LJ18j39R4j43Q6J11j62
14084a09J25n3L1Kj9R5j28J76j23L4N5j37r3J53K4N1j07J29j22%R6j22K5rO4n6
14110a8p2J07L6j53J08k3l9J08j11pJ9nJ02j02o6J0J38K2j12Q1j2p6n0O5J14l
14136F1oq0P2q9P6p8J3P6J6p3P0j4mN1j87L5R4n7M3m9P3l7LM6k0l9Jj28K42j13
14166bMj1L6p4p9Q6k8mO9Kj28L0J03L7p8j4O8Jj00K20j61M3%k5K1Jp9M7j2O8j7
14197B4M8j2n8Qk6J6J20j91L9O4j06O3P8Kj09jn8P2J1J20n9o2K9l8p3J43r0j8
$$ y = [-44, -61, -39, -57, -35, -23, -94, -71, -64, 21, -77, -225, 56, 47, -2, -1, -62, -21, -82, -42, -4, -120, 6, -62, -71, -115, -104, 61, 35, -158, 18, 31, -146, 13, 100, -38, -27, -89, 43, 56, 13, -36, 89, 42, 44, -51, -59, 155, 22, 83, 54, -18, -40, 78, -155, -48, -28, -34, 86, -88, -4, 74, -59, -40, 74, 3, 143, 12, 122, 35, -77, -74, 44, -95, -1, -144, -58, 53, -109, 16, -37, -6, -4, -23, 72, -56, 120, -3, 31, 86, -51, -144, 9, 33, 84, -23, 106, -16, -16, 80, -42, -17, -26, 38, -18, -90, 17, 53, -100, 8, -15, -54, 54, -57, -64, -45, -50, 52, -50, -116, -106, 32, 54, -58, 23, 11, -65, -115, -50, 64, 61, 55, -25, 47, -42, 34, -44, -31, 45, 61, -12, 58, 44, 40, 91, -96, -61, 33, -24, 19, -30, 43, 6, 9, 55, 35, -4, -3, -131, 111, -2, 2, -9, 27, -47, -126, -40, -68, -72, -3, -1, -129, -99, 4, 41, -37, -51, 17, 18, -82, 138, -23, 20, 20, -5, 16, 17, -62, -15, -27, 41, 24, 72, 60, 2, 10, -16, 0, 120, -71, -32, 32, -74, -11, 67, 69, -40, -41, -99, -27, -16, 104, 45, -17, 12, -26, -99, 44, -46, -64]
14225f4j7O0K2RRl5K8J08j31o5O1J1l4QP9m5R4j38J14p8n5k3P8K5Lm8J34r0p7
14254e7L4k8L5l4J26j41Q8rM9j20J10l9M0r5P4j00J5L7o2J44q3mM9Jn4J4l5J0
14282c5ok4R1P3j54M0J03k02J2O1M1m6J09M3o1P9p7o2J03k46J86O4j01pL9n9j4
14309e0Q2j11R3L1pL0n9l3R0k65J35N6q6L8M0O1r7O1j1m3m6J03k3L6J5k8j7PN
14338GO3j41N3J10j2j63J06j0j32R1R3K1l1q2j3M9k7R6l3j68J07N4k6ml4K1L4
14365B9k2n5O5m7p0L1P1j78K52j03Q2j23J21Jn3o1Q4Mp1R1K1l4n8m2P3Q9q5J07
14393A19o4rP3Lo3j07J45o1J2n0l3O0n2QL1j1o3K3j5Pl5Q6j24J42r3J45k05J22
14421il6J49r7K7J07k31J23m0N3M1j2p1O0o4j4J57N1k45L6M6K4k7r8M2N6K1o6
$$ y = [-64, -81, -21, 1, 10, 19, -16, 12, 120, -11, -76, -15, -4, -38, -30, 49, 4, 98, -40, 74, -4, -59, -82, -4, 21, 24, -24, 110, 20, -57, -23, -51, -16, -50, 76, -65, 23, 14, 63, -57, 53, 14, 54, -41, 33, -67, -52, -15, -77, 67, -16, -20, 29, 30, -24, -10, -45, -35, -41, -65, 26, 99, -55, -15, 88, -114, -102, -41, 0, -46, 63, 106, 45, 124, 47, -15, 88, -158, 28, 92, -9, -16, 23, -36, -50, 32, -79, 14, 45, 38, 68, 9, -24, 66, -199, -64, -8, -94, -56, -16, 45, -52, 9, -2, -45, -91, 12, -11, 25, 40, 12, -5, 2, 7, 70, -71, -18, 92, 80, -83, 23, 13, -119, -28, 65, 86, 55, -27, -40, 9, -18, 78, 45, -123, -16, 38, 12, 8, -26, -5, 29, 7, -48, 17, -30, -100, -69, 2, -176, 76, -27, 55, -68, 53, 54, 1, -60, 24, 28, -43, 48, 69, 35, -23, -65, 8, 97, 12, 119, 55, 46, 119, 122, 59, -48, 97, 36, 48, -2, -35, 25, -27, -19, 12, 1, -62, -39, -54, -47, -82, 4, -120, 22, -71, 74, -131, -9, -45, 104, 7, 34, 141, -90, 33, -7, 46, 87, 75, 4, 64, 0, -14, 143, 194, -51, -15, 31, 55, 28, -70, -28, 28, 49, -17]
14448a7p5K0J74k10oJ53M8j02Q0j58J0J98n9j36P8o8qO9J2p1K2N8o8o1R6M1r5
14475g5O7J31j99J49N5j48J04j55J00nmj30J29p2k9R9j5J75j49J00k10K28n3k09
14499a16J44k8L2m3J50k29j7Q8P6j15k4k3J56jp6O8j76N4N4m5O7q1l5J68J9n7
14525A0J24q1j20K03j33QN1m8m3M3K9l3J09j54q1K5pK64j75j5p7J18j02J51n3
14550A3l7l5R6Qm5K4p8r7J08M3n2N8j8j8J20Rj58J00j01J08k5J3k6j08J18l2n8
14577g0O5R2P8k03R1j2qm8n7O3L7q6ON4l4o4R9L5p1L8j1n4o6K5N2J3J1l5J01P0
14607A11k19J01j7j6JN3j32J39K3j58J48o5N3n6P4N2j05j8J0N6o9P1lOr6O0o1
14634e7M1KQ7l0P3j08J53k37R0k7L1j11J17j90J10lQ3j34M6J51l8M0j54R0p1J88
$$ y = [-17, -92, -72, 102, -108, -114, 39, 87, -15, 65, -93, -83, 115, 56, -80, -2, -70, -78, -9, 3, -68, -46, 12, -56, -117, -21, 20, -75, -8, 123, -76, 73, 128, -20, 84, -71, 29, 24, 20, -110, 19, -53, -82, 17, 2, 177, 28, 128, -82, 146, 93, -116, 28, 0, 32, -11, 139, -90, -107, -19, 57, -58, -82, -105, 51, 50, -26, 42, -134, -80, -26, -71, -4, -85, -120, 48, 67, 10, 134, 53, -67, 136, 3, 11, 62, 14, -29, 14, 43, 10, 119, -35, -116, -91, -98, 166, -9, -24, -101, 17, -85, 66, 13, -24, -59, 37, 45, 0, 24, -54, -151, -43, 0, -52, 6, -12, -30, 90, 99, -59, 41, -60, 48, 23, 36, 10, -98, 20, -12, -70, -5, 87, 165, -38, 53, 41, 33, -15, -72, -9, 28, -58, -52, 2, -32, -96, 3, 38, -33, 5, -6, -60, -126, -101, -49, -36, -25, -60, 41, 111, -108, -7, -24, -40, -39, 14, -118, 21, 44, -114, 34, -31, 22, -34, 40, 92, -13, -31, -21, 35, -34, 37, 34, 40, -56, 4, -57, -16, -14, 73, 43, 116, 8, 161, -76, 14, -13, 18, -93, 24, -166, -56, -59, 24, -110, -64, 87, 49, 89, -65, 25, -46, 142]
14660A42m6j18Q8K7k05m4J69k13K62j69J87r0q5J66o9J3n1qK9j5R6p5N3o1qj10
14686a35J46n9L0j6L0N0k0j49O1K1R4q4Pm4N7l2k3J32q2l6r6J20l1P6N5j12k2
14713f2M3J00rp3J4m7J1MJ56j55J38r1k2k7J44j42n7R7j39K01J2r9K0p3K6L1Q2
14740H3jj42m6L0Q8r4L8m5P7k4J0l3oj1L3p3M2P0r8L9J10j68Q6RK4K48l06J23
14768F3o8pJ55n7pj07J1M2J1P1M0k15R9l3J12k4j20R7p8l4O0p6o4J54J27j69r7
14795a14R2o1K29j24j15J01M7k35J16l8J13m7J6n1J26o4M5j03N1J41n8o4l3J14
14819H4j1m0l1Pj78J77j01Q3P9n6K7PM7j30L0Rj01K09j16Oj1o8J82j67o0L5N5
14846c3k1O7q8M7j4R1qJ1m4O4OMj33R8l5n8K4j5J32N8j66J29p5mO3j46R8n7J16
$$ y = [142, 96, -22, 66, 93, -112, -156, 13, -200, 62, -107, 80, -10, -95, 71, 2, 15, -36, -44, -15, -30, 66, -9, 44, -17, -25, -135, 11, -48, -18, -34, -4, 46, 26, -123, -62, -41, 53, -31, -24, -68, -11, -43, -66, 66, -16, -52, -148, -28, -59, 17, 72, -40, -62, -19, 81, 72, -1, 13, -34, -23, -19, 137, -18, 120, 29, 7, -20, 124, -18, -75, 22, -117, 84, 96, -3, 17, -56, -30, 1, 83, 82, -60, -106, -76, 12, -82, -44, -89, -12, -36, -26, -59, -65, -76, -43, -116, -74, -4, -102, -63, 47, -121, -35, -26, -2, 246, -60, 63, -5, -12, 143, 86, 79, -28, -17, 25, 36, 107, 147, -68, 31, -2, 110, 86, -34, 63, -15, -49, 11, -65, -129, 25, 152, -17, -114, -22, -83, 146, 22, -93, 8, 55, -180, -64, -102, 11, -36, -20, -71, 55, -9, 36, -67, -16, 125, 67, 3, -30, 84, 73, 33, 2, 9, -169, 8, -93, -10, 69, 13, 40, 47, 94, -36, -6, 3, -98, 111, -5, 1, -10, -78, 104, -63, -123, -88, -33, -54, 13, -75, -28, -42, 49, 41, 52, 8, 72, 78, 82, -51, 47, 12, -46, -22, -37, 95, 153, -13, 116, 41, 37, 100, -46, 52, -5, 111]
14875A11j68J6kM8l6j9J63j92K8m2Q5k0l5O7j33J11N8K0K2j15o6lJ30j07Q7j02
14901i4P8j4r7M5J54pJm8l2R1m8J2Oo7k8P5M7q3q2J36l6K1q6J25m3%K5N3j90J61
14931G5o9q1P2o7R9J1k3j92J45Q8p2R4j24L1l4J04j88K09Q0j79n2J29On4n0J37
14957I5l0j11K9L4L4K8j12R3n0Q3j36M7q2K4Q7j13J52k7l1l1P2j39J4J7K8n2K
14984g5M3p6M8O9o7J14k2m3j03J62o4J08Mj43p9R4R8L2p4r3l1oJ17r6P2K3K5M1
15012G8k0krQ0j81J28r9J4J13j11R0j53P5q0Q6K8j36M4j6K12j50J26k2j21k2p5
15038a23J64j12K1J20j60O0kJ36p7j9j09L6Ok8R5N5r0j8P2R1k7r5K1M0l1N7j06
15065b3J14r3O4j46J98j85LM9m8O2M5r2J4K1j3J8M7j03m8O5K3l9J1K0j6J9m0k2
$$ y = [111, -57, -41, -43, 5, -31, -50, 113, -79, -51, -93, -8, -28, -63, 4, -129, -18, 40, 60, 82, -33, -99, -102, 28, -79, 8, -94, -16, -30, -127, -82, 72, 65, 66, 18, -14, 77, 29, 41, 47, -20, -48, 27, 74, -9, -91, 45, 9, 30, -56, 69, 26, 26, 51, 104, -86, 75, 6, -75, -3, -70, 29, 40, 17, -175, -30, 58, -14, 80, -44, -13, -47, 57, -131, 78, 158, -21, -73, 56, 62, 8, -42, 95, 65, -46, -17, 17, 51, 79, -33, 60, 10, 93, -43, 4, -78, -54, 33, -80, 72, 45, 14, -17, 55, -84, -70, -53, -25, -77, -75, -32, -108, -60, 9, -58, 56, 34, -9, -112, 50, -14, 94, 98, -45, -124, -30, 68, 100, 26, -67, -98, -104, 13, -83, -11, 12, 37, 78, 58, 56, 47, 127, -54, 74, -25, -11, 102, -9, 81, -72, 3, -77, 9, 37, -99, -55, -71, 141, -9, 117, 95, -26, -48, -123, 41, -71, -50, 70, -90, -30, -32, 104, 27, 8, -101, -65, -59, -87, 8, 63, -27, -45, 27, 118, 91, -4, 17, 57, 26, 83, -23, 91, -2, 62, -84, 114, -71, -68, -19, -67, -5, 40, -52, -38, -17, -30, -12, 35, -68, -116, -51, -28, -67, -56, -36, -52, -33, -73, -95]
15093i5J25j92K08l9J32j90N1P6p4J13o6L6q8q3R4N6j12J29p5J5ol5M3r9O5j12
15119a23J59r4L6K0N6o4j2J33j09l4k8j2L1j9L2k1O7qm8J6m6Q9L0P0k24O6K3m
15147a8N6j69K17j41R3J6k1J25j82l2J11n9L0M4j66J37j81J39K1K0q9qJ73j76
15171f0m8J42o0l8J04O7j07j05P6qj05Q7j5J06O0q3j09M8J8q6O3J84j36P8q0l8
15197d5Pm0J06J0L4N4j46J04jr6oJ05jr3J13j49L8N7K0q5L6m0N6j2n4nl4l4K6
15226g5Q2M6j19K3J42j41Q1j34%J28MR7j81J13k2J19k07k2L7K4M2J58j45k6Q0
15251A04j63J17p5R6p2l5l6Q9m2L8l0l0J7K2jM4j40k6J57j51L1j3J17q2m9j7J09
15278b1KL8L5p1K0j26J94n0o7J9j3k5OO3J5k1j3L9J23p7k4o1k3Q2m0L6k6k5J14
$$ y = [-95, 30, -162, 46, 7, 139, -51, 0, 76, 2, 115, 49, 85, -3, -86, 8, 64, -48, 81, 6, 21, 15, -20, 23, -76, -11, -123, 36, -58, -22, -2, 54, -10, -22, 111, 2, -32, -60, -72, -41, -60, -28, -49, 18, 10, -38, -22, -68, 21, 51, 121, -103, -37, -14, -18, 38, -131, 86, -55, 38, 54, 33, 158, -24, -56, 55, -4, 26, 70, -96, 41, -140, -1, 20, 40, -49, -57, 116, -60, -108, 34, -26, -64, 40, 107, 0, -105, -29, -37, -142, -55, -70, 36, 96, 13, -96, -48, -30, -116, -53, 131, -5, 73, -7, -45, -38, -78, 28, 38, 72, 126, -20, 84, 83, -13, -19, 86, 85, -8, 105, -44, -6, 51, 71, -14, 22, -18, 38, 26, -28, -33, -67, -101, -75, 7, 53, -66, -43, 99, -42, 39, -95, -95, 33, 37, 134, -47, 66, 44, 163, -44, -66, -29, -5, 37, 195, 50, 24, 104, -59, 58, -17, 79, 7, -28, -64, 25, -17, 21, -9, -39, -22, 0, -1, 43, -97, -123, 34, -117, -86, -99, 18, -64, -113, -130, -21, -19, 19, 54, -17, 3, -123, 71, 21, -46, -27, -40, -65, -59, 4, 19, -2, -15, 24, 147, 70, 46, -15, -38, 44, 4, 40, 14, -11, 103]
15307A03j54J17j45J57k4J3M9j84j8J52j47R6J5p1J8Qp0J23l7n3k1Q7k8o4J30
15332E2j56J12o6P2j20Q2j0m3q0P4k5L15k56J70p0O4q1K9K5m3Q0j25m1J90j78
15357b9n5R2o4Q0j25O8J04n7N5j63J46R6k16M7l4J8k6J40j80R7j24O7l8Q8j20
15382a33J05K7P7j65jN1k6N7N8m5j23Q5j4j13K03L2o3j1J9M4q9r6J17R8r5m5J01
15409E5o6J1l5k0P5j11P7n8j7M4L2qJ4p0J38m3q5k1K0J10j24J9L3Q5o5J5L7r2
15437e0J02k1J6p4PO0p5N9qpM2m1P9j37J28j9r3Q8q4KM3l8J13j89oJ66p0o4J75
15466A04p1q4J99k31L0j31K27j40P9N6r4R8n1o3J29j14l6J43r1Ol5L1n6J54o5
15491fj25J63J72k57R0l5o3J46Lr7l5J7m1N1J7j0P6o7O5q2N2r3L0l1J00r9oj1
$$ y = [103, -51, 66, -79, 78, 54, 67, 116, -68, -86, 66, -81, 15, 30, -41, -23, -15, -85, 38, 1, -52, -73, 14, -14, -78, 52, -104, 8, -58, 14, -106, -24, -34, -77, -157, -83, -108, 207, -49, 121, 51, 115, 34, 63, 88, 45, 125, 0, -41, 149, -29, -84, 8, -56, 24, -101, -33, 71, 14, 69, -94, 52, 148, -68, -21, -55, -37, -63, 77, -103, -6, -130, -63, -101, -13, -133, -28, -1, 76, -89, -90, -39, -65, -8, 50, 5, -118, -33, -47, -160, 43, 75, 12, 1, 20, 64, -25, -121, -4, 94, -1, -46, 55, -11, 0, -35, -55, 20, -91, -14, -72, -89, -45, -13, -21, -7, -77, 61, 18, -67, -88, -68, 42, -82, -63, -30, 55, -10, 5, 42, -50, 52, 31, 47, -27, -20, 40, -35, 24, 16, 9, 51, 10, 89, -48, 80, 61, -32, 56, -28, -26, 17, -21, 92, -97, -103, 63, -7, -71, 104, 33, -51, 148, -83, -53, -184, 43, -97, -18, 38, -56, 42, -9, -72, 57, -57, -93, 50, -41, -35, -70, -39, -95, 59, -6, -131, 32, 204, -53, 37, 2, -61, 85, 88, -9, -44, -27, -68, -17, 0, -10, 66, -1, 64, -18, 34, -59, -29, -60, 40, -59, -65, -76]
15519g6O4J6Q7j79J0Q0OJ1l8n6Q1p3p5J00P8qj53J89j21N5J2j8n8J13j32K09o3
15546F1%jl2K4O4k70J55J0m8J31j93Q3O6L5j25N2p3L7l0O3j33J04l5N3P1J5o2
15573B2k9K0o6M8P2j06J25j08J4L2L2r6j13J93j45J53j64J19m7J28m9J6J6n5r0
15598g8P9L5J74j87o7j12J59M8PL7j84J13o7m1P0r5J28J5r1mk5O9M1P3l2N8j42
15625a9N1j3K2r4N2M2j08P4L6o6Q7j06l3J49j13N3LmPM2o7pJ9N7k1Qn6K6J8K2
15655F1j70J63J9p2l1K5j24J07l9Q8r5m9L2j1N0m5J24j20M7Q5J30k35Q9n0Q0j09
15681e0P4m3O0o7Q4p4O2k5L7j13J58j3o8N1n8n5n0N6L7P8J3p1j08L5j25J47K0
15708hl6k7O7o7m6J79k20N6l6J15N7m5M7k2p7M6O2r5J74j15J01p3k9j2l6o7J63
$$ y = [-76, -12, 4, 91, -88, -78, 2, 8, 19, -19, -75, 6, -67, -142, -42, 36, 28, -125, 64, -57, -2, 10, -8, -66, 47, -85, 124, 61, 61, 60, 28, 52, 116, -154, 1, 11, -37, 94, -99, -16, 50, 85, -40, 12, -61, -24, -54, 9, -124, -20, -55, -2, 69, 84, 22, -7, 13, -53, -5, 67, -39, 86, -22, -8, 24, 56, -40, -153, 40, -105, 48, -116, 3, -44, 84, 35, 51, 67, 12, -78, 1, 36, 210, 23, -44, -156, 3, 51, 58, 95, -89, 24, -43, -84, -14, -109, 19, 34, -57, -61, -86, -17, 24, 97, 65, 123, -19, 32, 19, 41, -53, -1, 41, -67, 7, 43, -23, 64, -42, -75, 74, -39, 14, 17, 13, 20, 62, -5, -12, 7, 64, 43, 51, -5, 21, 39, 61, -109, 54, 73, 1, -30, -5, -129, -22, -61, 27, -68, -117, -85, -96, -46, -91, 33, -87, -40, 45, 175, -60, 29, -21, 59, -50, 24, -19, 41, -26, 58, -16, 46, 21, 58, -55, 103, 90, 22, 73, 15, -40, -90, -34, 3, 81, 94, 23, -85, -50, -175, -28, -8, -44, -71, -4, -71, -117, 62, -158, -102, -138, -23, 34, -11, 36, 14, -63, -17, 45, -50, 124, 9, 110, 37, 8, -4, -40, -107, 56]
15735E6Mj56O0Q3Jko1R5k0M4q3m4m6o6O5J38o5j0j11O6m4L3N4L6kl7J0n4J6O2
15765B2r1M7J62p3j67J60J4j65J03n5J29p3K3L8m3j08o6K00j48K10Jl8j30L8J0
15790@q4Q0MM8L9J2k06J64o2o3j8JJ42j57j1J46K6o1pKJ03j70R2jj03Q3j00O0
15818d1J85r9m8j7Q6N5j22j6L0NQjj9k2J08p2l9k8Q5j5L0m2O7p6L2j02P4k4q9
15847a07O6K5K0M4k9n3OO3j12P3l9m6N9M8n3N5M2J3j93J09R3r5o7K5k1Q4jr1J46
15876F4n5nR3j13O7K1j75MJ73p2j5J07j64M0J9n2J7O4L0r2j6k5j2R4m4L1O6j44
15904i4J38j03J58p4n0J16k3k28P9J38p0p7J23J00n1j7m6k8N3J2k4K4R8j84P0
15929D0KQ4m2j8m5q8%J10J10j48j28J83J7q4n1QR4o5N1Nj58O1r9J39n4N0l3J4
$$ y = [56, 60, -96, -36, 47, 48, 46, -15, 80, 60, 104, 21, -23, -69, -135, -70, 68, 3, -7, -118, -52, -96, -63, -9, 27, 25, -12, -2, -56, -40, 22, -69, -22, 140, 67, -100, 60, 74, -91, 12, -43, 86, 13, 36, 74, 31, -77, -143, 57, -91, 119, 120, 82, -48, -10, 0, -84, -4, 0, 48, 87, 99, -107, 57, -5, -68, -86, -85, 57, -100, -111, 35, 61, 0, -7, -5, 98, -72, 20, 19, -84, -1, -101, -41, 144, 45, -3, -20, 66, 121, -1, -17, 13, 18, 26, 25, 6, -16, 92, 20, -19, -47, 38, 23, 53, 11, 78, 2, 34, -68, 6, -18, -107, -41, -16, 4, 48, 19, -34, -28, 35, -77, -4, -43, -89, -30, 18, -35, 20, 62, 75, -118, -9, 84, -11, -78, -53, -74, 10, 9, -82, 64, 9, 4, 97, -16, 51, 72, -103, -99, 74, 2, -13, 94, -70, -30, -11, -63, -46, 18, 48, -44, -60, -85, -97, -3, -47, -16, 50, -94, 44, -59, 99, 25, -25, 91, 68, -160, -81, 57, -13, -90, 33, 133, 82, 65, 19, -9, 44, 56, 32, 56, 154, -30, 40, 42, 126, 84, 66, 21, -67, -67, 43, 153, 5, -123, 60, 77, -7, -58, -50, 44, -21, 30, 35, -123, -62, -161, -22, -76, -26, -59, -45]
15957d5K4l9J45k29J78qN7q5j08J75J6j07K4P2p9P8j73J24j25m1J73PM5n3n5O9
15983D0q1J5K3P0j20J01l2j06L5j7J10OL5r8j79K03Qp3J00j24P2j02O5P2j05P
16009g5J03MQ7r1o3qJ19m4nJ33j01o6rK3j55J69L5j8O0o2r5J39j40r5J45j9J62
16036A33j24k0k8j5r8K36j01j5M7j28O7MJ13q7M4q5m9m7J17lO7p1j23Q5N1m0k0
16063i0N9k1J02oj24J17MM9j22K0P4L8p4Jq9r0R4q6J46n7J74j07K7l8J1o1LM7
16091Aj01J50q4M7j05J40j13J15j6Jm5J09j84J48j09O1R2r0r4J82j37l4K0M9r5
16116i2R4L8NJ29j29L2r8O9Oo6M5j10J35j74j4J78k9j30Q9Rj53P1N3N8r1Q7O8
16143H0j12k4O9q7K1nP1j38J14l1Q8o2o3n0K53j44Q2m8K8M7O2p1M3j70p8J0K61
$$ y = [-45, -21, -60, 85, -144, 34, 26, 83, -2, -110, 65, 81, -26, -2, 70, -9, 69, -104, 20, -105, -146, 27, 34, 79, 26, -29, 40, -41, -26, -3, 67, -53, 48, 16, -90, -55, -72, 38, 44, 79, -19, -198, 5, 13, -60, 40, -84, -12, -114, -49, 23, -82, -75, 28, 32, 119, 28, -35, -43, 76, 32, 27, 160, 59, -7, -16, 7, -148, 21, 56, 38, 98, 36, -59, 80, -60, -155, -10, -29, 133, 9, -11, -39, -54, -152, 84, -17, -32, 15, -113, -46, -42, 71, -16, 28, -57, -106, -153, -36, -39, 28, -43, -166, -81, -30, -70, -90, -31, -52, 50, 44, -80, 37, 41, 90, -32, -12, 62, 100, 26, 27, -62, -152, -58, -144, 2, -55, 119, 12, 39, 1, 12, -49, -46, 1, -100, 50, -34, 13, -92, 48, -65, 50, 34, 35, -10, 99, -85, 63, -46, 15, 107, 17, -77, 105, -32, -66, -46, 3, -92, 2, 40, 45, 174, 45, 77, -21, 48, 54, -12, 33, -77, 58, -116, -130, 48, 19, -111, -22, -13, -166, -95, -42, 16, -75, 12, 80, -32, -56, 13, -74, -53, -58, 13, -125, -11, -42, 46, -16, -79, -129, 124, -20, 62, 14, 42, 89, 151, 80, 123, -47, -125, -115, 146]
16170A46j87J37n3r5J21j09o6J39M4m6o4M5N0rj37M0R4j48P9M0j57Q2J36j41K2
16195c7J2J8j2m9N2n7M1L7j29J84j22K2OP6k09J34M3mN5p7J39j68J7R2K1l2j3
16222D0K9m8L1j27J64q7k1lP7j11R4j64J00p4L5P2n0p4J66r1J20j80P8j32P4O5
16248a7n7J05k5Or4k4Q0n1J47m5P3n1j35J54o3p3nQ5NOm0M4o0O1J4o7M6r2K3J07
16278E7N1j85N9J56r2q1j1Q7J8o5j8mk0n7k8J92m3k8mn3J19j3n2Kl1L1P7j4o4
16307a4NJ52m1O9K4r7k4p1K5K8o3k3Q2j7k1O0M0k24K4J6R5r1P9O9j35pq7J08o9
16336a08J44p6n9P1m0J48k4j67K9P7n1J03m6q0P0n3j11J98q5J34K4p7j5k0M5l9
16362hP6p7l4N3pqnJ0L8pp1j6L9l0R0q5o7M3n0M2q
$$ y = [146, -41, 96, 43, -52, 69, -40, -106, 33, 77, 31, -33, 12, 62, 53, -84, -44, 50, -98, -19, 21, -136, -54, 82, -59, -37, -25, -7, -19, -68, -16, -73, -32, 5, -124, 60, -62, -40, -34, 42, -167, -33, 10, 6, 61, -16, 123, -45, -28, 64, 85, 53, 40, 69, 21, 52, -75, 89, 2, -19, -22, 55, -56, 38, -126, -26, -100, -65, 7, -43, -117, 49, -42, 78, -102, -24, -156, -82, -17, -74, 31, 6, 12, -82, -106, -26, -77, 70, 25, 98, 47, -88, 66, 3, -70, -75, 10, 15, 21, -19, 25, -35, 26, 40, -27, 19, -73, -50, 57, 108, -77, -18, 138, 46, -35, -46, 41, 59, -6, -24, -28, -48, -105, -133, 59, 16, -12, -16, -69, 50, 37, -15, -13, -44, -13, 64, 50, -14, -9, 143, 102, 171, 195, 98, 74, 3, 28, 56, -7, -30, 52, 35, 14, 74, 114, -110, -86, -70, 25, -66, 13, 82, -53, -60, -147, -39, -108, 36, -40, -99, -28, -68, 80, 56, -111, -82, -5, -56, 47, 1, -79, -9, -62, -173, 25, -60, 74, 98, 21, 6, -14, 31, -8, 68, -9, -43, 10, 3, -5, -10, 0, 38, 31, -40, -56, -17, -47, 43, -42, -109, -66, -116, -74, -82]
16383h2
$$ Imaginary data points
##PAGE= N=2
##DATA TABLE= (X++(I..I)), XYDATA
0@%%%%%%%%%%%%%L2o4O4o4O4r6J28j28J60j92K24k88L20l52M16m80N46o42P37
32C85q33R60j088J217j360J521j700J898k121K369k627K912l228L560l922M331
48B274m777N261n799O389p039P763q572R488j0525J1703j3067J4672j6583J8907
62A0095k1812K5553l0579L7736m8827O8468j13631M07166P3022q70104j32930
73e95843M36694N52901j3577l16415k73322L0498Q0883O4885P6078J68751J0834
84B22367k44811l18420K1453L89007L69566j14860m69183k86187K14721L89264
94A72917J33653j84881k19800o9153O4120P9271P4471P7717J2220j48892j89431
105a97788J1328K37913J82231q8697k36056q7201J33026J33504m3003r0135M8047
$$ y = [0, 0, 0, 0, 0, 0, 0, 0, 0, 0, 0, 0, 0, 0, 32, -32, 32, -32, 32, -64, 64, -64, 96, -96, 128, -160, 160, -192, 224, -256, 290, -352, 385, -448, 512, -576, 641, -719, 802, -898, 1000, -1121, 1248, -1379, 1533, -1695, 1865, -2057, 2274, -2503, 2758, -3041, 3348, -3691, 4072, -4500, 4988, -5537, 6166, -6901, 7771, -8812, 10095, -11717, 13836, -16743, 20993, -27834, 40634, -72997, 334169, 407191, -462913, -595843, -159149, 393752, 380175, 63760, -209562, -179064, -98181, -33296, 42782, 211533, 222367, -22444, -340864, -319411, 69596, 439162, 324302, -144881, -431068, -216347, 172917, 306570, 121689, -98111, -167264, -103144, -23873, 50598, 128315, 140535, -8357, -197788, -186460, 51453, 233684, 144987, -91069, -178270, -45244, 88260, 45257, -44878, 3169]
116C169R4990o7259j73714k0995K01815J86317p1063k61071j34087J63385K45322
127A66809J3014k00279j18886R5864J23000n0055j31707L1831J95063N9808k22714
138c8252k22779J05134L18871J27057k18566k87634j3531K49315J84909q2278
148A22246j86062m2068Q5770L8232l9808J507Q1119L9485j02786j42197J9348
159a25214J87344J24748r5504j88859n7243J16834J35111L650j02089o1436L3677
170b8981L3052k4344j882O5426L4373p5904r7688J9412J24711O7759q3746j17434
182h5246J5279J12816L4130q6842o8251N0233R4335L054j03011p1980O7383J20761
194H2661O969j06387o3556N1788P3033o907n7906p360O1514K3444q2770q1804
$$ y = [3169, 98159, 30900, -142814, -163809, 38006, 224323, 153260, -107811, -241898, -78513, 166809, 179823, -20456, -139342, -43478, 79522, 29467, -102240, -70409, 124654, 184462, -38252, -261031, -155897, 162974, 290031, 71465, -216169, -229700, 19615, 204524, 122246, -63816, -105884, -20114, 18118, -21690, -20183, 60936, 100421, -2365, -144562, -125214, 62130, 186878, 91374, -97485, -154728, -37894, 97217, 100867, -1222, -62658, -28981, 4071, -20273, -22155, 43271, 77644, 1740, -95948, -76536, 48175, 115934, 32188, -85246, -69967, 42849, 76979, -9863, -78114, -27881, 66454, 69508, -33503, -105483, -38100, 82661, 89630, -16757, -80313, -28525, 44508, 37601, -20305, -27665, 33849, 57293, -25477, -107281]
206a07281N8298J41955L6624j28310j41134K0698J61465J05207p2778j39079l2142
217i6477P3342N7138M17p933O3k5838n6332k4576O5417J06054J5645j14097j14469
230a21646K0601J28961R3202l7278j17288o3420M8620P8908J9960k1948j5680
241A2992k1042l9730j3165N2933P8523J3230q6355r7071J5407J16094P3415n0454
253E4777r6423l0227M9938N6562J896l3841j1908J1133j1499k5753J5614N1985
265C2254J8468m3054n5718k776N8654N3476k0633o6808k2347M2540L9044j2818
277B0282l5625o629K8121J5026k8726k7448K6948M3811r283m6818j3778L3169
289i50L1126q009l2949j2566K4480K0716j8355k6032R713K8174L911k5195k2466
$$ y = [-107281, -48983, 92972, 129596, 1286, -139848, -119150, 42315, 147522, 74744, -64335, -96477, -23135, 34003, 34420, 26487, 26550, 712, -55620, -80196, -14779, 91275, 106920, -7177, -121646, -101045, 27916, 121118, 83840, -33448, -96868, -48248, 30660, 50620, 28672, 12992, -8050, -47780, -60945, -8012, 70511, 83741, -2614, -99685, -84278, 31816, 105231, 54777, -41646, -71873, -21935, 34627, 36523, 2682, -9226, 1907, -9592, -35345, -19731, 32254, 50722, 7668, -48050, -50826, 7828, 61304, 40671, -26137, -48484, -5944, 33100, 20282, -15343, -21972, 6149, 21175, -7551, -34999, -8051, 35760, 26477, -20341, -34119, -950, 30176, 22167, -10782, -23348, 1132, 21848, 3493, -22539, -12826, 15348, 19259, -5936, -28402]
302b8402J1043L6985J4597l2401l2913J4120L5669O953k3042j8845N806J8571
314H141J412k0036m673K4339J1068k7090k3284J8710L5805O210l1201l0461J1151
327a9909L9653J2561k8762k4146P187J6021L982m028m643K0L495n819r844R928
341d304K4070J872k6318j9994J0266K9421J5742k0605l4246j328K9555J4807j4118
354D820j3818K121N719M12l165K520J2397M614j8732j7844J3031K6127K227k0598
368a69j7388J212J8086J4150q381j8366j195J1943N251k511j614K38J724k78o916
383d214k027J2984Q095j5123j6837O046J7792N932j0507j3994r69J4960J0005
396A2143q073q235L838L116l614p9L892J395j118n138q404J495J3609O051r316
$$ y = [-28402, -17359, 19626, 34223, 1822, -31091, -16971, 18698, 25651, 2609, -16236, -10430, 8141, 9553, -10483, -15156, 9183, 20251, -6839, -30123, -11413, 24392, 30602, -599, -31060, -19909, 19744, 32305, 3543, -20603, -13416, 2605, 6587, 2559, -2084, -2064, 1431, -4388, -14232, -4304, 19766, 21638, -4680, -24674, -14408, 15013, 30755, 10150, -24096, -25424, 4131, 18938, 4820, -8998, -6877, -1158, -746, -3911, -1391, 11006, 15620, -3112, -20956, -7925, 18202, 20429, -169, -17557, -16345, 1741, 15891, 7510, -10856, -12051, -108, 5143, 2632, 1018, 1256, 2980, 2702, -4214, -6241, 6743, 14838, -285, -17122, -11076, 6716, 12648, 2141, -11853, -12822, 2138, 12143, 4070, -4165, -327, 2789, -825, -904, 2988, 4383, 3265, -1873, -10277, -8782, 4827, 10878, 1562]
411A562j0182r38O714J0569L322r423p094M876L576m959K23P460J683p864j0094
426a0569k650J0964J5268j593j6406p269O600P040M883M551l322j0573o153J539
440g690P073J0459K828j2030j3750j737P582J2457J1101l854j9246j1576P857
453a0526J5631J1365J345j2984j9604n877J3157J9770J0356j0948k6652j3446
465b8413J5601K4394Q064p200j3809j3270j540J2850J5815Q053m868k0936k1228
478b6487L785K7412K1658l041k4872k7331k394K9549L0340m82k5071k2686l508
491b3128J6791K1380N602r606j2383j2403p776R912K4174J3010j1199k4830j9069
504b9525N127L0934K7708n513l1668k6492J460K8410K9528j331k8784k2435J048
$$ y = [1562, -8620, -9558, -2844, 7725, 11047, 1624, -5470, -594, 2982, -1977, -1754, 5706, 7389, -475, -10569, -13219, -2255, 13013, 11420, -4986, -12255, -5655, 1385, 6268, 10819, 7497, -3076, -9229, -7690, -617, 9842, 12670, 640, -13110, -14847, -7265, 5192, 16293, 12439, -6807, -18383, -10526, 5105, 16470, 17815, 4831, -14773, -20650, -7493, 12277, 22633, 11685, -14967, -28413, -12812, 11582, 19646, 12446, -1363, -14633, -16173, -3323, 12492, 20545, 15677, -5259, -26487, -22702, 4710, 26368, 23327, -1545, -28876, -31270, -1721, 28619, 28137, 3066, -19620, -23128, -6337, 15043, 20645, 11039, -1344, -13747, -21523, -11611, 12563, 25573, 14374, -10456, -29525, -24398, 6536, 34244, 28731, -2937, -29429, -27969, 441, 29969, 28638, -146, -22581, -21533]
517b1533J3808J5315Q875m242j2850j0995n413M285J9317K0333k652k6168k6036
530b7956k110K8370L6024K563l8762l6358M417L4999K7095l316k5766j8339M385
543a4754J2209M834N300R370j511j8878k0174k236K4139L4013N125l8748m2688
556d3999K439M4206L9607l982m2343l4180R474L5133J9361n787j4073j3023p772
569a4939L18Q008J4086J5165k042k8105k8474N083L6500L3547j214l9560m1250
582d2877L216M5961L7630p826l9783l1604M467L1888K2807n672j6923r351l932
595a1999j469O043J3888J3921K850k0299l2769o490L6778M2328j390m5683m2497
608d6788N852M8614L5707j5542m0341j7330J3569K0813Q996l834m582J012m883
$$ y = [-21533, -7725, 7590, 16465, 12223, -627, -11622, -17035, -12750, 6567, 26900, 24248, -1920, -27956, -30066, -1696, 34328, 36891, -1871, -38229, -33812, 1187, 28282, 24966, -800, -19139, -14754, -2545, 2289, 7589, 16959, 15448, -3430, -23604, -25840, -1701, 32312, 37437, -1311, -43999, -41560, 2646, 42253, 38271, -4072, -38252, -28778, 6355, 25716, 19929, 5856, -7167, -14939, -14621, -6613, 7473, 22638, 20596, -7509, -35983, -30900, 5600, 39147, 37933, -1627, -42877, -39661, 6300, 43930, 36104, -3679, -35283, -30816, 1072, 23879, 18207, 1284, -8067, -11999, -13468, -7425, 6463, 20384, 23234, 2935, -29834, -36324, 454, 42782, 41392, -4291, -46788, -40936, 7678, 43385, 27843, -12498, -29828, -16259, 4554, 13550, 9716, 5134, 6146, 1263]
621A263j8036p324K3885L2888O32l7109l8608K236M5402M0958j0562m6962k9290
634d0627J3275L5089K3160n961k5106j7174J299Q692R700J1314M027j1258j9683
647a3253j2432N808K6911K6966n650l7195k9800R023L9125L2141p919m2045l1234
660c9554J1547L6280K1875q141k6394j9208M382J8726J0601k00p00l766j2807
673g359j1273N255K2379K0670o658l5806k5859J7391L9841J6039k1480l2360j0576
686b9796J9135K6314M478j5586j2223O24M389K842J338K010M748l66j3233j3076
700a8402P161K0909Q878j1569j7831o848J0332J7439N444j0122j0595k103L079
713d228N900M379j627m135j351j909l749J502P195N272p34o298r704k319J2800
$$ y = [1263, -16773, -24097, -212, 32676, 33308, -3801, -42409, -40173, 5229, 46187, 35625, -11337, -40627, -27352, 7737, 30897, 24936, -170, -17344, -16045, -7353, 2347, 13661, 17688, 6430, -13253, -25685, -19877, 7034, 34000, 28350, -8845, -38645, -29622, 9503, 41644, 33725, -8320, -39554, -28007, 8273, 30148, 22007, -4387, -23595, -19213, -487, 10114, 9914, 9214, 5448, -7359, -18632, -13377, 9002, 29672, 23014, -12792, -38651, -21260, 18581, 34620, 13140, -19220, -29796, -10661, 15653, 20131, 4545, -7678, -7054, -2665, 177, 1515, 3525, 8273, 7907, -5326, -18402, -11241, 9668, 18546, 6977, -10854, -17702, -7370, 10069, 15513, 5391, -5204, -7307, -4228, 1672, 6051, 4424, 289, -1062, -2971, -6720, -5218, 1977, 7249, 6515, 217, -9487, -11806, 994]
728I94J4033j808j4357j1098J001J1990J1357k349j2539p168K720N605M545J692
742D618k075k131j250m421j340R644J0655m445j4744p443N797J2196O910o313
756E658j2745m107O594P621L476j791n712l643K748L208o8J759K082l941n994
771d855j4L793L272J452k640n296o92M108K317M76J233j115l569n94K309J218
787A403J140J40l229k992J323J082l74K896K256l830m659J474M191K861J560k487
803B755n607j717L459L870J752j271o146m379L591N581J078p90j301m305k014
818e444M887O176M54l683n153l151L677O762P59m732l602j879K72N137M807k207
834C080m933k005R74L365N038qn618l465J035J823K735K486l479o009l73M466
$$ y = [994, 15027, 13219, -1138, -12236, -11235, 755, 12112, 9763, -2776, -9944, -7224, -1619, 2926, 4618, 2543, 412, -838, -5259, -6599, 3045, 13700, 9255, -5489, -12932, -7135, 5061, 11971, 5658, -7087, -11194, -4600, 3021, 6497, 4706, -1006, -4649, -1901, 1307, 1239, 2998, 5080, 1139, -4855, -4869, -1076, 2196, 3648, 1008, -4288, -4980, -872, 1445, 1921, 3154, 2039, -1530, -2124, 185, 1403, 2543, 2683, -546, -3538, -2215, -1133, -1507, 1389, 3645, -185, -4844, -3370, 821, 3682, 5242, 2755, -2852, -4569, -1110, 2760, 4512, 3241, -2905, -7284, -3693, 1888, 2966, 2176, 875, -3430, -5444, -557, 5619, 6073, 2390, -2763, -5914, -2237, 4525, 5284, 552, -3050, -4929, -4657, 480, 5287, 3080, -1853, -3858, -2884, 481, 5519, 5511, -107, -3572, -2537, -714, 2021, 4507, 1028, -4981, -5354, -888]
850h88K933R54j230l998j449L552L252m2n76k366l507J183M312L51k901r36p85
867b141j044K297L447q99k442l93J88R75L072K06l463j599J296K03O15J220j800
884b62k896P52K557J37M04J52j898k90K886Q24j921K87M94j948p37K294K75j975
902h65n30j38q6J831Q33j614j93J725n90p27K404N09l312o86K404k70j647L85
920e67K10q42L64J90n92J441J783j783j414J813J013p83O4K15j803j16J287q93
938d13j144J672M63k251r2J676L06O42J212j356k188J230K113k97m86r15k023
955a851m0K053l3n65J463q83l652M68N151J915k502k066j320N60K972J641k277
972A034j853k61j158J2K779J196j342r50j469j429L142N387o20n359k250J604
$$ y = [-888, 2045, 2999, 1769, -2229, -3678, -126, 3126, 3084, 2508, 142, -3365, -2182, 2130, 2481, -420, -1356, -2141, -3185, -888, 2559, 1660, -782, -1175, -987, -12, 3060, 3266, -197, -1796, -500, -297, 318, 1538, -262, -3158, -2406, 151, 288, 692, 844, -1054, -1344, 1542, 2366, 445, 732, 1226, -722, -1459, 835, 1110, -865, -1395, -1533, -1619, 212, 1045, -569, -762, 963, 373, -354, 2050, 2559, -753, -1439, 965, 695, -952, -567, -357, -1199, -835, -645, -1237, 204, 1987, 204, -1210, 603, 1616, 833, 897, 1112, -691, -807, 480, -413, -1557, 115, 578, -1673, -1765, -89, 217, 859, 2071, 715, -1473, -243, 1870, 1573, 1087, 172, -1851, -1891, 162, 129, -436, 1027, 144, -3508, -3040, 2111, 4026, 1524, -542, -1862, -1302, 1670, 3311, 1034, -819, -1080, -2238, -2226, 553, 1749, 407, -543, -2012, -3441, -299, 5088, 4468, -891, -3141, -1537]
988a537K351K188j69l507j994Q21K22K44L303J311l575l231O77L117L543J146
1004D910m267m095J715L259l44p69M76j031j881m55j74J921M459P70o081m575
1020f162L388O675K668l300o537k045N492L938l444l377K381J866k673k664Q12
1035b982M110M589j480p746l403O162O562L20m504n513j633M301M731q07l265
1050e58r87o25p61K144K814L87n57j278l034l76M111K579j170j704k274l557J39
1067d707N940M548j847o806n686K884J0610N331p796q959J485P171L050k871m864
1082b517k32N104J181p303m462P278R290j331j0817p499N430J4368N218j1937
1096A771j2640L254J1936M624n936q051o86O735L650n958n397N213P764j247q066
$$ y = [-1537, 814, 3002, 2833, -674, -2668, -1847, -1625, -1381, 1922, 3233, -342, -3573, -2896, 221, 3764, 4910, 643, -3452, -1737, 1522, 1178, 409, 885, -146, -2027, -2482, -2656, -735, 3724, 4494, -1587, -6162, -2774, 3901, 6569, 3269, -3268, -5313, 179, 4117, 673, -2704, -323, 1543, -1130, -3794, -2982, 1128, 5717, 4237, -3509, -6912, -750, 5812, 6132, 1628, -3885, -5518, -1217, 3514, 2707, -558, -1545, -2170, -2931, -787, 2027, 2414, 1857, 579, -2455, -2831, 1280, 3859, 2689, 985, -1289, -4846, -4707, 1233, 5781, 3934, -2872, -8558, -5674, 4936, 10267, 2471, -6488, -5003, 2168, 5218, 2347, -2517, -2749, 2355, 3536, -3767, -8229, -951, 8339, 7008, -3809, -11308, -5878, 8490, 13708, 1771, -10869, -7615, 4321, 8945, 3009, -5042, -5728, 1007, 4657, -1301, -6698, -1485, 6279, 5032, -3034]
1111c034m607M232R719L789p874r907O59P824M996o34n402n844M87O016K854j517
1127A757j624j189q60J686K461j168j960K539K016k759n259j678N522Q491p72
1142G203j2545q038Q772J3945J825j0949j0054K016J2367O752q355j0991K539
1155e513J0593J660q920o855M980J1700J916j3143j0673Q524J6400K276j3082
1168a37j1404L214J3927O870r535j1835K364J0335J489o542m075L107N821P30
1182D329o287m594M872P674J44n729m635J17M428M735j050n455k620R53J646K990
1198A518K393l089n089O11N253K260k022l454m51L988K644n267n614L882Q619
1213F182J41r255p067M168J1723N115j0010j1866L648J3220M040q320q129J552
$$ y = [-3034, -7641, -3409, 6310, 10099, 2225, -7682, -7023, 801, 5797, 5163, -239, -6083, -5596, 420, 3274, 1757, 133, -1056, -1916, -230, 2231, 1063, -897, 1642, 3658, 899, -4360, -6038, -516, 7975, 7203, -5342, -13380, -4608, 9337, 11162, 213, -9841, -7825, 4542, 11294, 2939, -8052, -5513, 5080, 6740, -2180, -9035, -4055, 7645, 9561, -3582, -14255, -5731, 10669, 12945, -137, -11541, -8327, 5600, 12470, 2935, -8900, -6536, 3799, 5288, -1254, -5329, -2222, 3599, 4329, -1958, -6552, -1680, 5994, 6138, 409, -4226, -4109, 319, 5054, 4004, -1451, -4071, -3118, -1472, 1518, 3911, 822, -4267, -3656, 1597, 3857, 1835, -1619, -2070, 1918, 4562, -705, -6319, -2437, 6182, 6323, -2932, -9999, -5831, 5892, 11007, 997, -10869, -7221, 5999, 10039, 1719, -6410, -4858]
1227d858Q460L389p286q011M753J0282l91j0694n442O961J0745J005j0902q034
1241a0023O660J0956k38q586l617L208M061Q2l813k312L543L426l532m697K366
1256b516N324J319l418l568N65M166J840l522k273K834P80l565j267L306K757
1271B762r60l717l099L161O702M05p242k968N442M744k761n346r23N323L535m934
1287A24o895K608Q531J220o941m255K701O176K777m794o310K025P523M17o716
1302a809l306M354M966j423o702k621O629O554m055p864N82O912L119l228m899
1317b791m69N013L193m980n206L151O067j017o093k127M255N376o14o175k454
1332d871N413M743l047m673K98L207J787k090m075M8N448J650n628l796M474N261
$$ y = [-4858, 3602, 6991, -295, -8306, -3553, 6729, 6338, -4356, -9798, -2837, 7908, 8913, -1989, -10023, -3363, 7593, 7355, -1231, -4848, -1640, 2421, 2503, -1310, -3622, -79, 3347, -185, -4882, -2516, 2808, 4127, 709, -2859, -2294, 1872, 3712, 190, -2083, 751, 1531, -2034, -3301, 5, 2762, 1802, -1915, -5014, -1853, 4849, 5254, -1988, -4956, 486, 5230, 2469, -2877, -3800, 1523, 5058, 124, -6771, -4163, 4368, 5588, -1353, -5608, -2907, 3269, 6046, 1252, -5058, -3033, 4490, 4907, -1809, -5115, -761, 4205, 2782, -3920, -6541, 88, 6642, 2587, -5277, -4695, 2217, 5336, 2108, -2791, -3260, 1753, 4946, -34, -5240, -2089, 3978, 2961, -3132, -5259, -1004, 4372, 3758, -2417, -4871, 542, 5285, 2238, -2435, -2137, 1070, 2857, 767, -3308, -3260, 2188, 3838, -1790, -5586, -1112, 4149]
1348D149r45m782k001L291M546j372n497m09M983J420m237k731J667L570J217
1363B869l354m227K159O458L95n854k496M199L928j124m528k364L985M477k901
1378A622o393N74O079K315l855m257O20N447L128m414n303K845O032r53n276j645
1394c434K956L205o82m314k376M135M467k451m681M95L774K128j401l546p05M261
1410A831K170m458l694L253L868j540l703j134K329L846j68m612j586M720L052
1425D174l083l144R06K901R78k710l395J223M662J95n080j525L690K716j098k212
1441h02j427J897L600o23m538p01L984J661l109k719L79L339J666k929l778K399
1457a701M546n13l790l95K544J608l29k510k041K207L398j626m384J47L413J403
$$ y = [4149, 3204, -1578, -3579, -288, 4258, 2886, -2611, -3020, 1963, 3383, -854, -3585, -1918, 1652, 2869, -485, -4712, -2553, 3905, 4300, -1554, -4050, 149, 4077, 2953, -1575, -3939, 46, 4523, 1622, -4771, -4197, 1882, 4197, 342, -3915, -3295, 2152, 5280, 866, -4437, -1592, 4440, 3487, -1789, -3434, -478, 2727, 2045, -2269, -4645, -510, 3957, 1506, -3175, -2680, 1094, 3222, 1821, -1725, -2430, 1831, 4001, -457, -4151, -898, 2970, 1430, -2273, -3407, -1078, 2768, 2600, -2012, -3598, 1122, 4174, 1091, -2053, -1147, 1754, 2732, 22, -3373, -2150, 2512, 2707, -2373, -3898, -208, 2508, 1410, -802, -2229, -332, 3268, 2645, -1893, -2594, 1390, 3051, -58, -2777, -2398, 941, 2607, -322, -4100, -1701, 2845, 2332, -1458, -1853, 691, 2299, 1970, -540, -2581, -374, 3024, 1398, -2986, -2839, 574, 1977]
1473A977j625k443n9L073K190k787k616K207K827j075k507n74P98K128M25l091
1489a152k372K618K933j413k288O52J646N56p80q83K71K109j97k861o65K200P39
1506A113j199p35p07K01J745Q62k083m78K232P51j839p89J238J216J95j843k318
1523b438J046L250l77l124m85J660J086J73n66j155Q28K024p49k583P44K205p5
1540A464j693q56k85O91J585l85j751p8J343R2N5O11n12j81N56l13r91J016J230
1559A598j558j635P30Q01j63K84m0p59M21P98p16P1J775O2j693o77N86M56N76
1578I17J52k192r96J531J158o50m9K6o00M55J395o98o33R78L79j291n99M08K84
1597b5L77L78j383j443Q60J727L93k13o75j532Q99K509K77k399n06Q96R5j5j56
$$ y = [1977, 352, -2091, -2150, 923, 3113, 326, -2290, -83, 2744, 1669, -838, -1412, -614, 1514, 1939, -1152, -3524, -906, 2027, 614, -1674, -1022, 624, 1180, 400, -483, -212, 1897, 1700, -1161, -1826, 374, 1113, -86, -821, -1528, -1327, 418, 1280, -803, -1281, 951, 1702, -137, -926, 312, 1528, 1723, -120, -2438, -1392, 1858, 1481, -1643, -2128, -468, 618, 791, 225, -930, -102, 1922, 1173, -1410, -666, 1539, 1464, -229, -1085, -1370, -679, 906, 521, -1230, -1308, 35, 127, 182, 793, 281, 100, 656, 343, -648, 368, 1598, 40, -1595, -865, -64, -227, 57, 17, -742, -321, 477, -239, -168, 1607, 1669, -24, -701, -115, 341, 917, 1069, -1123, -2119, -588, 570, -80, -129, -103, -703, -248, 1147, 449, -184, 794, 1173, -118, -717, -309, -25, 352, 730, -653, -2096, -1236, 491, 884, 671, -4, -1536, -637, 1872, 2149, -250, -756, 140, 235, 220, 64]
1616F4j065K30J497m90j746n5J799J005L15j046j916R7K975J101k172k011j9Q49
1634e88J459L41k087j252J626J507r81o95O68O12N56J63j682j288J814J954o85
1651A442k020j461k92K418K723j623l827k42L306J885o70k046j111J348K552o61
1667A721l275m08K615J264j216k475j417K303M166m89m663j971L320L470L20k703
1683E62l270P22L999R69l409k228J493K139Q2j454j974N76L560J027l075k274
1699b555J350K692J462j173l057j656K460K900r15k663r62O61J791J463j374k222
1715a798Q70K526K39j753j173J88K006J772j974m141J13M143J923j940l454j043
1731c496K658L936j94m242j614L072K591q14k421j647J413L158m64l994j702L427
$$ y = [64, -1001, -771, 726, 236, -1510, -1565, 234, 1239, 1554, 508, -1408, -1311, 1664, 2765, 593, -1418, -1437, -588, 871, 1212, -875, -2127, -501, 1006, 25, -670, -2, 610, 1166, 1329, -353, -1641, 173, 2127, 1442, -578, -2039, -2331, 87, 2810, 1187, -2640, -2882, 424, 2309, 1639, -407, -1518, -170, 2382, 1721, -1554, -1962, 653, 1917, 701, -1774, -3191, -888, 3278, 2789, -1874, -3845, -525, 2945, 3265, 562, -2708, -1986, 2013, 2982, -427, -2655, -1162, 977, 1059, -395, -2369, -1793, 1767, 2794, -281, -2555, -1205, 1487, 2949, 1776, -1281, -2937, -477, 2423, 1508, -1155, -2117, -1456, 335, 1798, 424, -1798, -928, 1598, 1837, 84, -1089, -901, 1105, 2877, 903, -3238, -3125, 1018, 2941, 1001, -2453, -3496, -838, 3098, 2904, -1338, -2952, 120, 2711, 1897, -524, -2171, -758, 2400, 1936, -2058, -3760, -333]
1747c33L237j079l417j897K142M233Q98m310k640K734K802l32j986j590L27J930
1763G19M89k213r97J635J418o35n87p82L5J876J297j426j866K34J001L56L76o28
1781C02j748k67J514R68m63n89p03J94J906O04j962r54J798J328j097j771r86
1798a926J192K737j81l622j650L025K952q18k605j226J573K792J65l216j024K327
1814D95J800j735k250j40J614K092q14l317p18L590K075j962k116J18J967J249
1830A948r50j924k04K107K88k302p54J475R43k65p83r43N76J980L13j849m37J531
1848G50L15j126j69L09L25Qj138j025J502J804j316j748N83J658L37o27r05p3
1866e36J676O43k214j418J752J935j122k260l47J313J907pk451j058K396K064
$$ y = [-333, 2904, 1825, -1592, -3489, -1347, 2886, 3784, -526, -3166, -432, 2370, 2038, 52, -1538, -1211, 719, 1208, -1005, -2002, -367, 1051, 416, -171, -953, -918, 958, 2255, 829, -1037, -803, 198, 554, 930, 302, -1446, -1713, -199, 769, 306, -283, -986, -792, 1114, 1718, -244, -1198, 600, 1928, 831, -940, -1926, -734, 2003, 1822, -1800, -3450, -425, 2527, 1709, -896, -2122, -549, 2243, 2408, -808, -1832, 495, 2295, 560, -1690, -1830, -216, 1876, 1062, -2255, -2973, 617, 2692, 730, -1386, -1268, 699, 1948, 998, -926, -1130, 977, 1265, -1037, -1791, -316, 627, 362, -421, -1364, -788, 1192, 1505, -344, -781, 750, 1065, -61, -230, 79, 404, 412, -726, -1751, -249, 1555, 239, -1509, -926, 732, 1069, 442, -463, -536, 1140, 1783, -431, -1849, -97, 1838, 716, -1544, -1891, -578, 1329, 1322, -1129, -2187, 209, 2273]
1882B273j305j869RJ505J106p99k366n60K786J489k757k081J240K246O42j353
1898B06j837N40K784L99k327j121J835J072j023j421k88Q06J623o48k225M2K197
1915F14N65j290o23O77P54L20o63j246O16J795q24k235J26J747M73q73j116j72
1933a355J563J465j402j726J123J846l10j599m40Q13J002J33j997j293J799K041
1949A663j259k081J79J914R90m94j612l62J992J255j882j808J160J380o2j296
1965c23j364M16K099O50k107j357K075J496r50j197R1R69Q69o70j801m6J834L93
1983A077j748o57O69Q35M32n25j104K77K094P1k071l83J681P70r75j293l48J243
2001D5J267j099k008N87J979J96j363k07N41R41L90j130j308J234J713j098k088
$$ y = [2273, 968, -901, -892, 613, 1719, 920, -1446, -2006, 780, 2269, -488, -2569, -1329, 917, 1559, 206, -1631, -1091, 1693, 2092, -235, -1356, 479, 1551, 528, -893, -1181, -375, 1248, 600, -1625, -1583, 614, 1179, -111, -734, -57, 697, 1017, 354, -892, -276, 1519, 695, -1540, -1414, 333, 806, -67, -1183, -1355, 208, 1673, 271, -1455, -332, 1514, 1204, -395, -835, -22, 980, 1113, -884, -2177, -378, 1663, 404, -1677, -1498, 416, 1406, 912, -700, -1062, 930, 2185, 303, -1505, -345, 1035, 973, -323, -1687, -1271, 828, 1478, -629, -1986, 89, 1585, 635, -562, -471, 498, 1367, 697, -1104, -1150, 684, 1077, -671, -1328, -659, 176, 608, 83, -1021, -744, 1350, 1421, -650, -1033, 648, 1418, 443, -850, -1198, 45, 1312, 213, -1795, -1208, 771, 967, -396, -603, -62, 879, 1269, 139, -1169, 65, 1778, 680, -1408]
2018a408K31J642L82q66j016j70J327J171j219j079R13J377m25r32p43L23J551
2035A059L35k262j325J839J915j319j760L57J342J047m78j638Q4J925Q00j874
2051D7j548J190J257Q6r83j683J56K296N72k136r21J590J120l98r43k84P50J222
2069A390n62j826oJ698L41j319j001N80P16N44n49j016P12J424l51j484M61J222
2087I74J24r26p80l27J124J028j118j808R14J674J6j277o08Q51J139L93j782r25
2105a314J664J642j141k152P3J213J129n08j789o94J881J549j391j411Q55J433
2121A039l6p51q81K06J288L78j712r75R77J034l77n15l54J38J022K52j191j06
2139e64J446K33j313n42Q73P83l44r14q55P62J349m51j462j5J438L81o40o52j0
$$ y = [-1408, -1177, 465, 847, -19, -1035, -1205, 122, 1293, 74, -1005, -92, 1285, 860, -72, -815, -492, 1059, 1394, -868, -2193, -354, 1561, 242, -1518, -1161, 181, 1228, 750, -888, -804, 1121, 1921, 47, -1501, -311, 946, 1032, 49, -1634, -1478, 818, 1390, -746, -1667, -77, 1043, 645, -298, -582, 168, 1390, 828, -998, -1004, 694, 1035, -284, -1285, -705, 11, 555, 6, -1010, -298, 1126, 775, -709, -248, 974, 1098, 172, -608, -935, 189, 1217, 99, -1709, -795, 879, 895, -382, -990, -139, 1000, 1393, -389, -1314, 350, 1992, 851, -1301, -1228, -15, 1114, 606, -1183, -1877, 4, 1553, 162, -1249, -394, 1039, 1003, 252, -629, -423, 865, 1243, -469, -1444, -467, 567, 190, -325, -679, -541, 481, 733, -458, -564, 882, 1115, -198, -740, 133, 916, 572, -342, -1197, -435, 914, 463, -999, -1014, 424, 805, 165, -487, -497]
2158d97J073J167j043k120L95K107J57j516r66K46Q85Q40n52j351M93J515k1q84
2176g2l63M62M07N97p18j524O78J215k27r75j40K66N0L81M56n76k67N08J06p1
2196A93O08l37q51J45P16l59l79j24p3R5Q93l36j232M18J428L26j125n13N9Q44
2216C96J044q62j885J21J640L75r23p75k04J009J085j75j738j8J618N71q16q73
2234d10j38L76J315j22j765q05J201J174k32q64q03L12J482N32j262q77Q28R21
2252H63j18m62q02l94J057R99j104j547N34J121O24k59j080o25J279J594q31j488
2270f39p6R49N43j45r77r57Q71J421o13j435J65R72L75J00l52q98L20J240K73
2289A137j136l47J16K65M62q0j153l34J217M03n15j54k38n0Q84O90r23j081O06
$$ y = [-497, 576, 1743, 700, -1420, -1025, 1082, 1239, -277, -1243, -997, -112, 728, 176, -1175, -682, 833, 812, -72, -435, 27, 434, 1031, 313, -1211, -533, 682, 455, -520, -660, -394, -344, 37, 493, -83, -350, 158, 264, 193, 801, 464, -387, -242, 474, 115, -264, -388, -461, -366, 527, 191, -1041, -623, 805, 1131, 6, -507, -448, 396, 1440, 578, -1307, -1186, 454, 829, -94, -869, -1073, -64, 1021, 846, -892, -910, 708, 1279, 463, -410, -548, -172, 1143, 1021, -744, -1549, -348, 826, 594, -270, -1073, -761, 721, 1253, -9, -886, -58, 863, 745, 283, -519, -913, 144, 1143, 39, -1508, -974, 147, 771, 512, -568, -1193, 86, 1680, 849, -639, -715, 234, 777, 632, -345, -1302, -431, 990, 377, -1058, -893, 79, 454, 554, 202, -696, -376, 864, 1137, 1, -346, -230, 35, 497, 417, -736, -1070, 147, 550, 35, -119, -357, -407, 477, 1167, 244, -837, -231]
2308b31J093j14q70p23j48J083Q97j103j296N31J455M21o82r85j87J360J328j232
2326E97j844M07J650J67j075j035j80J476J240j181j631N14J787L27r82p97Q2
2343d78R33R53j182j317O02J160k02r37j27j19M79O72k43o65O9J042j69k95R6
2362B72k31j96L28m0l07J47j25o25J90R96j91q57K67R51P6l63n12l61P84J123
2382A326q73j751L22J552L13r91q60j47J281J241j045j719O88J688K59j237q36
2399g89K72J094P80j277j699N42J843l7j417l58M11J073M72p65q70N02J336m47
2417F66j099J05L50L49j62o12o09Q02P11p17m99N53O14l04j81J31K77J92k45p05
2437c83l7J132m4j263l49P39O74j11n61p32N16J392r6j598j83J601N85r17j086
$$ y = [-231, 862, 748, -122, -845, -993, 90, 987, -116, -1412, -881, 574, 995, 313, -672, -859, 501, 1829, 597, -1247, -840, 810, 977, -98, -1133, -1313, 163, 1403, 222, -1409, -895, 892, 1219, 237, -560, -478, 455, 1408, 226, -1091, -489, 671, 469, -468, -595, -714, -235, 437, 194, -471, -402, 640, 471, 176, 272, 41, -155, 173, 133, -174, -27, -152, -777, -587, 409, 218, -639, -372, 579, 655, 292, -220, -581, 203, 1326, 453, -1298, -976, 576, 889, -102, -962, -1109, 172, 1413, 368, -1351, -663, 1025, 1284, 47, -789, -517, 577, 1357, 80, -1619, -1077, 766, 729, -688, -1046, -635, 438, 910, 145, -725, -223, 1113, 666, -433, -328, 22, 371, 209, -403, -1012, -210, 501, -216, -715, -162, 452, 148, -33, 98, 375, 567, 322, -383, -420, 712, 668, -595, -944, -205, 469, 358, -203, -935, -419, 973, 877, -721, -904, 697, 1282, 365, -721]
2456g21o9Q15J143p85j709L8J542M96q29p85J50R57P86m82j431L00J654o8j374
2475c72n70P35O06P0q03q11N69J251k39j031M13N20J80j67l65j39O56J37p91q21
2495i72Q76Q11p05p37K11N52K41j0n41l78J137L79r14o64P91N70r2p38p58K58
2515f83J323K24j656n66J233R42m61p28k25P63R56m02j345p7J315M60j155p67
2533h49J00O42O61k01j157L2J341L11j182m4O55K42j67m22n97M53Q77l97j135
2552h37J2R88J64n07j97Q8L66O75p31p60P83R75p20j052L34O29J73j33q90l05
2572i45P46J029p56r33N33P73J36m32n03OJ070L68j295r34R05R46o15o58j57M44
2592b72O12J55r59p2R50L95q62l48N93J96j6l83p84K62J008Pj097j47Q08K02k52
$$ y = [-721, -790, 25, 1168, 383, -1326, -1288, 254, 750, -79, -864, -714, 243, 1029, 547, -884, -584, 1070, 1002, -372, -942, -207, 399, 469, -334, -1145, -576, 675, 436, -595, -182, 338, 518, 351, -14, -153, 503, 640, -151, -972, -96, 715, 10, -727, -516, 36, 277, 267, -274, -652, 485, 864, -50, -714, 77, 647, 555, -183, -941, -683, 640, 864, -792, -1358, -125, 817, 356, -372, -597, 166, 1122, 720, -625, -702, 613, 1073, -82, -849, -749, -107, 554, 353, -804, -772, 569, 880, -302, -346, 309, 551, 384, -38, -635, -182, 695, 298, -837, -825, 163, 327, -180, -377, -289, 77, 752, 21, -739, 44, 1019, 299, -753, -419, 210, 383, 250, -640, -945, -199, 830, 74, -859, -326, 447, 583, 151, -352, -346, 724, 1092, -203, -1137, -232, 714, 99, -559, -716, -272, 340, 495, -464, -536, 414, 809, -53, -401, 192, 388, 372, -11, -795, -533, 475, 482, -615, -762, 46, 248, -4]
2613dj44j16L40Q28m38j032J95J072J6r76o04M15O24L60o83p51N28J019j28r23
2633d02J26N25L59r4n20n07N03P42o39r02L64N56Ok74j48p5L99M63l61o13P34
2654B42L36o23j37K00P2n9L8o00j09Q34M13r67l65Q10M82l85k39j48K67O38j87
2675E13r35p0O96L23n51m73k68M65R11n9j165j0J156K28o66j76J15J27K76j93
2695B44o52j26P45j13m24k47K89L32J99j7o15K56M67P0n36L41K23o09q5K23K63
2716B28l09o1r4l16N35M71m69j12K58J50LJ3l76j2N76J32j219k32Q64N63m42n73
2738d22l60M37P28M02q83n15P65L54m4n33n8j10N94M1q95k68O71M69l06m42j2
2759c87NO58M67m66n44L17K13j09J42j35m26NM02j14l15Q7Q9j38L70J60m76m2
$$ y = [-4, -148, -264, 76, 904, 466, -566, -371, 701, 717, -259, -863, -448, 176, 536, -147, -898, -370, 649, 521, -402, -276, 249, 608, 514, -6, -513, -10, 732, 93, -809, -445, 111, 117, -157, -305, -380, 19, 482, 121, -492, 242, 578, -45, -182, 18, 90, 31, 69, -531, -640, 194, 607, -360, -725, 85, 567, 182, -57, -205, 62, 700, 513, -422, -492, 204, 527, -24, -497, -765, -300, 611, 552, -613, -623, 533, 761, 95, -81, 34, 161, 437, 244, -408, -534, 211, 98, -326, -573, -284, 48, 247, 230, -385, -129, 338, 408, -128, 213, 436, -173, -258, -35, 228, -81, -142, -236, -552, -17, 454, -15, -127, 131, 281, 284, 297, -79, -91, 485, 617, -602, -834, 30, 593, 151, -422, -782, -345, 383, 785, -98, -613, 152, 506, 462, -71, -129, -239, 355, 396, -499, -767, -96, 373, 67, -375, -387, -382, 276, 743, 277, -267, 50, 263, 154, 296, 161, -265, -260, 142, 28, -287, -200, -111, -249, 121, 281, -195, -237]
2781b37Q18jn25k99nJ43N20%r70k71O38N41j06n38j63l1O69M81o60l84O62L83
2803F65n27l74M3j2N40J92r76n48O84Q38j20l29k31k09N12P26k83q35j5L09J67
2824B17j35j28m29K37O50k56q38J47Q14j8k7o6n31J08R45N9p25o28K82K59L99
2845C36l2r21j08P68L39m88j23J33L69J16po89k63Q98M46p84n83J96J57L88M5
2866A93l95m82M03N27K8k04n5j25J23N03j28o31J37N19m49l10O9k07J39P40l0
2887C65q57r8O49M36K0k83o18J09P36J78p28n40L06L05O3O1p04J18Q02L51q51
2908a80m35O09O77rn13n64n3P76N00r84n34L86L54N7R8l25j66M92L64n30k01L65
2930A84R9j58j30M9l47J56K84k95j53J00Rp3M59K32m85j26J77J75Q1J61n87m12
$$ y = [-237, 581, 580, 55, -244, -249, -106, 414, 414, -556, -827, -189, 352, 246, -292, -455, -486, 183, 664, 4, -380, 282, 665, 138, -236, -193, -205, 335, 527, -449, -997, -313, 525, 405, 76, -155, -364, 148, 874, 591, -244, -259, 50, 217, 82, -46, -475, -238, 412, 156, -682, -535, 279, 261, 234, 168, -363, -255, 690, 749, 24, -604, -322, -63, 336, 304, -617, -725, 43, 382, -106, -229, -96, 273, 389, 382, -307, -570, 328, 774, -10, -593, -397, -240, 148, 193, -202, -684, -281, 246, 274, 70, 15, -110, 13, 516, 388, -243, -106, 413, -36, -346, -277, -484, -345, 395, 365, -492, -590, 59, 495, 515, 232, -386, -277, 459, 637, -91, -631, -325, -20, 43, 104, -600, -482, 320, 671, -180, -615, -6, 671, 662, 149, -415, -468, 308, 808, -176, -710, -324, 30, 87, 185, -140, -306, 186, 550, 20, -181, 184, 283, 125, -5, 44, -303, -147, 137, -158, -311, -211, -202, -275, 184, 416, -69, -195, -18, 157, 238, 399, -188, -600]
2952f00O22M83n70m22N5L37L06j15l29k91R25N91r35n62L43O36L22m77p89k71
2972g41Q77N83q19p20L54O08J14j80l47r7O37N50p24o44N36M79l47k83l02j31
2992e97P15K55p18k07N72J95k88L7K22p0n8J26k12j23O56k89o31p2P09j99l35
3013c12R4M0M81J12n08k97N58Q09n80r12J91M68L11p1o95o44O75Q21m19p41J62
3034d57P38J04j43m82k53O69P00q13q03N00N26P0m58m81r0N67P01n83n19M70O11
3055E74l68j48m2j5L08p0m09k68N44K26m71j25J66J02j19Mj37K54N32j92q74K83
3077b45R68j26p05l29J07L61K61k92p32L40Q44r5q26J79L97L22j4o38m69O77R52
3098I37m26j211N6O59M74k19o13j75L49Q57n03o70L71O65o6n99M1OM01J70o27
$$ y = [-600, 22, 505, -65, -487, -432, -95, 211, 96, -233, -524, 401, 992, 57, -505, -162, 474, 796, 319, -470, -741, 136, 719, -100, -820, -466, 142, 256, 76, -271, -368, 269, 819, 95, -549, -13, 466, 119, -164, -466, -597, 118, 373, -345, -552, 20, 215, -73, -36, 186, 116, 58, 184, -28, -151, 505, 216, -415, -487, 222, 23, -312, -218, -178, 303, 415, -93, -390, 168, 977, 397, -515, -324, 144, 455, 384, -311, -955, -280, 541, 122, -619, -457, 281, 385, 242, -240, -493, 176, 876, 63, -740, -240, 286, 356, -102, -583, -673, -106, 595, 12, -507, -37, 574, 206, 58, 16, 1, 309, 239, -170, -438, 106, 332, -139, -264, -98, 4, -115, -111, -248, 6, 538, 346, -528, -245, 723, 597, -108, -437, -330, 31, 292, 0, -732, -392, 452, 357, -469, -290, 107, 429, 415, -223, -692, -15, 937, 511, -700, -644, 15, 489, 270, -343, -518, -169, 688, 185, -485, -114, 551, 485, -114, -73, -67, 334, 504, -123]
3119a23n24M99K97k30k56M4L13K30r7k53j92O65K29p79k89N56L18k60m13l09K35
3140c39P69k06o78j61Q68J72l67l48L34K96J39k71p07R2Q58J67q88m53K71O15
3160A63J77n02l38K59Q91j37p82N9N79J21k96m86p2L33M43l82o24P3Q07p7l34
3181a25k28L23L23M6l50m03O04N73p44n87K95M74J1p4o15q6O68N12o46n55M67
3202a17N96m3m12j42P3N32m0q16m12R67M28o16o37J79M03M95p2o38m0O51L22o82
3224b1j88K70K20j41l44j83R1N81q2q17J73N91K65l60l22J04K38L57l57m21L03
3245d3N29k19o95l4L61M03J2o04l81O60Q06l00p57p7Q53o1k59l71k90O13M25o04
3267c3q22M50P72m1n81k09N0O36L61m60m65L43N27l55l88K37l2J79j71l95j75
$$ y = [-123, -647, -148, 149, -81, -337, -293, 20, 250, 153, -100, -292, 373, 602, -177, -466, 90, 408, 148, -265, -574, -339, 430, 224, -454, -615, 253, 425, 58, -290, 44, 340, 479, 208, -499, -407, 451, 618, -270, -723, -452, 163, 340, -162, -500, -241, 650, 513, -269, -210, 369, 490, 194, -292, -364, -31, 412, 30, -594, -521, 286, 209, -125, -353, -30, 293, 339, -11, -414, 190, 763, 19, -568, -273, 201, 212, 138, -477, -563, 105, 617, -29, -584, -117, 479, 436, 24, -118, -45, 487, 447, -369, -781, 186, 614, -2, -639, -460, -57, 438, 366, -272, -312, 339, 661, -21, -209, 61, 281, 140, -204, -387, -296, 285, 203, -614, -441, 150, 415, 55, -267, -163, 75, 432, 75, -346, -43, 486, 267, -428, -462, -101, 302, 314, -290, -671, -11, 795, 495, -262, -339, 514, 453, 194, -177, -467, 146, 571, -33, -855, -405, 367, 326, -255, -464, -414, 222, 583, 123, -342, 1, 528, 173, -215, 22, -10, 169, -2, -397, -572]
3288e72O13K96l89j68L47j1k2J81j23j21J98r4m58K1O70P4p07k38K65L14L82m60
3310bm34L37O73q5p22q1O92Q9l04m02l90N28O25l43q68P6P67J15o8l35k34L17
3332d9N07k28n25J24M81K8l42l14L0J47M99k04n95J28N40M0p9k0J1k01K44%k65
3355d3J92o4k76j74N07o2l93R1K79n9l2J24j81L4M73p4n66p1M48K13j58k86o49
3378g27L12P00K2p47n1O16J45j2j30k45Q9N79q9o82j61M51J76k49l58l0J28N53
3400B90J67o29k38M59J62M2o6j2l15K03J80l46p0J95J2k11PO9QM9K76j64j76J52
3424D4q7PL91n2o53L3M06J2r6j22j91M6L97J71n18k9M37R4q0m9k78J8N32k9o75
3449b71j59M13J19J8j17l13p3O81J96l81k94K19J45o0Q3k28k56L79J9l18k07K70
$$ y = [-572, 41, 337, -52, -220, 127, 116, 94, 275, 152, 31, 229, 135, -323, -302, 368, 442, -265, -503, -238, 76, 458, -2, -436, -99, 574, 489, -233, -314, 378, 467, 163, -239, -629, -101, 524, 181, -687, -611, 156, 271, 203, -132, -366, -49, 458, 230, -295, -171, 310, 338, -4, -318, -288, -141, 358, 154, -441, -313, 227, 267, 188, 168, 179, -22, 222, 222, -43, 149, 85, -191, -365, 142, 80, -313, -222, 57, -2, -34, 90, -91, -57, 416, 342, -224, -295, 153, 366, 208, -78, -727, -415, 285, 307, -440, -491, 125, 270, 258, 128, -117, -28, 551, 462, -220, -381, 70, 246, -3, -361, -391, -263, 290, 457, -172, -410, 49, 211, 253, 187, 175, -140, 63, 243, -103, -173, 22, 34, -177, -170, -101, -93, -44, 232, 68, -108, 44, -43, -36, 355, 303, -350, -317, 89, 101, 5, -117, -308, -262, 135, 306, -212, -241, 196, 290, 210, 161, -117, -99, 433, 404, -271, -430, -17, 102, 120, 3, -310, -383, 298, 494, 113, -181, 38, 183, 123, 206, -22, -278, 101, 120, -198, -405, -135]
3471a35J38j19K17k05j65K47L69j04k25n0j47K49J82L3n91r9M73j9Oj8j31N3L27
3494B86l0l85Q2K67M6j13r5j77O0J86J57n56j64L06J30nKl1j44K58K80j12l70
3517a22L12k07Q5Q8r9m15K61J80j11k99J49J76J45J50j83m10J58O53l6n49j19
3538a93J79r0L55q4m19r9M19J70l98QL5J14L96l8m97JL62J19l19k71J52p0K27
3561E9J57l73k41K92L10j59o3M3l3K01J57m16j55K54R4k31Q9Jk43J21K70j06j47
3584a19M8J00k3L49j48k99r6M63jj43k65q6J00L70j46n33m4N12L35l63j94Q0K11
3607A08K16N0o06j30N37K14l97l19Q4L3L73K6l79j20M31J18j96j48R0P1J37K41
3629D34m24k82L24J9j46j25J57r5M8K41j46j15K20P2k25K97J17l66o9K14J8k70
$$ y = [-135, 3, -116, 101, -104, -269, -22, 347, 243, 18, -32, -179, 70, 252, 285, -306, -405, 68, 49, 55, 37, -94, -41, 286, 256, -129, -47, 220, 266, 153, 58, -119, -59, 127, 284, -272, -436, -130, 0, -5, -3, -34, -178, 80, 360, 248, -122, 190, -17, 68, 156, 57, -358, -97, 83, -28, -327, -178, -2, 143, 293, 110, -300, -142, 511, 475, -74, -193, -14, -104, 251, 167, -252, -351, 68, 238, -160, -152, -117, -3, 393, 355, -142, -141, 221, 340, 21, -250, -98, -168, 59, 216, -157, -398, -106, 204, 45, -18, 25, -8, 193, 350, -66, -221, 33, 127, -104, -15, -14, -257, -136, 134, 28, -119, -71, 29, 6, 355, 207, -92, -188, 275, 274, 131, -134, -220, -120, 250, 104, -429, -473, 39, 374, 11, -183, -103, 108, 324, 374, -232, -362, 175, 389, -8, -327, -243, -210, 163, 189, -190, -310, 121, 239, 43, -105, -15, 56, 193, 434, 10, -272, 52, 71, -75, -200, -43, -138, -90, 151, 5, -110, 110, 182, -43, 254, 371, 5, -64, 150, 168, -102]
3651a02o2Jm1K19L01m91j61M69K41k24j86p4J00L18L0l94l55M87K48l83j59q5
3673c03L4L43K51m87j94M22M08m50n0J08L2K36k37l04j14M27K48m22k34K48j09
3694a47K52L1m5k13L30J30m22j7K56k2k42r0J50j84J00J36l09J20J34P6q1J88
3716A31P8j98o8Q2R8Q1P0m27k06K84K92j04l55R6n8K37J93j24k24K90J70l87j60
3739b09J71N3J95q6k45m44M65K76k39j98J54J83j29J95m9j10J47K30l91j09K52
3760A12o6k74J46j02k1J51K01k50n3J16N5m6R4K53k12m8M1k35N5L22j70m26J21
3783b36J41J7Q1K12k32j56M30p4l56K60K28k38j29NP2n9K02k99k61N6N34q4j31
3806a7J40m0j63J67K4j33j8J93j56l53K94Mk7j17O9K3k3L15j46j29L60J00l29
$$ y = [-102, -164, -163, -204, 15, 316, -175, -336, 133, 374, 150, -36, -110, -10, 308, 338, -56, -411, 76, 324, -59, -218, -303, -269, 74, 325, -162, -356, 66, 474, 24, -26, 82, 114, 350, 113, -191, -305, 122, 370, -52, -286, -38, -147, 105, 136, 91, -122, 208, 338, -84, -101, 155, 133, -109, -199, -49, -233, -133, 3, -306, -186, -52, 24, -57, 131, 209, 11, -57, 25, 123, 204, 274, -153, -359, -75, 217, 113, -242, -146, -204, 33, 226, 102, -122, 168, 338, -49, -209, -38, 15, 210, 124, -121, -565, -100, 176, -63, -261, -107, 76, -53, 142, 93, -17, 130, 360, -31, -140, 112, 46, -228, -82, -184, -205, -54, 147, -103, -156, -40, 15, -31, 63, 316, 104, 56, 97, -138, -83, 239, 69, -357, -236, -95, -78, 3, 215, -17, -173, 257, 183, -173, 87, 315, 77, -52, -47, 25, -34, 168, -131, -392, -336, 198, 114, -17, 123, 83, -80, 87, 111, -22, -40, 153, -3, -356, -62, -58, -85, -202, -133, -110, -133, 182, 36, -93, 267, 367, 38]
3829C8j62K55KL3j23l60o1M50J49k97j03J80O1m5J37k52j3L65O6m41J6K46L4j75
3853@k06Op6K14J91l11MK67k5m0O6N5l66K99P7k91n5L46q7k70K1J96q5k7L18k14
3879Gk6K09j97MK24J49l23p8R1p6K2L21l69k81L48K28l24pJ18R9n8j4n6j01K70
3904A80Q6k97l47L24Q2j67J03n9l62M61M8K3k34K65q5L5O4qj60K78j3m52J03Q5
3928d7J60j24J9Kj27J12K03k29K8K93j32l00J06K03k6k03nj32J69M5l6k79K16
3951h4K47j99m1J38M6k3Q8j77k09K67J88k37k46J58j21J16J54j3l25K40L17j71
3973A13k37L72r6j86P3j08n9JL66l13q2l8J67j18K40M4k70O0J56J4pK7l3l62J97
3998g9K74k81j83K58n4l1J79r6k18K73J50r7k56J01K01lL3m0k73M9L43j28l82
$$ y = [38, -124, 131, 133, 166, 43, -317, -378, 72, 221, -76, -179, 1, 62, 17, 154, -98, -111, 254, 320, -121, -105, 141, 175, 0, -206, -200, -276, -62, 129, -182, -178, 89, 64, 24, 90, 145, -221, 78, 155, -136, -191, 155, 68, -202, -181, 15, -70, -97, 221, 7, -19, 190, -7, -3, 221, 370, 47, -31, 60, -16, 6, 327, -42, -323, 25, 253, -71, -78, 40, 139, 81, 67, 11, -90, 180, 266, -31, -378, -54, 28, -139, -36, -95, -457, 4, 52, 75, -159, 106, 21, 56, 120, 112, -48, 230, 217, -235, -132, -47, 113, -11, 8, 10, -117, -5, 198, -31, -3, 290, 158, -142, -36, 167, 141, -62, -67, -199, -30, 15, -21, -300, -84, 163, -36, -77, 61, 107, 84, 172, -5, -214, 53, 241, 4, -242, -84, -205, -89, 65, 52, -273, -33, 284, 113, -124, 248, 152, -34, 39, -69, -128, -127, 239, -74, -156, -194, -27, -145, 95, 139, -131, -71, 85, 99, 92, 119, 86, -276, -79, 195, -86, -269, -11, -65, -96, 83, -13, -231, 42, 192, 95, -161, -60, 141, 138, 171, 131, -142, -93, 250, 122, -260]
4021b60J66J25q4J71m4j50J02K45p7m05J88k7R8J13m9l64m3K99J02k36jR4o9J97
4045I1P8k71P3J66J4k11J08j05j13J76J35j55k94J39L44j98j16J46j40J42L58
4066C67k55j97K8J72j46K3m5k23J60K40j11l07K60qP3J08N7l74k6M50m6l51Rq6
4090b28O9K85j93k02J1J00J88j54J14j0n2K52R2l70o2J65J47j92Ll4j54J06K55
4113A36j03k85J57J01K35j95O5l05K94K42k62k45J68K26p2k08l7j65J77K25J4
4134A63l36P8J71n0J01k0j25j23L48j02k84nJ99j58M8P3l0J0K21qk42J0K88k30
4158cN8J86j14l35J36Q9j7j06K8j36J30K87k18j51K12K39j60Q6k17j36J61K79
4180B98k48l29K23O9L4j71q3p2J84K14K6m15L44J98j72j71J70j51N4J29j42k72
$$ y = [-260, -94, 31, -53, 118, 74, -76, 26, 271, 194, -211, -23, -50, 48, 161, 112, -252, -295, 4, 106, -130, -131, -37, -106, 91, 169, -102, -29, 137, 151, -60, 48, -57, -170, 6, 141, -14, -308, -169, 175, -23, -139, 7, -133, 9, 367, 112, -85, -57, 115, -31, -8, -53, -276, -116, 124, 13, -294, -34, -42, 31, 139, 196, -178, -204, 246, 200, -151, -142, -228, -159, 126, -67, -269, -258, -158, 30, -124, -10, -20, -72, 180, 272, -98, -160, 5, 152, -40, -37, -71, -225, -119, 136, 33, -252, -95, 6, 241, 46, 111, -194, 100, 342, 80, -165, 3, 229, 157, -51, -88, -253, -76, 149, 163, -173, -95, 76, 26, 127, 107, -18, -141, 207, 105, -179, -184, 15, -143, -95, -22, -52, -42, 179, 171, -71, -61, 227, -3, 55, 241, 127, -208, -72, 17, 0, -106, -78, -214, -84, 203, -15, -166, 46, 285, 125, 211, -6, -142, 19, 298, 50, -279, -56, 13, 47, -124, -207, -279, -95, 119, 145, -270, 74, 272, 100, -71, 99, -52, 2, 131, -11, -283]
4202b83J04K97p9q9J3L2N7J70N2l38K2K68j85r7K10o3k29J32j9j60J36K23k78
4225a04J43J07j23j24mL25j29j16Qj1o4L20j15m06N5J90K7j15O8n7J06K78n4m32
4249b27J94L12j04j50p9p2O2K14o5k93M8K51n0j35J31mP3J01j46k31K35K01j24
4272A42l63R5Q9K5L0L7k37k6J66N3j48K00J25j42j42J74N3j07R4k98j03K29R5
4295D1j79K9O9j02M0R5J35q0J82R2m07k2L21J7k55j59J5N9K53o6k24NK56j0j47
4320d2k1J37O1J8q2k04J0L46j50l11o0P1K44l9jo5LJ46l8j66K01R4m2M2j56m8
4346e2J22J1j40k59K71J46j22l6J13N0p3Q5j72j5J86J22j41k79J55Q3K7l1j58
4369a07j67L65j53k07O5L37M8j43j46P4J05J47j36k33j52L77q0j22r0J1j1L30
$$ y = [-283, -179, 118, 39, -50, -37, -5, 52, 222, 274, -64, -42, 226, 41, -56, 154, 91, -138, -6, -25, -185, -49, 174, -104, 39, 146, 23, -101, -105, 220, 91, -25, -17, -28, -92, 228, 113, -293, -238, -48, -21, -136, -68, -125, -19, 259, 205, -227, -33, 279, 175, 25, -54, -126, -64, 150, 85, -208, -160, 91, 41, -94, 37, 33, 106, 207, 61, -170, 65, 266, 142, -221, -126, -37, -12, 18, 55, -182, -208, -42, 11, -137, 63, 188, 46, -96, 78, 131, 24, 118, -180, -283, -54, 41, -138, -109, -40, -142, -102, -7, 128, 48, 230, 322, -85, -107, 214, 231, -24, -183, -168, -109, 144, 78, -146, -141, 115, 105, -42, -63, 74, 135, 153, 71, -133, -123, 223, 73, -238, -298, -227, 17, -22, -23, -88, -85, 61, 23, -143, 58, 152, 110, 152, -4, -52, 70, 81, -59, -318, -47, 99, -23, -59, 54, 104, 31, 116, -56, -71, 115, 237, 96, -183, -28, 55, 82, 51, -107, -274, 91, -62, -269, -204, 133, 181, 38, -108, -34, 71, 218, 82, -151, -303, 74, -6, -128, -218, -207, -218, 112]
4391A12l3j78LL13j60j36O6J50J07k60k6j01P2Q4j14j3j0J58Q0k25Q9J37K4K00
4415C39l48k01K10L68l24k81N2R4K0J48k12q0J07K13j56k21L86J00r1j19r3k8
4437a17J63K37k48l11O3K25j14M2K2J07j2J16j98j03K69J22j48l16J80O3P0k11
4459i9nj68K32M3j70J3K63L3k11L5m2P3K66%m08r8L35Rk02l4N1k4O4lk56K65L94
4486C56k45k41L2K53j8l6j47m4K8K36j85j70R4J83j77K8K75k41M0K89k30j45J37
4509G2P8k42kn6J20l8N7k19l4L56P4l56K3J21K18m8m7o2k1J49O5k02j02O5J16
4534H5j03j52J04L4K03j51j19L9J63K33l18m2J41k30J71M6k03MJ12L8j41O1J05
4557H0m8O5m2K7j39K21J6l98J35J02o7m7J81k6j28o1JL5P3K72j50k71K20J13j35
$$ y = [112, 79, -99, -96, 217, 57, -79, -13, 137, 244, -16, -42, -143, -71, 13, -101, -114, -124, 34, 114, -111, -22, 115, 139, 339, -9, -210, 0, 368, 44, -237, -185, -91, -71, 77, -135, -215, -108, 105, -51, -272, 114, 214, 123, 4, -89, -117, 46, 283, 35, -276, -213, 12, -102, -60, -38, 69, 57, 173, -25, -128, 141, 263, 115, -201, -21, 42, 112, -99, -104, -272, -40, 3, -167, -154, 109, 142, -69, -34, -76, -3, 263, 263, -145, -243, 92, 101, -101, -135, -84, -108, -44, -47, -303, -38, 356, 111, -130, -98, 155, 137, 101, -46, -90, -62, 174, -11, -181, -87, 96, -81, -53, 222, -19, 21, 310, 80, -65, 72, 150, -92, -94, -150, -30, -68, -11, -230, -264, 92, 166, -190, -167, -46, 172, 124, 77, 15, -6, 143, 208, 6, -96, -31, 85, -18, -170, -66, -32, 171, 20, -99, -60, 103, 336, 18, -24, 117, -113, 58, 104, -99, -95, 17, 55, -86, -25, 80, 32, 97, 55, 82, -57, 164, 180, -218, -83, 19, -48, -95, 86, 60, -68, -129, -128, -93, -20, 252, 102, -169, 51, 164, 29]
4582B9J18k21r1K57J07l43j44K79P9j99K5J2kJ89J17j80k30J56K44j19j05r0R7
4605a5K1P0j72j61K65J27n4r6rJ36kK9j87j20K93J8j33Oj17k9J47l5qq5J45m1
4631gj20K7L83k51m5pJ27j25n6J20k24P9J74j73p3J76O5K8k20P9J57k9J91j51
4655A25k28j4K07j95l8K14j24j3J1m1m4K04L5q5m5mP8r4J32r5j29J57M3k45R7
4680i1O5j31QN7J15j67J56J49j78J43J29j80n8Q6J28k24j5k0k8N5lj9k08J93K25
4705A87q9n9N8k2l3J1p3j3M9J0j19r3Q8l8L3K16k36k2J27Q5K4j7q4N8j12J10k7
4732A9k05P9J63q4m9J31k1r1J08J24k03nJ36l0p0O0j14n1K3J46p6j52J81q5rK04
4758A29j37k5R7J38k99o1K37O9n3n1j45j07J84R7j07j41J78K7n6J29n3j24J46
$$ y = [29, 147, -74, -165, 92, 199, -144, -288, -9, 70, -129, -104, -92, -94, 95, 212, 32, -198, -42, 202, 83, -22, -112, -15, 6, 76, -96, -257, 8, 135, 81, -15, -24, 112, 110, 139, -48, -168, 125, 143, 10, 16, -101, -130, 17, -18, -26, -111, 34, -7, -127, -100, 283, 32, -13, -20, 107, -18, -74, 46, -178, -99, 75, -98, -171, 5, 70, 98, -122, -43, 114, 85, 276, 125, -103, -117, 90, -105, -143, 71, -53, -66, -55, -96, -140, 64, 99, 14, -31, -35, 43, -51, 81, -14, -143, 14, 57, -188, -91, -26, -157, -149, -92, 23, -144, 12, 161, -17, 126, 255, 75, 17, 103, 231, 7, -8, -28, -56, -1, -4, -23, -231, -38, 187, 98, 39, 97, 75, 42, 53, -20, -33, 16, 26, -93, -186, -98, -136, -103, 113, -123, -145, -18, 67, 91, 74, -10, 48, -64, 46, 19, -186, -107, 56, -28, -77, 54, 33, -58, 50, 174, -29, -34, 102, 72, 2, 62, -52, -103, -80, 66, -10, -162, 19, -66, -75, 129, -8, -33, 64, 202, -97, -158, 79, 148, 95, 44, -101, -208, -24, 73, -34, -175, 3, 30, -26, 103, 50, -74, 72]
4781G2K69l51q7J33R2r6o5o1k0O9J52j75nJ3J15o2J02kj31P5J45j43j24K05j16
4806Dj34M9l2K9l4K41j65K7m5J10r9J29K7j17l6L1O4n2j7r5K1P6J19j74p6J36
4832a3J88k14Q9N8j3L5L0j57j95J84J67k14N4j06M4J21m2J27l03L28m9j16J1R9
4856A13n2o8M7k00k4K10mj54j36J72O2j23J94l7j30K51L2j56NJ47j38j18N9l1
4880g9n4J4J18p2j05K02p2j21J45R8q9K17j12j44J06J04j19j92J37l4p0JL3M4
4904d4l9K48j19j48J88K55l82l0l6O5J0K1n9j09J39m5n4N4K23k07M9j49J57j8
4928c0J24J19j36j98P1J12n5K9o2j26J41K1j34P3O1P6k00J41J21j04P0p8q3j62
4952b09J81J52j67m3J9p3J5J93j62J48J8N7k50J07N4l5K0Lj25JK30L8k40R9m2
$$ y = [72, 341, -10, -97, 36, 128, 32, -33, -94, -114, -45, 107, -68, -73, -60, 55, -7, 95, 93, -38, 37, 182, 39, -85, 120, 4, -130, -81, -113, -84, -118, 123, -42, -15, -60, 50, -49, 80, 107, -10, -46, -15, 49, -3, -20, -115, -94, -18, 101, -73, -149, -13, 175, -39, 50, 108, 95, 130, 160, 3, -192, -8, 159, -55, -1, -107, -63, 58, 16, 143, -160, 168, 119, 3, 14, 113, 61, -7, 40, -160, -184, 26, 22, -132, -268, -96, -34, -157, 37, 0, -130, 121, 153, -3, 2, 149, 11, -107, -48, -79, -133, -119, -1, -73, -178, 24, -48, -169, -24, 74, -15, 202, 90, -54, 52, 156, 37, -155, -18, -52, -122, -121, -88, -44, -83, 165, 46, -102, 86, 341, -41, -71, -107, -42, -32, -11, -70, -179, -40, -85, -139, -85, 138, -69, -20, -169, -12, -30, 94, 213, 77, -121, -50, 62, 7, 36, -26, -152, -11, 10, -124, -51, 10, 86, -114, 27, 148, 44, 114, 36, -47, -209, -28, 124, -43, -86, -67, -140, -125, 68, -94, 54, 72, 129, -121, -14, 40, 5, 25, 28, -97, -96, 134, 172, -68, 31, -11]
4977a1o3M8J08O5j49J8N2n9J06J36k31n4P8%j13J36j61O5j2J49j24O4J65k7j34
5002E2j12J02l3J12k5j07j31J82j0j58M6N1O2j5j07Q9l5J91k4k13J08Q7j28LJ64
5027A51j57j89L47l8k41M8K31q0m1K7n9R8L4j22rk8K01k51j10J96q4jK7Kj1P3
5053A4J28j10j94J71L3l6n5l0j44J74K05j90j77K28O7j46Q7J8m4R5J57j18k15
5076h2K57m0o8m2J5o5j25J17K1K0K7J1j08J03J05k3j69J71j97J13j01J22p8p7
5100i3P4M1j60pJ62M8j91M6J7J31ol1j82J17P3j12J21o0o1r5K26m6j63N9J74m8
5126C4r2KO3j6K89r4k30J49L0j90K6L0o6p8J89j53N9L2J44j3j48j7r4P1N5m6n6
5153a20O3j4Pj2J49j10r0J6J75K9j40Q9L7j36J77j62J64j36J23jj49j0J9P0P0
$$ y = [-11, -74, -26, 82, 147, -2, 16, 68, 9, 115, 251, 20, -34, 44, 44, -69, 67, -94, -29, -41, 108, -16, 48, 213, 186, 52, -60, 42, 9, 121, 96, -11, -142, 40, 30, -128, -82, -31, 31, 16, -91, -2, -37, 154, 130, -83, 25, 112, -16, -13, 151, -6, -195, 152, 114, -127, -79, 152, 72, 31, 58, -1, 97, 131, 9, 0, -28, 173, -78, -188, 8, -76, -77, -50, -48, -59, 14, 142, 32, -162, 9, 42, 6, -49, -79, -223, -49, 156, -34, -211, 17, 84, -62, 25, 43, -1, 94, 251, 133, -82, 175, 135, 67, 25, 40, -25, -150, -33, -12, 8, 35, 46, -62, 41, 146, 123, -46, 125, -72, 41, -60, 62, -16, -93, -19, 22, -138, -145, 17, 65, -126, -80, -63, 68, 62, 31, -151, -34, 39, -73, 48, -12, -73, -168, 58, 12, -151, -92, 82, 34, -58, -56, 7, -9, 280, 186, -44, 105, 135, -55, -29, 1, -65, -143, 46, -107, -48, -16, 128, 115, -33, -50, -144, -73, -18, -64, -120, -57, -71, -64, -76, 73, -37, -127, -111, 64, 93, -47, 42, 79, -57, 120, -42, 122, -14, 109, 108, -41, -51, -32, 38, 108]
5178A08p2j18j42M05j14J19j11k3P5J9q2j73N1J2O2k09J06J14j31O9L5j80Q8J86
5202I4J4n6j8l4r0R9J03J1j08k5j2L2J9o3j28K00kl2K7L4j24M4J15M7k18Q3J21
5229A33l4k09j0J01K4Q4rj33j5J50j3q3J25j28l6l4J18k02l5K47j22O9kj33O2
5254h5J50J22l01K14Q5j24n9kn8l7oJ64j36N2J01jp5p1L9L4k1J54j77k3P1R7k10
5281a03L3J36j09l3J64k02Q2P8j5j85J38jJ8j7O4Mn1M7k8j48J79J3j70p4J41M2
5307Cj25K08j36J36k5LJ11j76J01L8k13R3P0j06l0J48k01n6J88j5N5j40J94j02
$$ y = [108, 36, -82, -224, 181, 67, 186, 75, 52, 127, 146, 64, -109, -58, -46, 16, -193, -87, 27, -104, -35, 0, -180, -92, 94, 108, 52, 34, 0, -90, 9, 112, 123, 15, -10, -22, 10, 29, -34, -162, 38, 36, 4, 31, 65, -59, -15, 100, 147, -71, 12, 133, 99, -110, -120, -19, 5, 89, 80, -53, -68, 82, 69, -14, 111, -17, -53, -87, 31, -171, -206, 41, -81, -12, -14, -147, -85, 65, 187, -114, 100, 185, 61, 2, 0, -58, -95, -101, 63, -73, -21, 80, 79, 4, -67, -28, 6, -15, 139, -38, -61, 10, 107, -103, -70, 66, -43, -76, 88, -114, -32, 46, 31, -154, -16, -17, 1, -16, 48, 52, 1, 48, 20, -128, 51, 64, -106, -180, -39, 3, -122, 86, -50, 86, 61, 64, 175, -1, 100, 138, -75, 18, 88, -18, -48, 100, -101, -157, 31, 16, 71, -69, 125, 23]
$$ [...]
16383C8
##END NTUPLES=NMR FID
##END=
