##TITLE=abcd
##JCAMPDX= 6.0         $$ Bruker NMR JCAMP-DX V2.0
##DATA TYPE= NMR FID
##DATA CLASS= NTUPLES
##ORIGIN= UXNMR, Bruker Analytische Messtechnik GmbH
##OWNER= root
$$ XWIN-NMR		Version 3.5
$$ Sat Jun 28 16:04:16 2025 Russian Standard Time (UT+4h)  servis@DPX200
##.OBSERVE FREQUENCY= 200.131235884673
##.OBSERVE NUCLEUS= ^1H
##.DELAY= (6, 6)
##.ACQUISITION MODE= SIMULTANEOUS
##.ACQUISITION SCHEME= undefined
##.AVERAGES= 32
##.DIGITISER RES= 18
##SPECTROMETER/DATA SYSTEM= spect
##.PULSE SEQUENCE= zg
##.SOLVENT NAME= CDCl3
##.SHIFT REFERENCE= (INTERNAL, CDCl3, 0, 16.5164)
##AUDIT TRAIL= $$ (NUMBER, WHEN, WHO, WHERE, WHAT)
$$ ##TITLE= Audit trail, XWIN-NMR		Version 3.5
$$ ##JCAMPDX= 5.01
$$ ##ORIGIN= Bruker BioSpin GmbH
$$ ##OWNER= servis
$$ F:\spectra/data/av/nmr/H1/1/audita.txt
$$ ##AUDIT TRAIL=  $$ (NUMBER, WHEN, WHO, WHERE, WHAT)
(   1,<2025-06-28 16:03:50.42 +0400>,<servis>,<DPX200>,
      <created by zg, POWCHK disabled, PULCHK disabled
       configuration hash MD5:
       00 E9 B6 7A A2 85 ED C7 34 08 36 98 17 FE 4E 26
       data hash MD5: 32K
       2E BE 29 99 85 1A E6 F3 03 23 60 5E 49 78 99 8F>)
$$ ##END=
$$ 
$$ hash MD5
$$ C9 4D 36 DF 25 09 03 F6 79 CE 48 7F 9C 72 AA 75
##$RELAX= 
##$RELAX= 
##$RELAX= 
##$RELAX= 
##$RELAX= 
##$RELAX= 
##$RELAX= 
##$RELAX= 
$$ Bruker specific parameters
$$ --------------------------
##$DU= <F:\spectra>
##$EXPNO= 1
##$NAME= <H1>
##$PROCNO= 1
##$TYPE= <nmr>
##$USER= <av>
##$AMP= (0..31)
100 100 100 100 100 100 100 100 100 100 100 100 100 100 100 100 100 100 
100 100 100 100 100 100 100 100 100 100 100 100 100 100 
##$AQSEQ= 0
##$AQ_mod= 1
##$AUNM= <au_zg>
##$AUTOPOS= <>
##$BF1= 200.13
##$BF2= 200.13
##$BF3= 200.13
##$BF4= 200.13
##$BF5= 500.13
##$BF6= 500.13
##$BF7= 500.13
##$BF8= 500.13
##$BYTORDA= 1
##$CFDGTYP= 0
##$CFRGTYP= 5
##$CHEMSTR= <none>
##$CNST= (0..31)
1 1 145 1 1 1 1 1 1 1 1 1 1 1 1 1 1 1 1 1 1 1 1 1 1 1 1 1 1 1 1 1 
##$CPDPRG= <>
##$CPDPRG1= <>
##$CPDPRG2= <>
##$CPDPRG3= <>
##$CPDPRG4= <mlev>
##$CPDPRG5= <mlev>
##$CPDPRG6= <mlev>
##$CPDPRG7= <mlev>
##$CPDPRG8= <mlev>
##$CPDPRGB= <>
##$CPDPRGT= <>
##$D= (0..31)
0 2 0 0 0 0 0 0 0 0.06 0 0 0 0 0 0 0.0002 0 0 0 0 0 0 0 0 0 0 0 0 0 0 
0 
##$DATE= 1751112229
##$DBL= (0..7)
120 120 120 120 120 120 120 120 
##$DBP= (0..7)
150 150 150 150 150 150 150 150 
##$DBP07= 0
##$DBPNAM0= <>
##$DBPNAM1= <>
##$DBPNAM2= <>
##$DBPNAM3= <>
##$DBPNAM4= <>
##$DBPNAM5= <>
##$DBPNAM6= <>
##$DBPNAM7= <>
##$DBPOAL= (0..7)
0.5 0.5 0.5 0.5 0.5 0.5 0.5 0.5 
##$DBPOFFS= (0..7)
0 0 0 0 0 0 0 0 
##$DE= 6
##$DECBNUC= <off>
##$DECIM= 32
##$DECNUC= <off>
##$DECSTAT= 4
##$DIGMOD= 1
##$DIGTYP= 9
##$DL= (0..7)
0 120 120 120 120 120 120 120 
##$DP= (0..7)
150 150 150 150 150 150 150 150 
##$DP07= 0
##$DPNAME0= <>
##$DPNAME1= <>
##$DPNAME2= <>
##$DPNAME3= <>
##$DPNAME4= <>
##$DPNAME5= <>
##$DPNAME6= <>
##$DPNAME7= <>
##$DPOAL= (0..7)
0.5 0.5 0.5 0.5 0.5 0.5 0.5 0.5 
##$DPOFFS= (0..7)
0 0 0 0 0 0 0 0 
##$DQDMODE= 0
##$DR= 18
##$DS= 0
##$DSLIST= <SSSSSSSSSSSSSSS>
##$DSPFIRM= 0
$$ [...]
##$SUBNAM0= <"">
##$SUBNAM1= <"">
##$SUBNAM2= <"">
##$SUBNAM3= <"">
##$SUBNAM4= <"">
##$SUBNAM5= <"">
##$SUBNAM6= <"">
##$SUBNAM7= <"">
##$SUBNAM8= <"">
##$SUBNAM9= <"">
##$SW= 20.6817932712277
##$SWIBOX= (0..15)
0 0 3 0 0 0 0 0 0 0 0 0 0 0 0 0 
##$SW_h= 4139.07284768212
##$TD= 32768
##$TD0= 1
##$TE= 0
##$TE2= 300
##$TE3= 300
##$TEG= 300
##$TL= (0..7)
0 120 120 120 120 120 120 120 
##$TP= (0..7)
150 150 150 150 150 150 150 150 
##$TP07= 0
##$TPNAME0= <>
##$TPNAME1= <>
##$TPNAME2= <>
##$TPNAME3= <>
##$TPNAME4= <>
##$TPNAME5= <>
##$TPNAME6= <>
##$TPNAME7= <>
##$TPOAL= (0..7)
0.5 0.5 0.5 0.5 0.5 0.5 0.5 0.5 
##$TPOFFS= (0..7)
0 0 0 0 0 0 0 0 
##$TUNHIN= 0
##$TUNHOUT= 0
##$TUNXOUT= 0
##$USERA1= <user>
##$USERA2= <user>
##$USERA3= <user>
##$USERA4= <user>
##$USERA5= <user>
##$V9= 5
##$VALIST= <valist>
##$VCLIST= <CCCCCCCCCCCCCCC>
##$VD= 0
##$VDLIST= <DDDDDDDDDDDDDDD>
##$VPLIST= <PPPPPPPPPPPPPPP>
##$VTLIST= <TTTTTTTTTTTTTTT>
##$WBST= 1024
##$WBSW= 30
##$XGAIN= (0..3)
0 0 0 0 
##$XL= 0
##$YL= 0
##$YMAX_a= 123050
##$YMIN_a= -90750
##$ZGOPTNS= <>
##$ZL1= 120
##$ZL2= 120
##$ZL3= 120
##$ZL4= 120
##$ABSF1= 10
##$ABSF2= 0
##$ABSG= 5
##$ABSL= 3
##$ALPHA= 0
##$AQORDER= 0
##$ASSFAC= 0
##$ASSFACI= 0
##$ASSFACX= 0
##$ASSWID= 0
##$AUNMP= <proc_1d>
##$AZFE= 0.1
##$AZFW= 0.1
##$BCFW= 1
##$BC_mod= 2
##$BYTORDP= 0
##$COROFFS= 0
##$CY= 19
##$DATMOD= 1
##$DC= 2
##$DFILT= <>
##$DTYPP= 0
##$F1P= 11.0000007629395
##$F2P= -0.999999237060547
##$FCOR= 0.5
##$FTSIZE= 0
##$FT_mod= 4
##$GAMMA= 1
##$GB= 1
##$INTBC= 1
##$INTSCL= 1
##$ISEN= 128
##$LB= 0.05
##$LEV0= 0
##$LPBIN= 0
##$MAXI= 10000
##$MC2= 0
##$MEAN= 0
##$ME_mod= 0
##$MI= 0
##$NCOEF= 0
##$NC_proc= 0
##$NLEV= 6
##$NOISF1= 0
##$NOISF2= 0
##$NSP= 1
##$NTH_PI= 0
##$NZP= 0
##$OFFSET= 16.51637
##$PC= 1
##$PHC0= -273.2733
##$PHC1= 1.101538
##$PH_mod= 0
##$PKNL= yes
##$PPARMOD= 0
##$PSCAL= 4
##$PSIGN= 0
##$REVERSE= no
##$SF= 200.13
##$SI= 16384
##$SIGF1= 0
##$SIGF2= 0
##$SINO= 400
##$SIOLD= 16384
##$SREGLST= <1H.CDCl3>
##$SSB= 0
##$STSI= 0
##$STSR= 0
##$SW_p= 4139.07284768211
##$SYMM= 0
##$S_DEV= 0
##$TDeff= 0
##$TDoff= 0
##$TI= <>
##$TILT= no
##$TM1= 0
##$TM2= 0
##$TOPLEV= 0
##$USERP1= <user>
##$USERP2= <user>
##$USERP3= <user>
##$USERP4= <user>
##$USERP5= <user>
##$WDW= 1
##$XDIM= 8192
##$YMAX_p= 0
##$YMIN_p= 0
$$ End of Bruker specific parameters
$$ ---------------------------------
##NTUPLES= NMR FID
##VAR_NAME=  TIME,          FID/REAL,        FID/IMAG
##SYMBOL=    X,             R,               I
##VAR_TYPE=  INDEPENDENT,   DEPENDENT,       DEPENDENT
##VAR_FORM=  AFFN,          ASDF,            ASDF
##VAR_DIM=   16384,         16384,           16384
##UNITS=     SECONDS,       ARBITRARY UNITS, ARBITRARY UNITS
##FACTOR=    0.0002416,     1,               1
##FIRST=     0,             0,               0
##LAST=      3.9581328,     0,               0
##MIN=       0,             -90750,          0
##MAX=       3.9581328,     123050,          0
$$ Real data points
##PAGE= N=1
##DATA TABLE= (X++(R..R)), XYDATA
0@%%%%%%%%%%%%%%%%%%%%%%%%%%%%%%%%%%%jOj7L0m2N2n8O1o2O2o4O7p1Q0r1J02
$$ 0 0 0 0 0 0 0 0 0 0 0 0 0 0 0 0 0 0 0 0 0 0 0 0 0 0 0 0 0 0 0 0 0 0 0 0 -1 5 -12 18 -24 28 -30 31 -31 31 -33 34 -37 43 -48 54
51E4j12J20j33J48j60J75j93K14k38K63k95L30l63L97m23M06k24q24J4086J09822
$$ 54 -58 62 -71 77 -83 92 -101 113 -125 138 -157 173 -190 207 -216 190 -34 -858 13228 123050
71A23050k4562j25344n4601K7010O1409L1466k3376j7078K0518J5781m6061l4933
$$ 123050 98488 -26856 -81457 -54447 6962 38428 15052 -2026 18492 34273 -11788 -46721
83d6721L6912M6094J3891k7241l9877j9146K9233L2596k6677k1577K4877K3348
$$ -46721 -9809 36285 50176 22935 -16942 -36088 -6855 25741 -936 -22513 2364 25712
95B5712j9293k9485J864J7659K7247k77l7740q963L6855J6913m4300k8539L0206
$$ 25712 6419 -23066 -21202 -3543 23704 23427 -14313 -23276 13579 30492 -13808 -42347 -12141
108a2141L6335L298l7598l6368J4208N7225J8509n1986l3182K5971L8389Q893
$$ -12141 24194 27492 -10106 -46474 -32266 24959 43468 -8518 -41700 -15729 22660 31553
120C1553k0765k8573q961L1803K0264k3337j7113J7313J4107j9567j8938N644
$$ 31553 10788 -17785 -26746 5057 25321 1984 -15129 2184 16291 -3276 -22214 -16570
132a6570K6421K7651j4912m6242j1424M3518L0550k1857k7611m678J1902J3722
$$ -16570 9851 37502 22590 -23652 -35076 8442 38992 17135 -10476 -15154 -3252 10470
144A0470l31j4718o639J4294j386j8100N110K5867R128k0133k3741p689K1208
$$ 10470 10139 -4579 -11218 3076 1690 -16410 -11300 14567 23695 3562 -20179 -27868 -6660
157f660L6619L378l5744k6684R577J9101N627j395l699K402L126j3364j9325R264
$$ -6660 29959 33337 -2407 -29091 -19514 -413 5214 3819 120 2522 5648 -7716 -27041 -17777
171a7777L6808J3425k3098k3731j593J3516J0819j259q613K474J1231n327j9247
$$ -17777 19031 32456 9358 -14373 -15966 -2450 8369 7110 -1503 971 12202 6875 -12372
184a2372p897J2440J8246Q469o123j7886q420P432Q077J823M779Q322n898j9674
$$ -12372 -20269 -7829 10417 18886 12763 -5123 -13543 -6111 1966 3789 8568 16890 10992 -8682
198h682j3360P538K4041J3886j3394k6414o450J8556J5632k910j1688k955O649
$$ -8682 -22042 -14504 9537 23423 10029 -16385 -22835 -4279 11353 8443 -3245 -6200 449
211D49M657k949n261J616N028n04o443m261M662P268j11q948o972M560J1821P018
$$ 449 5106 2157 -3104 -1488 3540 3036 -3407 -7668 -3006 4262 4151 -4797 -11769 -7209 4612 11630
227A1630o103j1037j006Q900M849m067j615K612k473o202k422M652P263J777q470
$$ 11630 5527 -5510 -6516 2384 7233 3166 1551 4163 1690 -4512 -6934 -2282 4981 6758 -1712
242a712r245N454J1989K385o186m573o06L281O475r71r060k799O072K031m781
$$ -1712 -10957 -5503 6486 8871 2685 -1888 -2494 787 7262 6291 -2769 -5568 504 2535 -2246
257b246k276J86J274M741N21n989L29P982o80p143K800P008j317n189m030l403
$$ -2246 -4522 -4336 -3062 1679 2200 -3789 -3460 4522 3842 -3301 -501 6507 5190 1 -4029 -7432
273g432L655R629j377j0141j119M542l82J870O392j213m240K920n86o859K966
$$ -7432 -3777 5852 4475 -5666 -6785 -2243 -2625 -755 5637 4424 184 3104 2518 -4341 -1375
288a375R584j545q077k898j957J212Q547J667r645j363R024k77n043M086L116
$$ -1375 8209 6664 -1413 -4311 -6268 -5056 3491 5158 -4487 -5850 3174 2897 -2146 1940 5056
303E056m031L33K408m969r63N424l602p102M638N389m292j093K979m164l20J0357
$$ 5056 1025 1358 3766 -1203 -2166 3258 -344 -7446 -2808 2581 -1711 -2804 175 -3989 -4309 6048
319F048J907r539j063N224j734j002L462l846l956M921J12q258L310R574l286
$$ 6048 7955 -1584 -2647 2577 843 -159 3303 -543 -4499 422 534 -7724 -4414 5160 1874
334A874n795M233J839l360M115K939o558k86O380m030o423M440K009m920K755
$$ 1874 -3921 312 2151 -1209 2906 5845 -713 -999 5381 1351 -5072 -632 1377 -3543 -788
349g88L748o800k137R170N92o635L365M875m277j400K558l871q92P604j923j0086
$$ -788 2960 -3840 -5977 3193 3785 -2850 515 5390 1113 -287 2271 -1600 -2492 5112 3189 -6897
365f897K109O827l505j807N271j353m368M628K364n161K013N618m475m240M287
$$ -6897 -4788 2039 -1466 -3273 1998 645 -3723 905 3269 -1892 121 5739 1264 -2976 1311
380A311k49m240L936K067p238o01P725j442n189L526K972k863J595K330m728n22
$$ 1311 1062 -3178 758 2825 -4413 -5014 2711 1269 -3920 -394 2578 -285 1310 3640 -1088 -1610
396a610O176k238o084M089L234n983j509M561j593j825N025m1n669J915M406k554
$$ -1610 4566 2328 -3756 333 3567 -2416 -3925 636 -957 -2782 2243 2202 -3467 -1552 2854 300
412C00j36M180k719m251L625P75n433J757N766l371m778K503J221j574K811J816
$$ 300 164 4344 1625 -2626 999 1774 -3659 -1902 3864 493 -4285 -1782 -561 -2135 676 2492
428B492l743R52M405l134l742L952J666l818P56K516l277k495K630k73j844L460
$$ 2492 -1251 -299 4106 972 -2770 1182 2848 -970 -214 2302 -975 -3470 -840 -1113 -2957 503
444E03K274l068n58J849j715j93M638J77m290M10J943l288k235K412J296j56J230
$$ 503 2777 -291 -849 1000 -715 -908 3730 3907 -383 27 1970 -1318 -3553 -1141 155 -1 1229
461A229j814l537J457L783K05K99K218j349l774M14J792j253J22K122j047k867
$$ 1229 -585 -4122 -2665 1118 1323 1622 3840 2491 -1283 -869 923 -330 -208 1914 867 -2000
477b000q23m40K10L337K711j675j957M86M4L65K540O99l079k251R15J390Pj236
$$ -2000 -2823 -3263 -3053 284 2995 1320 -637 -151 -107 258 2798 3497 418 -1833 -918 472 479 -757
495g57k197m41K315J857l08j09N37n44q54O43J268J300N71q16k809l387j256K710
$$ -757 -2954 -3395 -1080 777 469 360 897 353 -501 142 1410 2710 3281 2465 -344 -3731 -4987 -2277
513b277M374J316k947l652j074J677L519K376K52o50j409k130j309R08J133K30
$$ -2277 2097 3413 466 -3186 -4260 -2583 936 3312 3564 2914 1505 -625 -1934 -1026 107 337
529C37J429M23l619m000L43L221L418K500j029l725j257J822R46N16J734n60l081
$$ 337 1766 2189 -1430 -5430 -5087 -1866 1552 4052 3023 -702 -1959 -137 809 1325 3059 2499 -582
546e82l71M04k138r84K946J616n39O2p12j607J795K722j672j253K864P78k710
$$ -582 -953 -549 -2687 -3671 -725 891 352 414 -298 -1905 -110 2612 940 -313 2551 3329 619
563F19o30q55l328M86N560J800k875k367k545j030N196N582j719l119M20j884
$$ 619 -11 -866 -4194 -3708 1852 3652 777 -1590 -4135 -5165 31 5613 3894 775 1195 -689
579f89j987K777K454k482m39K313k602l911J527K103N89L075P62n340j505N086
$$ -689 -2676 101 2555 73 -366 1947 -655 -4566 -3039 -936 -347 2728 3490 -1850 -3355 1731
595A731J131k636P42L4k512J738K986l725m221K464K293k12K135l21m750O81N615
$$ 1731 2862 226 968 1002 -1510 228 3214 -511 -4732 -2268 25 -187 1948 1627 -3123 -2442 3173
612C173r44m187K034K671r84N18m39o187k003O727L683j708j158l322m993L389
$$ 3173 2229 -1958 76 2747 1763 2281 1842 -4345 -6348 379 4062 2354 1196 -2126 -7119 -3730
628c730P923k26l330J560m68m491P02K560r65J757M475l658p572j08L141K016
$$ -3730 4193 3967 637 2197 1729 -2762 -2060 500 -465 1292 5767 2109 -5463 -5571 -2430 -414
644d14M420J644p551m498N554M052k056J89L45k783J097L396l644m182L350K775
$$ -414 4006 5650 -1901 -6399 -845 3207 1151 1340 1685 -1098 -1 3395 -249 -4431 -1081 1694
660A694j976O21O80m267l97N828P02m010J142K127j929O72J699l572k414M029
$$ 1694 -282 339 1019 -3248 -3645 2183 2885 -1125 17 2144 215 887 2586 -986 -3400 629
676F29J599k952N04M63l767L24N216k36l309K111K337k750p28J150j881R99M583
$$ 629 2228 -724 -220 243 -3524 -3200 2016 1780 -1529 582 2919 169 -559 591 -1290 -291 4292
693D292j194o147n15K369n44J738K958k838l467K900J835j931R76K583j857j170
$$ 4292 3098 -3049 -3564 -1195 -1739 -1 2957 119 -3348 -448 1387 -544 432 3015 1158 -12
709a2J667j598k501K821J111l561l89L134p85j876J999N34j680J577K344j914
$$ -12 1655 57 -2444 377 1488 -2073 -2462 672 -113 -1989 10 544 -1136 441 2785 871
725H71l09J788k122k595K299J810k126m66O77k102p31L165Q10j692J079J652j268
$$ 871 562 2350 228 -2367 -68 1742 -384 -850 -173 -2275 -3006 159 969 -723 356 2008 740
742G40n61N38r22L16K634p78l935l77J927p45m25J644J01q44P15K19j192J170
$$ 740 179 717 -205 111 2745 1967 -1968 -2345 -418 -1163 -1588 56 157 -687 28 247 -945 225
760B25K531p04j795L10l60j259Q31R03j469n83R01l66r33J274J416l31j89N9j77
$$ 225 2756 2052 257 567 207 -1052 -221 682 -787 -1370 -469 -835 -1768 -494 922 591 402 461 284
779B84P77J202j238k400M91J598l34j168n28l0L68P59j71j45P93R01k22o23J66
$$ 284 1061 2263 1025 -1375 -884 714 380 -788 -1316 -1346 -978 -219 -390 -535 258 1159 937 314 480
798D80J91R3J25o05p20l09J51l5l54j09P08O53k90p54O52J110M41m07o67j83M67
$$ 480 671 764 889 284 -436 -745 -594 -629 -983 -1092 -384 269 -21 -775 -123 987 1428 1021 354 171 638
819F38J14j041q50Q72N64r51p51N52K43N70Q93l68j005P77R12m01l07M58p76o87
$$ 638 752 -289 -1139 -267 297 -654 -1405 -853 -610 -40 853 485 -520 257 1169 768 461 919 143 -544
839e44O96m28j132Q99J244j428j192J607Q91o08M91K28q62Q12J184j542j474J723
$$ -544 152 -276 -1408 -509 735 -693 -1885 -278 613 5 496 724 -138 674 1858 316 -1158 565
857E65N10j744l7O92j303P5J878o31j581J710J070j474K34J565j051n93J626r41
$$ 565 1075 -669 -706 -14 -1317 -1242 636 5 -1576 134 1204 -270 -36 1529 478 -115 1511 570
875E70k145J400J570k094j010J927m58j207J411M58j462J445J591k317o69K646
$$ 570 -1575 -175 1395 -699 -1709 218 -240 -1447 -36 422 -1040 405 1996 -321 -990 1656
891A656O1k508R16Q71k170K90K027j695j763K233O67j988J274J385j581j1K531
$$ 1656 1717 -791 125 996 -1174 -884 1143 -552 -2315 -82 585 -1403 -129 1256 -325 -336 2195
908B195j247k068K125J004l070j74K203j432j262K093n25k070K116J556k474K6
$$ 2195 948 -1120 1005 2009 -1061 -1235 968 -464 -1726 367 -158 -2228 -112 1444 -1030 -1004
924a004L099q71j984K044K99k710Q89K084k493j286K273m94k087J826J188k146
$$ -1004 2095 1224 -760 1284 1583 -1127 -238 1846 -647 -1933 340 -154 -2241 -415 773 -1373
940a373P99K679j729j764L007N36k825O75J737k292o54J961j270j939K190J073
$$ -1373 -574 2105 376 -1388 1619 2155 -670 5 1742 -550 -1204 757 -513 -2452 -262 811
956H11k662P43K858j696j099K732j91k242J773J374l046o63K161j076j865K248
$$ 811 -1851 -1108 1750 54 -1045 1687 1496 -746 1027 2401 -645 -1308 853 -223 -2088 160
972A60J13k451J372K082k259m34L392Rk471J240J047k503M36J891j807j742K206
$$ 160 273 -2178 -806 1276 -983 -1417 1975 1984 -487 753 1800 -703 -267 1624 -183 -1925 281
989B81k03k532J284J898j680N1K684j011j772J869J090k258K19J939j672j231
$$ 281 78 -2454 -1170 728 -952 -901 1783 772 -1000 869 1959 -299 -80 1859 187 -1044
1005a044J355p13k002J792J479k039J53K403j016j709J779J019j096Q35P34k338
$$ -1044 311 -402 -2404 -612 867 -1172 -1019 1384 368 -1341 438 1457 361 1196 1930 -408
1021d08j082J921l21j533J030Q07j689K29J404j138m56K761O66k067j42P27j042
$$ -408 -1490 431 110 -1423 -393 414 -1275 -1046 358 -780 -1236 1525 2191 124 -18 709 -333
1038c33L09J498j178j530J027L58j725K84J693o53n07J397R1j065P60O27r25K29
$$ -333 -24 1474 296 -1234 -207 151 -1574 -1290 403 -250 -757 640 731 -334 426 1053 128 357
1056C57J083j193j311R52L22r72N5K18n92L98J853j69j732j85J082P49N97l11
$$ 357 1440 247 -1064 -112 210 -762 -707 -489 -1081 -683 1170 1001 -731 -916 166 915 1512 1201
1074A201j450l93J070q4j202qJ057J16l72o23p86K46J594R78m84o91k41r8L66
$$ 1201 -249 -642 428 344 -858 -866 191 307 -65 -688 -1474 -1228 366 1344 860 169 -72 -170 196
1093A96L84l6l53l9n90j33k06J41R7K11N03Q6K68p65n55P35J297L21q82j020l59
$$ 196 580 544 191 152 -438 -571 -777 -636 -539 -328 175 261 529 -236 -791 -56 1241 1562 680 -340 -699
1114f99P07P94p38j541N21J228P7n57n04n32P32K093M1j558k20P29j04m55J86
$$ -699 8 802 64 -1477 -956 272 349 -208 -712 -1244 -512 1581 1622 64 -156 573 469 14 200
1133B00n62m1R25j68j949j87J565J63j24J030J1j388L99P65l39N36Q93j614j616
$$ 200 -362 -403 522 354 -1595 -1782 -217 -54 -178 852 863 -525 -126 639 300 836 1729 115 -1501
1152a501J312O93j196k70O32n95L98J637q26k087J819J909o78q98K84q37j11J750
$$ -1501 -189 504 -692 -962 -330 -925 -527 1110 284 -1803 16 1925 1247 349 633 -204 -315 1435
1170A435j015k835Q93K460q99j090O66m64l22K232O03j922L55J759j385j311J437
$$ 1435 420 -2415 -1522 938 39 -1051 -385 -849 -1171 1061 1664 -258 97 1856 471 -840 597
1187E97j26j571J086P60k158m56J902p69q57K732J107k502l28J166m50L39K006
$$ 597 471 -1100 -14 746 -1412 -1868 34 -735 -1592 1140 2247 -255 -583 583 133 472 2478
1204B478j834k676J659J627k220q33J631l64k97J780q50k237K163K819j870j343
$$ 2478 644 -2032 -373 1254 -966 -1799 -168 -532 -829 951 101 -2136 27 2846 976 -367
1220c67J143m11r19J721l40l083P50K616j325j716J751L36j128J421J070j872
$$ -367 776 365 -554 1167 827 -2256 -1506 1110 -215 -1931 -180 156 -972 449 1519 -353
1236c53M15K207j653j947K098N45k490K65J611j466o72J908j011j513K652J617
$$ -353 62 2269 616 -1331 767 1312 -1178 -913 698 -768 -1440 468 -543 -2056 596 2213
1252B213k528m77J916o18n96J734p97k466J506J786k661j302K358O1r13J118j90
$$ 2213 -315 -792 1124 506 -90 1644 847 -1619 -113 1673 -988 -2290 68 129 -784 334 144
1269A44j768J552K616k139j670K215N00j831M75N88j888L35J925j480j702J980
$$ 144 -1624 -72 2544 405 -1265 950 1450 -381 94 682 -1206 -871 1054 -426 -2128 -148
1285a48J070j751M02J333j197K71J892j180j844J615J262k117n67J382p19o28
$$ -148 922 -829 -427 906 -291 -20 1872 692 -1152 463 1725 -392 -959 423 -296 -924
1301i24J191o15j348J742J486k012o95K054J00j059N95L7j344R78J275k043j174
$$ -924 267 -348 -1696 46 1532 -480 -1175 879 979 -80 515 552 -792 186 1461 -582 -1756
1318a756J945K07j335M64N05q69Q20J329j371r90J832Q20j562k62O97n06k3N93
$$ -1756 189 396 -939 -475 30 -839 -19 1310 -61 -1051 781 1601 39 -223 474 -32 -55 538
1336E38j124r40J572O01j425k66J101K07k39O06m14o57J067P45j384o13R63N6
$$ 538 -586 -1526 46 647 -778 -1044 57 264 25 631 217 -440 627 1372 -12 -625 338 394
1354C94p13p2k53l15R18M99r78m57J333P22p28k51L66j70L90J92j228m82R22K07
$$ 394 -319 -391 -644 -959 -41 458 -520 -977 356 1078 350 99 465 295 685 877 -351 -833 89 296
1374B96q57l49K28L29M39o2l98J29J005K22n65k31J74K84j99n11n23J73M23j56
$$ 296 -561 -910 -682 -353 86 24 -374 -245 760 982 417 186 360 644 445 -66 -589 -416 7 -149
1394a49m91k30L89O28J63m49k0Q04M73m80m95j5K36j31j28r36j74P04L42p09k00
$$ -149 -640 -870 -481 147 310 -139 -159 645 1118 638 143 128 364 233 105 -831 -1005 -301 41 -668 -868
1415h68N86M80K51J26m33j69R69L54j280m88O99k13m26L4m76k55J084L70j028
$$ -868 -282 198 449 575 142 -27 942 1296 16 -472 227 14 -412 -378 -854 -1109 -25 345 -683
1434f83k06J526J48n24K63K5l04M15K63j301n03J136q0j226K42N36l56M03Q05
$$ -683 -889 637 785 261 524 549 245 660 923 -378 -881 255 175 -1051 -809 -273 -629 -226 579
1453E79q64r3J452K16j462K13R30q06k72M12r63m10J117J92j624L96J577m80m57
$$ 579 -285 -378 1074 1290 -172 41 971 165 -107 305 -658 -1068 49 241 -1383 -987 590 110 -347
1472c47Q03p7n52J195L40j745j23J571p83j332P78J24j003Q80Q61j551rJ980j82
$$ -347 456 379 -173 1022 1362 -383 -506 1065 282 -1050 -272 -148 -1151 -271 590 -961 -970 1010 828
1491H28j495J091P69j118Q5Q87j402p08J826l25k002P49J327j099o3J288p12n93
$$ 828 -667 424 1193 75 160 1047 -355 -1063 763 438 -1564 -815 512 -587 -650 638 -74 -667
1509f67J633J20j728N23J513j297q62J282m06j257J206M16j778M10J809q36j134
$$ -667 966 1086 -642 -119 1394 97 -765 517 111 -1146 60 476 -1302 -892 917 81 -1053
1526a053J408M32j179P72Q76j628j75J884q31j671J064P68j541L39J037j223l43
$$ -1053 355 787 -392 380 1256 -372 -547 1337 506 -1165 -101 667 -874 -535 502 -721 -1064
1543a064J858k25j599J008J410j434k72J272o35j017J371L6j954N46J427j250
$$ -1064 794 569 -1030 -22 1388 -46 -318 954 319 -698 673 709 -1245 -699 728 -522
1559e22n87J293r1r60J407M27j478L69J468q54j033J267q1j417N51P47j284j94
$$ -522 -1109 184 93 -867 540 967 -511 -142 1326 472 -561 706 625 -792 -241 506 -778 -972
1577i72J507o17j182J243P77j220M16J237q86n84J196l92j389R46P56j261m34
$$ -972 535 -82 -1264 -21 756 -464 -48 1189 303 -281 915 523 -866 80 836 -425 -859
1594h59J126o58o89J317k7j067P25J253r18n49R94m4q12Q16m8j333J39J040p03
$$ -859 267 -391 -1080 237 210 -857 -132 1121 203 -346 648 604 -208 608 560 -773 -634 406 -297
1613b97p57Q32J70p60Q50P21r53N7J100m35o18Q19Q1j091NO26n75n67O27k35n13
$$ -297 -1054 -222 -52 -812 38 759 -194 -137 963 528 -90 729 810 -281 -276 350 -225 -792 -165 -400 -913
1634i13R12L95q53J53Q75K8k14L47l14p48N07M39p35n88L47J8k89M44Q2o26N87
$$ -913 -1 394 -459 -306 569 597 383 730 416 -332 175 614 -121 -709 -362 -344 -633 -189 -107 -733 -146
1655a46Q23l18l60L25J30j27K71q1p46k22L16k65j17J03N3j47K77L75l8Q0J96
$$ -146 677 359 -1 324 454 327 598 517 -229 -451 -135 -400 -517 -414 -361 -508 -231 144 106 186 382
1676C82P5K3J42r5n91j38J26K7n3m33j63K06N40l6j81J4K42N42K02k99n54N7L23
$$ 382 457 480 622 527 -64 -202 -76 -49 -102 -535 -698 -492 48 12 -169 -155 87 629 831 532 -22 35 358
1699C58j10l28l17k00R5L04q5j76J77M08l3Q2L10k28J04R2K1m43J49j03m77q9
$$ 358 248 -80 -397 -597 -502 -198 -283 -459 -282 126 93 175 485 257 361 453 474 31 180 77 -400 -489
1721d89M85k43l84M35J15j83M77L43m72o7P10j29n57J27M8n09K88K90p31m66R45
$$ -489 -4 -247 -631 -196 -81 -264 213 556 84 17 727 598 41 168 216 -293 -5 285 -446 -912 33
1742C3J68o21K14L08k70L57Q42q17n87Q18J30q16J13M85o86j81P84n38o72Q03
$$ 33 201 -420 -206 102 -168 189 1031 214 -373 445 575 -241 -128 357 -329 -510 274 -264 -936 -133
1762a33O17r86K43R07k79o65Q89m3p33N55K41j004k72J028l07q56N75L03o77N20
$$ -133 484 -502 -259 648 369 -296 593 550 -183 372 613 -391 -663 365 58 -798 -223 80 -597 -77
1782g7P30r45l51J351M5j078L79O01q93L08N25r41p25J253K42j219J47Q94n91
$$ -77 653 -292 -643 708 753 -325 54 655 -238 70 595 -346 -1071 182 424 -795 -648 246 -345
1801c45r7J055m92q01J225O66j588N2R95o30n29P55k59q82N88P31j149J18J100
$$ -345 -442 613 121 -680 545 1211 -377 -325 670 40 -489 266 7 -875 -287 444 -705 -587 513
1820E13k16o95R08K50j041O29N17j242k11J237k24j401N38O56r04L20Q00q25l40
$$ 513 297 -398 510 760 -281 348 865 -377 -588 649 425 -976 -438 218 -686 -366 434 -391 -731
1839g31J419L52j494M47R77o96m20O28n94p68J062K31j323J17J184n15m64J010
$$ -731 688 1040 -454 -7 970 274 -146 482 -112 -880 182 413 -910 -793 391 -124 -588 422
1857D22k02n96R23M81j204j58J213o52q06O11J56r40L42O85r73j17J350j47j038
$$ 422 220 -376 547 1028 -176 -334 879 227 -579 32 188 -752 -410 275 -698 -815 535 388 -650
1876f50R19O71q09q4P77q01m28R96k70j243K81Q84o98j72O62k18l69J061K49j051
$$ -650 269 940 131 47 824 23 -405 591 321 -922 -641 243 -455 -627 35 -183 -552 509 758 -293
1896b93L09Q94n19n40M32j86n54M69J78j082K29Q62k86l56M79K97m39O21K70p42
$$ -293 16 910 391 -149 283 97 -457 12 190 -892 -663 199 -87 -443 36 333 -106 515 785 43
1916D3P2O99m39o64J74J75m92O6K51l50o7P27J5n61L28O48k71j09J94l14q6M15
$$ 43 115 814 375 -289 -115 60 -432 -366 -115 -465 -532 195 210 -351 -23 625 354 245 439 125 39 454
1938D54l04o60J18N14k19n18L66R5L4L91Qn37L58N90l12l86O9J71l91J42j76k87
$$ 454 150 -510 -392 122 -97 -615 -249 -154 -120 271 279 -258 100 690 378 -8 61 232 -159 -17 -193 -480
1960d80O1M23n9l91L20M29j30q9Q1q5J71L33k51m91K07R5j93k38o3QJ55K79l39
$$ -480 -419 4 -55 -446 -126 303 173 84 165 80 251 584 333 -158 49 144 -49 -287 -350 -342 -187 92 -247
1983b47Q0J66L20o0r5q7p0M75j69n24N9J03M3k73k8j84J40N17j11l40L17K70j02
$$ -247 -167 -1 319 259 164 77 7 482 313 -211 -152 -49 -6 -279 -307 -491 -351 166 55 -285 32 302 200
2006B00m0P8j50J7K57k23n15J30L19j25k68J38m2O8M58j23m74L71N07m62j01K49
$$ 200 160 238 88 105 362 139 -376 -246 73 -52 -320 -182 -224 -156 302 179 -295 76 583 121 20 269
2028B69r9k27J08pn36J72N46n04m18N80L01l49K30L70m36P0O60m23o83N25K60
$$ 269 170 -57 51 44 -492 -320 226 -278 -696 -116 185 -164 66 436 0 70 730 307 -376 149 409
2049D09o76l8L31n00j0N82k49m76N59N25m04j57O19l58j62O12k60p15K60O07p63
$$ 409 -267 -305 26 -474 -484 98 -151 -627 -68 457 53 -104 515 157 -5 607 347 -368 -108 499 -264
2070b64m12O64j21m52O54J35p62N86P88o92m13R22L5q66K98J51o36NN32m64o99
$$ -264 -676 -12 -133 -585 69 204 -558 28 816 124 -289 633 668 -198 100 251 -385 -380 152 -312 -1011
2091a011J013K61p45K67P22m63j30Q44l65o90O50L42r58j32O54m39n29O55pq28
$$ -1011 2 263 -482 -215 507 44 -86 758 393 -297 353 695 -263 -395 259 -180 -709 -54 -61 -889
2111h89P78P09p25k78J105k34n48N62Q0r10K47P03q59n50R68j38p32M99M31o17
$$ -889 -111 598 -127 -405 700 466 -82 480 560 -350 -103 600 -259 -809 159 21 -711 -212 219 -398
2131c98L18P93n12n30Q58K71r61J98L22n88k06O36m11p50P50N22p86K21O30k67
$$ -398 -80 713 201 -329 529 800 -161 37 359 -229 -435 201 -210 -960 -210 312 -474 -253 377 110
2151A10l75Q13o6q01N59N15r11l06Q76m04o77N14J36m65L68O81q19o5Q66p3o03
$$ 110 -265 548 482 -319 240 755 -156 -462 414 10 -667 -153 -17 -482 -114 567 -252 -317 549 476 -127
2172a27L36L65o97J69L93o47m33O73P6n51q3P19l96r5P95l00n49O94L09p60L2
$$ -127 209 574 -123 46 439 -208 -641 32 108 -443 -526 193 -203 -298 497 197 -352 342 651 -109 -77
2193g7M82m19l91N58r6p11N04K87n62J09P41k73m96N46L21o08K06K81n13q6M56
$$ -77 405 -14 -405 153 57 -654 -150 137 -425 -316 425 152 -344 202 523 -85 121 402 -111 -197 259
2214B59j94n81K56L23l33J40L85n56r9P45P5m94J42M84n69J52J02k79l04M47M5
$$ 259 65 -516 -260 63 -270 -130 255 -301 -400 345 420 -74 68 552 -17 135 237 -42 -346 101 146
2235A46n81K37K37j52j68L60r9k4J84K53j64k58K65j7k40J25j23k81K28J58m43
$$ 146 -435 -198 39 -113 -281 79 -20 -44 140 393 229 -29 236 219 -21 104 -19 -300 -72 86 -357
2256c57J91J95l1k50L22K82j48Pj2j61K9K01j14k60j11J61k40P4N8o7K4K80M9
$$ -357 -166 29 -2 -252 70 352 204 211 199 38 67 268 154 -106 -217 -56 -296 -222 -164 -231 -207 73 122
2279A22r4O6P8o3K22p7k42J29O7k72m3o5j55J26K0K1N1L05q0k23M12K4j04j37
$$ 122 28 94 172 109 331 254 12 141 208 -64 -107 -172 -327 -201 -181 -160 -109 196 116 -107 305 329 225 88
2303H8J42j21k46K27j73k05R8J54j12o2P0K5J9L83J32l76O4L16k16l39K15p1m00
$$ 88 230 109 -137 90 -83 -288 -190 -36 -148 -210 -140 -115 -96 287 419 43 107 423 207 -132 83 12 -388
2326c88L89rm55K2M04j47j38N04Q4l20L07K51l73k22M55l11m53L47J37n01P0M30
$$ -388 1 -8 -463 -441 -37 -184 -322 182 266 -54 253 504 131 -91 364 53 -400 -53 84 -417 -347 83
2348H3l41j38O66k3m36M04N65p50OL45k92l27M04j51n47K25N45m70l88P30p0m02
$$ 83 -258 -396 270 247 -189 215 780 30 36 381 89 -238 166 15 -532 -307 238 -232 -620 110 40 -362
2370c62O66J07n02J90O27m57m84M04n0n94K69L74o68J84M72k38l60O15K39m69
$$ -362 304 411 -91 99 726 269 -215 189 139 -455 -186 188 -480 -296 176 -62 -422 193 432 -37
2390c7J80L45l81k71N78j70p17N28M02q07j28O05l22l54P89O2o00M57N03n03l83
$$ -37 143 488 107 -164 414 244 -473 55 457 -350 -478 127 -195 -549 240 302 -298 159 662 159 -224
2411b24O99j13o16M96l3r13L18P85o52m23Q49j6n42M19M44n22l0O69k85o86N58
$$ -224 475 362 -254 242 209 -704 -386 399 -253 -676 173 157 -385 34 478 -44 -74 595 310 -376 182
2432A82K53q63K73N76p62j52P82j18p35N60L90n55J30M76j74m97O84o7p47M36
$$ 182 435 -428 -155 421 -341 -493 289 171 -564 -4 386 -169 -39 437 263 -234 450 383 -364 72
2452G2L43q21j62O42j87m70N96J53n12L56L84m07k89P43ko07K92L03p91J49N96
$$ 72 415 -406 -568 74 -113 -583 13 166 -346 10 394 -13 -302 441 439 -168 124 427 -364 -215 381
2473C81o00l86N13K92n96L36K76k87n1O32l84n01N62K45n55j19M86k71l82M34
$$ 381 -219 -605 -92 200 -396 -60 216 -71 -122 510 126 -375 187 432 -123 -242 244 -27 -409 25
2493B5j55l29M91J85m27M3M80l7k89L38ol77R4L69n56k43M45j50k97J45J70k82
$$ 25 -130 -459 32 217 -210 -167 313 276 -13 325 319 -58 36 405 -151 -394 51 -99 -396 -251 -81 -363
2515c63L86R4j83j02N21n1m40K09K88l88M8J36l86j82L92p3k36N0L63j38q5K36
$$ -363 23 117 -66 -168 353 302 -138 71 359 -29 19 155 -231 -413 -21 -94 -330 -280 83 -55 -140 96
2537I6O0j02J97Q8k83j10J71k10MK7j50r2K93P8l95K47J15J73j57J49L7j31P6
$$ 96 156 54 251 339 56 -54 117 -93 -89 -62 -212 -304 -11 67 -328 -81 34 207 50 199 236 105 181
2560A81o1j64j10O3n6k42mJ56J01Q5k0K1Q3K46j28M5j44J46o7l0j47k57K56m5
$$ 181 120 -44 -154 -91 -147 -389 -393 -237 -136 -51 -71 -50 33 279 151 196 52 198 131 101 -46 -303 -47 -92
2584i2j46j04L09k1OJ49jj73L25J09l71R6J57k02l3Mj89LM1R7l32N2L41M8K5K14
$$ -92 -238 -342 -33 -54 -48 101 100 -73 252 361 -10 86 243 41 8 12 -177 -174 -133 -36 -368 -316 25 73 98 312
2610C12o0j90L32l5l90j93L60k05j88Q8L4j96J33L28l31J04K85P4k76L23k5l35
$$ 312 252 62 394 359 -31 -224 136 -69 -257 -169 -135 -331 -198 130 -201 -97 188 262 -14 309 284 -51
2632e1J10K30m82k08M59o6l62K18K14l28J51L34o4l03N52j6m48K38Q1k64k09L70
$$ -51 59 289 -193 -401 58 -8 -370 -152 62 -266 -115 219 155 -148 404 388 -60 178 259 -5 -214 156
2654A56j91k68L94n7m30J31N71l79j65O08m2n24M08R9m05K8M89k14o08M25jm50
$$ 156 -35 -303 91 34 -396 -265 306 -73 -238 370 328 -196 212 311 -94 -66 423 209 -399 26 25 -425
2676d25K60L17n10J70L76M3l77L62K86m63j09M53l53k45M05J1o84L38L63n62Q4
$$ -425 -165 152 -358 -188 188 231 -146 216 502 39 -70 383 30 -215 190 201 -483 -145 218 -344 -260
2697b60M19k69k16N71J88m88kO22o06q5L69j77m80L86K26p24J08O09j89l60N03
$$ -260 159 -110 -326 245 433 -55 -57 565 -41 -126 243 66 -414 -28 198 -526 -418 191 2 -358 145
2718A45Rl80L81K37m71p6N27j97n07L83J44o09J29M72m41k12N43K6n07M96L88
$$ 145 154 -226 155 392 -79 -155 372 175 -332 51 195 -414 -285 187 -254 -466 77 103 -404 92 480
2739D80n86R1L72l12k26M12l8n88K33M02m49j43M56j97k33L59K30m33N9O47m77
$$ 480 -106 -15 357 45 -181 231 193 -395 -162 240 -209 -352 104 -93 -326 33 263 -170 -111 536 59
2760E9k33M13o1m22K74J34n13j80O10j45l67M85R4l50K27K81j22j44L47k12l75
$$ 59 -174 239 178 -244 30 164 -349 -529 81 -64 -431 54 148 -202 25 306 184 40 387 175 -200
2781b00K72K02m68m9K34o1l78M69j8k37L02L50m59N8L97k14k78L54j18m12N4K98
$$ -200 72 274 -194 -243 -9 -70 -448 21 3 -234 68 418 -41 17 414 200 -78 276 158 -254 -200 98
2803I8l09k08L25K2j31K48J69k97J33K96k11j83L07j22j82l1J61k82j8J48j62
$$ 98 -211 -419 -94 -72 -203 45 214 -83 50 346 135 -48 259 137 -45 -76 85 -197 -215 -67 -229
2824b29j74L84L7p4J20L08j64k72M07j11k37O3j0j73p2J51r4j67K72J2j07K68
$$ -229 -403 -19 18 -56 64 372 208 -64 343 232 -5 58 48 -125 -197 -46 -140 -307 -35 -23 -130 138
2846A38M2o6j15J56J22k13J03j50n2j30J85j00r3K2O2K3J3N4j08J79J23j23j4
$$ 138 180 114 -1 155 277 64 167 17 -35 -165 20 -80 -173 -151 -89 -66 -53 1 -107 72 195 72 58
2869E8J11j64J9q5O9j43O0n1j8p4J50qj29K60n6J09J02j40K9M0K9j38j11J39k51
$$ 58 169 5 24 -61 8 -135 -75 -126 -144 -218 -68 -76 -205 55 -1 108 210 70 99 139 168 30 -81 58 -193
2894a93m9K21q6j00K00N0l1r2K03j36j7J25K9k70K02J54m05KJ91k46L0L8J67p7
$$ -193 -242 -21 -107 -207 -7 43 12 -80 123 -13 -30 95 124 -146 56 210 -195 -193 -2 -248 -218 -180 -13 -90
2918i0m6K81k35O1K30j0k18J66p9j42m1K49k67r4K65M2l85J33K59j41J28J63j11
$$ -90 -136 145 -90 -29 201 191 -27 139 60 -82 -123 126 -141 -235 30 72 -313 -180 79 -62 66 229 118
2941A18k64L40J02l75R3K03l18j43M27k26k86L07J60m16J66M48m88JM95j37k62
$$ 118 -146 194 296 -79 14 217 -101 -244 183 -43 -329 -22 138 -278 -112 336 -152 -151 344 207 -55
2962e5K20K92n92m0L55l44o9J76P2l86J38M91l58l3M40J8m03K83J81m35pL55k32
$$ -55 165 457 -135 -175 180 -164 -233 -57 15 -371 -233 258 -100 -133 307 325 -78 205 386 -49 -56 299 67
2985F7m08L97Nl42J51L07l46r0N53k76k09M41J31m66J51K10k91k61L33j31l42
$$ 67 -341 56 61 -281 -130 177 -169 -259 294 18 -191 250 381 -85 66 276 -15 -276 57 -74 -416
3006d16L00J16j70j45N49k11k45M08J11m16K17K78l60j69L11j94l85L46O4l25
$$ -416 -116 0 -170 -315 234 23 -222 186 297 -119 98 376 16 -153 158 -36 -421 -75 -11 -336
3026c36j7N73l83n7M70K2l56K39K05k99j32L14k63k97K79J58m86K43K44l72nM82
$$ -336 -353 220 -163 -220 250 272 -84 155 360 61 -71 243 -20 -317 -38 120 -366 -123 121 -251 -256 226
3048B26n6k99L52O7l35M2M34m11k07J95R7m49J98J61k94m6M32P3m65M82J63k74
$$ 226 170 -129 223 290 -45 -3 431 20 -187 8 105 -344 -146 15 -279 -325 107 180 -285 197 360 86
3070H6J04O3k58j46K13M6l86K09O2l99J81M21l07O1K68j43j48J15L59k73k58L25
$$ 86 190 253 -5 -151 62 108 -278 -69 -7 -406 -225 196 -111 -50 218 75 -73 42 401 128 -130 195
3092A95r7k63J56M9l60K2L26lk62L56qj05K19j6j96l7M10l34j59J32k0j40K7N3
$$ 195 98 -165 -9 40 -320 -298 28 25 -237 119 111 6 225 209 13 -24 386 52 -107 25 5 -135 -108 -55
3116e5q3n8K87j17k63L59k3j9J28O5o6j26J11j26j07N9J46k50j00J64M2L9O3k1
$$ -55 -138 -196 91 -26 -289 70 47 28 156 221 155 29 140 14 -93 -34 112 -138 -238 -74 -32 7 70 49
3140D9o4J30J49k37K5k5L4j23N5n4j58J84J1J8j30n8N2J50L0j60P9J7K53j48%
$$ 49 -15 115 264 27 52 27 61 -62 -7 -61 -219 -35 -24 -6 -136 -194 -142 8 38 -122 -43 -26 227 79 79
3165G9l5L7q5J25k92j6K06k01p6K28N7L2q8J27j15J10K35k45j14J41J4j50l0O1
$$ 79 44 81 -4 121 -171 -187 19 -182 -258 -30 27 59 -29 98 -17 93 328 83 -31 110 124 -26 -56 5
3189Ej21j50L22j61j09R4K82o7r2J00j14R1k6jk74J55K71l56o6J95j06k3J89K4
$$ 5 -116 -266 56 -105 -214 -120 162 95 3 103 -11 80 54 53 -221 -66 205 -151 -217 -22 -128 -151 38 62
3213F2j30Q0J71j86J9J35P3k76M7J32l02J04Q0k93L1K17N4j08Q2J38r5l2M03l07
$$ 62 -68 12 183 -3 16 151 224 -52 -5 127 -175 -71 9 -284 -253 -36 18 -90 -8 130 35 3 406 99
3237I9k21K65R4k90jJ36k90lK78j81j85J89L94l49p3M34j71j67L03j56k65J22
$$ 99 -122 143 237 -53 -54 82 -208 -211 67 -114 -299 -110 284 -65 -138 296 125 -42 261 105 -160 -38
3259c8Q8j73j46L17j62k17L26R3k07J10L14j94j59M68j38l96J77K13m44L4K89
$$ -38 50 -123 -269 48 -114 -331 -5 88 -119 -9 305 111 -48 420 282 -114 63 276 -168 -134 155
3280A55l18j37L10J73m22J06L91j67k6K65k10k90L66M1l97K2L22l54j32L94l5
$$ 155 -163 -300 10 183 -239 -133 258 91 65 330 120 -170 196 237 -160 -138 184 -170 -302 92 57
3301E7l67M17Q0k61m0M15p3l85L37R5l43J7J98k06l39M66j11k66K51J92l53J83
$$ 57 -310 107 187 -74 -114 301 228 -157 180 275 -68 -51 147 -59 -398 68 -43 -309 -58 134 -219 -36
3323c6L09k79j21L88o5l44K42R2l05j66M52k75l56M12J79m48K46L00l08j3K34
$$ -36 273 -6 -127 261 196 -148 94 186 -119 -285 167 -108 -464 -52 127 -321 -75 225 -83 -96 138
3344A38lk51K52J00l74j2L32l05j43L84n9k87R1K62k38o3M72p5m10L19L2k72J80
$$ 138 135 -116 136 236 -138 -150 182 -123 -266 118 59 -228 -137 125 -113 -176 296 221 -189 130 162 -110 70
3367G0J97j63k77K05R1l99J74K55k17j35M13j71j70M34nk57Q6O5j85j41J78r5
$$ 70 267 104 -173 32 123 -276 -102 153 -64 -199 214 43 -127 307 302 45 131 196 11 -130 48 -47
3389d7j89K68M9l42M4J99M2j01K30K2k51J28K0l9o0K41k04j14Q8R4k32J00P4r3
$$ -47 -236 32 81 -261 -217 -18 24 -77 153 175 -76 52 72 33 -27 214 10 -104 -16 78 -154 -54 20 -73
3413g3o6J60L4j45K34or4%O6j25j73K79p8k74K74j24qk1O0k5K6L3K15j35P4M9
$$ -73 -139 21 55 -90 144 138 44 44 110 -15 -188 91 13 -261 13 -111 -119 -140 -80 -105 -79 -46 169 34 108 157
3439A57o3j02R5j49j25K8J0n0lK64j67J03J5P4O2j23K12j82J12l3k14l1Q9n8q3
$$ 157 94 -8 87 -62 -187 -159 -149 -199 -202 62 -105 -2 13 87 149 26 238 56 168 135 -79 -110 -21 -79 -162
3464a62J75k20K6J77N1j87K12KK6N5n4k8Q6P4j87j21k1J63k83m5J94n8jJ15R3
$$ -162 13 -207 -181 -4 47 -140 72 74 100 155 101 73 159 233 46 -75 -96 67 -216 -261 -67 -125 -126 -11 82
3489H2m1J67p4k2j35Q3r7n8J95p7k93J04M0n8n9L00j32k2K29k1j06j1J96j18r6
$$ 82 41 208 134 112 -23 60 -37 -95 100 23 -270 -166 -126 -184 -243 57 -75 -97 132 111 5 -6 190 72 -24
3514b4K04o7k24J63Nl83K19J22j15j06L18M4j30J49j11Km5L37l50j91J21L2k65
$$ -24 180 113 -111 52 57 -326 -107 15 -100 -206 112 156 26 175 64 66 21 358 8 -183 -62 -30 -295
3537b95J99J30o0k02L20R9k65M8L08l21rK99j50k05K31p8m05J98J82p7k51L55
$$ -295 -96 34 -26 -228 92 191 -74 -26 282 -39 -48 251 101 -104 127 49 -356 -158 24 -53 -304 51
3559E1K0j70J41J27j47p1L87l58k08M78k08j57kJ32k46r5L73j22j68L49K7k00
$$ 51 71 -99 42 169 22 -49 338 -20 -228 250 42 -115 -117 15 -231 -326 47 -75 -243 106 133 -67
3581f7J22K00k38j0J48j20j80J0L14l46Q3O0j68n3M47r0k83K61K43l34JL58k46
$$ -67 55 255 17 7 155 35 -145 -135 179 -167 -84 -24 -192 -245 202 112 -171 90 333 -1 0 358 112
3604A12l50M17m9k80K9J67j64k10M61k11j06L33L1j33j13L06j98j69L67K0l75
$$ 112 -238 179 130 -150 -121 46 -118 -328 133 -78 -184 149 180 47 -66 240 42 -127 240 260 -115
3625a15L3K59k56j49K38M1k94K82P2k51m4L14j20j50L53q6k50K56J1k14l1J50
$$ -115 -82 177 -79 -228 10 51 -243 39 111 -140 -184 130 10 -140 213 127 -123 133 144 -70 -101 49
3647D9j51o1K63j10j10J10K27p4j21K21o9l85L19J40k59O2J10k89J1J93n6l19
$$ 49 -102 -163 100 -10 -120 -10 217 143 22 243 174 -211 108 248 -11 51 161 -128 -117 76 20 -299
3669b99K37J15K0j21K03j9j86K18oj53p6K13j69p7J23j45j06J48P3n9k3K18Lj21
$$ -299 -62 53 73 -48 155 136 -50 168 162 9 -67 146 -23 -100 23 -122 -228 -80 -7 -66 -89 129 132 11
3693A1J71M6j49o2J13k23j60K72L5k57J62rj16pJ39M0RJ64Jn6J5J03l03R3R5q7
$$ 11 182 228 79 17 130 -93 -253 19 54 -203 -41 -50 -166 -173 -34 6 15 179 180 124 139 242 -61 32 127 40
3719D0j49O0l6o7MK13j39O8P2O3q2J53q3o3j4M6j79M1q9Mj9N2J84p8k6J14J9q7
$$ 40 -109 -49 -85 -152 -148 65 -74 -6 66 129 47 200 117 54 40 86 -93 -52 -141 -137 -156 -104 80 2 -24 90 109 22
3747B2Q7P0j48J22p7j28lK2j10J59j30N9m6J83m7o1J76j0j26J41m8JK5j58M1j52
$$ 22 109 179 31 153 76 -52 -55 -33 -143 16 -114 -55 -101 82 35 -26 150 140 14 155 107 108 133 -25 16 -136
3773a36R7n9PJ6j53J55RJ79r2j40K23K2j41J36j2j7j51K0l7j10K78m7j27k9R3
$$ -136 -39 -98 -91 -75 -228 -73 -64 115 23 -117 106 128 -13 123 111 94 -57 -37 -74 -184 94 47 -80 -109 -16
3798a6Qm4J85o6k01L04m5k42O1K07j57j99J65L9j36K7K02j61K5K27j28n9Q3K6
$$ -16 -8 -52 133 67 -134 170 125 -117 -56 151 -6 -205 -40 -1 -137 -110 92 -69 -44 183 55 -4 79 105
3822A05k02J67J25k68r4J41L4j57J58n9j01n6L94j61k18L79j01j69J53J79l17
$$ 105 -97 70 195 -73 -167 -26 8 -149 9 -50 -151 -207 187 26 -192 187 86 -83 70 249 -68
3843f8M8K49k28l4K8J87m61J66K07k11q1L46Qk86K31K18m02J28J86j89j76J76
$$ -68 -20 229 1 -33 -5 182 -279 -113 94 -117 -198 148 156 -130 101 319 -83 45 231 42 -134 42
3865D2J4l54K18K13m33J52K32j71l7P2K27k38pK06n6o3J06n2l21J97J69k49j3
$$ 42 56 -298 -80 133 -300 -148 84 -87 -124 -52 175 -63 -70 136 80 17 123 71 -250 -53 116 -133 -146
3888a46K90m1k67J78J19k15J91J20r3j51K39j77j87K40K7k71M0K03k30k1K39j78
$$ -146 144 103 -164 14 133 -82 109 229 136 -15 224 47 -140 100 127 -144 -104 99 -131 -152 87 -91
3910i1q0J92K74l57n2L90j94n5J06j86j64L4J32j49J25QQ9j38K53Q2l72J83K05
$$ -91 -171 21 295 -62 -114 276 82 27 133 -53 -217 -183 -51 -200 -75 -67 22 -116 137 219 -153 30 235
3933B35k22qK10j59j81J20Nk99J11K80k60K8K85n6j95J49L09l62p4K20Jk37J21
$$ 235 13 5 215 56 -125 -5 0 -299 -188 92 -168 -140 145 89 -106 43 352 -10 -84 136 137 -100 21
3956B1Jj72M9J47p4j42L00p8j79K36L3j81J59M3p7j24Q9M1k66j9K17j11j08J84
$$ 21 22 -150 -101 46 -28 -170 130 52 -127 109 142 -39 120 163 86 -38 51 92 -174 -193 24 -87 -195 -11
3980a1j34o5K56J37k21J84O4r3p5J24k57N3J25r0k57J44R6n6k1J03N3j17J30J11
$$ -11 -145 -210 46 183 -38 146 210 117 42 166 -91 -38 87 -3 -260 -116 -20 -76 -97 6 59 -58 72 183
4004A83j96j2J40j3k51J60K0j83O2K4j20N4J03k0L1O3P5m2J7K5j06J2Mm7m7Q3
$$ 183 -13 -25 115 102 -149 11 31 -152 -90 -66 -186 -132 -29 -49 -18 45 120 78 95 120 14 26 30 -17 -64 19
4030A9j5K3r1L8j73J13J51Q1j86m2J98j18M0J6p2J9Q6j55J43j9j05n3k2J55j31
$$ 19 4 27 -64 -26 -199 -86 65 146 -40 -82 116 -2 38 54 -18 1 87 -68 75 56 -49 -102 -124 31 -100
4055a00N8L3R9j5K8l1j14J60j20J65j91K4o4q0J17j7J1M1o8qj5Q6Q5j82J20L0
$$ -100 -42 -9 90 75 103 72 -42 118 -2 163 -28 -4 -68 -148 -31 -48 -37 4 -64 -72 -87 -1 84 -98 22 52
4081E2p7MK07k05q7P4n2j06O1J50j39J40M2j7n3J12j16k4J71m7j17l3N5j64j11
$$ 52 -25 -21 186 -19 -106 -32 -84 -190 -129 21 -118 22 64 47 -6 106 -10 -34 137 90 -27 -60 -5 -169 -280
4106b80K22J5p2LK66k28Q7J09q4j31J92L3j79J15j8j34q8K38j00k14J88J93j65
$$ -280 -58 -43 -115 -112 154 -74 13 122 38 -93 99 132 -47 68 50 -84 -172 66 -34 -248 -60 133 -32
4129c2j43L86j86j65L14N1k49J12N9k56n5J85j48N%J83k72R9L09j96r9Q5J31j61
$$ -32 -175 211 25 -140 174 225 -24 88 147 -109 -164 21 -127 -122 -122 61 -211 -112 197 1 -98 -13 118 -43
4153d3K25q3j33o2J41j44j67K45l2k21K49N3j68lL37j07o1J57K5l22K19Qk17K3
$$ -43 182 99 -34 -96 45 -99 -266 -21 -53 -274 -25 28 -140 -143 194 87 26 183 208 -114 105 113 -104 -81
4177h1J25j22k84K69Q9j24L1L05j96j04K43K08m17J08J25j45j14J93j40k00K10
$$ -81 44 -78 -362 -93 -4 -128 -97 208 12 -92 151 359 -58 50 175 30 -84 109 -31 -231 -21
4198b1J6k35O8K66j55j31J92J58k25J57L0k12l6K68m1l05J83K6j57O9J50q0j18
$$ -21 -5 -240 -172 94 -61 -192 0 158 -67 90 120 -92 -128 140 99 -206 -23 3 -154 -85 65 -15 -133
4221a33K80p7j83J98J68k76j9K68j52k03J85j38j08J53J34j97p8K18J08j77K59
$$ -133 147 70 -113 85 253 -23 -42 226 74 -129 56 -82 -190 -37 97 -100 -178 40 148 -29 230
4242B30j08j83O5K02r6j55K03j80k16K17M8j08KJ84j29j01K53q0jR0J1k26QJ83
$$ 230 122 -61 4 206 110 -45 158 -22 -238 -21 27 -81 -79 105 -24 -125 128 48 47 137 148 -78 -70 113
4266A13j19j86K19k3j83K25m4q9P8R6K1j00J83j7j86O9J07j44j04J38q0r6O3J61
$$ 113 -6 -192 27 4 -179 46 2 -87 -9 87 108 8 191 174 -12 57 164 20 -84 54 -26 -122 -59 102
4290A02j60N6J15l1j16J56J3k09J69p8J05j01j53K41k64K09j63n3Q3O3m2RN6J7
$$ 102 -58 -2 113 82 -34 122 135 -74 95 17 122 21 -132 109 -155 54 -109 -162 -79 -16 -58 -49 7 24
4314B4m8L5J13j92O5R3l6m1o2N0m8R8k0q1L5k3K1M9J88k09j3M6K6j38J20J2j49
$$ 24 -24 11 124 -68 -3 90 54 13 -49 1 -47 51 31 -50 -15 -38 -17 32 220 11 -2 44 70 -68 52 64 -85
4341h5J22O3j34j18%J10j31J52Q9o2m1J41M8j81J63j48J04p5L7j23K0j08J44j27
$$ -85 37 100 -34 -152 -152 -42 -173 -21 68 6 -35 106 154 -27 136 -12 92 17 54 -69 -49 -157 -13 -140
4365a40Q7K4l8J30O1q3J6M3P4o8J7r0l9m9n4Q0m3O1k5p8J07J72j76J97l9p1m1
$$ -140 -53 -29 -67 63 124 41 57 100 174 106 123 33 -6 -55 -109 -29 -72 -11 -36 -114 -7 165 -11 186 147 76 35
4392C5J99r3j68J54j95qK8o2PK9J4J70k58J5L62k38L5k1Kk5MR6j51o6J66j37Q2
$$ 35 234 141 -27 127 -68 -76 -48 -110 -103 -74 -60 110 -148 -133 229 -9 26 5 7 -18 -14 82 -69 -135 31 -106 -24
4419b4R0k6j02J23%k7M4J55j23j10Q1M9k16j8J35o2m6R0j52m1K85o1j19K3J94
$$ -24 66 40 -62 61 61 34 78 233 110 0 81 130 -86 -104 31 -31 -77 13 -139 -180 105 44 -75 -52 142
4444A42j40j2Q2j63m1J67J05l34N5J12o7o5J32mn8J04K53k20j18J38J1o2N9m1
$$ 142 2 -10 72 -91 -132 35 140 -194 -139 -27 -94 -159 -27 -31 -89 15 268 48 -70 68 79 17 76 35
4468C5j80J20K24k95j18K37k4p4J38p8n9J23J21j82p2K26m6k97J30J04n5j01J94
$$ 35 -145 -25 199 -96 -214 23 -1 -75 63 -15 -74 49 170 -12 -84 142 96 -201 -71 33 -22 -123 71
4491G1L2k54J16K41l22O6K03j07j9Qj4k26J34J00p6qJ02L1k82J66J04k27J48J16
$$ 71 103 -151 -35 206 -116 -50 153 46 27 35 21 -205 -71 29 -47 -55 47 78 -204 -38 66 -161 -13 103
4515A03j0p2J70j37j32J68J59k93n8J62m4r4J66n6j79J27J03n6j09J88p1p1P0
$$ 103 93 21 191 54 -78 90 249 -44 -102 60 16 -78 88 32 -147 -20 83 27 -82 106 35 -36 34
4538C4J96k95L8J81k01j95K43Q8k36J28l1k27K44J38q0j28K12N4j39N2K9Oj02
$$ 34 230 -65 -27 154 -47 -242 1 89 -147 -19 -50 -277 -33 105 25 -103 109 163 24 76 105 111 9
4561IJ90k01q9J11q1J0M2J03oj05O2NKN3K5r1n5J39j05l0P7k9j68O4JJ18q4J35
$$ 9 199 -2 -91 20 -61 -51 -9 94 88 -17 45 50 52 105 130 39 -16 123 18 -12 65 36 -132 -68 -67 51 -33 102
4589A02j7l02K88P0l8j50J15l5j14O4p0l0J30j22O3j38K32m4M3Q4m8j9M0k7j10
$$ 102 85 -217 71 141 103 -47 68 33 -81 -17 -87 -117 13 -109 -46 -184 48 4 47 131 83 64 104 77 -33
4614c3O5P5k63J6L9O0O1m2Q5j30R7J10L2j92J69r9J19j48n2J0j12J88k10K4N3
$$ -33 32 107 -156 -140 -101 -41 20 -22 63 -67 30 140 172 -20 149 50 169 21 -31 -21 -133 55 -155 -131 -78
4639g8M5j44K27m0J83l6k2r9q4J96j29j2j10O8l2mP0q6J2P7l5LK2k3nJ28r6N5
$$ -78 -33 -177 50 10 193 157 135 36 -48 148 19 7 -103 -35 -67 -71 -1 -87 -75 2 -33 -30 -8 -31 -36 92 -4 51
4667E1m4M5J4j44J57m1m3L4k00J33n2K50r3j30K00Kn2r4Q6j48j5J76j00l3j38
$$ 51 7 52 66 -78 79 38 -5 29 -171 -38 -90 160 67 -63 137 139 87 -7 79 -69 -84 92 -8 -41 -179
4692a79J19P6j15K02n8j16J52N0k55J97N3n9r6K3k1n2mR6J6j58K59j25q4J32N7
$$ -179 -60 16 -99 103 45 -71 81 131 -124 73 126 67 -29 -6 -27 -79 -83 13 29 -129 130 5 -79 53 110
4717A10q5R6l5p0R2Q5j37n3R5o5j75l9K29o7j24J33O6k08J29K14k40kJ72j38r4
$$ 110 25 121 86 16 108 193 56 3 98 33 -142 -181 48 -19 -143 -10 56 -152 -23 191 -49 -51 121 -17 -111
4742a11K24j75j90K58N4j26J9N0J9l7Q9J1j49M8Q8p0JJ30p1l0l5N2k17P6J64j05
$$ -111 113 -62 -252 6 60 -66 -47 3 22 -15 74 85 -64 -16 72 2 3 133 62 32 -3 49 -168 -92 72 -33
4768c3r6K70p1k04J72J15j19j89L45j37m3q2J08p5p7K18j91pK37j38j97J73K21
$$ -33 -129 141 70 -134 38 153 34 -155 190 53 10 -72 36 -39 -116 102 -89 -96 141 3 -194 -21 200
4791B00l07L9K51n4k23K07L8l71K07K1j45n7K20r8Q8l1J58q3q2J90j47j16J66
$$ 200 -107 -68 183 129 -94 113 151 -220 -13 8 -137 -194 26 -72 16 -15 143 60 -22 168 21 -95 71
4814G1J06j67k8J49k14q4L02k45j02K03L9o6P5K05k23o9K58j92R6j07N3j22p7
$$ 71 177 10 -18 131 -83 -167 135 -110 -212 -9 30 -36 39 244 21 -48 210 18 114 7 60 -62 -139
4837a39J17lj26J10k1j78K36J59j75O9L5J1j41L7J32k20K03%j61n0J28j28q0K00
$$ -139 -22 -25 -151 -41 -62 -240 -4 155 -20 49 84 95 -46 -9 123 -97 106 106 -55 -105 23 -105 -185 15
4861A5L4j85Q5J53j5j91K39N1j81L2n1r9N1J03j23r4K68l2r9l2J9P6j6J26j63
$$ 15 49 -136 -51 102 87 -104 135 186 5 37 -14 -113 -62 41 -82 -176 92 60 -39 -71 -52 24 8 134 -29
4886b9n7K49j65MM8l5j32k4J09j34N7J39R9j56R3P9k1j65R3L4l4m7J16j04j18
$$ -29 -86 163 -2 2 50 15 -117 -141 -32 -166 -109 30 129 -27 66 145 124 -41 52 86 52 5 121 17 -101
4911a01J20j0j0L3n8OJ02oo6J07Jj4q6P6L2l19L06j94J02j09M4J08k18L22q8J3
$$ -101 19 9 -1 32 -26 -20 82 76 10 117 118 104 18 94 126 -193 113 -81 21 -88 -44 64 -154 168 80 93
4937I3L7k3j41J31j85KJ19j62J51Kr4N3k9k7LQ2m6K2Qp3J0J30j0P8q0r3o1K74
$$ 93 130 107 -34 97 -88 -86 33 -129 22 24 -70 -17 -46 -73 -70 12 -34 -12 -4 -77 -67 63 53 131 51 -42 -103 171
4965A71j57j03N7K9l3j1L2l3OJ31j28L6k9J26%k37K29q9r5K16K9k63N6K2j16Q8
$$ 171 14 -89 -32 -3 -36 -47 -15 -48 -42 89 -39 -3 -32 94 94 -143 86 -3 -98 118 147 -116 -60 -38 -154 -66
4991f6J74o3q6R2J0r3O9m1Q1r3N3j02l2P0J71j72j2J81j45rL7O8p6q0K30j80o6
$$ -66 108 45 -41 51 61 -32 37 -4 77 -16 37 -65 -97 -27 144 -28 -40 141 -4 -13 24 92 16 -64 166 -14 -80
5018h0N3l6n2J77J62l63Q9J04mj06J25k11L3K03j0j45J31q9M9j44N7Rj43K31j49
$$ -80 -27 -63 -115 62 224 -139 -50 54 50 -56 69 -142 -109 94 84 -61 70 -19 30 -114 -57 -48 -191 40 -109
5043a09k3Q5LQ3m1J9P4j22L1J83j42l0N7m8o3p9J42j20K8J07r0J9J60o2OQORr1
$$ -109 -132 -47 -44 39 -2 17 91 -31 0 183 41 11 68 20 -43 -122 20 -100 -72 35 -55 -36 124 62 68 76 82 91 0
5072@J58k18j89K18Q7j82P1R5k4j52K36r3r1J80k6j61J29P3r5n6J20L5m24J64
$$ 0 158 -60 -249 -31 56 -126 -55 40 16 -136 100 7 -84 96 70 -91 38 111 16 -40 80 115 -309 -145
5096a45J64j23M5N4J27j67O7j1j32J86J01j75N0jL1j63P8O6l14R3K41j41J7J08
$$ -145 19 -104 -59 -5 122 -45 22 11 -121 65 166 -9 41 40 71 -92 -14 52 -262 -169 72 -69 -52 56
5120E6l6j45L0K59k12k4K12j57j73K46l0k21J65L9o8l3K28j20m2P8lj6J48j2j85
$$ 56 20 -125 -95 164 -48 -72 140 -17 -190 56 26 -195 -30 9 -59 -92 136 16 -26 52 49 33 181 169 -16
5145a6L4n8L0q6J06o6r0J74o5N8n7j02P7N2Q2K6j39j21K39k6r0k3J6k7O6q8N9
$$ -16 18 -40 -10 -96 10 -56 -146 28 -37 21 -36 -138 -61 -9 73 99 -40 -161 78 52 -38 -61 -45 -72 -6 -94 -35
5172c5P9m8J02k11lJ35J01j51N6m4q9J04O8j23K0m6Q9j07P7m9k1K01j9o0p7N7
$$ -35 44 -4 98 -113 -116 19 120 -31 25 -19 -108 -4 64 -59 -39 -85 4 -103 -26 -75 -96 105 86 26 -51 6
5198FJ04q9P2q9o8J05k1p8J11Mk14J06N3L7q7M4P2n5j16J95j22j6J01n9q4O1R3
$$ 6 110 21 93 4 -64 41 20 -58 53 57 -157 -51 2 39 -48 -4 68 13 -103 92 -30 -46 55 -4 -88 -27 66
5225F6k04kJ07J5J7Jo9L0J39K5r6M4O5j74J6N6m1j98J49O5j51O8K18k80J35J14
$$ 66 -138 -140 -33 -18 -1 0 -69 -39 100 125 29 73 138 -36 -20 36 -5 -203 -54 11 -140 -72 146 -134 1 115
5251A15oPl4q4j1K9N0j12%k8K01l20J36j3R8L1R9k52J5J16Lr6k4J83q3o9O8j5
$$ 115 109 116 82 -2 -13 16 66 -46 -46 -74 127 -193 -57 -70 28 59 158 -94 -79 37 40 -56 -80 103 20 -49 19 4
5279Dj5J30j15l0m5J83j37P9l8J28j70N0Mk6nl8O4j58O4J4L3L8k7m6P5Q5j38R1
$$ 4 -11 119 4 -26 -71 112 -25 54 16 144 -26 24 28 2 -3 -41 23 -135 -71 -57 -24 14 -13 -59 16 101 -37 54
5307E4M2Q6k34R5o5nk6J01l2q7K7P0l7m4J85j09n1P5J2l5O6k0p4r9J55j4q3P0
$$ 54 96 182 -52 43 -22 -27 -53 48 16 -71 -44 26 -11 -55 130 21 -30 45 57 22 88 68 -6 -105 50 36 -47 23
5335B3r1J06l4J44k84J48K0K5j08M1J77j66q4J10k2j95J75N5k47J80J59j55o1
$$ 23 -68 38 4 148 -136 12 32 57 -51 -10 167 1 -83 27 5 -190 -15 40 -207 -27 132 -23 -84
5358h4J36k7j25J60J07l62J99L4p0j07M4K16l27K07O1j50N5O8J1j54J87J00k18
$$ -84 52 25 -100 60 167 -195 4 38 -32 -139 -95 121 -206 1 62 -88 -33 35 46 -108 79 179 -39
5381c9l8P9J31k32K13Kj99J67r6j38O1K84j92l3P6ok8J24m5K3j18j9M6m3N6j08
$$ -39 -77 2 133 -99 114 116 -83 84 -12 -150 -89 195 3 -30 46 40 12 136 91 114 -4 -23 23 -20 36 -72
5407g2p8O7K4k7R5K0q5J20k2K5j97K36j01j9L7N3j2j63J76n1q7O3J23j07L1P1
$$ -72 -150 -83 -59 -86 9 29 -56 64 42 67 -130 106 5 -14 23 76 64 -99 77 26 -61 2 125 18 49 120
5433A20r2j18J51O6j44j3J26o5p2O5j08o9K19j00Q8p5J1J14j32Q9%j10O2kO8q1
$$ 120 28 -90 61 127 -17 -30 96 31 -41 24 -84 -153 66 -34 54 -21 -10 104 -28 61 61 -49 13 11 79 -2
5459bnJ01j06OQ2j80j0J24Nm6J65m6j67J76q5Or7J15Nn0j7k3J21m6k7P3j33l5
$$ -2 -7 94 -12 -6 76 -104 -114 10 15 -31 134 88 -79 97 12 18 -79 36 41 -9 -26 -49 72 26 -1 72 -61 -96
5487i6M5J21J09j43M5j25J74N0k70P7l3k0%J28j65RL24k21qR0m8qm6P9k8N4k15
$$ -96 -51 70 179 36 81 -44 130 180 -90 -13 -46 -66 -66 62 -103 -94 230 9 1 91 43 35 -11 68 40 94 -121
5514a21P4j30K22j32J15n3n7l2K34m9j54R5q0K9L9N5l6J28j67J03j04o7J8J50
$$ -121 -47 -177 45 -87 28 -25 -82 -114 120 71 -83 12 -68 -39 0 55 19 147 -20 83 -21 -88 -70 80
5538H0k69K10L8n7L7J9l7O0n1M2p4jN6l6L2Q8r5o4l6l0m9R5O7j26J52O3Mk15R5
$$ 80 -189 21 59 2 39 58 21 81 30 72 -2 -3 53 17 49 137 42 -22 -58 -88 -137 -42 25 -101 51 114 118 -97 -2
5567bk6M9n0J8m3P4j2%l1M2r3%Q9J7m9L5K0J0r1rQ6p7k1O9J2q6J41j21O5k6j0
$$ -2 -28 21 -29 -11 -54 20 8 8 -23 19 -74 -74 15 32 -17 18 38 48 -43 -52 34 -43 -64 5 17 -69 72 -49 16 -10 -20
5598b0O2o3J82j51K1j2K0j19K3J67j88m8J80j03j3J7O9l6NJ89k06L9J10j07p0
$$ -20 42 -21 161 10 31 19 39 -80 -57 110 -78 -126 54 -49 -62 -45 24 -12 -7 182 -24 15 125 18 -52
5623e2j5O8q5O6P2q5l4O8r6Q4LJ19j06l9J36j06j7M2l3m9M0l9r7J0L10k03n7K0
$$ -52 -67 1 -84 -18 54 -31 -65 3 -93 -9 -6 113 7 -32 104 -2 -19 23 -10 -59 -19 -58 -155 -145 165 -38 -95 -75
5651g5O7n5N8nL4Q3L3nk58N6J47j39pL6Q1j38L6J09k6Q8j40R6k07K01R2k83Q9
$$ -75 -8 -63 -5 -10 24 107 140 135 -123 -67 80 -59 -66 -30 51 -87 -51 58 32 120 -20 76 -131 70 162 -121 -32
5678c2K23j72p6P9o0L1K7M7o4Q2J7p0l8L4or2J81o2p3L4J1kj10J60j09o5l7K00
$$ -32 191 19 -57 22 -38 -7 20 67 3 85 102 32 -6 28 22 -70 111 49 -24 10 21 19 -91 69 -40 -105 -142 58
5706E8m7j03J36m5jJ87k2j52j00Q3n2j8J13p2j0N7j7Jj5K1k1N0j9j3k1L0M6k7
$$ 58 11 -92 44 -1 -2 185 163 11 -89 -6 -58 -76 37 -35 -45 12 -5 -4 -19 2 -19 31 12 -1 -22 8 54 27
5734B7KO9q8k8o8J98j61R5j03O2J7L9o5l4p4J96p2K6O0j87O5K2m4O5j26R1K3j20
$$ 27 29 98 10 -18 -86 112 -49 46 -57 5 22 61 -4 -38 -112 84 12 38 98 -89 -24 -2 -46 19 -107 -16 7 -113
5762a13J57j1k6q5J87j91J77j33J7j08J0K32j83J47o0M4j88J31L9M8m9J02j70
$$ -113 44 33 7 -78 109 -82 95 -38 -21 -129 -119 113 -70 77 17 61 -127 4 43 91 42 144 -26
5785b6K22k59J3N5L6k41J14J14j14M3RJ35j61N6P1j35jJ33mj38P1j3j35NR7K9
$$ -26 196 -63 -50 5 41 -200 -86 28 -86 -43 -34 101 -60 -4 67 -68 -69 64 60 -78 -7 -20 -155 -150 -53 -24
5811b4J6j05J9NR6O0r4O0r4J05j12J08Lj3j2l8J29j18J0m6J27p2L8mp5RRJ9M4
$$ -24 -8 -113 -94 -89 7 67 -27 33 -61 44 -68 40 43 30 18 -20 109 -9 1 -45 82 10 48 44 -31 -22 -13 6 50
5840E0o3L9J1m3j23M6JP5N5j24J06l2J53j07l7J07k7o6r7J30J8j42N5J30q9n8
$$ 50 -13 26 37 -6 -129 -83 -82 -7 48 -76 30 -2 151 44 7 114 87 21 -76 54 72 -70 -15 115 26 -32
5866c2k5J7j9R4q2mQJ46p9n8J01p9ll5Rj95J50Om1L3J20n3Q4j8j01N6J03l5j55
$$ -32 -57 -40 -59 35 -47 -51 -43 103 24 -34 67 -12 -15 -50 -41 -236 -86 -80 -121 -88 32 -21 63 45 -56 0 103 68 -87
5895h7J11k7o7o2J18j17L8N7m9P2n5J12J6j02l5J23m7J3j1l1N6m7P1%k0jj8j65
$$ -87 24 -3 -70 -132 -14 -131 -93 -36 -85 -13 -68 44 60 -42 -77 46 -1 12 1 -30 26 -21 50 50 30 29 11 -154
5923a54K05j4q3Q7N3m9n3J25j7j56J52j50n5k8K63j35K6j75mJ20n8M5J5R5O4j15
$$ -154 51 37 -46 41 94 45 -8 117 100 -56 96 -54 -109 -137 126 -9 17 -158 -162 -42 -100 -55 -40 55 119 4
5949Dj22K10j5k03J06J8j9J8O4j21J8JQj5O6Q5j47L0j1L7q4J16L4p3j33J66qo0
$$ 4 -118 92 77 -126 -20 -2 -21 -3 61 -60 -42 -41 -33 -48 18 103 -44 -14 -25 12 -72 44 78 5 -128 38 30 -30
5977c0j6Q0q4L3J50k82J80j29J68n1j3k4m9OR3j30K7J9n6k1N0qO4Pj6J6p5Q6M5
$$ -30 -46 34 -50 -17 133 -149 31 -98 70 19 6 -18 -67 -61 32 -98 -71 -52 -108 -129 -79 -87 -23 -16 -32 -16 -91 -5 40
6006D0P6j56O6k4j0J0K1j45J23m6K8L1n6J3R4o0j9J3NP7o3j6L6j30M6R4j50k1
$$ 40 116 -40 26 2 -8 2 23 -122 1 -45 -17 14 -42 -29 65 5 -14 -1 4 81 18 2 38 -92 -46 48 -102 -123
6034a23J44Jj69K32nl4k2j2m4q9J06no7m4J39j2L1J3p8J43j28M5RQ5j14P6n1n2
$$ -123 21 22 -147 85 80 46 24 12 -32 -121 -15 -20 -87 -131 8 -4 27 40 -38 105 -23 22 31 116 2 78 27 -25
6062b5P0M0k4j9L3j24J36j87K0j9LL8j07J44J89j74l5p1J92N6j23r2J46qj42J60
$$ -25 45 85 61 42 75 -49 87 -100 -80 -99 -96 -58 -165 -21 168 -6 -41 -112 80 136 13 -79 67 59 -83 77
6088G7r1o4P2j12K11N5j79Pk8j53J75R2k9r1n8J16m0R5j24L6R2Q2k80J23P8p7
$$ 77 -14 -78 -6 -118 93 148 -31 -24 -52 -205 -30 62 33 -58 -116 0 -40 55 -69 -33 59 141 -139 -16 62 -15
6114a5m2N8M6q5J01k3m8R1k1r2K1j1K5p3J26p3p2N5M4j7O1j34J22k4j6J2j68m0
$$ -15 -57 1 47 -38 63 40 -8 83 62 -30 -9 -20 5 -68 58 -15 -87 -32 12 -5 56 -78 44 20 4 16 -152 -192
6142a92J95L0j23M2N1j49J95p3m5O7kl8j5J65r2j5j20P4k0Q8k0k6j2J60j99M0
$$ -192 3 33 -90 -48 3 -146 49 -24 -69 -2 -4 -42 -57 108 16 1 -119 -45 -65 23 3 -23 -35 125 -74 -34
6168c4N0R0j47R1k4m0J5QM5p8R5j15J08j03NK2m1j2J73j7j05Q6J1r4K0j5Oj78
$$ -34 16 106 -41 50 26 -14 1 9 54 -24 71 -44 64 -39 -34 -12 -53 -65 108 91 -14 72 83 -11 9 -6 0 -178
6196a78K56j96J16R8j48N9J1ML1J3r9Q1j87J40L3m2L1L4j8q8J74j7p3K2m4k5o3
$$ -178 78 -118 -2 96 -52 7 18 22 53 66 -33 48 -139 1 34 -8 23 57 39 -49 125 108 35 57 13 -12 -75
6223g5J10m1Q1R2j44m1mlj07QJ74k31J74J1Mj4R6L4q5j49J69%p6Qmm7P9oj8OM5
$$ -75 35 -6 75 167 23 -18 -22 -25 -132 -124 50 -181 -7 4 8 -6 90 124 39 -110 59 59 -17 -9 -13 -60 19 13 -5 1 46
6254D6j8m2P7l9r0K3J67j56M0N9j58Q2o3J11l1K1O2q6j34J78r2%K2j5Q8k0k1j00
$$ 46 28 -14 63 24 -66 -43 124 -32 8 67 -91 -9 -72 39 8 29 91 5 -129 49 -43 -43 -21 -36 52 32 11 -89
6282h9pJ22p2N7j28J10rJ7j07P0oJ84j15k6N2j23jJ80p6k1k7p1J29j49J64n9P3
$$ -89 -96 26 -46 11 -117 -7 -16 1 -106 -36 -42 142 27 1 53 -70 -71 109 33 12 -15 -86 43 -106 58 -1 72
6309G2j30J88j10m3j5P4k7MJ26j79P8lk7r0M9r3J10j0K6j86J31J78j50J1KJ7L
$$ 72 -58 130 20 -23 -38 36 9 13 139 -40 38 35 8 -82 -33 -126 -16 -26 0 -186 -55 123 -27 -16 -14 3 6
6336Fp8M3P6j64Q3P4j29K1J15r6l5O6J37j52k2O6l7n5J97j47J6J19j09n4J3Q4
$$ 6 -72 -29 47 -117 -34 40 -89 -68 47 -49 -84 -18 119 -33 -55 11 -26 -81 116 -31 -15 104 -5 -59 -46 38
6362C8j4j25J42M3m3k4KN3r0pK6nn7M7n3N9O9n6p8J05jj01R8p1J10Op7j7K8K7
$$ 38 24 -101 41 84 41 17 19 72 -18 -25 1 -4 -61 -14 -67 -8 61 5 -73 32 31 -70 28 -43 67 73 -4 -21 7 34
6392C4p3J10n3o0O6o3P7k22K65j04k1J02j08M9l7J4J17p9J7l7l7Q8k2j27m6J45
$$ 34 -39 71 18 -42 24 -39 38 -184 81 -23 -44 58 -50 -1 -38 -24 93 14 31 -6 -43 45 23 -104 -150 -5
6418ep4R7j43N4KJ01k4p0l1K32p9j26J40k01Q4o5M5O2o6N1K4l7J3N7p3PL3jK3
$$ -5 -79 18 -125 -71 -69 32 8 -62 -93 139 60 -66 74 -127 -43 -108 -63 -1 -67 -16 8 -29 -16 41 -32 -25 8 7 30
6447C0P2j10R3qo4q9P1j2j1m4J18l4N4rl9P8m2r6N3J6k1kK0k2P7j08j11J22P1
$$ 30 102 -8 85 77 13 -76 -5 -17 -28 -72 46 12 66 57 18 96 54 -42 11 27 6 4 24 2 79 -29 -140 -18 53
6476E3O9j16JN8q4j36J47j02O9q8R8mL1l0J0kK8M8r0J19j34lJ04Lj00k0Q7j1N5
$$ 53 122 6 7 65 -19 -155 -8 -110 -41 -129 -31 -35 -4 -34 -24 -26 2 50 -40 79 -55 -58 46 49 -51 -71 16 5 60
6505F0m1jm1N5N2k3j14K12n6l7j22P7j10J56j07j0j7R5j88J16R3p1J1k5m4j7Q5
$$ 60 19 18 -23 32 84 61 -53 159 103 66 -56 21 -89 67 -40 -50 -67 28 -160 -44 49 -22 -11 -36 -80 -97 -12
6532a2KM7j62N7J50l4J5p4q5J11j4J3kj1l0R6j33M5M0n1k1Q4p0M1J00j03l5P1
$$ -12 -10 37 -125 -68 82 48 63 -11 -96 15 1 14 12 1 -29 67 -66 -21 19 -32 -53 31 -39 2 102 -1 -36 35
6560C5j44J48r1K5j11K9J63o3mP6o6j44J56M0j09L6J32k36J02N1J4r3q9J93k7
$$ 35 -109 39 -52 -27 -138 -109 54 -9 -13 63 -3 -147 9 49 -60 -24 108 -128 -26 25 39 -54 -143 50 23
6585B3K6M0j36R8n1o1L0OJ49j54o4J33k9n0R4K2j69J72j20p7J08R6k04J46m8J03
$$ 23 49 89 -47 51 0 -61 -31 -25 124 -30 -94 39 10 -40 54 76 -93 79 -41 -118 -10 86 -118 28 -20 83
6611H3j55K06j87k5K22j19J2q3l1J37j12J05p8Q1n0j51N5J79o3p0K4N0N6q9rK
$$ 83 -72 134 -53 -78 144 25 37 -46 -77 60 -52 53 -25 56 6 -145 -90 89 26 -44 -20 30 86 -3 -12 -10
6637a0P8o9J6O5j46J12j03J30l2j37J36q8K3M4J22r4q8m0L0O4j09J54j06R8n0
$$ -10 68 -1 15 80 -66 46 -57 73 41 -96 40 -48 -25 19 141 47 -41 -81 -51 13 -96 58 -48 50 0
6662@o2J18n6O3o0r4J00j51J87j13P8j64Q7j0l5J10J4q2M0j3j8J60P5k36r9J51
$$ 0 -62 56 0 63 3 -91 9 -142 45 -68 10 -154 -67 -77 -112 -2 12 -70 -30 -43 -61 99 174 -62 -161 -10
6688a0P4L4l6j4p4O9K3j06K5J16q7N5p2K6J6j9J22j96k2Q0k4j4K1kK6m3N0j01
$$ -10 64 98 62 48 -26 43 66 -40 -15 101 14 69 -3 23 39 20 142 -54 -76 4 -20 -34 -13 -15 11 -32 18 -83
6716h3j2J45o6k0L5O9K9j17O6q5JJ17j04L3k9r9N9P5o5K2m3J12j2m5M2l8m8O0
$$ -83 -95 50 -16 -36 -1 68 97 -20 46 -39 -38 79 -25 8 -21 -120 -61 14 -51 -29 -72 40 28 -17 25 -13 -61 -1
6744aNj3KP8Np8J5j3k1L0pJ7P7r5J20j52JQ8j07Q1o1l5J87j02j07P3J95k55J12
$$ -1 4 -9 -7 71 76 -2 13 0 -21 9 2 19 96 1 121 -31 -30 58 -49 32 -29 -64 123 21 -86 -13 182 -73 39
6773C9qr8O3J4l0J25j30OL3p6J12n2QJ38j80R5J4j20J82p8J9r6l0J05R2Ol14J68
$$ 39 31 -67 -4 10 -20 105 -25 -19 14 -62 50 -2 6 144 -36 59 73 -47 135 57 76 -20 -50 55 147 153 -161 7
6801GJ14k22J21kj6k0L3K3j49J33j9P2j36q3J82Mr4J72j20N1j2n8m1M2P0k9k8
$$ 7 121 -101 20 18 2 -18 15 38 -111 22 3 75 -61 -144 38 42 -52 120 0 51 39 -19 -60 -18 52 23 -5
6828eL5J2o9k0j5M3M2o5jj0J40j09PR5J6j24P4J16j71J0j5O0r5O3k0k3O0n2q0
$$ -5 30 42 -27 -47 -62 -19 23 -42 -43 -53 87 -22 -15 80 96 -28 46 162 -9 1 -14 46 -49 14 -6 -29 31 -21 -101
6857a01Q5j38P2J45j31J49j19N0J4o6Q5k2N8j34j2p6J79l2l2k0K7l5M5j09M9J15
$$ -101 -16 -154 -82 63 -68 81 -38 12 26 -40 45 23 81 -53 -65 -141 38 6 -26 -46 -19 -54 -9 -118 -69 46
6883D6K8r4P8m6l1l4P4j3n1JN7m2K0R7m4o1Q1n6K2n9Q1m9N4Kj07O0L5j02L6m0
$$ 46 74 -20 58 12 -19 -53 21 8 -43 -42 15 -27 -7 90 46 -15 66 10 32 -27 54 5 59 61 -46 14 49 -53 -17 -57
6913e7R7n3N4p9L8q5M7P0m2P0j3J63j56J3j25R8n4M2m4N1q6K9m2J45n1o5J91j31
$$ -57 40 -13 41 -38 0 -85 -38 32 -10 60 47 210 54 67 -58 40 -14 28 -16 35 -51 -22 -64 81 30 -35 156 25
6941B5j6N5Nom2L2n3qk1j03J56o1J52j35k4L7J9l6L7P0j2j37P0J11k53J44oL1
$$ 25 9 64 69 63 21 53 0 -8 -29 -132 24 -37 115 -20 -44 -7 12 -24 13 83 71 -66 4 115 -138 6 0 31
6969C1n0K0l8m0Q9pp5lP3j21O5Q9m4k9Q4Lj63K01k17J39O5r8Nj8R0J6o2K3M4q9
$$ 31 -19 1 -37 -77 12 5 -70 -73 0 -121 -56 33 -11 -40 44 47 -116 85 -132 7 72 -26 -21 -39 51 67 5 28 72 -17
6999a7N2q9JR2q4K0q1J88m6O1j15J80o7r7m5J48j71r2J52P0n1K0l5n8M4J06j35
$$ -17 35 -54 -53 39 -45 -25 -106 82 36 97 -18 162 95 -2 -47 101 -70 -162 -10 60 9 29 -6 -64 -20 86 -49
7026d9Q0O7j36L2O6N1j20K6M1j50J34k7nnr0J19j59J11J03j28J65n6k01K50n6
$$ -49 31 98 -38 -6 60 111 -9 17 58 -92 42 15 10 5 -85 34 -125 -14 89 -39 126 70 -131 119 63
7051F3q6J1R3j06R5l6O0l8n2l4j6P4m3l7K6n9R6n2R6m9J6k1J2L2K4lkpj39J04
$$ 63 -23 -12 81 -25 70 34 94 56 4 -30 -46 28 -15 -52 -26 -85 11 -41 55 6 22 1 13 45 69 66 64 57 -82 22
7081B2m3o7K36j17k3k0M9j29Q8J1p8j9M7R7j64J28k1R8j5j41N2P1j43J85m8o0
$$ 22 -21 -88 148 31 8 -12 37 -92 -4 7 -71 -90 -43 54 -110 18 -3 95 80 -61 -9 62 -81 104 56 -4
7107dKJ0j9m2N8m4J72j94J23j75L3J04n1OM3l3j5L4m0K9O7p9O1r9O6K37l90J21
$$ -4 -2 8 -11 -53 5 -39 133 -61 62 -113 -80 24 -27 -21 22 -11 -26 8 -32 -3 64 -15 46 -53 13 250 -140 -19
7135a9p3L7O5q9R9k5P1q1r5J40Mp3j2R4j19Q4J11j18N7n9l6L2K6l6j1J22r5J7
$$ -19 -92 -55 10 -79 20 -5 66 -15 -110 30 34 -39 -51 43 -76 8 119 1 58 -1 -37 -5 21 -15 -26 96 1 18
7163A8n3p4J36L4qL3q0r0K63k08l3J11j7m8k7N8J16j67J6M6K6r9J19r2M3l0n3
$$ 18 -35 -109 27 61 53 86 6 -84 179 -29 -62 49 32 -16 -43 15 131 -36 -20 26 52 -47 72 -20 23 -7 -60
7190f0PKJ04j23N3J23j90MJ33o3pL7L8j20k3J69j04L3M3n0j11J17J9j09J1J39
$$ -60 -53 -51 53 -70 -17 106 -84 -80 53 -10 -17 20 58 -62 -85 84 -20 13 56 6 -105 12 31 -78 -67 72
7216G2n9J6N0l9p4Q8j3q1j6LQPJ16J2m7jj9K5l0Q2p8j00N7J74k15Q0lr1Q1k6M1
$$ 72 13 29 79 40 -34 54 41 -40 -56 -53 -45 -38 78 90 43 42 23 48 18 100 22 -78 -21 153 -62 18 15 -76 5 -21 20
7247B0j12Q7P0q1j05J04Pj8j72J77l6N3o2k4M6o7K06q1Pk8m3J09o2M9r9Q6r9J07
$$ 20 -92 -5 65 -16 -121 -17 -10 -28 -200 -23 -59 -6 -68 -92 -46 -113 93 12 19 -9 -52 57 -5 44 -55 31 -68 39
7275C9p8j7Q8l0o4r1J97j42J17K7r3M8RJ67j31j41J56q8l3J43j34J27j58Q0o1
$$ 39 -39 -56 32 2 -62 -153 44 -98 19 46 -47 1 10 177 46 -95 61 -27 -60 83 -51 76 -82 -2 -63
7300f3Q6j63J49n7K9PM8J7j2j52J33o6k2M9m9J43q5l5J9P3j58Q8J3l8N5N5j18
$$ -63 23 -140 9 -48 -19 -12 36 53 41 -111 22 -44 -66 -17 -66 77 -8 -43 -24 49 -109 -21 -8 -46 9 64 -54
7327e4J32q6n4M1p3N6mk6k9J17J4L5j26J32r8l3L1k1k3O1N9j36J05n9j9J27k8
$$ -54 78 -8 -62 -21 -94 -38 -42 -68 -97 20 34 69 -57 75 -23 -56 -25 -46 -69 -8 51 -85 20 -39 -58 69 41
7354D1o5N2O9o9L9j2j02k1J79Q2j83P8n3Op2P7OrJl4L7o5L9r7J35j68J26L5j6
$$ 41 -24 28 97 28 67 55 -47 -68 111 193 10 88 35 41 -31 46 52 43 44 10 47 -18 21 -76 59 -109 17 52 36
7383C6j1l9K8q9Q3k6P3j2j35O4l1m0J19K4p4M5jk3j13K3K8J29l6j47J07Lk1M7
$$ 36 25 -14 14 -75 8 -18 55 43 -92 -28 -59 -99 20 44 -30 15 14 -9 -122 -99 -71 58 22 -125 -18 -15 -36 11
7411A1j18J28l4N3q9Q0n6K6J67j35l0k0O3l9or2j6J00nM2p0M4k0n2J5p4J55P9
$$ 11 -107 21 -13 40 -49 31 -25 1 168 33 3 -17 46 7 1 -91 -107 -7 -12 30 -40 4 -16 -68 -53 -127 28 107
7439A07n5j03o1J42j11J39o1j09J16kOj6mK5n1j0P8M9k08K56m7j62P1O8j06Q4
$$ 107 52 -51 -112 30 -81 58 -3 -112 4 2 8 -8 -12 13 -38 -48 30 79 -129 127 80 -82 -11 57 -49 35
7465C5p0J5M8L7k5r3N6j3o8j5J01j14N4L8J9j30K26j53J10j93J26J4NM8n5Q2k51
$$ 35 -35 -20 28 65 40 -53 3 -10 -78 -93 8 -106 -52 -14 5 -125 101 -52 58 -135 -9 5 10 58 3 85 -166
7492a66P3j4O8R7K8k3j19R5p5L8k5m2J29j39J14j1p8R8j57J61m1n3O7M1j67J1
$$ -166 -93 -107 -39 58 86 63 -56 39 -36 2 -23 -65 64 -75 39 28 -50 48 -109 52 11 -42 25 66 -101 -90
7518i0N8J12%Mp2p4R0k01K08PJ5p4o6J15p1q2K6P2j5R4m9n2O8OJ5o2K0O5n1N0
$$ -90 -32 80 80 84 12 -62 28 -173 35 42 57 -17 -83 32 -39 -121 -95 -23 -38 56 7 -45 23 29 44 -18 2 67 16 66
7548F6j16Q7R0j54j0Q8j11rJ28k18J09L0M7l3l7o7K26j49J45q7k4K6j83J51o3
$$ 66 -50 37 127 -27 -37 51 -60 -69 59 -159 -50 -20 27 -6 -43 -110 116 -33 112 25 1 27 -156 -5 -68
7573f8J77m3o4j7m5M8L8j80J80p2Ml5l4J10kJ5N8m0j46K10o3R7j19qm0l3N4p6
$$ -68 109 66 2 -15 -60 -12 26 -154 26 -46 -42 -77 -111 -1 -3 12 70 30 -116 94 31 128 9 1 -39 -72 -18 -94
7601i4J67p5j4J33j41K0J12j2j12J08m5k0Kj8J0j2n8k8J14O5Oj32%j27K35k22
$$ -94 73 -2 -16 117 -24 -4 108 96 -16 92 47 27 29 11 21 9 -49 -77 37 102 108 -24 -24 -151 84 -138
7627a38P3J18j46J65j08J4M4M2r4J26r9k5Q6r3Q4p2K8O7q3l4M9j12K9kQM1k7K7
$$ -138 -65 53 -93 72 -36 -22 22 64 -30 96 -3 -28 58 -35 49 -23 5 72 -11 -45 4 -108 -79 -81 -73 -32 -59 -32
7655c2J13K0j01Lm1l7J10k5j6P9p6j1p8Q8R1j36J64j68K0n1O1ON6k5J14k40K3
$$ -32 81 101 0 3 -38 -75 35 10 -6 73 -3 -14 -92 -4 87 -49 115 -53 -33 -84 -23 -17 39 14 128 -112 -89
7682h9O4o0P3L9onp8n4K37n6nP0k11K13l9mj43O0J15k59K83k12o7J22j7M8l1K9
$$ -89 -25 -85 -12 27 21 16 -62 -116 121 65 60 130 -81 132 93 89 -54 6 121 -138 145 -67 -134 -12 -29 19 -12 17
7710A7L3j03J14op0J4p8O3j1r1OK7M4Q1j20P0P7j10j0J79k47J17j1Q1j1r2P9j23
$$ 17 50 -53 61 55 -15 -1 -79 -16 -27 -118 -112 -85 -41 40 -80 -10 67 -43 -53 126 -121 -4 -15 66 55 -37 42 -81
7738h1J4R7l9N3j49j9Q8m5J37q9pK9K0o2J21o0R0p8Lo3R7l5k2J74j97k5P1j01
$$ -81 -67 30 -9 44 -105 -124 -36 -81 56 -33 -40 -11 9 -53 68 8 98 20 23 -40 57 22 0 174 -23 -48 23 -78
7766g8J00M1j20P7j57J51k2o4P0p1NM5p4j6J59Ml8l6k4noJ3l8L9k1J05J9L8j26
$$ -78 22 63 -57 20 -137 14 -8 -72 -2 -73 -68 -23 -97 -113 46 50 12 -24 -48 -53 -59 -46 -84 -45 -66 39 58 96 -30
7795c0k4J03M9j73J32J1p4N4k5P4o6lKn2k8Q8l7qm8K9k7J0P0J9l6L1L3q7L8N1
$$ -30 -54 49 98 -75 57 68 -6 48 23 97 31 28 30 -22 -50 38 1 -7 -55 -26 -53 -43 27 46 10 41 74 -13 25 76
7825G6j03L6n7J08j6j8K7j65J05Jj2k6K05j88Q4j39R0n5M2k5l6P6R1r5j3P0k3
$$ 76 -27 9 -48 60 44 26 53 -112 -7 -6 -18 -44 161 -27 57 -82 8 -47 -5 -30 -66 10 101 6 -7 63 40
7852D0m3%R9j18K9Ml9J76Mk73M1J52N1j05n4M4j05J37K5j37j6J02j8J1O4j24N1
$$ 40 -3 -3 96 -22 7 11 -28 148 152 -121 -80 72 123 18 -36 8 -97 40 65 -72 -88 14 -4 7 71 -53 -2
7879bl5j0J00m5p8j5J93k36J22R6q8M7j60J80J7l9j04R8Mj24o8K17l9j37J48j94
$$ -2 -37 -47 53 8 -70 -85 108 -128 -6 90 2 49 -111 69 86 47 -57 41 45 -79 -147 70 31 -106 42 -152
7905a52J72k9R6j14P4j14J31j5j05M7K5K8K4r0J54k49J4L5l2J41L9q6j35J66m1
$$ -152 20 -9 87 -27 47 -67 64 49 -56 -9 16 44 68 -22 132 -117 -103 -68 -100 41 80 -6 -141 25 -16
7930a6L3r6K8o4J63k6J8o8j7J41q6j67K17r6J1o0M7l2R5M1k1q8J39j16l9K1J48
$$ -16 17 -79 -51 -115 48 22 40 -28 -45 96 10 -157 60 -36 -25 -85 -38 -70 25 66 45 -43 96 -20 -59 -38 110
7957A10M3k35J06n7R7j38Q1M4m7Km1N0O8j41J11j69Q7Km3P9Q0q9M1kl7n9K6R5
$$ 110 153 -82 24 -33 64 -74 7 51 4 6 -35 15 83 -58 53 -116 -29 -27 -70 9 89 0 41 39 2 -57 -31 64
7985F4k04P9N2L9M3k00O7J06m0LK8j72K34l1p6N2n9Q2qK5j7j64Q0K3K0J6j48L9
$$ 64 -140 -61 -9 30 73 -127 -60 46 6 9 37 -135 99 68 -8 44 -15 67 59 84 67 -97 -17 6 26 42 -106 -67
8013f7O7j43N2J56n9mmL0o2L0k5n7J03r7J42n1Jm4M1k3L3m4Q1n3m7k8J87j48J5
$$ -67 0 -143 -91 65 6 2 -2 28 -34 -4 -29 -86 17 -80 62 11 12 -32 9 -14 19 -25 56 3 -44 -72 115 -33 -18
8042a8O5KL0Mj12J04p2j8p9M6J50j50J48n3m5Mm0m9J25q6k6J5K4N2p9K4J03o5
$$ -18 47 49 79 83 -29 75 3 -15 -94 -48 102 -48 100 47 2 6 -34 -83 42 -44 -70 -55 -31 21 -58 -34 69 4
8070Dm2N3l6j1p3J15R2j13R5j16rN7K7pj00J40jj38J31p5j04P6MQ0L4K5j98M8
$$ 4 -38 15 -21 -32 -105 10 102 -11 84 -32 -41 16 43 36 -64 76 75 -63 68 -7 -111 -35 -31 49 83 108 -90 -42
8098d2R4q6J08j01RJ0N4p4J8m1l5J04r1J32om8L8q5J25j53l3K27p5n4%k3j6JL8
$$ -42 52 -34 74 -27 -18 -8 46 -28 -10 -51 -86 18 -73 59 53 5 43 -42 83 -70 -103 124 49 -5 -5 -28 -44 -43 -5
8127ep1R7j67R9O4K5J0j5p1m1J71j40j2J8r9J23r4L4J03K9j4q5R9n7j4r6J45j13
$$ -5 -76 21 -146 -47 17 42 52 37 -34 -75 96 -44 -56 -38 -137 -14 -108 -74 29 58 44 -41 58 1 -13 -109 36 -77
8155g7J32M8q3n0m7k9J8r1K20r4J5K9q7M7O0N1m2n5%J16l0j5k9l5k9J7R1j9Lj8
$$ -77 55 103 20 -30 -77 -106 -88 -179 41 -53 -38 -9 -96 -49 11 62 20 -35 -35 81 51 36 7 -28 -57 -40 51 32 35 17
8185A7k7R3K1n1o0kO5M2r6R2K4l6m5o9J03m4j6l3lj70J45L4P7l5k4N4p8J7r2M4
$$ 17 -10 83 104 53 -7 -9 56 98 2 94 118 82 37 -32 71 27 11 -22 -25 -195 -50 -16 61 26 2 56 -22 -5 -97 -53
8215e3r7J73m0m3L3M8j8p8J87l7M9k37J40j36J50o8l0P5n0j8r3J33k8Rp6J18J3
$$ -53 -150 23 -17 -60 -27 21 3 -75 112 75 124 -113 27 -109 41 -27 -57 18 -32 -50 -143 -10 -38 -29 -105 13 26
8242B6p6J41o6q9J53j54R3n2l1O0j6j32R3M9n4N7l8N3j2j48J98j22J71n2j24R9
$$ 26 -50 91 25 -64 89 -65 28 -24 -55 5 -11 -143 -50 -1 -55 2 -36 17 5 -143 55 -67 104 52 -72 27
8268B7k3o4J58r4n2O8l6l7J13k4p3J16j7l9J13j19qJ19j02Q3j03l9R1m2J07r8
$$ 27 4 -60 98 4 -48 20 -16 -53 60 36 -37 79 62 23 136 17 9 128 26 109 6 -33 58 16 123 25
8294B5j03N7O3M4j2j64J22K4Pj33L7j1R2P9k46J76n1L8K5j03r8J01J7P4m6n7J74
$$ 25 -78 -21 42 86 74 -90 32 56 63 -70 -33 -44 48 127 -119 57 6 44 69 -34 -132 -31 -14 60 14 -43 131
8321A31l0j06K3L9j22M0R3q9O3J6m5OJ50j02n9k7N0pr8N7j40J09QO5Kk2q4R1M2
$$ 131 101 -5 18 57 -65 -25 68 -21 42 58 13 19 169 67 8 -19 31 24 -74 -17 -157 -48 -40 25 27 5 -79 12 54
8350E4j52J35k5n4o8J31n9R7L0k4j18J08j33J51j53J00n8Q4j42R1L1j13N6R4m4
$$ 54 -98 37 12 -42 -110 21 -38 59 89 65 -53 55 -78 73 -80 20 -38 46 -96 -5 26 -87 -31 63 19
8375A9j54P8J9Q2l6q2J07rP8m5O0j10J10j42k8N8N5p6N2j7J0P4k04J43Q1k02J4
$$ 19 -135 -57 -38 44 8 -74 33 24 102 57 117 7 117 -25 -53 5 60 -16 36 19 29 103 -101 42 123 -79 -65
8402f5J02j2km7m7P1N6J0j63lN6K1Q3j40J45j9r5%q6Q5N2J15k13J16pJ9j44J23
$$ -65 37 25 23 -24 -71 0 56 66 -97 -100 -44 -23 60 -80 65 46 -49 -49 -135 -50 2 117 -96 20 13 32 -112 11
8430A1K0o0J35j19N9j02K8N2K4nk1l1l8jN3J8J1K1n5q8J11j2N3q0l7L3L3l0N6
$$ 11 31 -29 106 -13 46 -56 -28 24 48 43 22 -9 -47 -48 5 23 34 55 0 -88 23 11 64 -16 -53 -20 13 -17 39
8459C9j13J0R8j45K62j71L6k3j12O6K2R1Np6J4l1M0K5L8J0j5q3j51J47O3Mq1L8
$$ 39 -74 -64 34 -111 151 -20 16 -7 -119 -53 -31 60 65 -11 3 -28 12 37 75 85 70 -13 -164 -17 46 50 -31 7
8487GM1k1J33r2n5n9O4J40j33J6q5J00Kj57P5l9Q3J2p8L6o5J23K7n8k3J7J49j62
$$ 7 48 27 160 68 13 -46 18 158 25 41 -44 56 58 -99 -24 -63 20 32 -46 -10 -75 48 75 17 -6 11 160 -2
8515bL8J6K4j63n7K21o5oo3Q3P0j31Pr3J7J63m3O3j56N6N6r2J38j16J41R2q2k34
$$ -2 36 52 76 -87 -144 77 12 6 -57 26 96 -35 -28 -121 -104 59 16 79 -77 -21 35 -57 81 -35 106 198 116 -118
8543a18J80r2n9J30p1J6J01p8jj70K12j03M9N6l1O2k8Mj37k2K08j94L1P3j13J99
$$ -118 62 -30 -89 41 -30 -14 87 9 8 -162 50 -53 -4 52 21 83 55 59 -78 -100 108 -86 -55 18 -95 104
8569A04j33J04L5k8r8M1j11J02J05j15k7J51j48pon7L8K0q1k4J03Q9j05l4K50
$$ 104 -29 75 110 82 -16 25 -86 16 121 6 -21 130 -18 -25 -31 -88 -50 -30 -111 -135 -32 57 -48 -82 168
8594A68j41N8j44K00j03P4j16j6L9q8M6P6n5R1J9k09K16j84J17j7n2J4o5N0l8
$$ 168 27 85 -59 141 38 112 -4 -20 19 -69 -23 53 -2 89 108 -101 115 -69 48 31 -21 -7 -72 -22 -60
8619f0K2J36l3q9j0N2r9J24o4m2J41Lm2n6%l6o9M7%J22m6M7o2n1J07j64J07K3
$$ -60 -38 98 65 -24 -34 18 -81 43 -21 -63 78 81 39 -17 -17 -53 -122 -75 -75 47 1 48 -14 -65 42 -122 -15 8
8647HlJ11j23R0j30%q9J46o6m6J54l5K7j64R0Q4j38M0K7j0p0J88pK5q9p8J11n1
$$ 8 5 116 -7 83 -47 -47 -136 10 -56 -102 52 17 44 -120 -30 54 -84 -44 -17 -27 -97 91 84 109 20 -58 53 2
8675BJ6r6J54j79N7R0O7l01J98mj31J74j8J4Q8q8j19J0j0J36j47o7JJ04O2m9n4
$$ 2 18 -78 76 -103 -46 44 111 -190 8 4 -127 47 29 43 131 43 -76 -66 -76 60 -87 -154 -153 -49 13 -36 -90
8702i0J29q7k5J38j48K28j67k2J09m9L4M0rl2r1O2j1J2J33j5K7j50j23M5O4M5
$$ -90 39 -48 -73 65 -83 145 -22 -44 65 16 50 90 81 49 -42 20 9 21 154 139 166 16 -107 -62 2 47
8728D7Pk4n5J09k11N2L4Q7J9O1q7K0k38J43O1N5q5Q6j11L3j05R4p2O7P7n0k3J1
$$ 47 54 30 -25 84 -127 -75 -41 46 65 126 39 59 -179 -36 25 80 -5 81 -30 3 -102 -8 -80 -13 64 14 -9 2
8756BjKn5M9M3q8J16r6J7q4M0J02k7j25J89Jl7j30P3Q7p7K8J4K9j33J4P7j30N4
$$ 2 1 3 -52 -3 40 -48 68 -28 -11 -95 -55 47 20 -105 84 85 48 -82 -9 78 1 29 43 72 -61 -47 30 -100 -46
8785d6Pq4L2o6J57n5K9J14M5o4p4P6P0j13p6nk9J6R4p1R0q6J23o6L1l2n6L0o2
$$ -46 -39 -123 -91 -157 0 -55 -26 88 133 69 -5 71 141 28 -48 -53 -82 -66 28 -43 47 -39 84 18 49 17 -39 -9 -71
8814g1O6p9Q2J3K8L7j86J05k8L9q8P0KL7j36J73r8n2J79m2r4O8j9j2r0J6N3PJ5
$$ -71 -5 -84 -2 11 39 76 -110 -5 -33 6 -82 -12 -10 27 -109 64 -34 -86 93 51 -43 25 6 -6 -96 -80 -27 -20 -5
8843eM8m7k1O4o4J0J05j79j02K05p4Q4q4J85j84o1M5Q9p2O3J8l8L4o3J32r2Jo6
$$ -5 43 -4 -25 39 -25 -15 90 -89 -191 14 -60 24 -60 125 -59 -120 -75 14 -58 5 23 -15 19 -44 88 -4 -3 -69
8871f9J12J2r6M3j24J75j06q2P0j0Ll7M7OO8j20P1O4M9ok0j03K16k68J5L3N7n
$$ -69 43 55 -41 2 -122 53 -53 -135 -65 -75 -72 -109 -62 -56 12 -108 -37 27 76 70 50 -53 163 -105 -90 -57 0 -5
8899em6J28j11P5m4P6k3r2P5n5O9L9j41Q4N5j05J08p7l0p2P4L8P9p6M1j28j09
$$ -5 -51 77 -34 41 -3 73 50 -42 33 -22 47 86 -55 29 84 -21 87 10 -20 -92 -18 20 99 23 64 -64 -173
8926a73K10j7j06q1P3j25J86N1Qp7j1k4N3R0l3r5M7L8k8K9mn7J56k64J17N8n1
$$ -173 37 20 -86 -167 -94 -219 -33 18 26 -51 -62 -86 -33 57 24 -71 -24 14 -14 15 11 -46 110 -154 -37 21 -30
8953c0k3P4k2L4N6r8k9R4l9J4q1O5L0K6k9j61J12m2M6K7r6J03n5O9j22RL4K5M9
$$ -30 -53 21 -1 33 89 -9 -38 56 17 31 -50 15 45 71 42 -119 -7 -49 -3 24 -72 31 -24 45 -77 -68 -34 -9 40
8982D0m0M2J1j12J16r3P8j30M5O4j75J75m2L0o6P6J7k0o2nK02k62J53j17P6j0
$$ 40 0 42 53 -59 57 -36 42 -88 -43 21 -154 21 -21 9 -57 19 36 16 -46 -51 151 -111 42 -75 1 -9
9008iQ2p3mJ05m0n9N1j10n5N4M3p5P8p2L7l3R5r3M5J54pj02J23k4o1n1j18J39
$$ -9 73 0 -4 101 61 2 53 -57 -112 -58 -15 -90 -12 -84 -47 -80 15 -78 -33 121 114 12 135 111 50 -1 -119 20
9036B0J4q0k7L7KO4m3J19j5p6n8l4J00Q9j39j06R3P4J03j09j08J15K4j26R3J26
$$ 20 34 -46 -73 -36 -34 30 -13 106 91 15 -43 -77 23 112 -27 -133 -40 34 137 28 -80 35 59 -67 26 152
9062A52j45L2p7R2r5lJ63p9k3p8K4P5j17J25n6j23J44j20k9J96j2o2n1M1M8o1
$$ 152 7 39 -38 54 -41 -44 119 40 17 -61 -37 38 -79 46 -10 -133 11 -109 -138 58 46 -16 -67 -26 22 -39
9088c9ll4Q5Qj38L13j14J9k15M6N3o1R8kj0QQ9j81K43J3j56%N3l3j02P7k5L5m
$$ -39 -42 -76 9 17 -121 192 78 97 -118 -72 -19 -80 18 16 6 14 103 -78 165 178 22 22 75 42 -60 17 -8 27 23
9117B3j17J16o0N1R7j10m2nJ57j54kO8j2P7j52R3j75J26lJ2L3L6rM6l1r2M6Pr0
$$ 23 -94 22 -38 13 110 0 -42 -47 110 -44 -46 22 10 87 -65 28 -147 -21 -24 -12 21 57 48 94 63 -29 17 24 -66
9146f6j3J01K7q3K2J06j20J20j61Q7k7pK1l2L7m9m7K6P2P1p7J5k4L8o6n6M1o2
$$ -66 -79 22 49 -34 -12 94 -26 94 -67 20 -7 -14 7 -25 12 -37 -84 -58 14 85 8 23 -1 37 -29 -85 -44 -106
9174a06J75k57J23j0J26L5j13m2mM7J43q5q8J38o6k0%J3j0J1o6P7l0M2L4r5M7
$$ -106 69 -188 -65 -75 51 86 -27 -69 -73 -26 117 32 -56 82 16 -4 -4 9 -1 10 -56 21 -9 33 67 -28 19
9201A9j3j8NJ7N5K7k8o3J18j90J09Q5m8j38O2K3m2j1q8R4%l0O1j19N7K9m5j03
$$ 19 6 -12 -7 10 65 92 64 1 119 -71 38 123 75 -63 -1 22 -20 -31 -119 -25 -25 -55 6 -113 -56 -27 -72 -175
9229a75J46j3K6j3Rpj20J65J33j45L1J5kJ4m9R9j71J66j12J16q8P3q2M3M0j55
$$ -175 -29 -42 -16 -29 -20 -27 -147 18 151 6 37 52 50 64 15 114 -57 109 -3 113 25 98 16 59 99 -56
9255e6N9K4K6J11k18R8j15L7M6L3l6l3J11j86J43r9J14j39N3N5j45Q7Qj4J60j54
$$ -56 3 27 53 164 -54 44 -71 -34 12 45 9 -24 87 -99 44 -55 59 -80 -27 28 -117 -30 -22 -36 124 -30
9281c0l4Kj08Q8J36Qj66J97k09P6J56j75R2k6K1p0K5l5J40M0j22M0K5J6o8j90
$$ -30 -64 -62 -170 -82 54 62 -104 93 -116 -40 116 -59 33 7 28 -42 -17 -52 88 128 6 46 71 87 19 -171
9307a71J37K9P1j74J06M9l9L7l2j19m0J15j4l7O4L6L2p8N8K1m6q1Q3j7l7j4mm2
$$ -171 -34 -5 66 -108 -2 47 8 45 13 -106 -146 -31 -45 -82 -18 18 50 -28 30 51 5 -76 7 -10 -47 -61 -65 -107
9335a07J10P3%q4m0J92j52P9l9J3j48R6j7mRq6J37M7m3k9jj25J89j24j29K07q1
$$ -107 3 76 76 -8 -48 144 -8 71 32 45 -103 -7 -24 -28 -19 -105 32 79 36 7 6 -119 70 -54 -183 24 -57
9362e7O6o5o7J14M6MR5k50N9L6j52J57L5K1m2Q6j03J4J5Q8o3n0J79j45r1M3J8
$$ -57 9 -56 -123 -9 37 41 136 -114 -55 -19 -171 -14 21 42 0 86 -17 -3 12 100 37 -13 166 21 -70 -27 -9
9389il7J18m7j61J96%o2q2J16P8k31K20r4M8m6n8N9jk6q1J25k6N4o9JM0op6j9
$$ -9 -46 72 25 -136 60 60 -2 -84 32 110 -121 99 5 53 7 -51 8 7 -19 -100 25 -1 53 -16 -15 25 19 -57 -76
9418g6J16j12L5M9p1J0K1Q4q7J21k55J94l2r6O1K0R8o0n8MR3q6M9m9N1J8j8m0
$$ -76 40 -72 -37 12 -59 -49 -28 56 -31 90 -165 29 -3 -99 -38 -18 80 20 -38 -34 59 -27 22 -27 24 42 24 -16
9446a6k1lj4J54o6Q3o2M8L2j88L9o3j6J39m5rj0j30Q5J0j4KJ43j13N6r1L3l0J05
$$ -16 -37 -40 -54 100 34 117 55 103 135 -53 -14 -77 -93 46 1 -8 -18 -148 -63 -53 -67 -65 78 -35 21 -70 -37 -67 38
9475C8j5n8o6J63M5q7l8L3O6l7o9Q3j51K08j09j9J80r7k7q3J11o8M6k7K0j36Q9
$$ 38 23 -35 -101 62 107 20 -18 15 81 44 -25 58 -93 115 6 -13 167 70 43 -40 71 3 49 22 42 -94 -5
9502eK0j62J29j9j0O0nJ0K4q5qP9p2N5q4M9l4J42j08m0J08r2J67k43J40j1p8J51
$$ -5 15 -147 -18 -37 -47 13 8 18 42 -43 -51 28 -44 11 -73 -24 -58 84 -24 -64 44 -48 119 -124 16 5 -73 78
9530G8p0J6NM1p2Qj8NK7j6p2o2P4J56j00RM3l9J8m8k8K6o0J16j73P0J32j10mL3
$$ 78 8 24 29 70 -2 6 -12 -7 20 4 -68 -130 -56 100 0 9 52 13 31 -17 -45 -19 -79 37 -136 -66 66 -44 -48 -15
9560a5j18J81o1j5k2OJ05J0k60K48O9j96o7J56J9m5o8O1l4J21o7n5o9K64j36o5
$$ -15 -133 48 -13 -28 -50 -44 61 71 -189 59 128 -68 -135 21 40 -5 -73 -12 -46 75 8 -47 -116 148 12 -53
9586e3M4L0j30K24Kj63P0l7n9l8Q4K7n3J13q6o1K2J21n1j9o1OJ62j62LJ44p1m6
$$ -53 -9 21 -109 115 117 -46 24 -13 -72 -110 -26 1 -52 61 -25 -86 -64 57 6 -13 -74 -68 94 -68 -65 79 8 -38
9614c8K6o0L1j5oJ47n5J1Km6n9J1M5J21j08p8O1m0O0q9O0J06l7R7j00k4N1j05
$$ -38 -12 -72 -41 -56 -62 85 30 41 43 -3 -62 -51 -6 115 7 -71 -10 -50 10 -79 -19 87 50 147 47 23 74 -31
9642c1l9%J39j27J35j59o0J97r8J09r4PQ6j23N7LP9q4P5j22m4K2QK3J30m4o8J6
$$ -31 -70 -70 69 -58 77 -82 -142 55 -43 66 -28 -21 65 -58 -1 2 81 -3 72 -50 -94 -72 -64 -41 89 45 -23 -7
9670gl3K1r8J41l5nj08J11O0r4JP1o8J1O7nL6j78Q8M3J01j62O6j3L1oj03jN0N2
$$ -7 -40 -19 -117 24 -11 -16 -124 -13 47 -47 -46 25 -43 -32 35 30 66 -112 -24 19 120 -42 24 11 42 36 -67 -68 -18 34
9700C4m4M5m9J8qlL5J20j14K0o0j1k6k3J36j22p7J31m6J3J2M4%j69K39j65R8%
$$ 34 -10 35 -14 4 -4 -7 28 148 34 54 -6 -17 -43 -66 70 -52 -129 2 -44 -31 -19 25 25 -144 95 -70 28 28
9728B8J4k0jL5mj08l2J66r1J00j68P7o1R1K4r0J66j65jL4O0r9M1rj33K42j27L4
$$ 28 42 22 21 56 52 -56 -88 78 -13 87 -81 -4 -65 26 50 -40 126 -39 -40 -6 54 -45 -4 -13 -146 96 -31 3
9756CPn0m1R7o2P6j02P4kn8J21q7J4l1l5J69j83J35L8j95J60%k9K1j0Q3j80J67
$$ 3 10 -40 -81 16 -46 30 -72 2 0 -58 63 -24 -10 -41 -76 93 -90 45 83 -112 48 48 19 40 30 113 -67 100
9784A00M3j04J3n4qp1J28m2o9Q3Q%j34m1J21P2j56R7N0PN3j79L5K4O5Lj31P3L5
$$ 100 143 39 52 -2 -10 -81 47 5 -64 19 27 27 -107 -148 -27 45 -111 -14 36 43 96 -83 -48 -24 41 44 -87 -14 21
9813B1o6n5M6l8Q2Q0J6j10PJ37k00P2n9M3j7J57ln0q1K5J8j10R5k0n3R3J03k14
$$ 21 -45 -100 -54 -92 -10 70 86 -24 -17 120 -80 -8 -67 -24 -41 116 113 63 -18 7 25 -85 10 -10 -63 30 133 -81
9841h1K8N9rK9j35J76j23pJ4M1J15j63Q2L1pP2q0r2r0J42Q8o2q7q7J78K2K2k03
$$ -81 -53 6 -3 26 -109 67 -56 -63 -49 -8 107 -56 26 57 50 122 42 -50 -140 2 90 28 -59 -146 32 54 76 -127
9869a27Q6N8k5l7n2J00J26j80P4k9J40j97N2j30R9p4K13p4JL9J9k7q0J56k20J37
$$ -127 -41 17 -8 -45 -97 3 129 -51 23 -6 134 -63 -11 -141 -42 -116 97 23 24 63 82 55 -25 131 -89 48
9895D8m1pK1L7N0k12LQ3j1k7P6L9q2rj07J38M8j19J26j36Q1M1r0K0J95k12J4P
$$ 48 7 0 21 58 108 -104 -101 -18 -29 -56 20 59 -23 -32 -139 -1 47 -72 54 -82 -1 40 -50 -30 165 -47 -33 -26
9923b6L9LM5o6N0Pr0J18j11m3J14k8K0l3n8l3K08j01j34R1K5O2J4o5Mj27J33o4
$$ -26 13 16 61 -5 45 52 -38 80 -31 -74 40 12 32 -1 -59 -92 116 15 -119 -28 -3 59 73 8 12 -115 18 -46
9951d6L6j8O2j2j22Q7k6M3K4jm2O6n2o0Q4J7q3J35k0k6j3L7j73J81j7l4j1j16
$$ -46 -10 -28 34 22 -100 -13 -39 4 28 27 -15 51 -1 -61 23 40 -43 92 72 46 33 70 -103 78 61 27 16 -100
9979a00J56m6K0q1jN7N7M0r8O4j76NK9p7J03L2K5N2k4L3p2n6P9Rp0M1K2N2qm2
$$ -100 56 10 30 -51 -52 5 62 102 4 68 -108 -103 -74 -151 -48 -16 9 61 37 70 -2 -58 21 30 -40 1 23 75 67 25
10009B5R6Kk30R4km6J4K3m0K0J7Mk5P1K7r9oJ17M5j40%lj7O1M4j58O2O5j13Q7
$$ 25 121 123 -107 -13 -15 -61 -47 -24 -64 -44 -27 -23 -48 23 50 -49 -55 62 107 -33 -33 -36 -53 8 52 -106 -44 21 -92 -5
10039eQ2K4j73J17j41J30l8m3O9l8l5K1L7j26J48k0j12Q6J20K3j21n3J7J14j23
$$ -5 77 101 -72 45 -96 34 -4 -47 22 -16 -51 -30 7 -119 29 9 -103 -17 103 126 5 -48 -31 83 -40
10064d0L0O5o0j1O1k2P8Pn3J5Nq3r7J39n1R6r2M5l3nN1j20J61m0O5j93O4J8rQ8
$$ -40 -10 55 -5 -16 45 23 101 108 55 70 75 -8 -105 34 -17 79 -13 32 -1 -6 45 -75 86 46 111 -82 -18 0 -9 79
10094G9m5p3j28N1M1q6K68n9n9n1k7R5o0k6J13j17L1O5J5j9J07q8L3p7J43j60
$$ 79 34 -39 -167 -116 -75 -161 107 48 -11 -62 -89 6 -54 -80 33 -84 -53 12 27 8 115 27 60 -17 126 -34
10120c4j4J83j66J5R3lp1J07q3k3J8J04j05rJm2L2n0k7N8q1R9K9M1j17j0m3J66
$$ -34 -48 135 -31 -16 77 74 3 110 27 4 22 126 21 12 13 -29 3 -47 -74 -16 -97 2 31 72 -45 -55 -98 68
10148F8L4k2q6J0n1j5R8pr3Q5P8l4j06m3R3n9P8J7N7j16m6J46o3j3P3j08j7R0
$$ 68 102 80 -6 4 -47 -62 36 29 -64 21 99 65 -41 -84 9 -50 28 45 102 -14 -60 86 23 10 83 -25 -42 48
10176D8k6j17Q1k9j03K05pm9J19n5l4j11P1n1K4L4O8r0M7j3M3j53L6R7j2o7J1
$$ 48 22 -95 -14 -43 -146 59 52 3 122 67 33 -78 -7 -58 -34 0 68 -22 25 12 55 -98 -62 35 23 -44 -33
10203c3m2P4rj15NO6J87j45P4m3P2j10P0Nq3oJ96q5j11J7kP1j04k0J91r4o5O6
$$ -33 -75 -1 -10 -125 -120 -54 133 -12 62 19 91 -19 51 56 -27 -33 163 78 -33 -16 -18 53 -51 -71 120 26 -39 27
10231B7j00J18n7J4q5L7J7Q4r2Ml4M4K0QJ1Lo2R2N9j61L3Kl5MM3j6l7J04o4m9
$$ 27 -73 45 -12 2 -83 -46 -29 55 -37 -33 -67 -23 -3 5 16 19 -43 49 108 -53 -20 -18 -53 -49 -6 -22 -59 45 -19 -68
10261f8J22j05J39j56Q7o7k5K06j01Kj20J27k0r2J41j02j6j2O5kO5k0K3n4n1k0
$$ -68 54 -51 88 -68 19 -48 -73 133 32 34 -86 41 21 -71 70 -32 -48 -60 5 3 68 48 71 17 -34 -54
10287e4M5nl3P0p0p6J23OJ3M9q3J50r0l7L6j7N5p0R1o1P7o5j01RJJ16n3n9n2L1
$$ -54 -9 -14 -47 23 -47 -123 0 6 19 68 -15 135 45 8 44 27 82 12 103 42 119 54 -47 -38 -37 79 26 -33 -85 -54
10317e4k0M6J6M2j29J41m7kr0N9RL2Lq5Mj4J58j33J03J1mq8J06j47P2J26q8r9
$$ -54 -74 -28 -12 30 -99 42 -5 -7 -97 -38 -29 3 6 -79 -75 -89 69 -64 39 50 46 -42 64 -83 -11 115 27 -72
10345g2N0J06n4l6R7o4r5J08L3j6nl1kp5Q2q0M4M1PO2j42O4P1j60J02np9M1O2
$$ -72 -22 84 30 -6 91 27 -68 40 73 57 52 21 19 -56 26 -54 -10 31 38 100 -42 22 93 -67 35 30 -49 -8 54
10374E4l6l0Rp8oP0M4k07J81m4kl4M8O9o1M6m7K0j86K23k0p7N3J16j3r1P2p1R1
$$ 54 18 -12 -3 -81 -87 -17 27 -180 1 -43 -45 -79 -31 38 -23 23 -24 -4 -190 33 13 -64 -11 105 92 1 73 2 93
10403I3r0N1j67J02M6Q6j20o8R8j40Q7k2mN2%j0o4P0j8J11j21J10j03M8P2r3k9
$$ 93 3 54 -113 -11 35 121 1 -67 31 -109 -22 -44 -48 4 4 -6 -70 0 -18 93 -28 82 -21 27 99 6 -23
10430b3L1k8m3Q5K9k3j07J30o9Rm5N1L8M1J9j23q4O0J00m6%J1K7o7k8M4P4N1n2
$$ -23 8 -20 -63 22 51 28 -79 51 -18 -9 -54 -3 35 76 95 -28 -112 -52 48 2 2 13 40 -27 -55 -11 63 114 62
10459F2q2J03n4J6Kk9O0j86N8K0m1J13j3j03N5J0O6L2k49J14k1R1m1j9n0M8M3
$$ 62 -20 83 29 45 47 18 78 -108 -50 -30 -71 42 29 -74 -19 -9 57 89 -160 -46 -67 24 -17 -36 -86 -38 5
10486Ej21J80n1K5l9j7J4L0L3N1p0p4J21j6j9J1k0m9J7J66k08J03m2r8J24n1N4
$$ 5 -116 64 13 38 -1 -18 -4 26 59 110 40 -34 87 71 52 63 43 -6 11 177 -31 72 30 -68 56 5 59
10513E9j40J00J9l4J55q3n8q4Q2j8q3J20p3m8P6m2m2J10N4p1%o6J57j91Q4N9p9
$$ 59 -81 19 38 4 159 76 18 -66 16 -2 -85 35 -38 -86 -10 -52 -94 16 70 -1 -1 -67 90 -101 -17 42 -37
10540c7R3Nl1n9J18l8p4r9J19P0j08Q6j24m2R1J66q8q6M8Q6j76P1pN8l3lJ3N2
$$ -37 56 61 30 -29 89 51 -23 -122 -3 67 -41 45 -79 -121 -30 136 48 -38 10 96 -80 -9 -16 42 9 6 19 71
10568G1m6L4L0j60J27r2J72j43J02o5j81J45P1j78J53j10p3K41j10R2pp1K6ql0
$$ 71 25 59 89 -71 56 -36 136 -7 95 30 -151 -6 65 -113 40 -70 -143 98 -12 80 73 2 28 20 -10
10593a0j3m2L7P8k8j52J28JRJ4k07K66rj39P1mj04P3Q3N5j45lN6j4j7j5Lo5J41
$$ -10 -23 -65 -28 50 22 -130 -2 -1 8 22 -185 81 72 -67 4 0 -104 -31 52 107 -38 -41 15 1 -16 -31 -28 -93 48
10622D8Kj34mJ21j1j08l1J06J12m5j0o8o2J46l7L4j70J21j3j10J80k4l5R9j93
$$ 48 50 -84 -88 33 22 -86 -117 -11 101 56 46 -22 -84 62 25 59 -111 10 -3 -113 67 43 8 107 -86
10647h6J69Qj2j96K8J37m7QL2O9q0j6J05o4lp5N4j5o1J0K4k2O8j58J13j08J28
$$ -86 83 91 79 -117 -89 48 1 9 41 110 30 14 119 55 52 -23 31 16 -45 -35 -11 -33 35 -123 -10 -118 10
10674A0o7PNOOj6J23j36J58j72J49m7J12j06p8J00j63L8K4n9J75p2o8N6N3j8o7
$$ 10 -57 -50 -45 -39 -33 -49 74 -62 96 -76 73 26 138 32 -46 54 -109 -71 -47 -106 69 -3 -71 -15 38 20 -47
10701d7J21k3j47J86q2k5k8L2K4J7Nm0Jn6J08Qj8k1m2K1N5j5m5l2J5M7j4k2m8
$$ -47 74 51 -96 90 8 -17 -45 -13 11 28 33 -7 -6 -62 46 54 36 15 -27 -6 49 34 -11 -43 -28 19 5 -17 -65
10730f5N7QJ8Q4j05n0J9J66j44k1L0J39j35Jj7KJ10j02Q4j41N0L9p4Q0k8j5Q8
$$ -65 -8 0 18 102 -3 -53 -34 132 -12 -33 -3 136 1 2 -15 -13 97 -5 79 -62 -12 27 -47 33 5 -10 78
10757G8j08r7P5L4n3N0j05J17l6NO9q3O3J9k0N3j04j9O6J40j2j67J18j66M9q6
$$ 78 -30 -127 -52 -18 -71 -21 -126 -9 -45 -40 29 -54 9 28 8 61 -43 -62 4 144 132 -35 83 -83 -34 -120
10783a20R8j4J10j74J08n4p2R7pJ51k21L3Rk5J61q1m6j4J00q2J16p1KQ9j00R1
$$ -120 -22 -36 74 -100 8 -46 -118 -21 -28 123 -98 -65 -56 -81 80 -1 -47 -61 39 -43 73 2 4 93 -7 84
10809H4m2k3Q1k31N4J30m3j15J66j7j17j1l9OJ33j9j8N0O4j08L6N3q1n3J2rN5
$$ 84 42 19 100 -131 -77 53 10 -105 61 44 -73 -84 -123 -117 16 -3 -21 29 93 -15 21 74 -7 -60 -48 -57 -2
10836bp4J32l2P4n4l9k1N2L7k4p8M8l8J4RlP9j06M7P3j23o8Q3k4RL5j9Q0j29M8
$$ -2 -76 56 24 98 44 5 -16 36 73 49 -29 19 -19 -5 4 1 80 -26 21 94 -29 -97 -14 -38 -29 6 -13 67 -62 -14
10866a4p6L0J47j47R5m4jQ1r6K0j24N0JJ28q5O2J64k61j3Q9N1j0k4n1MM6k9k7
$$ -14 -90 -60 87 -60 35 -9 -10 71 -25 -5 -129 -79 -78 50 -35 27 191 -70 -83 6 57 47 23 -28 -24 22 -7 -34
10894c4K1j03J06J04p9Mj06L4O4n8L2N9n6j0o0J86j95J42n4m6J03j84K15q9N8
$$ -34 -13 -116 -10 94 15 19 -87 -53 11 -47 -15 44 -12 -22 -82 104 -91 51 -3 -49 54 -130 85 -4 54
10919E4l7j54J04Q9P1k04J77o3n4P2L6m1NJ9j2j12J14L7jq3J2L0m3pl9n2J70r6
$$ 54 17 -137 -33 56 127 -77 100 37 -17 55 91 50 55 74 62 -50 64 101 100 17 29 59 16 9 -30 -82 88 -8
10947hR7n3j57J92j42K5m4Q7J80k82Q9K0L1m7n8L8O3o4K1j7lJ05k1j09O9k3mK7
$$ -8 89 36 -121 71 -71 -46 -90 -3 177 -105 -16 4 35 -12 -70 -32 31 -33 -12 -29 -32 73 52 -57 12 -11 -15 12
10975A2P6q2j21j4J84J1q7M6nn4N9k6q0P4K0j56K83j04L6j54J99n6j23k2J18m5
$$ 12 88 6 -115 -129 55 66 -21 25 20 -34 25 -1 -81 -7 13 -143 140 36 72 -82 117 61 -62 -84 34 -11
11001a1j83J00J32j11R4p3M9j67K45p8j08Q2q5l0J35J5Qk35K05O1j9j34K42o3
$$ -11 -194 -94 38 -73 21 -52 -3 -170 75 -3 -111 -29 -114 -144 -9 6 14 -221 -16 45 26 -108 134 71
11025G1j17J43R2j30p8O2M6P3j02l3O2q4P2n8l8K5OJ7j72J32k9P5m7RJ0pp7O7
$$ 71 -46 97 189 59 -19 43 89 162 60 27 89 5 77 19 -19 6 12 29 -143 -11 -40 35 -12 -3 7 0 -77 -10
11053a0Q4r2L2j6pM4q1j8M7O2qn1J26k9r6J02p2K9n6j25J25L6J2J2oP%P3o4o3
$$ -10 74 -18 14 -2 -9 35 -46 -64 -17 45 37 -14 112 83 -13 89 17 46 -10 -135 -10 26 38 50 44 51 51 124 60 -3
11083ck2n5J47m1K9K8J06j39n5P4%j79J86j67P1j8K0p1J24p9L4j7o5N7l8k6O4
$$ -3 -25 -80 67 26 55 83 189 50 -5 69 69 -110 76 -91 -20 -38 -18 -89 35 -44 -10 -27 -92 -35 -73 -99 -35
11110c5m6J04j9j59J51J14n2o9q5M3J17rJ18j23j12Q4M7j08l0J27k7J37j57n7
$$ -35 -81 23 4 -155 -4 110 58 -11 -96 -53 64 55 173 50 -62 22 69 -39 -69 58 31 168 11 -46
11134d6K1P5j77K42j63J36k4j25J86o7L0j24R4j12ol6R5n5kN7Q4p0Lk4j9K0K3
$$ -46 -25 50 -127 115 -48 88 64 -61 125 58 88 -36 58 -54 -60 -96 -1 -56 -58 -1 83 13 16 -8 -27 -7 16
11161A6o4J03j12P1r1J14R2k26R1j33J55o9J55o1n8J07q7J0PJ34m9k01O0L5k1
$$ 16 -48 55 -57 14 -77 37 129 -97 -6 -139 16 -53 102 41 -17 90 3 13 20 154 105 -96 -36 -1 -22
11186b2N8n4M3o2m5K02r1j3k1M8m7L1m6p5J24p5J5N4o6l4J53q2K9J2p3K0O9l3
$$ -22 36 -18 25 -37 -82 120 29 16 -5 43 -4 27 -19 -94 30 -45 -30 24 -42 -76 77 -5 24 36 -37 -17 52 19
11214A9q5J12M9j15J47o7j08Q0K1kp9Pp8O5N7o5J72p2j32nJ15n0L9K2p4K0L3j09
$$ 19 -66 46 95 -20 127 60 -48 32 53 51 -28 -21 -99 -34 23 -42 130 58 -74 -79 36 -14 25 47 -27 -7 26 -83
11242h3R0J4q2P0q9J16J31j72o4l0J03N5m5j1L4O7m1m8k0Rj49P5Q7r0J27m1k4
$$ -83 7 21 -61 9 -80 36 167 -5 -69 -99 4 59 14 3 37 104 63 15 -5 4 -145 -70 17 -73 54 13 -11
11269a1M1r0M5L5mlj23P6jQ6Ro3K3j20J16o3K5o6J38L3l2L6j85O3l1Q4q2j0P0
$$ -11 30 -60 -15 20 16 13 -110 -34 -35 51 60 -3 20 -100 16 -47 -22 -88 50 83 51 87 -98 -35 -66 18 -64 -74 -4
11298dm4P2r8J15R7r6n2J34q5j02O0J38o9m4K9NQ6r2M3j03O9p1oj1L7J39k84J34
$$ -4 -48 24 -74 41 138 42 -10 124 39 -63 -3 135 66 22 51 56 142 50 93 -10 59 -12 -18 -29 8 147 -137 -3
11326cl6J07j88K14o7l1L3k5k3J6M7Ppj2O4r1l8j6M7N7k6j21P4mJ1jk3j12P9J46
$$ -3 -39 68 -120 94 27 -4 29 4 -19 -3 44 51 44 32 96 5 -33 -49 -2 55 29 -92 -18 -22 -11 -12 -35 -147 -68 78
11356G8n9r2R5r3Q4J0Mq1J29j79J00M0j14R9o7L2J16j68J42r3J2Q6j75J97j64
$$ 78 19 -73 22 -71 13 23 27 -54 75 -104 -4 36 -78 21 -46 -14 102 -66 76 -17 -5 81 -94 103 -61
11381f1J20j31K5mKqJn2J76n5r3J11P5q2j22J2J57q8j7J08r6N6L1k7j52K27j06
$$ -61 59 -72 -47 -51 -49 -57 -56 -108 68 13 -80 31 106 24 -98 -86 71 -17 -34 74 -22 34 65 38 -114 113 7
11408GN0on0Q8l3j7N8M5j84pJ01K5Nk1j46M1j06J66K0M9o8j1j05N4J4P0K6j69
$$ 7 57 51 1 89 56 39 97 142 -42 -49 52 77 82 61 -85 -44 -150 16 36 85 17 6 -99 -45 -31 39 65 -104
11436a04j4J35o5m5J28ql2O4j23K3J27r3o6N3j3k4L3N2k8Q2N6j82M7J12o3j3K7
$$ -104 -118 17 -48 -93 35 27 -5 59 -64 -41 86 -7 -73 -20 -33 -57 -24 28 0 82 138 -44 3 115 52 39 66
11463F6j10J21q8J2pp5J33n1l2O5k00J46NR2k02Q1K3PN1j08L5r2k9K23O8r4j41
$$ 66 -44 77 -11 1 -6 -81 52 1 -31 34 -166 -20 -15 77 -125 -44 -21 -14 37 -71 -36 -128 -157 66 134 40 -101
11490a01J59j04QQ6n9K0K5p2O5m5K6k1J05r2K2L5j29J10on3n3q6K39o2Pj2n3J07
$$ -101 58 -46 -38 48 -11 9 34 -38 27 -18 8 -13 92 0 22 57 -72 38 32 -21 -74 -160 79 17 24 12 -41 66
11518F6m3J0o4J25j92P8j1J62j30K9l2L2J35j40l4L3j10PP4M3n7K3n8J11ln4m
$$ 66 23 33 -31 94 -98 -20 -31 131 1 30 -2 30 165 25 -9 24 -86 -79 -5 38 -19 4 -54 57 54 0 -4
11545dm7JO2pn8K6J08q5m2O7P2J3Lr2k0Q8j51O2j9N9j01N9M7J0j15P0j13J32l5
$$ -4 -51 -50 12 5 -53 -27 81 -4 -46 21 93 106 109 17 -3 85 -66 -4 -23 36 -65 -6 41 51 -64 6 -107 25 -10
11574a0k7J84j05j68O6N6L6L0j09Omk9k1K8l7K2O5j40K52j77j7J01J9ro0N9k1
$$ -10 -37 147 42 -126 -60 -4 32 62 -47 -41 -45 -74 -95 -67 -104 -82 -17 -157 95 -82 -99 2 21 12 -48 11 -10
11601a0ML7N2m7K9k03J12P5o3K6M4l8M5q7k8JN3j4J22j65J09r3J01j08N2J4q6
$$ -10 -6 31 83 36 65 -138 -26 49 -14 12 56 18 63 -24 -52 -51 2 -12 110 -55 54 -39 62 -46 6 20 -66
11628f6M3O0M5j09Q7j81J78rr9k6Q9q9J26M6q2q5J6O8K5l2q4R2n7L4j8LJ52r2
$$ -66 -23 37 82 -27 60 -121 57 48 -51 -77 12 -77 49 95 13 -72 -56 12 37 5 -79 13 -44 -10 -28 -25 127 35
11656C5O4n0R8j01m8j2Q2o8R0Q7j98K0n7K1j8qK1Q2n5n2R7l9j3K5J1Or5N1j9R7
$$ 35 99 49 147 46 -2 -14 68 0 90 177 -21 -1 -58 -37 -55 -63 -42 40 -15 -67 30 -9 -22 3 14 20 -75 -24 -43 54
11686E4k2j12k4R5P9n1m5pR3Qm0o9L4j05Q5J05qo2K0l5m9J33n1Q7p7l0K3Lq7m
$$ 54 32 -80 -104 -9 70 19 -26 -33 60 68 28 -41 -7 -112 -27 78 70 8 28 -7 -56 77 26 113 36 6 29 32 -55 -59
11716e9M4O8m5k8Q1q6P0j9MJ23k25j0J15n8n3J90j9j19J7j09R8O7q6o2N4M9J19
$$ -59 -15 53 8 -20 61 -25 45 26 30 153 -72 -82 33 -25 -78 112 93 -26 -9 -118 -20 47 -39 -101 -47 2 121
11743A21q3m3Q3J6Q4k30oJ95r4R0j71J7k1NJ15j36n0J62j05L2m4J6J80j66J13
$$ 121 38 -5 78 94 178 -52 -58 137 43 133 -38 -21 -42 -37 78 -58 -108 54 -51 -19 -63 -47 133 -33 80
11768H0o7k9n3J12q3L1o2P0o1K2o6O7L8r7J99j07%O4j1k3l3j06J49l5Q1j09L8
$$ 80 13 -16 -69 43 -40 -9 -71 -1 -62 -40 -106 -39 -1 -98 101 -6 -6 58 47 24 -9 -115 34 -1 80 -29 9
11795Ir1N3N1J00j23J00l3r5J04o3j66K17M0k3j13k2J46j21M1K5o7P9Mp1k2M8
$$ 9 -82 -29 22 122 -1 99 66 -29 75 12 -154 63 103 80 -33 -55 91 -30 11 36 -31 48 52 -19 -41 7
11821GM2j13Q1o7m2R6J24k00N2K8K0R9p9K1r2Qk6J47q7R5M2j47k8J8l6O3K0m5
$$ 7 49 -64 17 -50 -92 4 128 -72 -20 8 28 127 48 69 -23 -15 -41 106 19 114 156 9 -19 -1 -37 26 46 1
11849AJ11m3j24J11J0n1j20L4J62j01J33q9p5kQ4j2j34J26j12J83k38J21J85k57
$$ 1 112 69 -55 56 66 15 -105 -71 91 -10 123 34 -41 -43 41 29 -105 21 -91 92 -146 -25 160 -97
11873i7J82j25Kj7J8Lmj3J92k23m4J41K4n4l3O8q7J26l7o5j37K18On6J35j26L2
$$ -97 85 -40 -38 -55 -37 -34 -38 -51 141 -82 -126 15 39 -15 -48 20 -67 59 22 -43 -180 38 44 -12 123 -3 29
11900B9qp5mP7N2j17M3R7j49L0J35m1j84Q8Q7j9j00Q4j23P4l2kr9K20o8Q2j64
$$ 29 21 -54 -58 19 71 -46 -3 94 -55 -25 110 69 -115 -27 60 41 -59 25 -98 -24 -56 -58 -157 63 -5 77 -87
11927h7L6M5pKR2J2j55J77j11mQ0r2R1ml9N6q9k8O9Q1j79Q9l6p2J47k5m5M0j5
$$ -87 -51 -6 -13 -11 81 93 -62 115 4 0 80 -12 79 75 36 92 3 -25 44 125 -54 35 -1 -73 74 49 4 44 29
11956B9M6j9N7m6l9p8Q8L5n6P2k01Q6K1M3k9q7O9P8r7J06q4J6mj6n4J37k05Q0
$$ 29 75 56 113 67 28 -50 38 73 17 89 -112 -26 -5 38 9 -78 -9 69 -28 78 -6 10 6 -10 -64 73 -132 -52
11984e2J36L9j54Q9J7p5k5O5nj5Q5k42K31p7M8j18J04Pj72J6J39o2J42l4j28N
$$ -52 84 123 -31 58 75 0 -25 40 35 20 105 -137 94 17 65 -53 51 58 -114 -98 41 -21 121 87 -41 -36
12010c6K9J62j92L6m9Q9p4J22j16P7o9L2oL2M0J05j62j1N4J2o2j2O4j08KJ02o2
$$ -36 -7 155 -37 -1 -50 39 -35 87 -29 48 -21 11 5 37 77 182 20 9 63 75 13 1 65 -43 -41 61 -1
12037aL8Q9o9p1J32j6j95J13p2J14j11J24j39N6op2R0K8oQ9j42pR8j11J7l3M7
$$ -1 37 126 57 -14 118 102 -93 20 -52 62 -49 75 -64 -8 -14 -86 4 32 26 115 -27 -34 64 -47 -30 -63 -16
12064a6RK5m2PR0Kr7N9J5j43J35j00J52j00O4J0q6Oo5J04m4R2p2n4J60p2Q8M5
$$ -16 -7 18 -24 -17 73 75 -22 37 52 -91 44 -56 96 -4 60 70 -16 -10 -75 29 -15 77 5 -49 111 39 127 172
12092A72j97l3J2P5q2J06Q3j41J3l4J37o9o5K6qR4J4p6m2n4J31q6Q1j00J17m9
$$ 172 -25 -58 -46 29 -53 53 136 -5 8 -26 111 42 -23 3 -5 89 103 27 -15 -69 62 -24 57 -43 74 25
12118B5L2r1P4M2j60N3n6M2O4o5Q7m8Np5J21j22R4k7P9q5N0n4l1J53j35J08j49
$$ 25 57 -34 40 82 -78 -25 -81 -39 25 -40 47 -1 4 -71 50 -72 22 -5 74 -11 39 -15 -46 107 -28 80 -69
12145f9J81k4j30M8j42K39j54J79j62p8K3lJ47o7o2KR5l3O3%m7O7k17K14m7o0
$$ -69 112 88 -42 6 -136 103 -51 128 -34 -112 -89 -92 55 -12 -74 -72 23 -10 53 53 6 73 -144 70 23 -37
12171c7M2k3o1R0J9J6k2p7Q0j8o4R8j7j46J32l2O7j35J7J47r5q2N1J13lo0P4k3
$$ -37 5 -18 -79 11 30 46 24 -53 27 9 -55 43 26 -120 12 -20 47 -88 -71 76 -19 -101 -50 63 60 0 74 51
12199E1r1l6J90j27O3p2k1j5J56k09Q7O6k2M4l1Pn3N9k1R8p5P2j63R7N0j38P7
$$ 51 -40 -76 114 -13 50 -22 -43 -58 98 -111 -24 42 20 64 33 40 -13 46 25 123 48 120 -43 54 104 -34 43
12226D3k3L1J4o6nQ3q9O6j04N1k2L4j4P0K1nK7j48R5O1k13P9L4j32Q7L1n3O7l
$$ 43 20 51 65 -1 -6 77 -12 54 -50 1 -21 13 -1 69 90 85 112 -36 59 120 -93 -14 20 -112 -25 6 -47 20 17
12255A7q8J08N0j8j9m8L8q6OP3jj44R8q5J75m4K1j06J16j0l6j37O1L7R4q1L6K3
$$ 17 -71 37 87 69 50 2 40 -46 -40 33 32 -112 -14 -99 76 32 53 -53 63 53 17 -120 -59 -22 72 -9 27 50
12283E0j6n8J18j17K9lQ8j43M0KJ97j71j03PJ24O5j79N0km1J34r2q2O0l4M7O9
$$ 50 34 -24 94 -23 6 3 91 -52 -12 -10 187 16 -87 -80 44 109 -70 -20 -22 -63 71 -21 -103 -43 -77 -30 39
12310C9n3J5o4R0M0O2m3J6LQ1o9j68oJ46l1n8Lk5K23j35m4pL3N9j04K7J4l9K0
$$ 39 -14 1 -63 27 67 129 86 102 105 186 117 -51 -57 89 58 0 3 -22 201 66 22 15 48 107 3 30 44 5 25
12339B5j24O8o9K01j85J51p5O7p7l0J05r6%nl9P8l5L2Qo5m5R8kj7Q9j04N4j00
$$ 25 -99 -31 -100 101 -84 67 -8 59 -18 -48 57 -39 -39 -44 -83 -5 -40 -8 0 -65 -110 -12 -14 -31 58 -46 8 -92
12367i2N9P0n1kN5J6L3j8r2M4L3K6J9r4Ln1K7n1K5J9N5N0rJ8j58J56p5o8J09j37
$$ -92 -33 37 -14 -16 39 55 88 70 -22 22 55 81 100 6 9 -42 -15 -66 -41 -22 33 83 74 92 -66 90 15 -53 56 -81
12397h1J17r0J22o1l4M6l6R7r1P1j9O2j09m3N3n8Q0j47J33j0l4l9L2M6j9qm0K9
$$ -81 36 -54 68 7 -27 19 -17 80 -11 60 41 103 -6 -49 4 -54 26 -121 12 2 -32 -71 -39 7 -12 -20 -60 -31
12425c1M6N5P4j65J29j63l5J7N0N3o8J4L2l9M9j1L7l1p5J30r5N7m3O1l8mJ05j44
$$ -31 15 70 144 -21 108 -55 -90 -73 -23 30 -38 -24 8 -31 18 7 44 13 -62 68 -27 30 -13 48 10 6 111 -33
12453c3J4P1P1q3m7m5J17l0j79J26M5k7Q9o5L0q8R5K7oj4j26Q6J4NM3m5p8JL6
$$ -33 -19 52 123 40 -7 -52 65 35 -144 -18 27 0 89 24 54 -34 61 88 82 68 -58 28 42 47 90 45 -33 -32 4
12482Dj1p4N4J35j64R7j43J05K9l0NjL2j02J67j41J7jK5p5J00n0q6J17L4j19P3
$$ 4 -7 -81 -27 108 -56 41 -102 3 32 2 7 6 38 -64 103 -38 -21 -22 3 -72 28 -22 -108 9 43 -76 -3
12509cM4lK0P6p1m0n5Q3K3j45L6K3O7o9n6R2m9J07n0k01K57r1N3K0Q8j18r1M5
$$ -3 41 38 58 134 63 23 -32 51 74 -71 -35 -12 55 -14 -70 22 -27 80 30 -171 86 -5 48 68 156 38 -53 -8
12537hnM0LJ1j17P2k0p1J46L4k66J85K3p6p1R9ql7NJ35Q2j44J21r2R2j35J59j55
$$ -8 -13 27 30 41 -76 -4 -24 -95 51 85 -181 4 27 -49 -120 -21 -29 -66 -61 74 156 12 133 41 133 -2 157 2
12565BP8l7o0K2J3L0k8M4n5m1J10o5oJ6j9q4R2Q7k5j03n3R9j09J24l8kJ5N9o3
$$ 2 80 43 -17 5 18 48 20 64 9 -32 78 13 7 23 4 -80 12 99 74 -29 -82 17 -92 32 -6 -8 7 66 3
12594Cj3J11o8q1Q1j36K7J38l1L8p5P6q6o9N5L1l0M0k9Q7k0Jj08J95j06J41n9
$$ 3 -10 101 33 -48 33 -103 -76 62 31 69 -6 70 -16 -85 -30 1 -29 11 -18 69 49 50 -58 137 31 172 113
12621A13j22J52j37Mj42J82j31P7l2M7M9nkl6j08j00K83q4Ok4o2L7L8M1j68O2
$$ 113 -9 143 6 10 -132 50 -81 -4 -36 11 60 55 53 17 -91 -191 92 8 14 -10 -72 -35 3 44 -124 -62
12647f2o7J89j57Q2m7P0Pk7n6L5P3O5l8N9r3p7N6K6n9Lk9P0o2N3r6N1J38k62J92
$$ -62 -129 60 -97 -15 -62 8 15 -12 -68 -33 40 105 67 126 33 -44 12 38 -21 -18 -47 23 -39 14 -82 -31 107 -155 37
12676C7p6M2K9M3p1L8p5p2J15j5l1j5J57q0l6N8r9Q7m6m5P6M3M7j99k5Pl3J46
$$ 37 -39 3 32 75 4 42 -33 -105 10 -5 -36 -51 106 26 -10 48 -51 36 -10 -55 21 64 111 -88 -113 -106 -139 7
12704GL0p7k5P7J2o7Q0j14M8R1q5M7m4J5j7M4rk4P9p2o3K52k10jlP2K3Lj13J42
$$ 7 37 -40 -65 12 24 -43 37 -77 -29 62 -23 24 -20 -5 -22 22 13 -11 68 -4 -67 185 -25 -26 -29 43 66 69 -44 98
12734I8m5l2N0j48P3p7J6M5J01j9j00p6R3j7O7m1L5M9q3J56j38P4m0J06j41J10
$$ 98 53 21 71 -77 -4 -81 -65 -20 81 62 -38 -114 -21 -38 29 -12 23 72 -11 145 7 81 41 147 6 116
12760A16p1R6j38K3P8l9o3lR5p1j8j15K21Ln5q9J70j18m3J72j76j7O5Kl9l5J55
$$ 116 45 141 3 26 104 65 2 -1 94 23 5 -110 111 114 59 -30 140 22 -21 151 -25 -42 23 25 -14 -49 106
12787A06r7Q6l4o8k9m2J1l5J06J12r3p0Qj7j35J40Q0p9R5o8J22p8J0oo1M3k8L4
$$ 106 9 95 61 -7 -36 -78 -67 -102 4 116 23 -47 -39 -56 -191 -51 29 -50 45 -23 99 21 31 25 -36 7 -21 13
12815A3J05j24Q1j13M7M3n3K2M6q7j0M9o1O9j14J55k5j22J24j29m4J10K4L9k6
$$ 13 118 -6 75 -38 9 52 -1 21 67 -20 -30 19 -42 27 -87 68 43 -79 45 -84 -128 -18 6 45 19
12840A9K8j00O1n5L5n6L7M4M6k3p8K2K1J8p7j2M2n6J12N1j4j4jk3p7p7KJ39nr
$$ 19 47 -53 8 -47 -12 -68 -31 13 59 36 -42 -20 1 19 -58 -70 -28 -84 28 79 65 51 50 27 -50 -127 -125 14 9 0
12870@J17j30jp5J4Q8N2M4r1n4K0K3o7J8L4P6m8nrj10J67q1m3R5j14O9PM5kr2
$$ 0 117 -13 -14 -89 -75 13 65 109 18 -36 -16 7 -60 -42 -8 68 20 15 6 -104 63 -18 -61 34 -80 -11 -4 41 39 -53
12900e3J42n1m5K0o4L4m4L4O1m4Q3k16K79rj96J07J10Pj22N3j35J48j44l7J49
$$ -53 89 38 -7 13 -51 -17 -61 -27 34 -10 73 -143 136 127 -69 38 148 155 33 86 -49 99 -45 -82 67
12925F7l0kOp7J29j41M2o4Jo5J78n0L1p0On3N3l0J56l3l1j53K03j10J3J48p1J4
$$ 67 37 35 41 -36 93 -48 -6 -70 -69 -134 44 -6 25 -45 -39 -92 -39 -69 87 54 23 -130 73 -37 -24 124 53 67
12953F7N8o4j01M4jJ02j80Q6R7k4q8N2P1j4j50L3Oo9M3ro1L5J14n4R3p2l8qq0
$$ 67 125 61 -40 4 3 105 -75 11 108 84 -4 48 119 105 -45 -12 -6 -75 -32 -41 -102 -67 47 -7 86 14 -24 -32 -112
12982a12K21q5r1M6K5J0j1qJ16m7p3M7j10J1P1M3j5J4j10K0R3m2kJ11j31L1R1
$$ -112 109 24 -67 -21 4 14 3 -5 111 64 -9 38 -72 -61 10 53 38 52 -58 -38 55 13 11 122 -9 22 113
13009A13l5k3o2l8R9o0q1J7M6R4nj21R3J1K8k42Q2J33r5P6j67J40o2K5J26j31
$$ 113 78 55 -7 -45 54 -6 -87 -70 -24 70 65 -56 37 48 76 -166 -84 49 -46 30 -137 3 -59 -34 92 -39
13035c9P8j39lJ99k7j25%L8K3JN6N3n3j43R4O5q7o3rJ32N8m0j80J95Pn3o0J70
$$ -39 39 -100 -103 96 69 -56 -56 -18 5 6 62 115 62 -81 13 78 -9 -72 -81 51 109 69 -111 84 91 38 -22 148
13063A48j61k8L3K1J5m9pL1k4r0J20Q8nj60J62j90J29r2P6j02J75q3J5mN5j67
$$ 148 -13 -41 -8 13 28 -21 -28 3 -21 -111 9 97 92 -68 94 -96 33 -59 17 -85 90 7 22 18 73 -94
13089i4M9J17j00qQ7j09J23%j04P9l9J9j13J43j6n5Q1j87J91j39L8K7P9j35J54
$$ -94 -45 72 -28 -36 51 -58 65 65 -39 40 1 20 -93 50 34 -21 60 -127 64 -75 -37 -10 69 -66 88
13114H8k1j8n2l5O4M6r2N3N3l3n4M9j2j13M6k4j42J83P4j19P0O3M1j02J5j02P8
$$ 88 67 49 -3 -38 26 72 -20 33 86 53 -1 48 36 -77 -31 -55 -197 -14 60 -59 11 74 115 13 28 -74 4
13141Dm4N1r6o6R6O0K8J2L9q0J4p6PP9J7m8O5j25k4OO3p2oP8p3K41l09O3kN1J71
$$ 4 -40 11 -85 -151 -55 5 33 45 84 4 18 -58 -51 28 45 -3 62 -63 -87 -81 -18 -90 -96 -18 -91 150 -159 -96 -98 -47 124
13172A24q3r5m0m7K80k01l6K13j24J51j41ml2Q2n0N4Q7j77R4m6r5J43m2j15J32
$$ 124 41 -54 -94 -141 139 -62 -98 115 -9 142 1 -3 -35 47 -3 51 138 -39 55 9 -86 57 15 -100 32
13197C2P8j43nj7Q6Q9j77J34r5J7M2nn7O8MQ8j11l5k9J65j94jJ30j34pR7q9O1
$$ 32 110 -33 -38 -55 31 120 -57 77 -18 -1 41 36 -21 47 51 139 28 -7 -36 129 -65 -66 64 -70 -77 20 -69 -8
13225hR5j00R6k0m6m3m7N5J1m2M3MJ50n1j05K5J16j22jk2J12j90P6l0J23LJ9J7
$$ -8 87 -13 83 63 17 -26 -73 -18 -7 -49 -6 -2 148 97 -8 17 133 11 10 -12 100 -90 -14 -44 79 82 101 118
13253A18j04l1O4k7J1j69J29n6K5P6r3l4M1J7N4k4Nq9m4P6K4J38k33J91r2K3J2
$$ 118 14 -17 47 20 31 -138 -9 -65 -40 36 -57 -91 -50 -33 21 -3 2 -87 -131 -55 -31 107 -126 65 -27 -4 8
13280HJ52j92lJ4R6o8J2J22k02N6P7r6Rn0P1j38oJ30m2P4l6J66p5j48J36M3r9
$$ 8 160 -32 -35 -21 75 7 19 141 -61 -5 72 -24 -15 -65 6 -132 -138 -8 -50 24 -12 154 79 -69 67 110 11
13307A1m8K0M7PPr5N3M3n5K5j24J17k9j2O1k7OM9j30Q4Q5q7L3p2J3K0M9m6J0j0
$$ 11 -37 -17 30 37 44 -51 2 45 -10 15 -109 8 -21 -33 28 1 7 56 -74 10 95 8 41 -31 -18 2 51 5 15 5
13337Eo3J45r5N5P2j20J04p2j13K8R5k9M0J5m8j2Rk4lPN3n3O9j81J50M2o9mj16
$$ 5 -58 87 -8 47 119 -1 103 31 -82 -54 41 12 52 67 19 7 16 -8 -11 -4 49 -4 65 -116 34 76 7 3 -113
13366a13J22m8l5J21O0j03k8L9Nj6n6J29l1p5P6L9r4J22j79K4j8P5j01O8N9q2
$$ -113 9 -39 -74 47 107 4 -24 15 20 4 -52 77 46 -29 47 86 -8 114 -65 -41 -59 16 -85 -17 42 -40
13392d0M6J29j71RP6M7qk01J08j20J33o8k7N7kN6k01p0K10l2O5o2M5L3j49J34
$$ -40 6 135 -36 -27 49 96 88 -113 -5 -125 8 -60 -87 -30 -32 24 -177 -247 -37 -69 -4 -66 -21 12 -137 -3
13418cR1O6k44P3o5J99j34P8j00K7J4k2N6n5L6Ko4Q7M3j05M1O4j3l3k2J16q2p8
$$ -3 88 154 -90 -17 -82 117 -17 61 -39 -12 2 -20 36 -19 17 19 -45 42 85 -20 21 85 72 39 17 133 51 -27
13446b7M3J28j14p9J02P2j87N8n3P0K3j17J61j30l2k3R4nl3m8M0J49K2j66R8l4
$$ -27 16 144 30 -49 53 125 -62 -4 -57 13 36 -81 80 -50 -82 -105 -11 -16 -49 -97 -57 92 114 -52 46 12
13472A2Pl5J7R6n9n5M0O5j63Q8j3O2j90Q1R7o4R8p1O0K8p9q4M4j19J86Nl5M8j41
$$ 12 19 -16 1 97 38 -17 23 88 -75 13 0 62 -128 -47 50 -14 84 13 73 101 22 -62 -18 -137 49 54 19 67 -74
13501g4J61p7Rnqp3P9qj9j9n9J20M7n7j05M8J31j8L0j39qK5Q2n6k67L29J4j04
$$ -74 87 10 19 14 6 -67 12 4 -15 -34 -93 27 74 17 -88 -40 91 73 103 -36 -44 -19 63 7 -260 69 83 -21
13529b1o9O6Oj0J17j71K00p1m5lP8k1r0M9Q1o7J00j87N0k1m6R1l7J7N3l3r8N9
$$ -21 -90 -24 -18 -28 89 -82 118 47 2 -1 77 56 -34 15 96 29 129 -58 -8 -29 -75 16 -21 -4 49 16 -82 -23
$$ [...]
16383C8
##END NTUPLES=NMR FID
##END=
