##TITLE=abcd
##JCAMPDX= 6.0         $$ Bruker NMR JCAMP-DX V2.0
##DATA TYPE= NMR FID
##DATA CLASS= NTUPLES
##ORIGIN= UXNMR, Bruker Analytische Messtechnik GmbH
##OWNER= root
$$ XWIN-NMR		Version 3.5
$$ Tue Oct 14 13:13:25 2025 Russian Standard Time (UT+4h)  servis@DPX200
##.OBSERVE FREQUENCY= 200.131235884673
##.OBSERVE NUCLEUS= ^1H
##.DELAY= (6, 6)
##.ACQUISITION MODE= SIMULTANEOUS
##.ACQUISITION SCHEME= undefined
##.AVERAGES= 32
##.DIGITISER RES= 18
##SPECTROMETER/DATA SYSTEM= spect
##.PULSE SEQUENCE= zg
##.SOLVENT NAME= DMSO
##.SHIFT REFERENCE= (INTERNAL, DMSO, 0, 16.5164)
##AUDIT TRAIL= $$ (NUMBER, WHEN, WHO, WHERE, WHAT)
$$ ##TITLE= Audit trail, XWIN-NMR		Version 3.5
$$ ##JCAMPDX= 5.01
$$ ##ORIGIN= Bruker BioSpin GmbH
$$ ##OWNER= servis
$$ F:\spectra/data/av/nmr/H1/1/audita.txt
$$ ##AUDIT TRAIL=  $$ (NUMBER, WHEN, WHO, WHERE, WHAT)
(   1,<2025-10-14 13:10:59.10 +0400>,<servis>,<DPX200>,
      <created by zg, POWCHK disabled, PULCHK disabled
       configuration hash MD5:
       00 E9 B6 7A A2 85 ED C7 34 08 36 98 17 FE 4E 26
       data hash MD5: 32K
       F6 5C 90 91 0D ED D3 06 A4 8F D1 D8 F8 0E 96 4D>)
$$ ##END=
$$ 
$$ hash MD5
$$ 0E 69 55 AA 97 C1 2C A8 87 61 15 FE 19 39 0F 9E
##$RELAX= 
##$RELAX= 
##$RELAX= 
##$RELAX= 
##$RELAX= 
##$RELAX= 
##$RELAX= 
##$RELAX= 
$$ Bruker specific parameters
$$ --------------------------
##$DU= <F:\spectra>
##$EXPNO= 1
##$NAME= <H1>
##$PROCNO= 1
##$TYPE= <nmr>
##$USER= <av>
##$AMP= (0..31)
100 100 100 100 100 100 100 100 100 100 100 100 100 100 100 100 100 100 
100 100 100 100 100 100 100 100 100 100 100 100 100 100 
##$AQSEQ= 0
##$AQ_mod= 1
##$AUNM= <au_zg>
##$AUTOPOS= <>
##$BF1= 200.13
##$BF2= 200.13
##$BF3= 200.13
##$BF4= 200.13
##$BF5= 500.13
##$BF6= 500.13
##$BF7= 500.13
##$BF8= 500.13
##$BYTORDA= 1
##$CFDGTYP= 0
##$CFRGTYP= 5
##$CHEMSTR= <none>
##$CNST= (0..31)
1 1 145 1 1 1 1 1 1 1 1 1 1 1 1 1 1 1 1 1 1 1 1 1 1 1 1 1 1 1 1 1 
##$CPDPRG= <>
##$CPDPRG1= <>
##$CPDPRG2= <>
##$CPDPRG3= <>
##$CPDPRG4= <mlev>
##$CPDPRG5= <mlev>
##$CPDPRG6= <mlev>
##$CPDPRG7= <mlev>
##$CPDPRG8= <mlev>
##$CPDPRGB= <>
##$CPDPRGT= <>
##$D= (0..31)
0 2 0 0 0 0 0 0 0 0.06 0 0 0 0 0 0 0.0002 0 0 0 0 0 0 0 0 0 0 0 0 0 0 
0 
##$DATE= 1760433058
##$DBL= (0..7)
120 120 120 120 120 120 120 120 
##$DBP= (0..7)
150 150 150 150 150 150 150 150 
##$DBP07= 0
##$DBPNAM0= <>
##$DBPNAM1= <>
##$DBPNAM2= <>
##$DBPNAM3= <>
##$DBPNAM4= <>
##$DBPNAM5= <>
##$DBPNAM6= <>
##$DBPNAM7= <>
##$DBPOAL= (0..7)
0.5 0.5 0.5 0.5 0.5 0.5 0.5 0.5 
##$DBPOFFS= (0..7)
0 0 0 0 0 0 0 0 
##$DE= 6
##$DECBNUC= <off>
##$DECIM= 32
##$DECNUC= <off>
##$DECSTAT= 4
##$DIGMOD= 1
##$DIGTYP= 9
##$DL= (0..7)
0 120 120 120 120 120 120 120 
##$DP= (0..7)
150 150 150 150 150 150 150 150 
##$DP07= 0
##$DPNAME0= <>
##$DPNAME1= <>
##$DPNAME2= <>
##$DPNAME3= <>
##$DPNAME4= <>
##$DPNAME5= <>
##$DPNAME6= <>
##$DPNAME7= <>
##$DPOAL= (0..7)
0.5 0.5 0.5 0.5 0.5 0.5 0.5 0.5 
##$DPOFFS= (0..7)
0 0 0 0 0 0 0 0 
##$DQDMODE= 0
##$DR= 18
##$DS= 0
##$DSLIST= <SSSSSSSSSSSSSSS>
##$DSPFIRM= 0
$$ [...]
##$SUBNAM0= <"">
##$SUBNAM1= <"">
##$SUBNAM2= <"">
##$SUBNAM3= <"">
##$SUBNAM4= <"">
##$SUBNAM5= <"">
##$SUBNAM6= <"">
##$SUBNAM7= <"">
##$SUBNAM8= <"">
##$SUBNAM9= <"">
##$SW= 20.6817932712277
##$SWIBOX= (0..15)
0 0 3 0 0 0 0 0 0 0 0 0 0 0 0 0 
##$SW_h= 4139.07284768212
##$TD= 32768
##$TD0= 1
##$TE= 0
##$TE2= 300
##$TE3= 300
##$TEG= 300
##$TL= (0..7)
0 120 120 120 120 120 120 120 
##$TP= (0..7)
150 150 150 150 150 150 150 150 
##$TP07= 0
##$TPNAME0= <>
##$TPNAME1= <>
##$TPNAME2= <>
##$TPNAME3= <>
##$TPNAME4= <>
##$TPNAME5= <>
##$TPNAME6= <>
##$TPNAME7= <>
##$TPOAL= (0..7)
0.5 0.5 0.5 0.5 0.5 0.5 0.5 0.5 
##$TPOFFS= (0..7)
0 0 0 0 0 0 0 0 
##$TUNHIN= 0
##$TUNHOUT= 0
##$TUNXOUT= 0
##$USERA1= <user>
##$USERA2= <user>
##$USERA3= <user>
##$USERA4= <user>
##$USERA5= <user>
##$V9= 5
##$VALIST= <valist>
##$VCLIST= <CCCCCCCCCCCCCCC>
##$VD= 0
##$VDLIST= <DDDDDDDDDDDDDDD>
##$VPLIST= <PPPPPPPPPPPPPPP>
##$VTLIST= <TTTTTTTTTTTTTTT>
##$WBST= 1024
##$WBSW= 30
##$XGAIN= (0..3)
0 0 0 0 
##$XL= 0
##$YL= 0
##$YMAX_a= 234567
##$YMIN_a= -201097
##$ZGOPTNS= <>
##$ZL1= 120
##$ZL2= 120
##$ZL3= 120
##$ZL4= 120
##$ABSF1= 10
##$ABSF2= 0
##$ABSG= 5
##$ABSL= 3
##$ALPHA= 0
##$AQORDER= 0
##$ASSFAC= 0
##$ASSFACI= 0
##$ASSFACX= 0
##$ASSWID= 0
##$AUNMP= <proc_1d>
##$AZFE= 0.1
##$AZFW= 0.1
##$BCFW= 1
##$BC_mod= 2
##$BYTORDP= 0
##$COROFFS= 0
##$CY= 19
##$DATMOD= 1
##$DC= 2
##$DFILT= <>
##$DTYPP= 0
##$F1P= 11.0000007629395
##$F2P= -0.999999237060547
##$FCOR= 0.5
##$FTSIZE= 0
##$FT_mod= 4
##$GAMMA= 1
##$GB= 1
##$INTBC= 1
##$INTSCL= 1
##$ISEN= 128
##$LB= 0.05
##$LEV0= 0
##$LPBIN= 0
##$MAXI= 10000
##$MC2= 0
##$MEAN= 0
##$ME_mod= 0
##$MI= 0
##$NCOEF= 0
##$NC_proc= 0
##$NLEV= 6
##$NOISF1= 0
##$NOISF2= 0
##$NSP= 1
##$NTH_PI= 0
##$NZP= 0
##$OFFSET= 16.51637
##$PC= 1
##$PHC0= -274.2701
##$PHC1= 2.101565
##$PH_mod= 0
##$PKNL= yes
##$PPARMOD= 0
##$PSCAL= 4
##$PSIGN= 0
##$REVERSE= no
##$SF= 200.13
##$SI= 16384
##$SIGF1= 0
##$SIGF2= 0
##$SINO= 400
##$SIOLD= 16384
##$SREGLST= <1H.CDCl3>
##$SSB= 0
##$STSI= 0
##$STSR= 0
##$SW_p= 4139.07284768211
##$SYMM= 0
##$S_DEV= 0
##$TDeff= 0
##$TDoff= 0
##$TI= <>
##$TILT= no
##$TM1= 0
##$TM2= 0
##$TOPLEV= 0
##$USERP1= <user>
##$USERP2= <user>
##$USERP3= <user>
##$USERP4= <user>
##$USERP5= <user>
##$WDW= 1
##$XDIM= 8192
##$YMAX_p= 0
##$YMIN_p= 0
$$ End of Bruker specific parameters
$$ ---------------------------------
##NTUPLES= NMR FID
##VAR_NAME=  TIME,          FID/REAL,        FID/IMAG
##SYMBOL=    X,             R,               I
##VAR_TYPE=  INDEPENDENT,   DEPENDENT,       DEPENDENT
##VAR_FORM=  AFFN,          ASDF,            ASDF
##VAR_DIM=   16384,         16384,           16384
##UNITS=     SECONDS,       ARBITRARY UNITS, ARBITRARY UNITS
##FACTOR=    0.0002416,     1,               1
##FIRST=     0,             0,               0
##LAST=      3.9581328,     0,               0
##MIN=       0,             -201097,         0
##MAX=       3.9581328,     234567,          0
$$ Real data points
##PAGE= N=1
##DATA TABLE= (X++(R..R)), XYDATA
$$ plain form
0 0 0 0 0 0 0 0 0 0 0 0 0 0 0 0 0 0 0 0 0 0 0 0 0 0 0 0 0 0 0 0 0 0 0 0 0 1 -2 2 -3 5 -6 10 -11 12 -12 12 -14 14 -16 18 -21 21
52 21 -24 29 -39 42 -54 67 -86 112 -150 198 -282 407 -615 981 -1686 3329 -8452 50930 234567
71 234567 -87816 -128776 93183 24910 -52997 24474 7839 -44914 31219 -14613 2319 25335
83 25335 -73736 26426 52251 -68275 -23745 67699 -18255 -87250 68284 26028 -87835
94 -87835 18588 28212 -25756 -27381 12540 8543 -27514 -3633 -20129 17391 8986 -49196 1834
107 1834 5692 -169 -7940 -16296 -12991 -11896 34318 -22207 -35131 13737 -10488 14046 -7298
120 -7298 -33197 259 20005 -11622 -28827 35775 -31195 -35833 67825 -22206 -52407 22792
132 22792 21004 -20034 -13781 7309 -13969 22691 -16593 -31873 48021 -20918 -26472 32388 -12130
$$ packed form
0@%%%%%%%%%%%%%%%%%%%%%%%%%%%%%%%%%%%JlMnQj1J6k1K3k4K4k6K8l0L4l9M2
52B1m5N3o8Q1r6J21j53J98k62L48m80O89j022J596k667N015j1781N9382J83637
71B34567l22383m0960K21959o8273p7907P7471j6635n2753P6133m5832J6932K3016
83B5335r9071J00162K5825j20526M4530R1444q5954o8995J55534m2256j13863
94h7835J06423R624n3968j625L9921l997l6057K3881j6496L7520q405n8182N1030
107A834L858n861p771q356L305J095M6214n6525j2924M8868k4225K4534k1344
120g298k5899L3456J9746l1627j7205O4602o6970m638J03658r0031l0201P5199
132B2792j788m1038O253K1090k1278L6660l9284j5280P9894o8939n554N8860m4518
$$ plain form
145 -12130 -24089 28497 15627 -62423 20152 52480 -48431 -6831 16646 -28 4923 -5844
157 -5844 -2836 -1620 16245 -12669 3663 20724 -30420 12988 18366 -9047 1669 -146 8041
170 8041 -5713 19266 2225 -22352 20492 7365 4294 -4032 -3480 14766 1237 9552 -10679
183 -10679 8164 14723 -14780 16970 -109 -991 10825 -3628 5036 1259 15977 -8440 -4932
196 -4932 19650 -5470 10513 -3883 -1975 13368 -2495 10097 -5547 3503 3689 3023 15143
209 15143 -17573 8883 11211 -7097 8791 586 3461 -7305 12364 7584 -14685 14941 -4662
222 -4662 865 7553 -4001 7881 -9590 5368 4515 -538 1168 -9840 13171 -6230 -591 8718
236 8718 -14198 4926 1119 3443 -5799 -5925 10209 -12190 7191 661 -10498 3933 -4629 6623
$$ packed form
145a2130j1959N2586j2870p8050Q2575L2328j00911M1600K3477j6674M951j0767
157e844L008J216J7865k8914J6332J7061n1144M3408N378k7413J0716j815Q187
170H041j3754K4979j7041k4577M2844j3127l071q326N52J8246j3529Q315k0231
183a0679J8843O559k9503L1750j7079q82J1816j4453Q664l777J4718k4417L508
196d932K4582k5120J5983j4396J908J5343j5863J2592j5644R050J86o66J2120
209A5143l2716K6456K328j8308J5888q205K875j0766J9669m780k2269K9626j9603
222d662N527O688j1554J1882j7471J4958q53n053J706j1008K3011j9401N639R309
236H718k2916J9124l807K324r242j26J6134k2399J9381o530j1159J4431q562J1252
$$ plain form
250 6623 -8219 -1433 3446 -9932 6826 -5490 2003 -5758 -7166 13735 -12629 -1525 2601
263 2601 -4167 -2083 -5073 11278 -14414 -4246 10611 -10546 199 -3812 3739 -8117 -7873 14352
277 14352 -10435 -5624 -3109 2924 2765 -14649 7753 -6400 -6016 6419 -3920 -2743 -12144 11139
291 11139 894 -14680 6917 -4164 -49 -4047 1729 2389 -13116 8933 -2111 -2890 1291 -5031
305 -5031 6645 -8646 4338 2648 -7746 4838 -3577 4724 -4781 1138 5650 -11573 8593
318 8593 17 -2079 1046 -3381 7160 -6234 5750 -116 -7284 8409 -2414 4329 -4483 -474
332 -474 7126 -6233 7383 -2990 -343 2330 -1058 9222 -9333 3590 5510 -3523 4781 -2496
346 -2496 6529 -4389 2021 8590 -7914 6609 -482 1859 2408 -1661 8486 -7167 4753 4138
$$ packed form
250F623j4842O786M879j3378J6758j2316P493p761j408K0901k6364J1104M126
263B601o768K084k990J6351k5692J0168J4857k1157J0745m011P551j1856K44K2225
277A4352k4787M811K515O033j59j7414K2402j4153L84J2435j0339J177r401K3283
291A1139j0245j5574K1597j1081M115l998N776O60j5505K2049j1044p79M181o322
305e031J1676j5291J2984j690j0394J2584q415Q301r505N919M512j7223K0166
318H593q576k096L125m427J0541j3394J1984n866p168J5693j0823O743q812M009
332d74P600j3359J3616j0373K647K673l388J0280j8555J2923J920r033Q304p277
346b496R025j0918O410O569j6504J4523p091K341N49m069J0147j5653J1920o15
$$ plain form
360 4138 -2337 4726 -4320 7526 -2049 92 6760 -5477 4975 -2258 3965 2176 -4807 7489
374 7489 -5633 3900 3225 -3351 2369 -3488 8158 -3910 -1465 6041 -5430 5225 -2256 2246
388 2246 645 -4080 7233 -5163 3164 1069 -3059 3441 -3674 7105 -4646 -2491 6125 -3827
402 -3827 3687 -4533 2571 1093 -4999 6237 -4997 1719 -1050 -1601 4032 -6616 5020 -3783
416 -3783 -2369 4593 -4729 2038 -5107 2864 168 -5646 4746 -6024 2387 -1156 -3570 3449 -5431
431 -5431 3733 -4205 -1037 3437 -5157 2344 -5127 3529 334 -6593 5091 -4148 1529 -1103 -1643
446 -1643 1954 -5767 5477 -3286 -1503 2462 -4425 3913 -4785 2400 631 -5922 4551 -2708 1442
461 1442 -3050 -909 3677 -5723 3977 -3294 -333 2404 -4673 4426 -4585 1648 1187 -4243 3955
$$ packed form
360D138o475P063r046J1846r575K141O668j2237J0452p233O223j789o983J2296
374G489j3122R533o75o576N720n857J1646j2068K445P506j1471J0655p481M502
388B246j601m725J1313j2396Q327k095m128O500p115J0779j1751K155Q616r952
402c827P514q220P104j478o092J1236j1234O716k769n51N633j0648J1636q803
416c783J414O962r322O767p145P971k696n814J0392j0770Q411l543k414P019q880
431e431R164p938L168M474q594P501p471Q656l195o927J1684r239N677k632n40
446a643L597p721J1244q763J783L965o887Q338q698P185j769o553J0473p259M150
461A442m492K141M586r400R700p271K961K737p077R099r011O233m61n430Q198
$$ plain form
476 3955 -3088 2437 -2340 -321 3749 -5183 4891 -2728 -219 3224 -3346 4001 -3943 2897 1054
491 1054 -3317 5148 -3195 2666 -1561 681 4470 -5800 3880 -336 770 658 -2255 5355 -4806
506 -4806 3108 2013 -3694 4058 -2599 3456 -1544 -1076 4300 -3580 2903 -1651 2270 951 -3741
521 -3741 5833 -3159 1756 822 -1736 4140 -3757 3713 -633 -862 3679 -3306 3975 -1365 1008 923
537 923 -1901 4878 -4289 2888 1096 -2857 4103 -2731 3025 -1764 -80 3543 -4305 3577 -1635
552 -1635 914 784 -3004 4587 -3640 1275 525 -839 2071 -4782 5001 -1819 -2484 3773 -2745 2107
568 2107 -2935 1861 1066 -3946 3796 -2782 1411 -694 -1024 2933 -4470 3329 -1215 -882 1855 -3282
584 -3282 3706 -3389 356 1822 -3123 2773 -2926 2089 -655 -2216 2526 -2814 2397 -2922 299
$$ packed form
476C955p043N525m777K019M070q932J0074p619K509L443o570P347p944O840j843
491A054m371Q465q343N861m227K242L789j0270R680m216J106j12k913P610j0161
506d806P914j095n707P752o657O055n000M68N376p880O483m554L921j319m692
521c741R574q992M915r34k558N876p897P470m346k29M541o985P281n340K373q5
537I23k824O779r167P177j792l953O960o834N756m789J684L623p848P882n212
552a635K549j30l788P591q227M915p50j364K910o853R783o820o65O257o518M852
568B107n042M796p95n012P742o578M193k105l30L957p403P799m544L33K737n137
584c282O988p095L745J466m945N896n699N015k744j561M742n340N211n319L221
$$ plain form
599 299 1918 -4490 3466 -2781 294 1125 -3471 2750 -2816 1349 -1121 -1457 2419 -3567 2703 -1906
615 -1906 -761 1824 -2573 2705 -3761 2056 880 -3968 3875 -2545 916 -172 -1068 2196 -2868
630 -2868 2486 -2048 646 1384 -3500 3689 -2388 877 355 -2107 3311 -3650 2382 -378 -2113 3310
646 3310 -2715 1353 -1074 626 720 -2562 3075 -2898 1871 82 -2487 3925 -3159 1513 18 -776
662 -776 2305 -2952 2961 -1079 -297 1705 -1642 2598 -2582 2123 268 -1823 3437 -2949 2241 -407
678 -407 -650 2606 -3278 3026 -738 -500 1193 -1618 2692 -2564 1404 364 -1290 2487 -2856 2747
694 2747 -1249 -1060 2870 -2945 2177 -1188 420 916 -2259 3081 -2234 912 465 -1243 2045 -2231
710 -2231 2697 -1533 -553 2538 -2761 2720 -1657 253 1597 -2148 2596 -2202 1285 235 -1274
$$ packed form
599B99J619o408P956o247L075Q31m596O221n566M165k470l36L876n986O270m609
615a906J145K585m397N278o466N817j176m848P843o420L461j088q96L264n064
630b868N354m534K694P38m884P189o077L265n22k462N418o961O032k760j735N423
646C310o025M068k427J700R4l282N637n973M769j789k569O412p084M672j495p94
662g76L081n257N913m040P82K002l347M240n180M705j855k091N260o386N190k648
678d07k43L256n884O304l764K38J693k811M310n256L968j040j654L777n343N603
694B747l996J89L930n815N122l365J608M96l175N340n315L146m47j708L288m276
710b231M928m230R80L091n299N481m377J910J344l745M744m798L487j050j509
$$ plain form
725 -1274 2209 -2495 1940 -778 -283 1590 -2431 2532 -1875 645 1082 -2661 2939 -2142 597 111
741 111 -1190 1845 -2584 1904 -1215 -494 1640 -2439 2110 -1737 921 584 -2448 2871 -2369 1164
757 1164 173 -1598 2073 -2242 1723 -807 -382 1114 -1985 2612 -2152 715 729 -2164 2489 -2333
773 -2333 1155 -249 -1187 2281 -2654 1693 -599 -605 992 -2068 2115 -1906 539 341 -1691 2310
789 2310 -2581 1376 -307 -1338 2009 -2346 1617 -842 -321 1152 -1972 2141 -1507 652 487 -1348
805 -1348 2137 -2389 1672 -77 -977 2025 -2178 1927 -904 -73 1365 -1917 2129 -1369 730 440
821 440 -1371 1983 -2085 1638 -212 -984 1856 -2148 1960 -1025 -238 1256 -1790 1970 -1499 894
837 894 276 -1445 2153 -1968 1349 -421 -782 1646 -1881 1976 -1236 260 1198 -1838 2212 -1360
$$ packed form
725a274L483m704M435k718M95J873m021M963m407K520M37l743N600n081K739m86
741A11j301L035m429M488l119P21K134m079M549l847K658l37l032N319n240L533
757A164r91j771L671m315L965k530M25J496l099M597m764K867J4k893M653m822
773b333L488j404r38L468m935M347k292oJ597l060M183m021K445j98k032M001
789B310m891L957j683j031L347m355L963k459N21J473l124M113l648K159j65j835
805a348L485m526M061j749r00L002m203M105k831Q31J438l282M046l498K099k90
821D40j811L354m068L723j850p72K840m004M108k985P87J494l046L760l469K393
837H94o18j721L598m121L317j770l61K428l527L857l212J496R38l036M050l572
$$ plain form
853 -1360 786 424 -1074 2102 -1806 1514 -328 -408 1684 -1994 1771 -901 86 1104 -1583 1888
869 1888 -1678 801 383 -1350 1843 -1773 1215 -367 -387 1503 -2037 1792 -1032 53 898 -1709
885 -1709 1828 -1543 775 190 -1240 1749 -1779 1371 -389 -507 1332 -1724 1836 -1092 227 774
901 774 -1536 1998 -1646 713 299 -1120 1605 -1753 1401 -656 -440 1312 -1879 1692 -970 206
917 206 535 -1410 1736 -1722 691 -88 -1107 1602 -1966 1231 -518 -434 930 -1747 1573 -1324
933 -1324 214 622 -1523 1975 -1602 708 70 -751 1650 -1789 1225 -409 -244 1040 -1657 1685
949 1685 -1138 290 619 -1341 1771 -1670 823 91 -916 1311 -1671 1407 -736 -304 1085 -1696
965 -1696 1728 -1109 141 640 -1303 1561 -1369 700 -98 -928 1350 -1769 1437 -552 -410 902
$$ packed form
853a360K146l62j498L176l908L320j842q0K092l678L765k672R87J018k687L471
869A888l566K479m18j733L193l616K988j582k0J890l540L829k824J085Q45k607
885a709L537l371K318n85j430K989l528L150j760j18J839l056L560k928J319N47
901G74k310L534l644K359m14j419K725l358L154k057K16J752l191L571k662J176
917B06L29j945L146l458K413p79j019K709l568L197j749Q4J364k677L320k897
933a324J538M08k145L498l577K310o38q21K401l439L014j634J65J284k697L342
949A685k823J428L29j960L112l441K493p32j007K227k982L078k143M32J389k781
965a696L424k837J250M99j943K864k930K069p98q30K278l119L206j989J42J312
$$ plain form
981 902 -1421 1728 -1242 532 681 -1260 1508 -1428 956 -135 -485 1405 -1512 1426 -626 -307
997 -307 1154 -1210 1643 -1101 569 474 -881 1488 -1635 1190 135 -1097 1442 -1446 1173 -532
1013 -532 -233 745 -1261 1601 -1505 590 417 -1347 1509 -1383 821 17 -781 1118 -1406 1194
1029 1194 -759 132 771 -1305 1706 -1324 505 583 -1062 1391 -1334 1146 -77 -645 1154 -1163
1045 -1163 1346 -910 63 872 -1253 1536 -1119 387 309 -742 1263 -1325 974 -352 -531 1122
1061 1122 -1602 1288 -917 -177 837 -1368 1210 -955 348 178 -788 1231 -1401 1251 -444 -557
1077 -557 1382 -1462 1178 -601 -62 829 -992 995 -1086 830 71 -862 1485 -1568 1085 -194
1093 -194 -659 1034 -1236 1109 -781 43 609 -1195 1220 -1042 330 118 -808 1013 -1320 1043
$$ packed form
981I02k323L149k970J774J49j941K768k936K384j091l50J890k917K938k052L19
997c07J461k364K853k744J670r5j355K369l123K825j055j232K539k888K619j705
1013e32K99R78k006K862l106K095j73j764K856k892K204q04p98J899k524K600
1029A194j953Q91O39k076L011l030J829P8j645K453k725K480j223n68J799k317
1045a163K509k256R73Q09k125K789k655J506p8j051K005k588K299j326j79J653
1061A122k724K890k205P40J014k205K578k165J303j70r66K019k632K652j695j13
1077e57J939k844K640j779N39Q91j821J987k081J916p59r33K347l053K653j279
1093a94m65J693k270K345j890Q24N66j804K415k262J372k12r26J821k333K363
$$ plain form
1109 1043 -589 -382 1000 -1382 1253 -834 94 631 -1282 1189 -1103 512 68 -726 1063 -1168
1125 -1168 984 -306 -173 868 -1139 1367 -1015 239 778 -1201 1341 -895 617 69 -627 1196
1141 1196 -1158 854 -519 -174 748 -1237 1139 -910 120 629 -824 1259 -1186 487 312 -698
1157 -698 1067 -1145 933 -407 -122 675 -1135 1242 -718 341 462 -847 1291 -1208 659 -9
1173 -9 -785 1234 -1216 881 -266 -175 662 -881 1158 -783 349 364 -914 1188 -1192 774 -261
1190 -261 -628 1241 -1188 899 -403 -330 825 -948 969 -759 116 -20 -745 1158 -1249 880 -141
1207 -141 -631 1143 -1280 989 -456 -231 863 -1029 969 -547 222 289 -481 913 -1096 766 -177
1224 -177 -523 1165 -1158 1052 -474 -241 876 -1127 1075 -721 214 251 -629 848 -1086 762 -309
$$ packed form
1109A043j632K07J382k382K635k087R28N37j913K471k292J615m44p94J789k231
1125a168K152j290J33J041k007K506k382J254N39j979K542k236J512n48o96J823
1141A196k354K012j373L45R22j985K376k049J030N09j453K083k445J673j75j010
1157f98J765k212K078j340K85P97j810K377j960J059J21j309K138k499J867o68
1173ip76K019k450K097j147R1Q37j543K039j941J132J5j278K102k380J966j035
1190b61l67J869k429K087j302P3J155j773J917j728Q75j36p25J903k407K129j021
1207a41m90J774k423K269j445K25J094j892J998j516P69O7p70J394k009J862r43
1224a77l46J688k323K210j526K33J117k003K202j796R35L7q80J477j934J848j071
$$ plain form
1241 -309 -326 775 -1165 1001 -595 -97 682 -1200 1006 -630 72 182 -767 1050 -964 585 -179
1258 -179 -326 650 -1035 923 -691 134 733 -1069 1186 -902 270 584 -700 926 -895 696
1274 696 -156 -119 637 -1013 939 -653 106 350 -900 1156 -856 360 193 -735 1128 -1002 435
1291 435 -77 -299 527 -933 914 -749 248 429 -938 1007 -841 550 130 -732 954 -929 764
1308 764 -158 -306 724 -884 952 -442 24 491 -555 1018 -842 620 1 -472 1023 -1142 531
1325 531 -75 -313 695 -941 756 -462 42 269 -686 861 -813 517 -43 -565 854 -1123 663
1342 663 -364 -321 707 -875 852 -666 83 547 -676 732 -706 612 -36 -416 866 -939 939
1359 939 -453 -232 742 -895 766 -356 -8 386 -694 1011 -637 525 -20 -401 711 -898 660
$$ packed form
1241c09j7J101j940K166j596M98P79j882K206j636P02J10r49J817k014J549p64
1258a79j47R76j685J958j614Q25N99j802K255k088J172L14j284J626j821J591
1274F96q52L7P56j650J952j592P59K44j250K056k012J216j67r28J863k130J437
1291D35n12k22Q26j460J847j663R97J81j367J945j848J391m20q62J686j883J693
1308G64r22j48J030j608J836j394M66M67j046J573j860J462o19m73J495k165J673
1325E31o06k38J008j636J697j218N04K27r55J547j674J330n60n22J419j977J786
1342F63j027M3J028j582J727j518P49M64j223J408j438J318o48l80J282j805J878
1359I39j392K21R74j637J661j122L48L94j080J705j648J162n45l81J112j609J558
$$ plain form
1376 660 -379 -131 551 -864 988 -619 111 407 -724 759 -703 383 -114 -392 634 -807 709
1393 709 -417 -127 405 -760 895 -572 251 241 -532 874 -801 469 -98 -309 612 -746 706
1410 706 -411 -22 459 -688 859 -711 238 300 -691 771 -698 457 -103 -519 592 -739 609
1427 609 -377 -29 409 -902 929 -544 318 142 -584 883 -770 497 -67 -404 644 -900 782
1444 782 -264 -37 450 -718 755 -608 370 88 -487 746 -683 595 109 -267 559 -684 634
1461 634 -397 7 458 -725 730 -602 241 101 -422 578 -729 548 -141 -242 632 -760 676
1478 676 -428 53 279 -625 703 -657 265 123 -397 739 -638 482 -150 -190 536 -678 686 -470
1496 -470 167 327 -606 664 -504 350 105 -366 646 -672 599 -153 -189 482 -623 560 -385 109
$$ packed form
1376F60j039K48O82j415J852j607P30K96j131J483j462J086m97k78J026j441J516
1393G09j126K90N32j165J655j467Q23j0p73J406j675J270n67k11R21j358J452
1410G06j117L89M81j147J547j570R49O2r91J462j469J155n60m16J111j331J348
1427F09r86L48M38j311J831j473Q62j76p26J467j653J267n64l37J048j544J682
1444G82j046K27M87j168J473j363R78k82n75J233j429J278m86l76Q26j243J318
1461F34j031M04M51j183J455j332Q43j40n23J000j307J277o89j01Q74j392J436
1478F76j104M81K26r04J328j360R22j42n20J136j377J120o32m0P26j214J364j156
1496d70O37J60r33J270j168Q54k45m71J012j318J271p52l6O71j105J183r45M94
$$ plain form
1514 109 261 -475 786 -608 381 51 -431 633 -684 428 -274 -107 514 -694 571 -406 96 199
1532 199 -409 624 -672 380 52 -426 606 -625 467 -198 -146 408 -621 562 -486 162 326
1549 326 -467 654 -535 308 -21 -324 526 -663 586 -250 -142 315 -551 610 -429 194 134 -527
1567 -527 626 -515 394 -7 -394 534 -542 520 -302 -31 450 -626 680 -397 90 193 -382 637
1585 637 -527 283 -38 -216 565 -541 518 -236 -143 373 -525 640 -541 171 197 -497 563 -599
1603 -599 480 -58 -202 437 -653 579 -321 -47 391 -656 526 -445 183 56 -343 557 -659 296
1621 296 -58 -211 491 -514 420 -366 107 294 -494 366 -434 240 140 -287 456 -625 299 -91 -64 413
1641 413 -546 595 -401 -35 221 -473 599 -458 176 142 -285 381 -499 331 -205 -56 334 -565 539
$$ packed form
1514A09J52p36J261j394R89l30m82J064j317J112p02J67O21j208J265r77N02J03
1532A99o08J033j296J052l28m78J032j231J092o65N2N54j029J183j048O48J64
1549C26p93J121j189Q43l29l03Q50j189J249q36J08M57q66J161j039O23o0o61
1567e27J153j141R09m01l87R28j076J062q22K71M81j076J306j077M87J03n75J019
1585F37j164Q10l21j78P81j106J059p54R3N16q98J165j181P12K6o94J060j162
1603e99J079n38j44O39j090J232r00K74M38j047J182r71O28j27l99R00j216R55
1621B96l54j53P02j005R34p86M73J87p88Q60q00O74j00m27P43j081R24l90K7M77
1641D13r59J141r96L66K56o94J072j057O34l4m27O66q80Q30n36J49L90q99J104
$$ plain form
1660 539 -404 26 358 -621 507 -370 127 5 -281 516 -439 356 -63 -190 296 -519 570 -332 83
1679 83 186 -435 510 -385 296 49 -258 392 -485 374 -179 -134 360 -440 516 -327 42 213 -412 413 -470
1700 -470 270 58 -248 415 -553 370 -195 -214 308 -399 446 -335 50 118 -345 544 -455 385 15 -254 412
1721 412 -384 386 -101 -96 279 -552 353 -290 57 90 -319 318 -530 285 -104 -270 433 -503 406 -235 -2
1742 -2 198 -466 386 -294 89 189 -212 478 -389 407 -80 -187 302 -492 404 -265 -66 364 -415 399 -340
1763 -340 41 133 -329 438 -339 222 5 -85 287 -412 434 -373 -25 319 -434 471 -302 219 98 -321 349
1784 349 -393 235 -78 -152 352 -390 372 -438 -144 273 -417 392 -374 278 47 -246 505 -316 239 10
1804 10 8 373 -410 399 -224 184 177 -283 371 -395 258 -71 -170 518 -395 237 -14 -53 250 -395 251 -105
$$ packed form
1660E39r43M30L32r79J128q77M97j22k86P97r55P95m19j27M86q15J089r02M15
1679H3J03o21R45q95O81k47l07O50q77Q59n53M5M94q00R56q43L69J71o25Q25q83
1700d70P40k12l06O63r68R23n65j9N22p07Q45p81L85O8m63Q89r99Q40l70k69O66
1721D12p96P70m87NL75q31R05o43L47L3m09O37q48Q15l89j66P03r36R09o41K33
1742bK00o64Q52o80L83J00m01O90q67P96m87j07M89p94Q96o69J99M30p79Q14p39
1763c40L81R2m62P67p77N61k17r0L72o99Q46q07L48L44p53R05p73N21j21m19O70
1784C49p42O28l13p4N04p42P62q10K94M17o90Q09p66O52k31k93P51q21N55k29
1804A0kL65p83Q09o23M08pm60O54p66O53l29r9O88r13O32k51l9L03o45O46l56
$$ plain form
1826 -105 100 128 -263 345 -553 148 -2 -274 368 -494 326 -134 -140 293 -347 277 -211 52 -44 -194 293
1847 293 -433 337 -116 -202 278 -379 350 -117 10 333 -380 425 -165 2 176 -251 351 -360 300 -15
1867 -15 -243 414 -473 368 -153 33 139 -424 250 -249 67 -42 -248 366 -278 216 -137 -61 338 -275 306
1888 306 -195 -8 133 -335 423 -170 107 40 -357 459 -306 146 -13 -141 250 -316 469 -184 136 309
1908 309 -302 341 -215 337 89 -241 375 -212 132 29 -55 113 -362 342 -179 -19 233 -349 303 -273
1928 -273 213 24 -280 545 -314 222 0 -73 223 -331 351 -219 -9 174 -284 271 -336 122 16 -244
1948 -244 366 -438 233 24 -76 306 -326 331 -174 -44 139 -257 306 -139 193 -28 -230 315 -319 237
1968 237 -127 -119 227 -450 318 -263 -75 49 -290 186 -349 229 -49 -229 248 -160 292 -177 1 348 -373
$$ packed form
1826a05K05K8l91O08q98P01j50k72O42q62Q20m60oM33o40O24m88K63r6j50M87
1847B93p26P70m53q6M80o57P29m67J27L23p13Q05n90J67J74m27O02p11O60l15
1867a5k28O57q87Q41n21J86J06n63O74m99L16j09k06O14o44M94l53P6L99o13N81
1888C06n01J87J41m68P58n93K77o7l97Q16p65M52j59j28L91n66P85o53L20J73
1908C09o11O43n56N52k48l30O16n87L44j03q4J68m75P04n21J60K52n82O52n76
1928b73M86j89l04Q25q59N36k22p3K96n54O82n70K10J83m58N55o07M58j06k60
1948b44O10q04O71k09j00L82o32O57n05J30J83l96N63m45L32k21k02N45o34N56
1968B37l64QL46o77P68n81J88J24l39M76n35N78k78j80M77m08M52m69J78L47p21
$$ plain form
1989 -373 228 -144 -44 224 -247 287 -300 185 -49 -122 208 -238 237 -222 -13 288 -348 399 -184 -35
2009 -35 79 -191 255 -211 247 -56 -312 210 -332 237 -223 59 232 -261 308 -235 130 26 -285 240
2029 240 -357 153 -3 -62 81 -302 203 -204 121 190 -386 286 -199 128 93 -151 354 -296 320 -17 -109
2050 -109 135 -272 280 -283 -38 123 -330 348 -292 288 -15 -216 252 -390 183 -133 -68 156 -315 360
2070 360 -208 36 224 -253 146 -162 234 -37 -185 313 -262 125 -207 -14 210 -245 456 -242 -21 164
2090 164 -239 272 -172 95 26 -194 384 -346 199 -152 27 135 -323 229 -210 144 140 -322 102 -355 186
2111 186 -8 -237 285 -181 198 -179 192 69 -204 301 -365 -4 156 -130 353 -265 257 -50 -107 309
2131 309 -242 201 -51 211 119 -287 423 -154 137 57 -60 225 -378 356 89 -146 123 -255 171 -251 40
$$ packed form
1989c73O01l72J00K68m71N34n87M85k34p3L30m46M75m59K09L01o36P47n83J49
2009c5J14k70M46m66M58l03k56N22n42N69m60K82J73m93N69n43L65j04l11N25
2029B40n97N10j56n9J43l83N05m07L25O9n76O72m85L27l5k44N05o50O16l37r2
2050a09K44m07N52n63K45J61m53O78o40N80l03k01M68o42N73l16O5K24m71O75
2070C60n68K44J88m77L99l08L96k71j48M98n75L87l32J93K24m55P01o98K21J85
2090A64m03N11m44K67o9k20N78p30N45l51J79J08m58N52m39L54mm62M24m57N41
2111A86j94k29N22m66L79l77L71j23k73N05o66L61J60k86M83o18N22l07n7M16
2131C09n51M43k52K62r2m06P10n77K91q0j17K85o03P34k67k35K69l78M26m22K91
$$ plain form
2152 40 276 -336 299 -196 142 25 -133 199 -340 231 -80 -185 229 -187 279 -135 12 99 -278 214 -301
2173 -301 137 43 -147 301 -225 210 -121 -152 240 -79 119 -184 131 112 -240 186 -229 40 -123 -85 328
2194 328 -354 284 -189 -104 141 -294 243 -189 -20 181 -239 281 -150 86 -145 -239 296 -355 225 -100 -37
2215 -37 136 -208 245 -193 161 45 -200 195 -286 162 -31 -114 265 -260 260 -99 17 50 -212 323 -338
2236 -338 -16 46 -246 177 -116 141 -116 1 211 -417 28 7 87 63 -306 310 -261 -14 141 -207 132
2257 132 -222 165 -109 -158 281 -256 212 -68 -28 12 -269 275 -315 89 59 -175 194 -366 269 -113 -93 347
2279 347 -178 104 -233 139 19 -235 316 -251 69 -38 -102 194 -309 337 -90 -112 293 -234 172 -261 38
2300 38 -67 -195 248 -210 133 57 -64 223 -263 285 -72 -85 142 -244 309 -111 137 28 -272 164 -221
$$ packed form
2152D0K36o12O35m95L38j17j58L32n39N71l11j05M14m16M66m14J47Q7l77M92n15
2173c01M38r4j90M48n26M35l31l1L92l19J98l03L15j9l52M26m15K69j63L8M13
2194C28o82O38m73Q5K45m35N37m32J69K01m20N20m31K36k31r4N35o51N80l25O3
2215c7J73l44M53m38L54j16k45L95m81M48j93q3L79n25N20l59J16L3k62N35o61
2236c38L22O2k92M23k93K57k57J17K10o28M45k1Q0k4l69O16n71K47J55l48L39
2257A32l54L87k74m9M39n37M68k80M0M0k81N44n90M04l0k34L69n60O35l82K0M40
2279C47n25K82l37L72j20k54N51n67L20j07o4K96n03O46m27k2M05n27M06m33K99
2300C8j05j28M43m58L43p6j21K87m86N48l57j3K27l86N53m20K48j09l00M36l85
$$ plain form
2321 -221 126 -53 -106 291 -427 207 71 -176 207 -113 134 -283 -28 59 -248 213 -165 83 -18 -28 227
2342 227 -284 257 -138 11 65 -298 166 -210 121 94 -157 160 -88 111 -62 -197 180 -300 224 -70 -80
2363 -80 58 -208 319 -244 168 83 -192 296 -136 196 -16 -84 141 -279 254 -121 -20 10 -36 296 -365 112
2385 112 -57 -125 318 -252 -11 -136 -97 161 -290 190 -48 -7 57 -70 326 -426 143 68 -201 303 -252 63
2407 63 -88 21 233 -306 136 -171 10 -16 -245 208 -193 99 33 -175 242 -297 294 -60 -96 289 -208
2428 -208 258 41 33 83 -215 281 -300 11 -70 5 148 -222 358 -118 -47 147 -179 145 -102 83 99 -302
2450 -302 352 -97 151 -38 -180 146 -327 169 -165 -20 172 -101 230 -166 42 185 -291 223 -126 134
2470 134 -86 -113 231 -274 203 -65 -139 283 -211 308 -219 -9 35 -200 364 -83 107 -49 54 165 -283
$$ packed form
2321b21L47j79n3L97p18O34j36k47L83l20K47m17K55Q7l07M61l78K48j01j0K55
2342B27n11N41l95J49N4l63M64l76L31k7k51L17k48J99j73j35L77m80N24k94j0
2363h0J38k66N27n63M12q5k75M88m32L32k12o8K25m20N33l75J01L0m6L32o61M77
2385A12j69o8M43n70K41j25L9K58m51M80k38M1O4j27L96p52N69p5k69N04n55L15
2407F3j51J09K12n39M42l07J81k6k29M53m01K92o6k08M17n39N91l54l6L85m97
2428b08M66k17qN0k98M96n81L11q1P5J43l70N80m76P1J94l26L24k47J85J6m01
2450c02O54m49K48j89j42L26m73M96l34J45J92k73L31l96K08J43m76N14l49K60
2470A34k20k7L44n05M77k68p4M22m94N19n27K10M4k35N64m47J90j56J03J11m48
$$ plain form
2491 -283 227 -121 -19 55 -236 265 -207 73 20 -299 187 -278 114 -171 -241 305 -237 89 -105 -60 39 -120
2513 -120 257 -261 106 171 -375 279 -310 141 -54 -61 264 -314 288 -52 -37 46 -151 264 -184 130 49 -24
2535 -24 256 -254 174 -40 -118 215 -283 231 -94 -54 64 -225 335 -134 104 45 -141 192 -221 240 -161
2556 -161 -132 242 -336 191 -158 -14 -25 -107 334 -272 138 2 -40 287 -265 316 -40 -58 193 -201 267 -153
2578 -153 75 157 -95 338 -251 164 25 -87 226 -290 188 -246 -140 154 -389 242 -203 138 71 -140 334
2599 334 -167 118 4 -163 207 -313 280 -42 -34 108 -276 327 -243 28 26 -131 346 -140 167 44 -151
2620 -151 157 -215 372 -92 1 205 -152 225 -208 213 110 -236 360 -262 145 -76 -137 155 -263 233 3
2641 3 -91 72 -214 249 -197 143 193 -128 120 -191 131 -150 -112 202 -270 163 -143 -62 -1 -327 338 -232
$$ packed form
2491b83N10l48J02P4k91N01m72K80n3l19M86m65L92k85p0N46n42L26j94M5R9j59
2513a20L77n18L67O5n46O54n89M51j95pL25n78O02l40J5Q3j97M15m48L14q1p3
2535b4K80n10M28k14p8L33m98N14l25M0J18k89N60m69K38n9j86L33m13M61m01
2556a61K9L74n78N27l49J44j1q2M41o06M10j36m2L27n52N81l56j8K51l94M68m20
2578a53K28Q2k52M33n89M15j39j12L13n16M78m34J06K94n43O31m45L41o7k11M74
2599C34n01K85j14j67L70n20N93l22QJ42l84O03n70K71kj57M77m86L07j23j95
2620a51L08l72N87m64R3K04l57L77m33M21j03l46N96o22M07k21o1K92m18M96k30
2641Cr4J63k86M63m46L40N0l21K48l11L22k81L8L14m72M33l06Q1O1l26O65n70
$$ plain form
2663 -232 123 52 -148 201 -46 234 -124 -21 262 -293 163 -101 43 200 -213 292 -180 204 78 -155
2683 -155 215 -335 182 -30 -92 297 -316 150 -207 65 188 -342 222 -175 170 6 -91 157 -190 221 -75
2704 -75 -125 278 -196 203 -8 -23 -6 -171 188 -349 190 40 -74 206 -219 330 -40 -50 187 -128 290 -164
2726 -164 -45 14 -162 370 -138 59 11 -80 247 -188 315 -54 -8 41 -214 224 -153 54 -2 -174 218 -274
2748 -274 0 -31 -145 252 -195 302 -104 53 278 -215 200 -138 59 58 -140 209 -251 160 61 -195 270
2769 270 -372 182 -51 -12 126 -302 144 -251 -14 14 16 143 -153 131 -48 -186 227 -227 168 -62 49
2790 49 123 -219 229 -197 87 48 -148 197 -298 128 -143 18 163 -251 209 -131 49 102 -254 183 -58
2811 -58 169 167 -60 189 -154 176 -34 -51 73 -230 360 -161 -32 221 -305 188 -111 76 106 -213 146 -235
$$ packed form
2663b32L55p1k00L49k47K80l58J03K83n55M56k64J44J57m13N05m72L84j26k33
2683a55L70n50N17k12o2L89o13M66l57K72J23n30N64l97L45j64r7K48l47M11k96
2704g5n0M03m74L99k11j5J7j65L59n37N39j50j14K80m25N49l70j0K37l15M18m54
2726a64J19N9j76N32n08J97m8r1L27m35N03l69M6M9k55M38l77K07n6j72L92m92
2748b74K74l1j14L97m47M97m06J57K25m93M15l38J97jj98L49m60M11r9k56M65
2769B70o42N54k33L9J38m28M46l95K37K8KJ27k96K84j79j38M13m54L95k30J11
2790D9P4l42M48m26K84l9j96L45m95M26k71J61J45m14M60l40J80N3l56M37k41
2811e8K27kk27K49l43L30k10j7J24l03N90n21J29K53n26M93k99J87L0l19L59l81
$$ plain form
2833 -235 145 -13 -22 174 -183 266 -59 -1 47 -305 172 -265 118 -110 -30 178 -183 179 -60 -107 172 -322
2855 -322 181 -213 110 69 -279 376 -234 114 24 -188 213 -88 125 1 -70 186 -222 193 -98 27 161
2876 161 -255 173 -184 77 -64 -110 233 -196 211 3 -51 220 -283 221 -232 1 82 -55 307 -150 220
2897 220 49 0 235 -226 212 -73 12 190 -165 227 -156 31 62 -184 246 -207 123 -145 -188 340 -283
2918 -283 123 -98 -31 127 -200 112 -211 0 124 -72 166 -164 41 -6 -132 145 -311 204 -108 -131 174
2939 174 -204 316 -182 43 -74 -146 161 -259 79 -133 -71 158 -316 285 -14 -4 190 -199 250 -204 237
2960 237 114 -103 271 -119 198 37 -14 92 -161 58 -184 -163 75 -262 188 -227 27 -32 -36 350 -148 71
2982 71 -112 -96 101 -192 102 -78 109 143 -255 287 -168 19 144 -235 205 -154 148 55 -129 175 -343
$$ packed form
2833b35L80j58rJ96l57M49l25N8M8l52M77m37L83k28Q0K08l61L62k39m7K79m94
2855c22N03l94L23m1l48O55o10L48r0k12M01l01K13j24p1K56m08M15k91J25J34
2876A61m16M28l57K61j41m6L43m29M07k08n4K71n03N04m53K33Q1j37L62m57L70
2897B20j71m9K35m61M38k85Q5J78l55L92l83J87L1k46M30m53L30k68m3N28o23
2918b83M06k21O7J58l27L12l23K11J24j96K38l30K05m7j26K77m56N15l12k3L05
2939A74l78N20m98K25j17p2L07m20L38k12O2K29m74O01k99J0J94l89M49m54M41
2960B37j23k17L74l90L17j61n1J06k53K19k42K1K38l37M50m15K54n9mL86m98K19
2982G1j83J6J97k93K94j80J87L4l98N42m55J87J25l79M40l59L02r3j84L04n18
$$ plain form
3003 -343 195 -152 86 192 -191 193 -306 110 -50 -193 124 -227 136 -20 32 202 -234 175 -189 -65
3023 -65 163 -177 153 -218 -2 -19 -206 187 -230 347 -25 -92 19 -136 135 -22 39 65 -89 246 -186 31
3045 31 -6 -11 185 -212 252 -114 -54 189 -229 275 -70 -30 139 -216 173 -184 -39 -16 -168 134 -296 301
3067 301 -97 -146 227 -192 212 -216 -62 68 -153 200 -172 159 -152 -124 171 -300 186 27 -35 136 -209
3088 -209 232 -82 105 32 -230 176 -169 80 33 -188 192 -202 215 -46 -76 113 -179 333 -32 101 87
3109 87 -213 317 -251 71 88 -143 217 -185 212 -129 50 117 -289 294 -152 -1 148 -285 193 -144 136
3130 136 113 -72 145 -83 181 -100 -63 4 -68 110 -207 79 12 -288 201 -194 147 -79 -30 161 -178 110
3152 110 -119 -8 49 -169 222 -162 -24 38 -252 160 -194 235 44 -261 90 -17 137 -123 -18 118 7
$$ packed form
3003c43N38l47K38J06l83L84m99M16j60j43L17l51L63j56N2J70m36M09l64J24
3023f5K28l40L30l71K16j7j87L93m17N77l72o7J11j55K71j57O1K6j54L35m32K17
3045C1l7nJ96l97M64l66O0K43m18N04l45M0J69l55L89l57J45K3j52L02m30N97
3067C01l98m9L73m19M04m28J54J30k21L53l72L31l11K8K95m71M86j59o2J71l45
3088b09M41l14J87p3k62M06l45K49m7k21L80l94M17k61l0J89k92N12l65J33j4
3109H7l00N30n68L22J7k31L60m02L97l41J79O7m06N83m46J51J49m33M78l37K80
3130A36k3j85K17k28K64k81L7O7p2J78l17K86o7l00M89l95L41k26M9J91l39K88
3152A10k29J11N7k18L91l84J38O2k90M12l54M29j91l05L51j07J54k60J05J36j11
$$ plain form
3173 7 260 -221 46 93 -113 207 -171 253 -70 -50 146 -210 198 -172 -26 75 -91 197 -208 85 57 -104
3195 -104 191 -191 241 -102 21 205 -127 261 -182 12 -59 -198 356 -163 44 101 -61 205 -211 117 -14
3216 -14 -78 68 -202 236 -174 100 88 -251 185 -156 -5 -10 -23 99 -289 203 -158 -76 181 -116 199 -158
3238 -158 55 17 -38 182 -218 145 12 -129 218 -74 170 -53 -134 228 -178 236 -134 -19 79 -187 111
3259 111 -92 137 -20 -72 135 -144 95 -59 -93 143 -101 90 -178 -4 114 -157 80 -115 73 8 30
3280 30 93 -153 145 16 -67 4 -234 377 -30 42 103 -16 146 -217 99 -175 -239 149 -131 215 -81 -77 96
3303 96 -238 150 -99 5 25 -263 134 -247 -12 -115 -83 196 -216 211 -98 -164 116 -236 158 -74 -30 -34
3325 -34 -95 147 -198 166 -144 -27 187 -177 246 9 53 92 -44 73 -110 77 -29 -187 280 -155 -2
$$ packed form
3173GK53m81K67M7k06L20l78M24l23K0J96l56M08l70J46J01j66K88m05K93k8j61
3195a04K95l82M32l43J23J84l32L88m43J94p1j39N54n19K07N7j62K66m16L28j31
3216a4o4J46k70M38m10K74j2l39M36l41J51nj3J22l88M92l61Q2K57k97L15l57
3238a58K13l8n5K20m00L63j33j41L47k92K44k23q1L62m06M14l70J15R8k66K98
3259A11k03K29j57n2K07k79K39j54l4K36k44J91k68J74J18k71K37j95J88o5K2
3280C0O3k46K98j29q3P1k38O11m07P2O1j19J62l63L16k74o4L88k80L46k96MJ73
3303I6l34L88k49J04K0k88L97l81K35j03L2K79m12M27l09o6K80l52L94k32M4m
3325c4o1K42l45L64l10J17K14l64M23k37M4L9j36J17j83J87j06j58M67m35J53
$$ plain form
3346 -2 -5 -14 198 -103 100 25 -4 100 -100 199 -144 101 90 -202 243 -207 145 -32 -87 119 -66 130 -110
3369 -110 -80 129 -199 196 -222 74 -54 -211 79 -256 94 -100 50 137 -164 200 -82 -39 79 -216 180
3390 180 -92 1 66 -5 213 -234 114 -30 -99 143 -203 155 -108 -65 63 -148 164 -147 17 -99 -118 134
3412 134 -134 110 -53 -15 149 -279 215 -173 -53 165 -223 138 -219 128 65 -170 79 -219 181 -78 -119
3433 -119 145 -58 214 -81 36 12 -170 190 -148 265 116 -144 233 -247 245 -76 -111 142 -180 102 -171
3454 -171 108 89 -154 143 -147 130 -4 -45 206 -178 201 -137 -108 106 -243 123 -44 134 -18 -151 12
3475 12 -140 138 -56 -47 236 -118 35 -94 76 77 -168 123 -188 56 57 -158 141 -255 92 -57 -68 10 -252
3498 -252 103 -54 146 152 -126 231 -73 15 92 -241 91 -164 95 -16 -151 114 -76 127 -130 80 102 -317
$$ packed form
3346blrK12l01K03p5k9J04k00K99l43K45j1k92M45m50L52j77n5K06j85J96k40
3369a10L0K09l28L95m18K96j28j57K90l35L50j94J50Q7l01L64k82M3J18k95L96
3390A80k72R3O5p1K18m47L48j44o9K42l46L58k63M3J28k11L12l11J64j16j9K52
3412A34k68K44j63L8J64m28M94l88J20K18l88L61l57L47o3k35K49k98M00k59m1
3433a19K64k03K72k95J17k4j82L60l38M13j49k60L77m80M92l21l5K53l22K82k73
3454a71K79j9k43K97k90K77j34m1K51l84L79l38K9K14l49L66j67J78j52j33J63
3475A2j52K78j94RK83l54J53j29J70Jk45K91l11K44Jk15K99l96L47j49j1P8k62
3498b52L55j57K00Ok78L57l04Q8P7l33L32k55K59j11j35K65j90K03k57K10K2m19
$$ plain form
3520 -317 210 -141 -16 69 -188 97 -139 85 93 -16 162 -197 172 -3 154 -11 -139 91 -243 150 -98
3541 -98 -109 151 -141 95 -112 -175 102 -66 48 -50 -9 7 -69 98 -180 111 66 -144 131 -280 79 17 -139
3564 -139 36 -102 144 -63 43 108 -162 195 -185 90 -46 -106 296 -240 251 -18 -64 228 -152 104 -138
3585 -138 95 142 -157 157 -92 73 -6 38 174 -291 101 -91 -96 55 -270 30 -93 65 4 -332 131 -67
3607 -67 71 13 -87 144 -70 87 -120 -164 118 -74 175 -138 99 -2 -95 174 -173 81 22 -113 132 -153
3629 -153 69 -111 88 65 -59 55 -248 57 -25 -163 146 -54 130 32 -84 175 -217 185 -97 -4 137
3650 137 -191 183 -136 45 17 -157 80 -211 156 -76 1 -10 -168 182 -118 -18 87 -103 322 -133 63
3671 63 22 -85 267 -206 99 10 -18 94 -90 151 -45 3 74 -187 141 -59 88 -9 -71 84 -160 -10 -82
$$ packed form
3520c17N27l51J25Q5k57K85k36K24Qj09J78l59L69j75J57j65j28K30l34L93k48
3541i8j1K60k92K36k07o3K77j68J14r8M1J6p6J67k78K91m5k10K75m11L59o2j56
3564a39J75j38K46k07J06O5k70L57l80K75j36o0M02n36M91k69m6K92l80K56k42
3585a38K33M7k99L14k49J65p9M4J36m65L92j92nJ51l25L00j23J58o1l36M63j98
3607f7J38n8j00K31k14J57k07m4K82j92K49l13K37j01r3K69l47K54n9j35K45k85
3629a53K22j80J99k3j24J14l03L05q2j38L09k00J84r8j16K59l92M02k82R3J41
3650A37l28L74l19J81k8j74K37k91L67k32P7j1j58L50l00J00J05j90M25m55J96
3671F3m1j07L52m73L05q9k8J12j84K41j96M8P1k61L28k00J47r7o2J55k44J50p2
$$ plain form
3694 -82 -76 70 -369 185 -120 63 34 -208 191 2 -88 60 -151 80 -216 228 34 26 311 -244 190 -46
3716 -46 94 26 -37 83 -145 129 -83 -120 113 -273 180 4 -18 137 -59 237 -105 34 12 -116 26 -97
3738 -97 68 -28 -16 170 -135 145 -147 -87 138 -170 226 -71 -108 184 -277 223 -143 55 31 -130 133 -98
3760 -98 138 -66 -25 204 -133 158 -238 -31 181 -221 168 -128 87 -74 34 207 -140 162 -21 -8 23
3781 23 -166 162 -79 135 57 -239 106 -228 23 -24 -80 106 -221 129 -98 -35 78 -175 173 -275 -51 121
3803 121 -17 104 -110 217 -20 -79 77 -125 166 4 -112 91 -42 237 -110 82 -6 -53 61 -195 86
3824 86 -102 -104 158 -242 151 -51 -107 90 -93 181 -74 19 63 -94 187 -78 60 -108 26 161 -195 47
3846 47 -169 -76 39 -259 260 -36 -76 -90 -86 112 -96 129 78 6 105 -188 92 -115 -22 118 -171 272 -95
$$ packed form
3694h2OJ46m39N54l05J83k9k42L99j89r0J48k11K31k96M44j94qK85n55M34k36
3716d6J40o8o3J20k28K74k12l7K33l86M53j76k2J55j96K96l42J39k2j28J42j23
3738i7J65r6J2J86l05K80k92O0K25l08L96k97l7K92m61N00l66J98k4j61K63k31
3760i8K36k04M1K29l37K91l96K07K12m02L89k96K15j61J08J73l47L02j83J3L1
3781B3j89L28k41K14p8k96L45l34K51m7n6J86l27L50k27O3J13k53L48m48K24J72
3803A21j38J21k14L27k37n9J56k02K91j62j16K03j33K79l47J92q8m7J14k56K81
3824H6j88kK62m00L93k02n6J97j83K74k55R3M4j57K81k65J38j68J34J35l56K42
3846D7k16R3J15k98N19k96m0j4MJ98k08K25n1p2R9k93K80k07R3J40k89M43l67
$$ plain form
3869 -95 -1 77 -169 174 -309 2 -17 -13 100 -274 110 -44 -124 -12 -91 171 -9 62 163 -109 33 -53 93
3892 93 -86 -17 53 -96 121 -29 -23 -22 -26 172 -73 -27 114 -53 176 -137 180 -51 26 66 -186 19 -40 -67 25
3917 25 8 206 -99 111 130 -107 105 -131 124 -26 -99 113 -276 167 -123 -14 145 -319 160 -139 -20
3938 -20 -8 -134 -25 -168 44 -4 -51 141 29 239 -44 32 26 -77 145 -61 128 -23 17 115 -215 120 3
3961 3 -107 80 -147 34 -77 46 33 -132 81 -5 70 -151 34 78 -76 204 -87 -93 5 -151 183 -282 91
3984 91 135 -71 11 -89 26 -115 -130 119 -187 158 -193 -108 61 -118 38 -66 34 -38 -115 157 -129 21
4006 21 -50 -109 269 -72 59 -73 -114 47 -93 145 -35 43 22 -150 118 -101 -21 -118 -121 25 -69 213 2 -68
4030 -68 46 -58 149 -103 -1 10 -155 174 -145 36 -86 13 56 -153 182 -102 -28 134 -138 114 -53 165
$$ packed form
3869i5R4P8k46L43m83L11j9MJ13l74L84j54q0J12p9K62j80P1J01k72J42q6J46
3892I3j79O9P0j49K17j50OJmJ98k45M6J41j67K29l13L17k31P7M0k52K05n9k7R2
3917B5j7J98l05K10J9k37K12k36K55j50p3K12l89M43k90J09J59m64M79k99J19
3938b0J2j26J09j43K12m8m7J92j12K10k83P6oj03K22k06J89j51M0R8l30L35j17
3961Cj10J87k27J81j11J23j3j65K13q6P5k21J85M4j54K80k91oR8j56L34m65L73
3984I1M4k06Q2j00J15j41j5K49l06L45l51Q5J69j79J56j04J00p2p7K72k86J50
4006B1p1n9L78l41J31j32m1J61j40K38j80P8k1j72K68k19Q0r7lJ46r4K82k11p0
4030f8J14j04K07k52J02J1j65L29l19J81j22R9M3k09L35k84P4J62k72K52j67K18
$$ plain form
4052 165 11 -52 104 -189 9 61 -97 34 10 45 -102 98 46 -216 165 -80 20 -43 -90 -20 -153 114 -92
4075 -92 -70 111 -183 7 -106 -3 57 -66 190 -26 93 149 -87 226 -50 120 -51 -33 123 -200 157 -136
4097 -136 -50 58 -178 82 -37 32 136 -111 281 -95 149 -48 -26 -33 -109 69 -27 42 48 -221 106 -49 -14 16
4121 16 -58 -54 -208 59 -48 27 61 -146 42 -106 68 68 -89 -10 -141 87 -3 -98 114 -96 97 57 -114 121
4145 121 -42 75 12 107 -21 -116 53 -125 13 -82 -80 170 -134 98 -66 11 86 -198 135 6 160 16 -51
4168 -51 -3 -110 85 -33 91 85 -95 20 -35 -55 -28 -195 114 -100 -47 -45 3 117 -229 77 -70 -136 64 -124
4192 -124 29 47 -86 90 -206 147 -203 20 26 -64 199 -118 37 -20 -45 63 -154 30 -23 -66 129 -20 -103
4215 -103 -41 8 58 59 146 -228 155 -71 -57 54 -212 197 -123 -91 47 -152 194 -54 73 -12 -72 70 -113
$$ packed form
4052A65j54o3J56k93J98N2j58J31k4L5j47K00n2k62L81k45J00o3m7P0j33K67k06
4075i2K2J81k94J90j13J03O0j23K56k16J19N6k36L13k76J70j71J8J56l23L57k93
4097a36Q6J08k36K60j19O9J04k47L92l76K44j97K2pp6J78r6O9Ok69L27j55L5L0
4121A6p4Mj54K67j07P5L4k07J88j48J74%j57P9j31K28r0r5K12k10J93m0j71K35
4145A21j63J17o3R5j28r5J69j78J38r5KK50l04K32j64P7P5k84L33j29J54j44o7
4168e1M8j07J95j18J24oj80J15n5k0K7j67L09k14N3KM8J14l46L06j47o6K00j88
4192a24J53J8j33J76k96L53l50K23Or0K63l17J55n7k5J08k17J84n3m3J95j49q3
4215a03O2M9N0JQ7l74L83k26J4J11k66M09l20L2J38j99L46k48J27q5o0J42j83
$$ plain form
4238 -113 84 -44 76 90 -86 253 -63 90 -18 -119 152 -3 96 5 13 50 -50 106 -52 -9 136 -48
4260 -48 202 -140 42 -77 -17 97 -72 65 13 -192 152 -193 -78 -12 48 214 -137 120 78 34 15 -29 142
4283 142 -104 132 -172 -99 40 -74 105 -75 26 -15 -42 37 29 31 -97 -104 52 -153 178 -43 -18 193 -43 155
4307 155 21 -54 -72 -48 -9 -68 29 -47 -80 124 -200 77 -95 -120 105 -140 -53 -119 44 -23 -88 121 -80 -6 47
4332 47 -133 45 -145 136 -6 15 30 -69 39 -48 -87 43 -50 80 -123 -3 7 -129 147 -67 129 67 40
4355 40 9 -111 110 -30 14 19 -111 90 -13 -52 -13 -79 37 -156 111 -138 -94 7 -111 88 -96 -37 18 -25
4379 -25 22 -108 48 0 -160 155 -91 93 88 -100 74 -110 11 -216 19 25 -17 86 -61 2 12 0 53 -129
4403 -129 49 -35 -102 82 -191 10 -87 -71 90 -38 96 -131 67 51 -21 119 -72 -55 0 -66 0 -139 7
$$ packed form
4238a13J97j28J20J4j76L39l16J53j08j01K71j55R9r1QL7j00J56j58M3J45j84
4260d8K50l42J82j19O0J14j69J37n2k05L44l45J15O6O0J66l51K57m2m4j9m4J71
4283A42k46K36l04P3J39j14J79j80J01m1k7P9qKj28pJ56k05L31k21K5K11k36J98
4307A55j34p5j8K4L9n9R7p6l3K04l24K77j72k5K25k45Q7o6J63o7o5K09k01P4N3
4332D7j80J78j90K81j42K1J5r9J08q7l9J30r3J30k03J20J0j36K76k14J96o2k7
4355D0l1j20K21j40M4Nj30K01j03l9L9o6J16j93K67k49M4J01j18J99j84N9N5m3
4379b5M7j30J56m8j60L15k46J84nj88J74j84J21k27K35Om2J03j47O3J0j2N3j82
4403a29J78q4o7J84k73K01r7J6J61j28J34k27J98j6p2J40j91J7N5o6O6j39J46
$$ plain form
4426 7 103 -45 92 3 179 -91 50 -111 -63 74 -104 134 34 -92 103 -67 20 -95 83 99 -26 38 -11
4449 -11 38 -115 20 43 -156 64 49 2 56 -165 176 -137 93 -63 38 82 -114 -63 -134 -41 60 -58 160
4472 160 55 -15 43 -23 164 -22 4 2 54 16 -30 64 -155 -7 13 -216 -64 29 18 90 -83 54 -127 3 62
4497 62 -121 -45 -185 35 -66 -4 63 -63 106 -65 -51 32 -83 77 -85 75 30 -101 86 -43 108 134 -116
4520 -116 140 47 -35 88 12 3 -143 10 28 56 -16 -19 82 -92 91 -26 -126 -63 -66 25 -132 -72 -38 -124 133 -199
4546 -199 147 -25 -40 95 -104 129 -75 21 98 -86 111 12 30 43 12 -96 -27 34 14 -124 19 -65 28 -60
4570 -60 -70 -31 -91 28 -72 -79 80 -77 82 -7 112 -23 -37 80 -123 82 -147 93 131 -10 142 30 96
4593 96 47 32 29 -15 22 -13 -106 17 -122 82 -9 -107 -19 -46 28 57 -56 60 -55 95 -131 -38 62 -45 95
$$ packed form
4426GR6j48J37q9J76k70J41j61M8J37j78K38j00j26J95j70Q7j15J78J6j25O4m9
4449a1M9j53J35K3j99K20j5m7N4k21L41l13K30j56J01M4j96N1p1R3J01j18K18
4472A60j05p0N8o6J87j86K6kN2l8m6R4k19J48K0k29J52R3j1P2j73J37j81J30N9
4497F2j83P6j40K20j01O2O7j26J69j71J4Q3j15J60j62J60m5j31J87j29J51K6k50
4520a16K56r3q2J23p6rj46J53J8K8p2lJ01j74J83j17j00O3lR1j57O0L4q6K57l32
4546a99L46j72j5J35j99K33k04R6P7j84J97r9J8J3l1j08O9O1k0j38J43q4R3q8
4570f0j0L9o0J19j00pJ59j57J59q9J19j35j4J17k03K05k29K40L8j41J52j12O6
4593I6m9j5lm4L7l5r3J23j39K04r1r8Q8k7P4K9j13J16j15J50k26R3J00j07J40
$$ plain form
4618 95 -73 115 -82 -42 -50 -114 135 1 1 66 44 34 -82 4 57 -10 28 -76 -2 -24 39 37 33 71 -18 -1 23 -108
4646 -108 170 -91 -34 -47 -45 73 31 -85 -163 -107 -43 -97 121 -58 100 65 3 60 -60 157 4 -112 149 -136
4670 -136 61 -34 -47 2 -25 104 -1 84 -2 -70 -16 -96 4 71 11 -25 -8 97 -68 16 39 -79 66 0 -104
4695 -104 36 3 -44 54 52 -63 -64 -5 -125 87 -125 -8 114 -67 140 -28 65 -67 17 153 -33 94 29 34
4719 34 143 -102 -18 44 -5 13 -16 -7 -78 -1 38 51 128 -132 51 -1 107 76 -95 3 -118 25 70 -49 112 -24
4745 -24 -111 -47 -25 -36 -3 40 -130 7 -79 -51 77 14 -16 11 -107 38 4 6 -35 -100 92 -118 14 71 170 70
4771 70 -47 72 -86 -18 -74 -34 0 -25 98 -72 -34 44 -114 -2 -40 9 51 -15 45 98 -152 35 -16 17 -104
4796 -104 9 -60 -152 193 -43 29 -50 38 48 -8 105 20 21 36 22 69 40 -2 36 -12 50 -87 56 -50 -51 82 -34
$$ packed form
4618I5j68J88j97M0qo4K49j34%O5k2j0j16Q6N3o7L8j04P4k2O3kmL8q9J7K4j31
4646a08K78k61N7j3KJ18m2j16p8N6O4n4K18j79J58l5o2N7j20K17j53j16K61k85
4670a36J97r5j3M9k7J29j05Q5q6o8N4q0J00O7o0l6J7J05j65Q4K3j18J45o6j04
4695a04J40l3m7R8kj15jN9j20K12k12J17J22j81K07j68R3j32Q4J36j86J27o5N
4719C4J09k45Q4O2m9J8k9Rp1P7L9J3P7k60J83n2J08l1j71R8j21J43M5j19J61j36
4745b4q7O4K2j1L3M3j70J37q6K8J28o3l0K7j18J45l4Km1o5J92k10J32N7R9j00
4771G0j17J19j58O8n6M0L4k5J23j70L8P8j58J12l8M9M2o6O0N3k50J87n1L3j21
4796a04J13o9r2L45k36P2p9Q8J0n6J13q5JJ5j4M7k9m2L8m8O2j37J43j06jJ33j16
$$ plain form
4823 -34 101 25 78 -6 -103 93 -20 51 23 -69 51 -13 1 -36 -42 49 -59 -134 -46 52 17 -49 129 49 -10 -14 -15 42 -93
4852 -93 35 -31 -73 7 -117 71 -74 -45 76 -69 -16 -2 -53 72 -20 43 -85 73 5 49 14 15 -18 60 9 6 -68
4879 -68 140 -82 49 77 48 19 -84 170 112 -43 109 -67 19 61 -3 -77 -123 64 -59 -43 -5 -189 66 -47
4903 -47 25 95 32 62 -63 31 -118 -127 129 38 14 -65 29 -91 -61 85 70 69 -78 -31 166 -60 -59 -108 -50 89 0
4930 0 19 65 -12 -85 -40 -3 13 -13 36 28 -7 -41 111 39 -63 -140 -47 -83 -43 -70 -3 -135 -25 -57 35 100 -2 -94 58
4959 58 175 -137 -34 14 -90 15 -59 -39 -51 -30 98 -27 33 -18 4 -31 -95 24 13 -67 -49 -7 34 -178 -10
4984 -10 22 -56 84 -49 10 -72 12 187 -74 -69 -98 52 -83 -147 -37 -110 31 24 -50 -80 -34 -90 17 -21 64 -7 83
5011 83 16 -19 -92 -80 108 -41 -111 -9 64 57 -87 -6 -27 18 67 -106 185 -44 -59 -75 -112 26 -70 -84 -38 12 -27
$$ packed form
4823c4J35p6N3q4r7J96j13P1k8r2J20o4J4l7oR1j08p5Q8R8l5o6J78q0n9mjN7j35
4852i3J28o6m2Q0j24J88j45K9J21j45N3J4n1J25r2O3j28J58o8M4l5Jl3P8n1lp4
4879f8K08k22J31K8k9k9j03K54n8j55J52j76Q6M2o4p4m6J87j23J6L8j84K55j13
4903d7P2P0o3L0j25R4j49rK56r1k4p9R4j20L0J46j5jj47M7J97k26Jm9N8J39q9
4930@J9M6p7p3M5L7J6k6M9ql5l4J52p2j02p7R3l6M0k7O7j32J10l2R2O5j02r2J52
4959E8J17l12J03M8j04J05p4K0j2K1J28j25O0n1K2l5o4J19j1q0J8M2M1k12J68
4984a0L2p8J40j33N9q2Q4J75k61Nk9J50j35o4J10p3J41pp4l0M6n6J07l8Q5p1R0
5011H3o7l5p3J2J88j49p0J02P3pj44Q1k1M5M9j73K91k29j5j6l7J38r6j4M6N0l9
$$ plain form
5038 -27 -89 -68 -109 68 75 -7 5 38 24 -129 36 34 24 90 25 33 146 -72 -50 4 -8 -31 -179 123 -124 -172 -34
5065 -34 -70 9 26 51 90 20 14 -154 -59 -74 -8 111 89 42 -60 -64 -96 68 42 -65 -73 -6 -120 -44 -65 60 -31 55
5093 55 -7 -38 49 41 -98 67 19 -39 -28 167 -42 -89 54 -81 126 -48 46 -6 -97 107 -217 94 9 -24 52
5118 52 -100 4 -108 -115 36 -127 -12 -74 -61 -7 10 135 -24 -24 0 -61 1 76 -11 59 99 43 -34 38 -54 -22 46
5145 46 -65 -67 -118 41 -96 -4 22 -179 39 54 -61 59 8 86 -79 -1 -45 -95 1 -15 105 -49 -37 -12 -144
5170 -144 -34 30 -26 99 27 82 31 -73 16 -178 26 -92 -59 22 67 79 1 103 -97 16 37 -78 70 -143
5194 -143 20 35 -45 85 -52 23 -58 30 -10 -52 62 -56 98 105 56 -4 24 -103 -78 -40 35 45 100 -52 -20 18
5220 18 20 66 -98 46 -14 -43 -102 -32 -64 -38 -134 63 52 -35 -3 -125 49 1 -11 -88 84 -66 -148 54 -9 2 -38
$$ packed form
5038b7o2K1m1J77Pq2J2L3j4j53J65kj0O6o5QJ13k18K2N4j2k3j48L02k47m8J38
5065c4l6P9J7K5L9p0oj68R5j5O6J19k2m7j02ml2J64k6j07qO7j14P6k1J25r1Q6
5093E5o2l1Q7qj39J65m8n8J1J95k09m7J43j35K07j74R4n2r1K04l24L11q5l3P6
5118E2j52J04j12pJ51j63J15o2J3N4J7J25j59%K4o1O2P5q7P0M0n6p7P2r2L2O8
5145D6j11kn1J59j37R2K6k01K18J5j15J20n1P8j65P8m4n0R6j6J20j54J2K5j32
5170a44J10O4n6J25p2N5n1j04Q9j94K04j18L3Q1M5J2p8J02k00J13K1j15J48k13
5194a43J63J5q0J30j37P5q1Q8m0m2J14j18J54Pm9o0K8j27K5L8P5J0N5j52L2L8
5220A8KM6j64J44o0k9n9P0l2K6r6J97j1q7L2j22J74m8j2p7J72j50q2K02o3J1m0
$$ plain form
5247 -38 3 126 -27 102 -8 21 -22 7 202 49 53 44 -114 -74 37 -13 6 -51 -78 -67 36 -46 1 -52 1 33 -114
5274 -114 -58 -6 -19 62 -7 78 -113 -82 -27 -39 39 72 -2 -53 56 31 -69 -56 -93 -31 152 -72 5 -42 -28 93 -20
5301 -20 42 -28 -18 82 -98 78 -19 38 -70 78 21 -145 90 -78 25 73 -74 33 87 -13 -66 5 1 -33 163
5326 163 17 -77 66 -164 4 -22 -124 -62 -76 125 -59 4 -51 11 17 27 35 108 -26 -11 -88 28 122 -120 97
5351 97 10 92 -43 -32 -47 -78 -14 82 48 -63 138 -73 -109 84 -60 -150 -18 -74 47 -60 20 28 4 51 36 -115
5377 -115 -57 -5 50 -24 -101 56 142 -71 -73 111 9 -53 -28 -9 -12 -2 -56 29 38 51 -53 -26 -68 -33 -65 24 117 -37
5405 -37 81 54 6 -38 22 -28 -77 81 93 -4 53 -114 18 68 -26 81 -66 -49 -54 3 14 -4 55 13 -117 -36 -67
5432 -67 -65 -68 -56 -149 -22 -61 33 86 -74 -50 25 0 25 -25 55 11 81 129 65 -85 14 -158 11 60 -95 22 14 -79
$$ packed form
5247c8M1J23j53J29j10K9m3K9J95j53Mrj58M0J11n0J9n7k7J1J03q2M7n3N3L2j47
5274a14N6N2j3Q1o9Q5j91L1N5j2P8L3p4n1J09k5j00J3l7O2J83k24P7m7J4J21j13
5301b0O2p0J0J00j80J76r7N7j08J48n7j66K35j68J03M8j47J07N4j00n3P1ml4J96
5326A63j46r4J43k30J68k6j02O2j4K01j84O3n5O2OJ0QP3j34J5p7J16R4k42K17
5351I7q7Q2j35J1j5l1O4R6l4j11K01k11l6J93j44r0J32n6J21j07Q0Qk4M7j5j51
5377a15N8N2N5p4p7J57Q6k13kJ84j02o2K5J9lJ0n4Q5RJ3j04K7m2L5l2Q9R3j54
5405c7J18k7m8m4O0n0m9J58J2r7N7j67J32N0r4J07j47J7nN7J1j8N9m2j30Q1l1
5432f7KlJ2r3J27l9R4N3j60K4P5k5K5n0Q0m4P0M8o4j50R9j72J69M9j55J17qr3
$$ plain form
5460 -79 27 117 -104 -36 36 -41 2 4 12 -42 50 108 -8 -80 -91 -105 -46 -41 29 -86 -73 -61 -51 -25 -8 -11 22 -93 9
5489 9 62 -92 -82 10 65 -58 -55 -101 -37 -14 12 24 26 -88 13 -11 14 -81 23 -2 23 42 -25 30 -10 33 37 -1 -17 -20
5519 -20 -73 23 -5 36 -47 35 33 -146 72 14 -15 4 20 -84 -76 182 47 -56 -143 -5 25 -45 -82 96 -41 77
5545 77 -19 -11 -78 98 -82 -68 -24 -30 -17 -6 -35 -32 -78 54 2 -15 -38 -88 2 27 -97 70 -24 -71 -94 -115 59 -154
5573 -154 -14 -45 62 -32 1 -35 -104 9 -17 -31 85 28 66 35 70 -38 -3 -77 -87 -52 35 -10 20 -20 -88 75 -24
5600 -24 -38 60 94 181 30 37 15 -31 -64 -40 -33 41 54 66 -29 58 -8 -134 16 -60 -59 79 -132 -44 62 19 97 64 22
5629 22 50 7 65 -8 49 100 -51 -36 -36 51 -39 82 24 4 -53 -57 -39 -86 -71 -17 -64 -110 2 -12 -51 -49 -91 -1 -79 -112
5659 -112 -33 52 -58 -115 -73 -79 -26 -27 49 -49 -16 -42 20 -77 16 12 87 14 77 -142 -108 7 -14 7 52 97 -67 126 6
$$ packed form
5460g9J06R0k21O8P2p7M3KQn4R2N8j16p2j1j4N9NP0j15J3J2J0K6J7lL3j15J02
5489IN3j54J0R2N5j23Lm6O4K3K6J2Kj14J01k4K5r5J04k5K5J9o7N5m0M3Ml8j6l
5519b0n3R6k8M1q3Q2kj79K18n8k9J9J6j04QK58j35j03q7J38L0p0l7J78j37J18
5545G7r6Qo7J76j80J4M4oJ3J1k9Lm6J32n2j7k3n0R0K5j24J67r4m7k3k1J74k13
5573a54J40l1J07r4L3l6o9J13k6j4J16n7L8l1L5j08L5p4j0L5Q7m5L0m0o8J63r9
5600b4j4R8L4Q7j51Pk2m6l3K4PP4J3J2r5Q7o6j26J50p6JJ38k11Q8J06m3P8l3m2
5629B2K8m3N8p3N7N1j51J5%Q7r0J21n8k0n7mJ8m7J5N4m7m6J12j4l9Km2R0p8l3
5659a12P9Q5j10n7M2oN3jP6r8L3k6O2r7R3mP5p3O3k19L4J15k1K1M5M5j64J93j20
$$ plain form
5688 6 -1 129 -13 -14 70 -22 -16 -62 45 -90 4 -87 128 178 -60 -6 -66 10 -37 -21 3 67 23 -13 112 -49 94 57
5716 57 22 126 -125 -108 11 118 -69 2 17 -96 -46 -93 50 -2 -29 169 -36 14 -117 -1 5 -18 -70 -40 71
5741 71 -103 47 -78 82 19 45 -28 -161 -38 -72 -17 -36 -54 -118 -17 -124 -49 40 -4 -85 28 66 -36 57 42
5766 42 -118 39 -9 105 -84 15 -20 88 13 -187 43 -84 35 -13 66 -77 -89 -123 -31 -67 4 41 -79 28
5790 28 -20 -56 37 1 -31 -16 -24 47 -59 70 -50 27 -194 18 -79 64 -5 -9 -7 -87 -62 26 -33 -85 17 -83 -55 -28
5818 -28 -33 144 68 -136 41 60 -25 123 17 53 -108 -33 27 -80 70 -37 27 -11 -93 29 16 -4 39 -49 17 26
5844 26 -40 8 62 -81 -31 -14 -73 -43 55 -97 -87 -138 63 -113 -88 -110 -62 56 -118 -118 1 -4 109 -72 27 -46 55
5871 55 19 115 -4 15 54 89 -47 33 55 -95 76 21 51 69 -26 93 -138 32 64 -58 97 -62 -100 44 -27
$$ packed form
5688FpJ30j42jQ4r2Om6J07j35R4r1K15N0k38N4o0P6m7J6K4O4m4l6J25j61J43l7
5716E7l5J04k51J7J19J07j87P1J5j13N0m7J43n2k7J98k05N0j31J16Ok3n2L0J11
5741G1j74J50j25J60o3K6p3j33J23l4N5j9j8o4J01j07P5Q9m4q1J13L8j02R3j5
5766D2j60J57m8J14j89R9l5J08p5k00K30j27J19m8P9j43j2l4R2l6P1L7j20J07
5790B8m8l6R3l6l2J5qP1j06J29j20P7k21K12r7J43o9mKq0K5Q8n9n2J02j00K8K7
5818b8nJ77p6k04J77J9q5J48j06L6j61P5O0j07J50j07O4l8q2J22j3k0M3q8O6R
5844B6o6M8N4j43N0J7n9L0R8j52J0n1K01j76K5k2M8J18j74%J19nJ13j81R9p3J01
5871E5l6R6j19J9L9L5j36Q0K2j50J71n5L0J8r5J19k31J70L2j22J55j59l8J44p1
$$ plain form
5896 -27 60 -93 -132 -9 54 -177 -27 7 -130 3 15 -83 -51 -26 -65 20 120 -12 -6 42 -39 -46 15 -80 -11 12 -82
5923 -82 26 -64 -43 -4 64 13 87 30 -41 -224 132 11 -63 -21 -94 -68 -30 -17 0 24 -46 -6 23 43 61 69 15 44 -3
5952 -3 15 -52 79 32 64 -81 49 75 56 125 -70 8 -94 -1 77 66 27 68 51 51 -116 86 50 -2 -21 -68 78
5979 78 3 -9 -2 10 49 19 -12 58 72 -29 -69 22 85 44 -41 -49 -117 -114 -83 1 36 56 64 129 -61 30 155 68 -45 102
6009 102 57 -123 25 -90 29 75 23 -42 -37 68 153 -129 53 124 23 -6 -74 92 -97 55 5 22 6 49 -27
6034 -27 60 -11 -8 12 -100 -62 -51 1 40 3 -55 -76 -36 32 70 58 -5 80 20 -54 68 -102 -1 -41 4 -38 -12 -63 81
6063 81 2 83 58 50 61 87 -71 12 110 19 -108 -21 -21 64 -4 45 -106 92 -27 -73 67 -34 -92 11 49 -50 23
6090 23 -13 -69 -85 -39 -14 45 47 24 68 2 -65 27 76 26 -27 100 57 -143 57 67 76 -27 -14 -30 10 87 -55 -122 -53
$$ packed form
5896b7Q7j53l9J23O3k31J50L4j37J33J2r8L2K5l9Q5J00j32OM8q1pO1r5O9K3r4
5923h2J08r0K1L9O8n1P4n7p1j83L56j21p4M2p3K6L8J3J7K4p0M0K9K0J8Qn4K9m7
5952cJ8o7J31m7L2j45J30K6j9O9j95P8j02R3P8j1l9M1j7%j67K02l6n2j9m7J46
5979G8p5j2PJ2L9l0l1P0J4j01m0R1O3m1q5qo8LL1Q4L5K0QO5j90R1J25q7j13J47
6009A02m5j80J48j15J19M6n2o5NJ05Q5k82J82P1j01k9o8J66j89J52n0J7j6M3p6
6034b7Q7p1LK0j12L8J1N2L9l7n8k1M0O8L8j2o3Q5o0p4J22j70J01m0M5m2K6n1J44
6063H1p9Q1k5qJ1K6j58Q3R8r1j27Q7%Q5o8M9j51J98j19m6J40j01n8J03L8r9P3
6090B3l6n6j6M6K5N9Kk3M4o6o7R2M9n0n3J27m3k00K00J0Rj03J3j6M0P7j42o7O9
$$ plain form
6119 -53 25 62 29 -27 -10 -49 77 -42 62 72 -12 -5 -27 -38 53 -99 -33 108 -2 -29 -36 -84 -12 74 34 -149 -5
6146 -5 -8 -31 53 -74 62 -223 20 -49 -24 42 -49 16 -10 -51 107 62 -45 -27 -12 37 -28 76 -6 68 -120 -23 51
6173 51 -9 16 18 10 -28 52 93 -45 -7 -22 -10 0 -50 37 62 -86 140 -65 -17 -169 -111 5 7 -26 31 55 -23 -74 1
6202 1 9 78 52 -7 86 143 125 -55 -7 132 -71 -38 8 55 41 0 -46 46 43 34 -16 65 -26 13 -86 53 40 -27 10 -21
6232 -21 9 -21 -48 -47 -58 47 -60 76 23 -16 -17 -88 -145 6 -3 8 6 0 12 49 -5 -42 65 28 101 -25 -23 -91 81 -93
6262 -93 139 88 -17 -24 9 -26 62 -127 -60 63 2 -144 95 157 13 -13 -55 -32 -56 -47 -2 -38 -8 88 -2 -13 19 -94
6290 -94 -40 52 76 -48 -190 -59 14 -85 -26 42 -57 14 -35 59 -50 -22 15 -13 -124 -25 24 31 -36 -33 70 22 3 16
6318 16 92 -16 -67 -109 -19 -9 28 -13 -98 -34 83 -62 -44 -44 125 -15 71 -117 41 -82 41 74 59 62 -34 28 24
$$ packed form
6119e3P8L7l3n6J7l9J26j19J04J0q4Pk2j1R1j52O6J41j10k7pm8P2Q6m0j83J44
6146elk3Q4j27J36k85K43o9K5O6r1O5k6m1J58m5j07J8J5M9o5J04q2P4j88R7P4
6173E1o0K5Kql8Q0M1j38L8j5J2J0n0Q7K5j48K26k05M8j52N8J16Kl3N7K4p8n1P5
6202AQO9k6n9R3N7j8j80M8J39k03L3M6M7j4m1m6R2lrn0Q1r1L9r9J39j3o7L7l1
6232b1L0l0k7Jj1J05j07J36n3l9jp1n7J51rJ1koJ2L7n4l7J07l7P3j26Ko8J72j74
6262i3K32n1j05pL3l5Q8j89O7J23o1j46K39O2j44k6m2K3k4RM5l6L0R6r0j1L2j13
6290i4N4R2K4j24j42J31P3r9N9O8r9P1m9R4j09K8L7k8j11R9M9Po7LJ03m8j9J3
6318A6P6j08n1m2R0J0L7m1q5O4J17j45J8%J69j40Q6j88J58j23J23L3j5Lr6O2m
$$ plain form
6345 24 -145 44 -71 78 21 14 -19 -64 -103 -47 12 37 81 37 133 16 28 45 62 -55 -23 71 -7 -41 -112 -125 -14
6372 -14 -84 73 38 11 -90 -42 -42 -33 2 22 -1 -17 -90 -40 64 -69 -66 -16 32 -6 49 -61 -178 -75 -29 -94 22 -44
6400 -44 -28 -4 22 124 -59 -22 22 152 -78 -1 86 65 118 -38 54 1 -107 -20 -55 -3 -10 16 146 -67 -123 -6
6426 -6 -17 42 -43 27 -61 -92 -14 -167 25 -62 -9 16 -180 -160 11 -71 -70 -39 -11 -33 -29 48 121 47 -4 -118 0 77 36
6455 36 -68 -15 -67 69 48 -17 -112 43 8 20 -14 47 12 -53 51 -2 -66 47 -27 14 -74 -43 -83 -111 0 43 57
6482 57 98 25 -14 16 -68 116 -62 -82 -45 27 79 -138 15 67 0 82 -49 -7 86 77 51 -71 83 7 -118 -12
6508 -12 -68 80 -60 27 81 -18 19 9 -80 -48 45 -37 126 -26 -21 4 138 -66 -20 -100 14 8 142 40 18 86 -102
6535 -102 64 -44 -84 0 -14 -8 91 46 -104 31 71 -30 72 73 -34 -94 115 58 -152 42 16 -116 -22 -13 81 4
$$ packed form
6345B4j69J89j15J49n7pl3m5l9N6N9K5M4m4R6j17J2J7J7j17L2R4p8l4p1j3J11
6372a4p0J57l5k7j01M8%RL5K0k3j6p3N0J04j33LN0M8l8N5j10j17J03M6o5J16o6
6400d4J6K4K6J02j83L7M4J30k30P7Q7k1N3j56R2n3j08Q7l5N2pK6J30k13n6J17
6426fj1N9q5P0q8l1P8j53J92q7N3K5j96K0J71q2JL1K8k2MP7P3p4n1j14J18P7m1
6455C6j04N3n2J36k1o5r5J55l5J2l4O1l5o5J04n3o4J13p4M1q8L1m0k8J11M3J4
6482E7M1p3l9L0q4J84j78k0L7P2N2k17J53N2o7Q2j31M2R3rk6j22J54p6j25J06
6508a2n6J48j40Q7N4r9L7j0q9L2R3q2J63j52NK5J34k04M6q0J14oJ34j02k2O8j88
6535a02J66j08m0Q4j4OR9m5j50J35M0j01J02Jj07o0K09n7k10J94k6j32R4RR4p7
$$ plain form
6561 4 11 63 -55 9 -7 -26 -32 82 20 -17 -6 28 -97 33 -10 163 64 54 -34 -8 -31 -104 -102 -56 -21 -74 -161 57 -8
6590 -8 -8 -44 31 -47 -46 48 -104 -144 -51 127 16 18 22 230 111 3 6 13 22 -88 -3 -177 22 80 -43 -108 -26 -193 -55
6619 -55 4 53 67 -17 67 -75 37 109 6 52 16 -7 26 -134 -100 -28 41 21 83 59 -17 79 60 98 71 22 51 79
6647 79 35 18 52 125 82 -100 -60 77 88 8 -34 122 48 -1 -28 -44 0 -52 -70 7 -88 -21 -129 59 -21 -85 14 -43
6675 -43 -22 -50 -53 14 30 -34 7 -69 61 99 12 -7 34 31 8 93 31 -143 24 -33 -62 108 -139 -21 13 -44 67 -127
6703 -127 161 66 86 40 9 35 58 -1 -87 -16 72 38 -35 -56 -1 -153 -57 46 -21 -7 -59 -127 84 -84 -92 -90 -18 -4
6731 -4 97 74 -24 10 161 20 27 9 -22 -31 -107 21 -6 44 -12 -50 -42 -5 -137 -28 25 -62 6 41 34 -97 28 -43 0
6760 0 100 -45 -44 23 70 79 29 -33 -46 -35 -6 92 -5 15 -36 -141 67 12 93 -4 49 -21 -71 26 12 -12 49 19 -47 -68
$$ packed form
6561DPN2j18O4j6j9oJ14o2l7J1L4j25J30m3J73r9j0q8K6k3p3KM6L5n3q7K18o5
6590h%l6P5p8JR4j52m0R3J78j11KMK08j19j08LPRj10Q5j74J99N8j23o5Q2j67J38
6619e5N9M9J4q4Q4j42J12P2j03M6l6k3L3j60L4P2O9k0O2k4p6R6j9L8k7m9K9K8
6647G9m4j7L4P3m3j82M0J37J1q0m2J56p4m9k7j6M4n2j8P7r5O7j08J88q0o4R9n7
6675d3K1k8lO7J6o4M1p6J30L8q7j9M1lk3Q5o2j74J67n7k9J70k47J18L4n7J11j94
6703a27K88r5K0m6l1K6K3n9q6P1Q8l4p3k1N5j52R6J03o7J4n2o8K11j68qKP2J4
6731dJ01k3r8L4J51j41Pj8l1rp6J28k7N0n6l8QL7j32J09N3q7O8L5pj31J25p1M3
6760@J00j45JO7M7Rn0o2j3J1K9R8r7K0n1j05K08n5Q1r7N3p0n0R7j4k4O1l0o6k1
$$ plain form
6790 -68 103 -98 -63 71 -22 33 -138 -45 12 -100 1 -35 -36 -23 -47 -35 -76 85 49 60 25 4 1 -77 55 5 -84
6817 -84 -64 -5 109 3 -19 -88 -39 -23 47 56 124 70 149 -20 -65 112 -17 5 93 19 4 -23 11 57 -150 72 8
6844 8 67 53 101 65 -46 -15 -3 -81 -99 -26 -106 -42 49 -18 -22 38 -101 35 46 -50 -29 -30 -8 18 -28 -7 -7 -72 10 33 -9
6875 -9 -54 -20 -85 30 112 101 -69 43 -32 93 -42 35 -37 -42 -51 16 56 -6 -1 -56 -30 -1 -21 -57 -92 -39 -137 71 -66
6904 -66 11 -97 -116 -49 -61 -15 -14 12 -64 13 -5 -100 -49 -137 54 113 -85 -109 67 49 -40 19 143 7 125 -23 -31
6931 -31 -26 -44 -70 29 37 -43 -57 -105 -32 -104 15 -89 4 125 -69 -105 -9 -58 149 -79 -85 28 -3 -89 62 -13 -90 86
6959 86 -49 -81 2 1 55 45 -50 -88 -39 -43 -130 -52 32 90 -84 43 -39 -63 77 -75 10 -52 -51 35 -12 -1 -71 47 37
6988 37 79 1 -40 3 150 5 17 37 -88 41 -23 -51 -6 -40 -46 -23 33 81 10 3 6 124 -29 -40 18 -62 -94 -1 122
$$ packed form
6790f8J71k01L5J34r3N5j71R3N7j12J01l6jJ3k4J2m1J61l6J1l5k1lp8J32n0q9
6817h4K0N9J14j06k2o9M9J6P0RO8n4P9j69m5J77j29K2Q8p4j5k7L4M6k07K22o4
6844HN9j4M8l6j11L1J2p8j8P3q0O4R1o7mO0j39J36J1r6K1jK2K6m6K1%o5Q2K3m2
6875im5L4o5J15Q2j1j70J12p5J25j35P7p2nrO7M0o2Nn5K6K9k0l6l5N3r8K08j37
6904f6P7j08j9O7j2M6JK6p6P7j8r5N1q8J91N9j98k4J76j8q9N9J24j36J18j48q
6931c1Nj8k6R9Qq0j4m8P3p2J19j04R3J21j94l6R6m9K07k28oJ13l1q6J51p5p7J76
6959H6j35l2Q3jN4j0r5l8M9mq7P8Q4N8j74J27q2k4J40j52Q5o2JQ6m7J1p0J18j0
6988C7M2p8m1M3J47j45J2K0j25J29o4k8M5l4oK3N6M8p1pLJ18j53j1N8q0l2R3J23
$$ plain form
7017 122 44 0 -62 29 127 -22 17 -85 86 78 4 51 32 88 -50 -67 2 -63 32 32 -32 109 -83 69 98 69 72 -124
7045 -124 4 -84 -7 -18 -89 3 -22 -3 -27 31 -56 -154 -29 69 -96 -22 -93 70 50 37 -10 -123 20 22 10 25 -67
7072 -67 -11 3 87 0 7 25 -24 7 -64 106 81 -18 -46 -49 90 -22 -49 60 -10 27 -70 -60 10 -92 130 -16 -21 55
7100 55 -57 67 -73 61 -72 -48 -98 -2 -71 -15 -14 1 94 38 47 -5 -136 -14 -23 -60 -70 13 -9 126 -49 -53 -46 41
7128 41 185 62 -20 -107 -98 -91 -54 95 -9 -76 97 48 -52 10 -36 -19 50 -13 24 24 -59 -21 -48 28 -6 -112 105 -11
7156 -11 -12 -6 -45 -31 2 -10 -20 35 -5 -27 246 -33 -12 131 12 18 -118 27 -20 -68 122 -33 31 -14 15 80 -42
7183 -42 95 -20 30 -121 -61 -110 -17 -8 23 9 -1 67 29 -84 -34 -11 67 67 -5 4 -52 26 -39 8 -56 -86 -114 -54 72
7212 72 -6 -21 -48 29 11 -51 -52 -133 30 -63 -38 -48 -32 95 -16 50 -90 -20 -109 50 28 -56 -8 -33 73 -13 -97 78
$$ packed form
7017A22p8m4o2R1R8j49L9j02J71qp4M7j9N6j38j7O9o5R5%o4J41j92J52K9k9Lj96
7045a24J28q8P7j1p1R2k5J9k4N8q7r8J25R8j65P4p1J63k0j3m7j13J43Kj2J5r2
7072f7N6J4Q4q7PJ8m9L1p1J70k5r9k8lJ39j12k7J09p0L7r7J0P0j02K22j46nP6
7100E5j12J24j40J34j33K4n0R6o9N6JJ5R3n6Rn2j31J22rl7j0Q3k2J35j75mPQ7
7128D1J44j23q2q7RPL7J49j04o7J73m9j00O2m6J7O9o3L7%q3L8k7P6l4j06K17j16
7156a1jOl9J4L3j2j0N5m0k2K73k79K1J43j19Oj36J45m7m8J90j55O4m5K9O5j22
7183d2J37j15N0j51O0m9R3RL1j4j0O8l8j13N0K3P8%p2Rn6P8o5M7o4l0k8O0J26
7212G2p8j5k7P7j8o2jq1J63r3K5j0J6J27j11O6j40P0q9J59k2q4M8k5J06q6q4J75
$$ plain form
7240 78 -52 -63 -2 9 -103 -162 -41 101 -29 -68 34 1 -8 3 -81 -72 67 42 -18 22 38 128 -71 -63 26 -64 71
7267 71 -86 67 20 -24 2 11 -82 -55 -89 -87 51 8 27 47 17 -8 5 44 -48 6 -50 -3 30 -52 -33 -106 23 -67 -23
7296 -23 -138 -97 -39 -99 144 -163 -8 42 -5 130 -10 30 36 -24 39 -96 77 5 -31 -42 76 -63 -40 107 33
7321 33 -64 -86 -161 11 -40 -74 111 3 60 -6 -21 32 -52 34 43 15 -39 -70 4 -50 145 20 -128 -5 -80 -33 -95
7348 -95 -46 -180 -57 29 14 -32 -25 13 28 -2 28 -22 150 63 -50 27 -68 -27 22 26 -10 -110 20 97 -107 -99 -113 -14
7376 -14 -64 -83 19 -94 35 -58 -139 -64 -18 7 10 31 28 -47 73 31 -37 -31 47 42 -115 27 -12 -32 88 8 144 -17
7404 -17 -63 45 21 -79 58 115 -21 22 -136 60 61 -106 -17 -112 -8 43 -18 56 -65 33 48 9 -5 5 47 -101
7430 -101 -26 62 23 -58 -68 -93 -6 -41 -19 0 95 -46 -78 27 -57 -81 -113 -49 -14 59 -45 45 -50 149 30 -1 -7 -62
$$ packed form
7240G8j30j1O1J1j12n9J21J42j30l9J02l3rJ1q4RJ39k5o0M0J6R0j99QQ9r0J35
7267G1j57J53m7m4K6Rr3K7l4KJ38m3J9K0l0k5J3L9r2N4n6M7L3q2J9p3J29r0M4
7296b3j15M1N8o0K43l07J55N0m7J35j40M0Oo0O3j35J73p2l6j1J18j39K3J47p4
7321C3r7k2p5J72n1l4J85j08N7o6j5N3q4Q6Rk8n4l1P4n4J95j25j48J23p5M7o2
7348i5M9j34J23Q6j5m6PL8J5l0L0n0J72q7j13P7r5M1M9Ml6j00J30P7k04Qj4R9
7376a4n0j9J02j13J29r3q1P5M6K5LK1lp5J20m2o8OP8nj57J42l9k0J20q0J36j61
7404a7m6J08k4j00J37N7j36M3j58J96Jj67Q9r5J04N1o1P4j21R8J5l9j4J0M2j48
7430a01P5Q8l9q1j0k5Q7l5K2J9R5j41l2J05q4k4l2O4L5P3j04R0r5J99j19l1on5
$$ plain form
7458 -62 81 -41 -23 -101 -64 118 -109 -64 -81 58 -5 -39 61 -37 30 63 47 35 -26 -34 34 -76 -63 -84 84 -35
7484 -35 -59 -179 78 -2 -149 -31 61 77 -40 -4 120 -91 -66 -65 -58 -24 -120 80 88 -133 20 -46 -6 15 8 68 -60
7511 -60 -82 -41 -5 -9 -97 51 0 -79 -52 19 -13 -101 11 -76 6 71 -8 -7 -107 73 14 -25 -69 -205 12 -86 -32 -5
7539 -5 -123 133 -86 -76 -34 -97 -12 -83 83 -58 -159 111 -39 59 -91 18 14 -69 81 -102 -34 -70 34 117 10
7564 10 -60 -121 -69 5 -89 -13 -25 -110 -68 -50 88 61 -78 -37 -63 133 66 -95 -45 -124 5 -132 67 -95 -29 93
7590 93 98 -19 -140 -9 41 -13 30 -126 34 69 54 -27 -12 107 -51 -43 47 51 92 -66 40 -11 -42 -29 25 84 -53
7617 -53 -189 -22 -91 -83 -54 -58 42 -86 57 17 -56 100 2 -29 -134 -21 -45 -26 -66 61 34 -61 -72 -17 -49 -9 0
7644 0 -44 74 -17 -5 20 -10 -19 51 35 -26 -1 -25 -2 47 -3 -32 -97 65 -127 27 71 -119 -27 -61 -27 -90 50 35
$$ packed form
7458f2J43j22J8p8L7J82k27M5j7J39o3l4J00r8O7L3j6j2o1qO8j10J3k1J68j19
7484c5k4j20K57q0j47J18R2J6j17L6J24k11K5JPL4r6K00Qk21J53o6M0K1pO0j28
7511f0k2M1L6mq8J48n1p9K7P1l2q8J12q7Q2O5p9Jj00J80n9l9m4j36K17r8N4K7
7539ej18K56k19J0M2o3Q5p1J66j41j01K70j50R8j50J09mq3J50j83O8l6J04Q3j07
7564A0p0o1N2P4r4P6j2q5M2J8J38k7j39M1k6J96o7j61N0p9J29j37J99j62O6J22
7590I3Nj17j21J31N0n4M3j56J60L5j5q1J5J19j58QR0MM1j58J06n1l1J3N4N9j37
7617e3j36J67o9QK9mJ00j28J43m0p3J56r8l1j05J13k4J9m0J27k7r5j1N5l2M0R
7644@m4J18r1J2K5l0rP0j6o1K5k4K3M9n0k9o5J62j92J54M4j90R2l4L4o3J40j5
$$ plain form
7672 35 14 36 42 -82 -43 -84 -2 -39 -36 124 -117 -72 -26 45 44 -109 -52 23 -1 64 -156 42 -2 29 57 -188 -70 -34
7700 -34 113 8 56 6 -11 32 -37 -25 -7 -56 -17 -106 1 -105 -146 -47 -171 -95 -23 -43 31 -93 -21 -97 55 -92
7726 -92 -6 22 -89 70 53 -44 11 25 4 -75 44 -108 115 19 23 20 33 -24 62 60 -60 61 -27 105 12 82 -69
7753 -69 35 30 -62 71 -159 -56 27 -192 67 -150 -2 15 21 -81 -58 -54 -24 -53 41 -150 -73 -67 -28 -45 -63 81 -112
7780 -112 -79 39 -1 80 13 -38 6 82 44 -87 31 -81 -47 11 -130 10 -127 -11 7 -18 -47 -70 1 -78 38
7805 38 -15 -48 29 95 -31 -31 5 46 -155 41 16 -76 -54 -233 18 52 -46 -120 7 106 -14 -17 -26 37 78 -9 30 90
7833 90 -7 68 24 -84 -31 57 -62 -89 -40 -50 -27 25 54 -35 -81 -72 -88 37 19 -21 -16 -4 62 -65 -56 -27 -88 44 -115
7862 -115 -64 12 -150 -41 -132 10 62 9 -47 43 24 1 97 44 -5 1 -20 -13 51 20 -42 -48 92 -10 -64 109 -123 146
$$ packed form
7672C5k1K2Oj24L9m1Q2l7LJ60k41M5M6P1jj53N7P5k4O5k20J98m4L1K8k45J18L6
7700c4J47j05M8n0j7M3o9J2J8m9L9q9J07j06m1R9j24P6P2k0P4j24P2p6J52j47
7726i2Q6K8j11J59j7r7N5J4k1p9J19j52K23r6MlJ3n7Q6kj20J21q8J32r3P0j51
7753f9J04nr2J33k30J03Q3k19K59k17J48J7Oj02K3ML0k9R4j91P7OL9j7j8J44j93
7780a12L3J18m0Q1o7n1M4P6l8j31J18j12L4N8j41J40j37J16J8k5k9k3P1p9J16
7805C8n3l3P7O6j26%L6M1k01J96k5r2K2j79K51L4r8p4J27R9j20lrO3M1q7L9O0
7833I0r7P5m4j08N3Q8j19k7M9j0K3N2K9q9m6Rj6J25j8m0NJ2O6j27RK9o1J32j59
7862a15N1P6j62J09r1J42N2n3n6R0j9k3R6n3m9Ok1PO4l1o2oJ40j02n4J73k32K69
$$ plain form
7890 146 60 -20 95 95 -151 8 39 64 34 9 -72 -75 -5 21 -22 -87 -69 -26 -29 60 -123 50 -110 -38 -136 1 46 -39
7918 -39 36 -41 -58 13 -45 -37 73 18 80 -40 -96 -98 9 36 25 45 -69 51 1 72 -21 16 17 -38 -25 89 -83 1
7946 1 -49 -28 75 38 66 -117 14 145 14 -43 22 39 -95 -97 -5 -95 -147 133 28 18 -61 79 97 82 -72 55
7972 55 -59 0 4 -104 42 -56 -73 56 81 60 63 -93 9 65 -31 -74 -4 -30 -7 -95 57 -187 4 -111 58 22
7998 22 2 -11 -3 -59 39 -12 123 -77 22 -120 -89 -64 -132 -24 -95 98 -38 61 -81 -88 22 -5 -21 -45 -166 17
8024 17 -72 21 -103 -80 65 -41 -39 50 0 110 -40 -29 88 -67 44 78 71 53 -38 57 -111 -22 19 -72 -40 -140
8050 -140 31 3 18 -34 26 70 -132 -51 -26 31 13 -11 69 9 -56 -34 -164 -42 -34 39 -131 -99 73 -56 -53 -57 -96 -84
8078 -84 -36 82 -17 -11 11 104 132 -13 21 0 -19 102 -7 -52 87 -73 51 7 67 -21 -22 -34 -81 -134 -100 -60 -75 48
$$ packed form
7890A46q6q0J15%k46J59L1K5l0k5q1lP0K6m3o5J8M3lQ9j83J73j60P2r8J37M5q5
7918c9P5p7j7P1n8QJ10n5O2j20n6kJ07K7j1K0j14J20n0P1r3L7Jn5J3J14j72Q4
7946An0K1J03l7K8j83J31J31j31n7O5J7j34kR2r0n2K80j05j0p9J40J8j5j54J27
7972E5j14N9Mj08J46r8j7J29K5k1Lj56J02N6r6m3P0k6K3q8J52k44J91j15J69l6
7998B2k0j3Qn6R8n1J35k00R9j42L1K5o8J08p1J93j36R9j42pJ10k7j6k4j21J83
8024A7q9R3j24K3J45j06KQ9n0J10j50J1J17j55J11L4pj8r1R5j68Q9M1r1L2j00
8050a40J71k8J5n2O0M4k02Q1K5N7j8k4Q0o0o5K2j30J22QP3j70L2J72j29Lml9J2
8078h4M8J18r9OK2R3K8j45L4k1j9J21j09m5J39j60J24m4O0q8jj2m7n3L4M0j5J23
$$ plain form
8106 48 -65 -130 15 102 -89 -83 22 -155 -71 64 27 16 1 28 47 -66 -93 5 43 -95 -57 17 -30 78 4 20
8132 20 101 94 49 -18 20 13 -142 -121 -91 -6 47 -43 43 -30 -66 -56 18 -81 -22 35 -30 27 22 60 62 14 -50 10 -23 -68 72
8163 72 -53 -41 -69 59 -73 25 -51 -58 -68 24 -114 -32 -4 3 -53 -6 -78 -76 -27 -75 -57 -56 9 -97 -116 -38 66 -3 -48
8192 -48 -126 -50 -120 -57 28 25 72 -80 68 12 -12 -34 -134 -86 -65 92 -28 -93 104 106 -106 7 17 -18 17 15 30 -25
8220 -25 80 -16 93 -2 -5 95 -53 -13 89 -57 11 62 -118 -20 84 183 -65 -96 -66 128 78 -40 -1 -47 -42 -96
8246 -96 -39 -30 -149 -109 -45 7 -94 88 63 -37 19 51 132 35 -79 -30 -10 -48 59 -50 105 43 -42 -2 81 21 22
8273 22 62 -38 134 -102 164 16 3 41 -169 -43 -24 -61 -10 68 95 -4 -11 -84 -6 -6 11 -95 -31 -64 -82 -155 -71
8300 -71 -14 -4 22 -12 18 -41 -75 57 -174 -35 89 -138 44 91 -19 -65 -8 -46 -25 -192 116 -79 -37 2 91
$$ packed form
8106D8j13o5J45Q7j91OJ05j77Q4J35l7j1j5K7J9j13k7R8L8j38L8P4m7J08p4J6
8132B0Q1pm5o7L8pj55K1L0Q5N3r0Q6p3l6J0P4r9N9N7o5N7nL8Km8o4O0l3m5J40
8163G2j25J2k8J28j32R8p6pj0R2j38Q2K8Pn6M7p2KM9m8J8JO5j06j9P8J04o9m5
8192d8p8P6p0O3Q5lM7j52J48n6k4k2j00M8K1J57j20o5J97Kk12J13J0l5L5kJ5n5
8220b5J05r6J09r5lJ00j48M0J02j46O8N1j80R8J04R9k48l1L0J94n0j18L9m6Nn4
8246i6N7Rj19M0O4N2j01J82k5j00N6L2Q1r7j14M9K0l8J07j09J55o2q5M0Q3o0J
8273B2M0j00J72k36K66j48j3L8k10J26J9l7N1P8K7r9pp3P8%J7j06O4l3j8p3Q4
8300g1N7J0K6l4L0n9l4J32k31J39J24k27J82M7j10m6N7l8K1j67L08j95M2L9Q9
$$ plain form
8325 91 -41 13 -40 0 -73 46 9 41 72 16 29 59 77 67 -32 -60 -34 -180 -111 -109 -40 -63 -154 -147 64 -83 -36 25 -8
8354 -8 40 -83 114 -47 -18 101 -6 35 11 -22 -91 21 -69 -73 -22 38 -4 43 -23 15 -63 -25 -195 -104 11 70 21
8381 21 -80 5 -14 -93 -38 -44 35 -21 -26 -100 7 26 -133 -20 88 -119 -38 116 6 23 -18 105 71 -140 91 112
8407 112 -8 -100 -33 -42 139 -72 -44 14 58 38 -7 -85 -107 -127 29 -57 -77 -103 -36 -79 -107 -9 -20 -67 -7 -63 -3 -136
8435 -136 -81 21 -73 -39 -97 -77 23 -55 -138 -80 30 -92 -46 31 -22 42 11 -5 61 45 13 59 30 44 74 136 40 14
8463 14 84 68 -72 80 17 -60 -37 -63 18 -45 -53 -74 -36 -69 70 -67 -17 21 -28 -105 -43 -63 20 17 -50 58 -25 -138
8491 -138 12 33 21 -42 -135 122 -25 61 -12 74 123 38 -92 91 -25 4 12 6 -19 -112 22 13 15 14 -46 49 23 -32 -128
8520 -128 -4 27 -80 53 11 -8 22 -19 -45 55 -11 -97 -114 46 -44 -3 12 -15 -126 -2 -26 -3 49 -92 -81 -30
$$ packed form
8325I1j32N4n3M0p3J19l7L2L1n6J3L0J8j0r9k8K6j46O9KO9k3r1PK11j47M7O1l3
8354hM8j23J97j61K9J19j07M1k4l3o9J12r0mN1O0m2M7o6L8p8L8j70R1J15N9m9
8381B1j01Q5j9p9N5oP9n6np4J07J9j59J13J08k07Q1J54j10J7m1J23l4k11K31K1
8407A12j20r2O7rJ81k11K8N8M4k0m5p8k2k0J56q6k0k6O7m3k8R8j1m7O0n6O0j33
8435a36N5J02r4L4n8K0J00p8q3N8J10j22M6P7n3O4l1j6O6j6l2M6k9J4L0O2r6k6
8463A4P0j6j40J52o3p7K3k6Q1o3qk1L8l3J39j37N0L8m9p7O2k0Q3lo7J08q3j13
8491a38J50K1j2o3r3K57j47Q6p3Q6M9q5j30J83j16K9Qok5r3J34rKjo0R5k6n5r6
8520a28J24L1j07J33m2j9L0m1k6J00o6q6j7J60r0M1J5k7j11J24k4K3N2j41J1N1
$$ plain form
8546 -30 10 76 53 -26 -24 -34 -25 -19 49 22 -27 -65 -24 -31 59 30 -18 10 -89 -91 53 17 -17 -58 8 -24 -22 -47 -25 -58 -10 51 -29
8579 -29 57 -19 -74 -81 27 59 -12 -58 -171 1 -13 -51 25 -128 -3 -103 -75 94 -47 -142 -21 -25 -20 -53 98 -97
8605 -97 -34 -10 33 -84 -47 59 -108 -59 91 24 25 -6 -115 5 15 53 -59 -82 12 13 23 -54 -34 -39 1 -37 32 -59
8633 -59 -86 -20 22 10 33 -7 69 18 5 -51 69 36 10 79 -3 -36 58 -15 -48 47 -29 -38 -36 -119 87 103 -76 -96 26
8662 26 -86 -45 -39 23 -92 -167 67 -22 -27 -87 -18 -2 30 -143 -78 -16 3 -50 -61 -73 -17 -139 15 -43 -8 -45 -1 15
8690 15 -65 -9 -43 73 -37 8 -66 58 47 30 -50 -46 18 48 16 20 134 39 -57 29 124 15 0 59 -43 60 67 5
8718 5 37 -1 6 93 16 -27 -64 -80 -59 -10 -133 -44 21 -12 3 -5 143 40 -35 -89 37 72 14 -26 -32 35 117 -119 -55 59
8748 59 -86 1 -112 70 -39 -17 20 62 63 -36 -29 -26 -49 50 2 104 -6 -17 -30 -51 51 -42 -59 -94 5 -97 -37 -70
$$ packed form
8546c0M0O6k3p9Kj0ROO8k7m9l8M1pR0k9m8K8r9kJ44l6l4m1O6l2Kk5K2l3M8O1q0
8579b9Q6p6n5pJ08L2p1m6j13J72j4l8P6j53J25j00K8J69j41r5J21mNl3J51j95
8605i7O3K4M3j17L7J06j67M9J50o7Jl1j09J20J0L8j12k3R4JJ0p7K0nM0l8O9r1
8633e9k7O6M2j2K3m0P6n1j3n6J20l3k6O9q2l3R4p3l3R5p6rKq3K06J6j79k0J22
8662B6j12M1OO2j15p5K34q9no0O9J6L2j73O5O2J9n3j1j2N6j22J54n8L5l7M4J6
8690A5q0N6l4J16j10M5p4J24j1j7q0MO4L0l2MJ14r5r6Q6R5j09j5N9j02J03Po2
8718EL2l8PQ7p7m3l7j6K1M9j23Q9O5l3J5qJ48j03p5n4J26L5n8m0oO7Q2k36O4J14
8748E9j45Q7j13J82j09K2L7M2Jr9PLk3R9m8J02j10j1j3k1J02r3j7l5R9j02O0l3
$$ plain form
8776 -70 115 -74 -14 -120 28 -67 -70 -98 29 19 33 -39 87 -89 77 -18 -106 83 53 28 -149 -114 -101 55 31
8801 31 2 22 126 -15 24 -27 18 -75 33 -3 -8 19 0 -148 -79 14 -68 -33 -3 29 20 45 85 -88 -45 165 -67 10
8829 10 -24 52 91 191 -111 -76 42 6 53 0 76 14 -62 102 10 -99 -1 -23 2 -28 -41 28 -59 -15 13 -40 -98 11
8857 11 -91 166 -61 40 58 102 9 -52 17 54 87 91 -89 -84 -50 -6 -66 -6 -28 -18 -27 -29 -119 -4 7 10 26 47 -70
8886 -70 32 -98 76 85 48 -69 -36 25 108 15 11 91 21 28 -16 52 25 29 -72 14 34 -142 -32 78 -7 -13 98 1
8914 1 -57 54 -91 27 -94 -13 36 -8 96 -18 -64 0 -40 -61 104 18 18 57 13 -84 -90 71 18 18 -27 22 -108 -15
8942 -15 -43 -40 -40 39 55 46 38 97 48 -56 -12 -62 -17 84 -102 98 36 -25 -137 -42 -23 85 -27 -130 1 137 50
8969 50 -5 12 -26 -10 -77 -44 73 -22 -49 -41 -58 -116 6 5 -89 22 -37 22 -8 38 -117 51 -67 69 40 118 6
$$ packed form
8776g0J85j89O0j06J48r5lk8J27j0J4p2J26j76J66r5q8J89l0k5j77L5J3J56k4
8801C1k9K0J04j41L9n1M5r3J08l6nK7j9j48O9R3q2L5L0L2rK5M0j73M3K10k32P7
8829A0l4P6L9J00l02L5J18l6M7n3P6o2p6J64r2j09R8k2K5l0j3O9q7M4K8n3n8J09
8857A1j02K57k27J01J8M4r3o1O9L7L3Mj80NL4M4o0O0k2J0rkr0J15J1LJ6K1j17
8886g0J02j30J74Rl7j17L3O1Q3r3mQ0p0Pm4O8k7Mj01Q6K0j76J10J10q5oJ11r7
8914An8J11j45J18j21Q1M9m4J04j14m6O4m0k1J65q6%L9m4r7oJ61n3%m5M9j30R3
8942a5k8L%P9J6rqN9m9j04M4n0M5J01j86K00o2o1j12R5J9J08j12j03J31J36q7
8969E0n5J7l8J6o7L3J17r5k7Qj7n8J22jr4J11n9N9l0M6j55J68j18J36k9P8j12
$$ plain form
8996 6 123 -48 -99 106 -36 64 -80 40 36 -55 91 -52 11 72 -87 -98 33 67 14 -94 -30 81 -97 72
9020 72 11 13 -87 -23 -31 -43 -103 -17 52 -10 -46 -28 -148 -49 12 -121 1 -75 -47 16 -28 -45 -75 24 -108 -84 63 -51
9048 -51 55 22 18 -23 -122 -133 34 -33 -97 0 -45 -61 -22 -66 -104 -47 100 -64 0 14 -35 -45 0 -42 -65 -73 81 4 -4
9077 -4 32 22 -41 4 117 57 -28 53 -78 -55 3 -57 16 -50 -32 -117 -27 10 40 -10 9 44 -44 121 93 -147 -106 28
9105 28 -133 25 -45 70 -66 65 73 -75 -47 27 -171 -92 26 -20 9 1 30 40 68 -130 -2 52 -3 -61 102 81
9131 81 22 13 86 231 39 92 -51 -42 21 46 36 14 17 -65 -130 -30 -60 69 19 -113 -17 -57 24 36 -53 -35 64 -3 -103
9160 -103 -7 -92 -41 28 -44 6 -79 12 -32 114 -24 89 105 -51 103 -20 37 38 71 -36 89 -120 -21 -75 -7 42
9186 42 76 69 -69 15 30 58 -75 -25 -21 -37 -82 29 -129 -1 38 -57 -77 92 -11 21 -59 -41 103 37 -59 -86 -23
$$ packed form
8996FJ17j71n1K05j42J00j44J20mr1J46j43O3O1j59j1J31L4n3j08O4J11j78J69
9020G2o1Kj00O4qj2o0Q6O9o2l6J8j20R9O1j33J22p6K8O3m4j7l0R9j32K4J47j14
9048e1J06l3mm1r9j1J67o7o4R7m5j6L9m4l8N7J47j64O4J4m9j0M5m2k3qJ54p7q
9077dL6j0o3M5J13o0q5Q1j31K3N8o0P3o6J8q5R0L7L0n0J9L5q8J65k8k40M1J34
9105B8j61J58p0J15j36J31Qj48K8P4j98P9J18m6K9qK9J0K8j98J28N4n5n8J63k1
9131H1n9rP3J45j92N3j43RO3K5j0k2Lq2o5J00l0J29n0j32R6m0Q1J2q9J8R9o7j00
9160a03R6q5N1O9p2N0q5R1m4J46j38J13J6j56J54j23N7JL3j07J25k09R9n4O8M9
9186D2L4pj38Q4J5K8j33N0Mj6m5J11j58J28L9r5k0J69j03L2q0J8J44o6r6k7O3
$$ plain form
9213 -23 -39 -13 27 -34 -118 -20 -33 -70 71 12 43 -35 -100 75 -63 -82 0 81 -36 -13 -17 46 -146 66 -44 -57 33
9240 33 -39 -27 -20 25 13 14 -57 -164 25 -3 -176 19 -72 -62 -45 -48 -33 69 -22 15 29 4 53 69 -140 70 11 132
9268 132 74 -37 49 34 127 -47 -31 -81 -6 -46 57 14 10 87 118 160 34 -24 120 43 -13 -65 8 -87 -49 56 -33
9295 -33 65 55 -115 -35 -50 -7 -43 -21 -91 26 48 84 -14 21 88 39 12 -50 -42 55 5 48 -41 -35 87 -97 -29 -37 78
9324 78 32 -38 127 177 -21 -90 -16 86 32 55 31 63 -60 -19 23 45 -24 39 -27 35 -47 43 27 7 -70 -41 -139 -21
9352 -21 -96 12 -107 -118 -78 -62 34 -84 70 16 -85 -52 -18 -55 -48 -27 26 -25 -124 77 110 3 -3 50 79 10 63 -94
9380 -94 49 -14 111 39 -36 -60 -2 -29 -27 8 -105 14 32 -32 -30 -75 -63 -107 -94 38 20 -88 33 -57 11 -24 -59 -45
9408 -45 -8 21 8 11 65 26 48 43 149 50 -16 -24 45 -44 -5 -69 -3 31 46 76 93 -69 20 84 -11 -52 -4 23 -11 19 -72
$$ packed form
9213b3j6K6M0o1q4R8j3l7J41n9L1p8o5J75j38j9Q2Q1j17K3mO3j92K12j10j3R0
9240C3p2J2PM5j2Jp1j07J89k8j73J95r1J0J7lJ5J02r1L7J4k5M9J6k09K10n9J21
9268A32n8j11Q6j5R3j74J6n0P5m0J03m3mP7L1M2j26n8J44p7n6n2P3r5L8J05q9
9295c3R8j0j70Q0j5M3l6K2p0J17K2L6r8L5O7m9k7o2QR7n0M3q9OJ22j84O8qJ15
9324G8m6p0J65N0j98o9P4J02n4K3k4L2j23M1M2K2o9O3o6O2q2R0j6k0p7K9r8J18
9352b1p5J08j19j1M0J6R6j18J54n4j01L3L4l7PK1N3n1r9K01L3j07oN3K9o9N3j57
9380i4J43o3J25p2p5k4N8k7KL5j13J19J8o4Km5J2m4J3J32j8j08J21r0O8l5l5J4
9408d5L7K9j3LN4l9K2nJ06r9o6qO9q9L9o4O6L4J5L0J7j62Q9O4r5m1M8K7l4L0r1
$$ plain form
9439 -72 -48 3 40 1 1 29 -104 -24 15 48 92 -97 32 -72 57 0 -31 8 26 -67 -73 68 138 12 59 8 -105
9466 -105 -19 69 48 -77 4 -8 -16 42 -67 46 -49 25 -44 -32 64 -59 -123 111 -21 -5 1 -69 -18 78 14 -31 50 80
9494 80 -32 -74 -102 -86 67 -102 -57 -7 93 -60 -45 -23 -106 39 37 33 21 6 -55 106 50 22 -6 2 -6 28 99 -1
9522 -1 37 43 46 -88 99 5 13 -74 32 37 51 -104 15 -168 -61 -34 12 32 -64 -65 -2 2 -17 -12 -96 53 -42 31 88 -90
9552 -90 -34 -130 73 -120 59 7 36 96 4 -89 -12 -95 5 95 17 107 61 84 60 -54 67 16 7 -29 30 54 14 -59
9580 -59 60 136 71 -35 -107 30 39 -21 11 -132 -3 -24 12 71 -104 124 19 52 -26 -134 -25 -67 -73 -54 -63 -42 36
9607 36 -42 107 -3 20 52 1 -2 105 11 10 -42 -28 -41 62 -75 -41 10 57 -52 1 -33 -166 -170 19 -68 82 80 57
9635 57 -58 -5 31 -50 26 -10 -50 -101 -87 -66 117 -37 -62 -25 -135 -62 14 72 -40 -107 190 -103 41 -3 19 -4
$$ packed form
9439g2K4N1L7l9%K8j33Q0L9L3M4j89J29j04J29n7l1L9J8r3oJ41P0j26M7n1j13
9466a05Q6Q8k1j25Q1j2qN8j09J13r5P4o9J2R6j23o4K34j32J6Op0N1R6o4m5Q1L0
9494H0j12m2k8J6J53j69M5N0J00j53J5K2q3J45kmj2j5o1J61n6k8k8QqL4P1j00
9522aL8OLj34J87r4Qq7J06NJ4j55J19j83J07K7M6K0r6jO3Mj9Nq4J49r5P3N7j78
9552i0N6r6K03j93J79n2K9O0r2r3P7q3J00R0p8R0m6K3k4j14J21n1rl6N9K4m0p3
9580e9J19P6o5j06p2J37Ro0L2j43J29k1L6N9j75K28j05L3p8j08J09m2oJ9rK1P8
9607C6p8J49j10K3L2n1lJ07r4jn2J4j3J03j37L4N1M7j09N3l4j33mJ89q7J50kk3
9635E7j15N3L6q1P6l6m0n1J4K1J83j54k5L7j10P3P6N8j12o7K97k93J44m4K2k3
$$ plain form
9661 -4 -73 -120 -39 68 -50 -106 28 -88 -24 -49 9 -67 -95 66 18 23 -3 86 22 3 -129 7 -29 60 -93 -36 -38 -21
9689 -21 -1 41 -96 14 -141 -126 -71 -5 -32 -67 -133 38 8 -27 49 -17 4 45 67 49 -87 -23 61 39 86 -38 -82
9716 -82 -4 -90 -16 94 -139 -58 -75 29 31 -101 -41 -19 -22 -150 61 -107 -89 -67 -68 -124 9 45 -3 -100 -22 -100 -35 53
9744 53 -10 -61 -27 -7 126 9 25 91 34 -71 -5 -58 26 36 71 19 -44 -20 10 -70 111 20 37 -57 -80 73 -9 -33
9772 -33 86 29 -36 -52 -144 75 6 -70 -15 -45 6 -58 -48 23 70 5 -73 15 57 -79 -38 -3 26 -1 -12 -72 0 71 -102
9801 -102 58 71 -48 -110 -46 -26 83 19 -38 -26 101 -37 4 43 51 35 25 129 -48 -12 -28 -64 -34 -4 -139 46
9827 46 35 -56 -85 66 -40 -33 1 14 -103 -59 -52 44 -10 -23 1 18 -63 -29 -242 5 -4 19 55 56 -8 70 -3 -12 83 26
9857 26 -25 -73 -39 -46 37 39 39 -29 -27 69 -23 2 -38 51 -32 -99 -77 -8 -3 -58 -82 41 40 -85 -106 -61 -129 -114 -34 -61 52 -65
$$ packed form
9661do9m7Q1J07j18n6J34j16O4k5N8p6k8J61m8Nk6Q9o4j9j32J36l6Q9j53N7kJ7
9689b1K0M2j37J10j55J5N5O6k7l5o6J71l0l5P6o6K1M1K2j8j36O4Q4k2M7j24m4
9716h2P8q6P4J10k33Q1j7J04Kj32O0K2lj28K11j68J8K2jn6J33L6m8r7P8p8O5Q8
9744E3o3n1L4K0J33j17J6O6n7j05O6n3Q4J0L5n2o3K4L0q0J81r1J7r4k3J53q2k4
9772c3J19n7o5j6r2K19o9p6N5l0N1o4J0P1M7o5p8Q8M2j36M1L5K9k7j1o0P2P1j73
9801a02J60J3j19o2O4K0J09o4n7J2J27j38M1L9Qj6j0J04j77L6j6l6L0L0j35J85
9827D6j1r1k9J51j06PL4J3j17M4PR6n4j3K4J7q1L4k13K47rK3L6Jo4P8p3rR5n7
9857B6n1m8L4pQ3K%o8KR6r2K5m0Q9q3o7K2O9Nn5k4J23jj25k1M5o8J5Q0k7J13j17
$$ plain form
9889 -65 -27 102 -52 -18 81 15 113 37 -45 -44 -51 -17 17 -104 30 45 9 6 -44 -105 -156 56 -46 38 -75 -84 41 -76
9917 -76 104 -29 -136 53 -79 27 9 -103 -43 -30 6 16 -71 -70 -34 -113 -102 -8 -59 12 9 -20 72 84 -40 77 -21
9944 -21 -32 -45 -17 111 -10 -114 -30 7 37 -38 27 8 -30 -161 8 -20 -25 110 -60 -6 -80 -11 -100 -82 -141 -183 -44
9971 -44 18 -99 58 -82 3 -4 -31 42 -39 -100 -27 -13 -94 -5 71 104 8 22 -62 182 -10 88 -66 3 36 -27 117
9998 117 98 28 -66 -29 -4 -58 120 37 -75 29 8 23 10 101 30 -63 -86 159 36 -39 36 -3 18 -81 72 4 -43
10025 -43 -48 -7 -80 -32 16 -27 -19 -22 -69 -79 -77 -21 -56 -28 72 -11 3 58 155 13 -6 -37 38 16 95 92 7 2 51 43 34 6 22
10058 22 50 70 -38 -104 -13 -34 -19 53 25 -7 2 26 -14 14 41 9 -55 -34 154 102 91 -4 -50 -74 -141 -74 -30 -13 -16 -56
10088 -56 1 -93 29 73 -43 -40 11 39 -39 95 26 77 -17 93 28 -65 -37 152 -73 -68 -15 13 14 14 -19 17 -43 -113 83
$$ packed form
9889f5L8J29j54L4R9o6R8p6q2JpL4L4j21J34J5l6ln0o1n1K12j02Q4j13rJ25j17
9917g6J80j33j07J89j32J06j8j12O0J3L6J0q7JL6p9J1R4n1P1lk9R2J2j24J17r8
9944b1j1j3K8J28j21j04Q4L7L0p5O5j9l8j31J69k8nJ35j70N4p4O9q9J8n9m2J39
9971d4O2j17J57j40Q5pk7P3q1o1P3J4q1Q9P6L3r6J4q4K44j92R8j54O9L3o3J44
9998A17j9p0r4L7K5n4J78q3j12J04k1J5j3R1p1r3k3K45j23p5P5l9K1r9J53o8m7
10025d3nM1p3M8M8m3Qlm7j0KN6l5K8J00q3J4N5R7j42j9l1P5k2P9lq5nM9qrk8J6
10058B2K8K0j08o6R1k1J5P2k8l2RK4m0K8K7l2o4K1J88n2j1r5m6k4o7O7M4J7lm0
10088e6N7r4J22M4j16LN1K8p8J34o9N1r4J10o5r3K8J89k25NN3K8J%l3L6o0p0J96
$$ plain form
10117 83 -92 -5 -5 -72 -154 6 131 108 31 -19 2 33 22 117 -10 -68 20 -59 -23 169 82 -47 7 38 0 -33 -37 -95
10145 -95 -134 133 110 -49 -5 15 -207 -98 95 60 -1 33 50 3 -54 -22 -17 53 -30 -28 146 61 48 -26 77 -154 23
10172 23 -142 166 -3 41 -33 -45 23 10 -47 -54 -94 6 -29 70 1 64 -9 -44 68 -8 -122 57 -23 -90 97 -19
10198 -19 10 -54 -14 -98 -30 -57 7 28 -68 94 -13 9 -86 31 -121 -81 40 10 -13 -41 10 -10 78 -51 -2 131
10224 131 -33 41 -20 44 21 -12 73 64 53 32 -55 12 -24 -8 -75 -7 45 54 -23 22 188 -75 -12 -10 46 -46 -36 -19 1
10253 1 -45 17 -77 -16 -82 38 -45 -150 37 -18 -38 -19 -67 -78 -2 -26 -15 -95 -128 146 -2 65 1 -39 -52 25 30 41
10281 41 -7 80 -109 64 -52 -15 -8 25 82 -81 110 -45 -156 -56 -17 -31 -37 7 -75 -39 55 49 -72 -103 16 14 -194
10308 -194 -1 -171 -64 60 -84 33 8 -38 -9 -6 -6 42 -8 36 11 81 194 56 -12 -70 -4 -107 -3 -44 2
$$ packed form
10117H3j75Q7%o7q2J60J25k3p7n0K1L1j1R5j27n8Q8p9L6J92q7j29N4L1l8l3mn8
10145i5l9K67k3j59M4K0k22J09J93l5o1L4J7m7n7L2NP0q3KJ74q5j3p4J03k31J77
10172B3j65L08j69M4p4j2O8j3n7pm0J00l5R9o9O3p3l5J12p6j14J79q0o7J87j16
10198a9K9o4M0q4O8k7O4K1r6J62j07K2r5J17j52M0J21l0k3k8N1k0Q8j29M9J33
10224A31j64P4o1O4k3l3Q5rj1k1q7O7l6J6o7O8N2Rp7M5J66k63O3KN6r2J0J7K0
10253Am6O2r4O1o6J20q3j05J87n5k0J9m8j1P6k4J1q0l3K74j48O7o4m0j3P7NJ1
10281D1m8Q7j89J73j16L7PL3N7j63J91j55j11J00L9j4oM4q2L6R4oj21l1J19kk08
10308a94J93j70J07J24j44J17k5m6K9L%M8n0M4k5P0J13j38o8n8O6j03J04m1M6
$$ plain form
10333 2 -59 93 87 123 0 38 4 -2 -10 23 -12 -34 -2 24 -35 103 -43 20 -87 -21 -109 -12 -23 -62 6 14 -120 -115 -18 66
10363 66 -50 67 19 19 -122 -122 -21 78 54 19 36 -18 -14 102 5 166 27 -49 23 53 139 83 25 -17 9 -22 -54 -9
10391 -9 38 -66 -99 -101 -31 -21 177 10 -46 -37 36 -99 32 77 35 -154 -70 -24 18 -73 -43 -116 -12 15 69 -52 -79
10418 -79 -3 13 -17 -25 -58 -112 48 -16 6 72 -135 -64 16 13 -65 -37 -26 -22 20 29 -64 3 15 -94 129 -15 -50 -64 -48
10447 -48 -1 -44 -56 -37 -42 27 -51 -33 12 -21 -78 95 55 3 -32 -71 38 -29 -83 80 -28 -29 -28 67 -95 20 -114 14
10475 14 -80 -111 23 31 -18 -91 -3 14 115 -11 63 39 16 21 -104 -39 5 -164 -96 73 172 30 -16 51 -121 75
10501 75 -3 -53 -16 58 -23 -26 20 -164 -97 -9 -6 -150 42 -42 7 -2 -62 -46 -60 35 -21 17 -28 -19 -56 -73 38 -60 67
10530 67 47 130 112 -47 -76 -3 -28 -39 46 6 3 -101 12 29 -81 -5 -4 -118 120 37 10 62 -81 109 -121 135
$$ packed form
10333Bo1J52oL6j23L8l4oqL3l5k2L2K6n9J38j46O3j07O6q8R7j1l9O8Qj34NR7Q4
10363F6j16J17m8%j41%J01R9k4l5J7n4MJ16r7J61j39p6P2L0Q6n6n8m2K6l1l2M5
10391iM7j04l3kP0J0J98j67n6RP3j35J31M5m2j89Q4M6M2r1L0p3J04K7N4j21k7
10418g9P6J6l0ql3n4J60o4K2O6k07P1Q0lp8K8J1MM2Rr3O7J2j09K23j44l5j4J6
10447d8M7m3j2J9nO9p8J8M5l3n7J73m0n2l5l9J09o7n4J63j08jJR5j62J15j34J28
10475A4r4l1J34Qm9p3Q8J7J01j26P4k4k3Nj25O5M4j69O8J69R9j42m6O7j72J96
10501G5p8n0L7P4q1lM6j84O7Q8Lj44J92q4M9ro0J6j4R5n6L8m5Rl7j7J11r8J27
10530F7k0Q3j8j59k9P3k5j1Q5m0lj04J13J7j10P6Jj14K38q3k7N2j43J90k30K56
$$ plain form
10556 135 -81 -92 -23 -31 51 -29 -64 -4 60 58 63 35 49 45 -30 -4 -5 11 95 -16 -36 -11 26 74 85 -102 28 -47 62
10585 62 -53 40 -32 -18 -7 54 -43 35 -30 59 30 -58 -35 -6 -40 25 -14 -19 88 -97 -32 54 49 -75 -42 10 -76 42
10613 42 2 23 73 -30 6 49 16 -156 10 -76 43 76 -9 -55 -116 -177 47 -8 -52 -59 -19 -72 26 13 36 22 -39 -19
10641 -19 -85 -69 18 8 -54 19 33 -85 -48 44 -66 41 -58 -108 36 -83 -130 24 -59 84 29 46 84 61 -41 -56
10667 -56 -11 -40 -49 52 40 -45 103 6 -151 -83 -12 -11 -10 -38 -23 65 26 -6 -12 -117 18 -51 21 31 80 36 1 -86 -114
10696 -114 -102 59 -29 -33 37 74 -50 -81 -86 -66 -47 -14 -38 -38 3 -44 -6 1 -107 29 33 44 46 135 99 21 34 -58 -107 -61
10726 -61 103 18 64 -175 13 -46 58 -73 121 25 -80 67 -85 -56 -72 -23 -51 -115 -62 4 -45 105 46 -74
10750 -74 -27 -104 -6 37 -29 80 89 84 58 -78 21 -24 35 20 12 46 -94 -94 5 53 64 -80 39 -3 48 -5 -140 -48 -33
$$ packed form
10556A35k16j1O9qQ2q0l5O0O4kNk8J4mp5K6jJ6Q4j11k0K5L7M8J1j87J30p5J09
10585F2j15R3p2J4J1O1r7P8o5Q9k9q8K3K9l4O5l9nJ07j85O5Q6nj24L3N2q6J18
10613D2m0K1N0j03L6M3l3j72J66q6J19L3q5m6o1o1K24n5m4pM0n3R8j3K3j4o1K0
10641a9o6J6Q7j0o2P3J4j18L7R2j10J07r9n0J44j19m7J54q3J43n5J7L8k3j02j5
10667e6M5k9rJ01j2q5J48r7j57O8P1JJk8J5Q8l9l2oj05J35o9P2J0M9m4l5q7k8
10696a14J2J61q8mP0L7j24l1nK0J9L3k4%M1m7L8Pj08J36MJ1KQ9l6p8J3r2m9M6
10726f1J64q5M6k39J88n9J04j31J94r6j05J47j52K9j6M9k8o4N3O6m9J50n9j20
10750g4M7p7R8M3o6J09Rnk6j36R9m5N9j5qL4j40%R9M8J1j44J19m2N1n3j35R2J5
$$ plain form
10779 -33 102 -84 -31 -48 31 -128 -50 -69 -68 -12 72 -42 -93 5 -92 -6 36 -1 -39 -68 18 -61 -3 57 147 -138 174
10806 174 72 4 32 61 -80 8 -77 21 -29 -35 -74 -145 73 -95 -11 208 139 56 -6 -58 26 52 -42 1 -44 37 82
10833 82 -40 -83 75 78 -20 -66 25 0 -46 6 -71 25 70 60 79 45 -29 118 -6 97 -22 -7 -16 29 -155 -58 -69
10860 -69 -83 -19 9 0 -144 -72 -4 -67 -32 7 59 -41 -30 71 8 44 -50 135 -23 -56 3 34 76 62 37 159 0
10887 0 -50 -18 48 132 -91 40 25 71 -35 -49 -109 13 -42 50 67 18 31 -90 67 67 -36 65 -17 32 52 -35 -55
10914 -55 -2 -45 45 29 -92 14 7 -1 -146 -63 -7 -147 -18 -98 -68 -50 40 -85 -77 8 -112 19 -48 57 -99 -29
10940 -29 -60 -93 1 -77 73 6 85 -62 44 -25 37 78 -8 156 92 -62 42 74 10 11 85 69 -99 -135 -7 -51
10966 -51 25 -5 82 -109 -101 63 -15 31 108 -73 -57 -79 -27 -17 -15 -105 120 -24 -89 26 -34 -83 -1 -15 40 -34 -70 42
$$ packed form
10779c3J35j86N3j7P9j59P8j9JN6Q4j14n1R8r7Q6M2l7l8k9Q6p9N8O0R0k85L12
10806A74j02o8K8K9j41Q8q5R8n0ol9p1K18j68Q4K19o9q3o2n2Q4K6r4M3m5Q1M5
10833H2j22m3J58Lr8m6R1k5m6N2p7R6M5j0J9l4p4J47j24J03j19J5rM5j84R7j1
10860f9j4O4K8rj44P2O8o3L5L9N2j00J1J01o3L6r4J85j58l3N9L1M2j4k5J22j59
10887@n0L2O6Q4k23J31j5M6j06j4o0J22n5R2J7m9J3j21J57%j03J01q2M9K0q7k0
10914e5N3m3R0j6j21J06pqj45Q3N6j40J29q0L0J8R0j25QQ5j20J31o7J05j56P0
10940b9l1l3R4p8J50o7P9j47J06o9O2M1q6J64o4j54J04L2o4JP4j6j68l6J28m4
10966e1P6l0Q7j91QJ64p8M6P7j81J6k2N2J0Kr0K25j44o5J15o0m9Q2j4N5p4l6J12
$$ plain form
10994 42 26 28 -75 15 3 17 60 -162 -60 51 22 37 -113 91 27 -19 -78 -79 9 -205 53 35 36 16 25 -4 -57 29
11022 29 -17 5 35 -83 -39 -56 -112 -83 -34 4 -26 -33 44 -38 -34 91 -107 16 -24 8 37 -27 82 -50 -14 31 -46 63
11050 63 17 117 116 17 -3 -48 69 -79 -38 -68 8 43 64 -29 -50 4 47 -25 -29 -112 -104 -29 1 -14 108 85 -55 -45 -130
11079 -130 -190 -62 44 132 -78 -96 57 102 86 -89 67 -28 -81 -30 -84 -86 92 -8 66 83 28 53 120 100 -112
11104 -112 38 -57 5 -55 -84 56 -7 30 -13 -17 -100 -1 -27 66 -13 -87 26 68 -18 -145 -121 -67 -93 -8 2 35 20 -57
11132 -57 32 2 28 -37 -19 -93 115 58 21 16 -14 129 -82 42 -18 45 62 20 26 77 48 158 211 -19 -17 41 38 -77
11160 -77 -88 -11 -27 63 49 -9 -67 27 34 -9 -52 -15 18 -30 -10 13 47 -86 -65 7 1 54 -4 44 -147 -10 58 -165 41
11189 41 -34 -1 -51 -61 -53 -97 -10 70 -8 10 129 27 135 164 135 0 -11 41 15 25 -102 -70 -42 -58 -40 -4 -109
$$ packed form
10994D2j6Kj03R0j2J4M3k22J02J11k9J5j50K04o4m6n9jQ8k14K58j8Jk0Rk9n3Q6
11022B9m6K2L0j18M4j7n6K9M9L8l0pP7q2MJ25j98J23m0L2K9o4J09j32L6M5p7J09
11050F3m6J00jr9k0m5J17j48M1l0P6L5K1r3k1N4M3p2mq3QP5L0j5J22k3j40J0q5
11079a30o0J28J06Q8k10j8J53M5j6j75J56r5n3N1n4kJ78j00P4J7n5K5O7k0k12
11104a12J50r5O2o0k9J40o3L7m3mq3R9k6R3p9p4J13M2q6j27K4N4k6Q5J0L3j5p7
11132e7Q9l0K6o5J8p4K08n7l7nl0J43k11J24o0O3J7m2ON1k9J10N3k30KN8lj15
11160g7j1P7j6R0j4n8n8R4Pm3m3L7L3m8K0K3L4j33K1P2oN3n8M8j91J37O8k23K06
11189D1p5L3n0j0Qm4Q7Q0p8J8J19j02J08K9k9j35j1N2k6J0j27L2K8j6J8L6j05
$$ plain form
11216 -109 -2 -134 87 -61 -101 88 -29 45 58 5 141 53 109 -41 157 131 95 -51 -7 34 -45 67 170
11239 170 -51 -23 20 -27 -49 157 129 124 76 93 87 -96 71 6 -150 13 -51 -75 118 -18 86 37 -57 89 -19
11264 -19 20 1 -138 16 62 56 -90 -49 29 30 34 -19 -8 40 -61 -38 27 -107 -35 -37 57 47 32 20 31 -29 42 -25 -75
11293 -75 5 -95 114 76 -61 66 127 -23 -65 -50 106 -85 -81 23 -30 -189 67 28 90 -40 123 -65 51
11316 51 -1 -52 -14 20 3 -64 84 -47 15 -67 -62 -44 93 -93 -4 -36 116 -29 52 46 -12 -29 -2 -97 15 54 146
11343 146 51 -132 130 -63 60 -66 -52 -92 37 -83 -107 -36 18 54 122 -2 -172 -31 -30 27 -63 14 24 -77
11367 -77 -69 116 41 16 38 50 -26 63 -12 32 82 -13 32 25 61 18 -7 68 30 27 -66 -41 12 25 1 -13 147 27 -21 1
11397 1 180 84 4 75 -37 69 56 59 -96 -73 -38 -9 35 -36 117 138 -59 -75 91 51 -74 96 -7 7 -9 -29
$$ packed form
11216a09J07j32K21j48m0J89j17P4J3n3J36q8N6j50J98k6l6j46M4M1p9J12J03
11239A70k21K8M3m7k2K06k8nm8J7oj83J67o5j56J63o4k4J93j36J04m9r4J46j08
11264a9L9j9j39J54M6oj46M1P8JMn3J1M8j01K3O5j34P2kR4j0j5j2J1o0P1o7n0
11293g5Q0j00K09l8j37J27O1j50m2J5J56j91MJ04n3j59K56l9O2j30J63j88J16
11316E1n2n1L8L4j7o7J48j31O2q2NJ8J37j86Q9l2J52j45Q1on8j7K7r5J12L9R2
11343A46r5j83K62j93J23j26J4m0J29j20k4P1N4L6O8j24j70J41JN7r0P7J0j01
11367g7QJ85p5k5K2J2p6Q9p5M4N0r5M5pL6m3k5P5l8lr3K5N3J3k4j4J60j20m8K2
11397AJ79r6q0P1j12J06j3Lj55K3L5K9M4p1J53K1j97j6J66m0j25J70j03J4j6k0
$$ plain form
11423 -29 97 123 72 -30 92 -36 -11 69 42 32 -29 40 93 44 -24 -19 15 -47 -70 -8 31 93 -49 -24 -72 45 -24
11450 -24 -111 -26 -8 -14 -36 40 59 -18 -7 -48 6 3 -33 -103 -29 75 -54 -14 -7 -22 91 26 -87 -16 62 -117 44 -77
11478 -77 61 91 44 62 88 -23 19 -135 41 -5 56 78 85 -54 -25 -64 47 98 -49 -5 -160 -28 53 154 -25
11503 -25 -149 -46 40 -44 -24 -81 71 -14 65 -11 -29 120 44 145 -7 -14 62 29 23 74 15 70 -2 107 34 6 16
11530 16 -24 -24 -39 149 40 101 92 -17 6 22 -80 85 -102 8 -34 96 30 106 -48 5 42 28 100 -66 25 56
11556 56 78 -123 -25 -6 31 -151 -115 -10 102 -53 17 -81 -12 71 -50 -81 51 14 -8 -15 -67 87 44 95 53 202
11582 202 79 -116 -54 -12 -82 3 60 40 13 -6 -77 -30 15 -24 -98 -49 -42 60 8 54 -62 -1 28 -76 -21 5 92
11609 92 -95 -52 -6 -86 -21 113 -94 -147 104 -106 84 -35 -13 73 -61 48 52 -23 68 31 -15 45 -24 -64 -27 -94
$$ packed form
11423b9J26K6n1j02J22j28K5Q0k7j0o1O9N3m9o8NL4o2k3O2L9O2j42K5m8J17o9
11450b4q7Q5J8ok2P6J9p7J1m1N4ll6p0P4J04j29M0Pj5J13o5j13P1P8j79J61j21
11478g7J38L0m7J8K6j11M2j54J76m6O1K2Pj39K9l9J11N1j47M4j55J32Q1J01j79
11503b5j24J03Q6q4K0n7J52q5P9p6j8J49p6J01j52pP6l3oN1n9N5p2J09p3k8J0
11530A6m0%j5J88j09O1rj09K3J6j02J65j87J10m2J30o6P6j54N3L7j4P2j66R1L1
11556E6K2k01R8J9L7j82L6J05J12j55P0r8O9Q3j21l1J32l7k2pn2J54m3N1m2J49
11582B02j23j95O2M2p0Q5N7k0k7j9p1M7M5l9p4M9PJ02n2M6j16O1K9j04N5K6Q7
11609I2j87M3M6q0O5J34k07n3K51k10J90j19K2Q6j34J09Mp5R1l7m6O0o9m0L7o7
$$ plain form
11635 -94 59 50 44 -108 -99 -9 139 61 36 -95 63 -37 15 -95 6 124 -37 -102 32 74 3 -26 -83 -105 -53 -18
11661 -18 19 -134 -54 -37 -49 27 -45 55 63 -48 -51 72 -67 136 -18 -5 95 86 15 64 -59 7 -15 100 78 149
11687 149 82 48 -98 -109 6 -108 29 31 -46 46 -17 10 47 -170 -58 -19 -14 33 -43 99 -79 -9 -11 -102 -43 98
11713 98 -1 -17 -79 -44 -28 -56 -50 -205 -38 -2 72 -87 -32 53 36 -25 79 51 -24 37 26 -49 -79 -9 -65 -54 -68 -71 11
11742 11 55 -36 22 -145 -36 102 40 29 -11 12 3 86 73 114 -106 -58 56 -49 40 126 21 -44 -31 91 -13 44
11768 44 68 88 3 -17 27 4 9 36 137 -26 -5 53 56 -17 -26 128 -43 -168 -14 -118 -20 133 -36 -40 -128 58 -77
11795 -77 6 78 -12 -80 58 52 3 16 -32 10 -38 93 -104 49 40 52 136 -11 -16 -34 81 -10 93 -77 -3 108 -152
11822 -152 -55 -127 -56 39 -48 18 -69 41 71 3 55 131 -18 -92 -27 -53 -17 28 -91 54 -61 -44 -57 100 -5 40
$$ packed form
11635i4J53roj52RR0J48p8k5j31J58j00N2j10J01J18j61o5J34M2p1k9n7k2N2L5
11661a8L7j53Q0J7j2P6p2J00Qj11lJ23j39K03j54J3J00rp1M9j23O6k2J15k2P1
11687A49o7l4j46j1J15j14J37Kp7R2o3K7L7k17J12L9NM7p6J42j78P0kr1N9J41
11713I8r9j6o2L5J6k8Oj55J67L6P4j59N5Q5j7o1J04k8p5O1j1p5l0P0n6J1j4lQ2
11742A1M4r1N8j67J09J38o2j1m0K3rQ3j3M1k20M8J14j05Q9Q6j05o5J3J22j04N7
11768D4K4K0q5k0M4k3NK7J01j63K1N8Lp3rJ54j71j25J54j04R8J53j69mq8J86j35
11795g7Q3P2r0o8J38om9J3m8M2m8J31j97J53rJ2Q4j47nj8J15r1J03j70P4J11k60
11822a52R7p2P1R5q7O6q7J10L0o8N2P6j49p4O5k6L6M5j19J45j15J7j3J57j05M5
$$ plain form
11848 40 -22 -4 30 -42 -18 -66 -29 58 -34 -42 89 9 -28 -55 93 -72 -20 178 48 2 66 -77 -84 10 -79 47 30
11875 30 5 -96 -24 45 -65 -71 -44 -53 -34 66 10 -23 -62 64 -117 -23 -10 -10 51 -50 -25 -41 43 -9 -51 -11 -24 -58
11903 -58 -45 33 -18 69 9 28 -65 -10 102 169 152 62 86 5 146 -6 -21 26 4 80 -60 101 18 -25 7 -77 13
11930 13 -65 105 -69 -33 -10 21 129 4 10 39 0 -3 28 -23 -75 -17 18 25 17 114 52 136 -50 34 58 -28 -47 -12 27
11959 27 71 77 82 141 59 38 -113 -31 34 90 -24 79 69 1 -67 9 86 87 -84 -78 84 -34 -88 212 15 -63 25 -188
11987 -188 -43 18 -82 -52 -140 -69 78 13 34 -5 -153 19 -41 68 -37 -132 53 -62 80 -51 44 -9 43 91
12011 91 75 -16 -23 57 46 -102 35 28 22 -155 -57 -109 12 -63 32 67 -36 21 -1 -5 -47 -39 -3 25 -86 101 -100 -46
12039 -46 -80 10 16 -31 85 -21 4 36 -111 56 24 -107 27 -25 -44 17 -4 -11 -35 67 -80 35 123 -27 59 0
$$ packed form
11848D0o2J8L4p2K4m8L7Q7r2qJ31q0l7k7J48j65N2J98j30m6O4j43pR4q9J26j7
11875C0k5j01P2O9j10oK7rJ9J00n6l3l9J26j81R4J3%O1j01K5j6Q4n2m2M0j3l4
11903e8J3P8n1Q7o0J9r3N5J12O7j7r0K4q1J41j52j5M7k2P6j40J61q3m3L2q4R0
11930A3p8J70j74L6K3L1J08j25OK9l9lL1n1n2N8L5PqR7o2Q4j86Q4K4q6j9L5L9
11959B7M4ONN9q2k1j51Q2O5N6j14J03j0o8o8P6P7Jj71OJ62j18n4L00j97p8Q8k13
11987a88J45O1j00L0q8P1J47o5K1l9j48J72o0J09j05r5J85j15J42j31R5n3N2M8
12011I1j6r1pQ0j1j48J37poj77R8n2J21p5R5L5j03N7k2mm2QL6K8j11J87k01N4
12039d6l4R0Om7J16j06K5L2j47J67l2j31J34n2j9O1k1pk4J02j47J15Q8j50Q6n9
$$ plain form
12065 0 47 -177 -17 34 -59 140 -67 -83 -238 -23 -51 -123 -29 4 60 -7 30 -36 -5 -44 -90 -38 -6 -49 42 9 49
12092 49 -44 -78 36 77 37 -31 -78 -81 14 -4 5 -67 51 -50 29 44 69 81 -20 -107 14 -105 -1 -75 66 -9 -67
12119 -67 -103 37 -20 -109 29 -30 -99 18 -5 -67 12 -32 71 -4 -6 69 -45 68 -75 21 89 -25 63 -56 53
12144 53 28 -24 141 -14 -32 -23 44 -34 -50 4 139 55 75 78 57 -48 141 75 -24 2 -103 115 82 -20 -13 44 -61
12171 -61 -64 90 46 -30 -35 -2 98 15 -9 9 -4 -29 -54 14 -200 20 -16 23 -31 -25 162 -22 85 56 76 13 -32 62
12199 62 -44 23 94 43 1 61 12 97 -39 59 -10 -47 -9 38 44 6 20 -66 82 10 -37 -16 -90 -61 54 156 -1
12226 -1 43 -75 -64 7 -28 -15 -25 24 74 -94 -20 -9 71 38 56 -118 -25 176 34 6 -100 -46 -4 47 -40 -49 -26 -53
12254 -53 -15 98 105 35 -50 -27 -74 -51 -45 -49 58 -88 -98 -67 38 -56 -130 -1 -2 -31 -96 -107 -15 -12 70 93 -117 -17 -53
$$ packed form
12065@M7k24J60N1r3J99k07j6j55K15k8p2R4L3N6o7L7o6L1l9m6N2L2m3R1l3M0
12092D9r3l4J14M1m0o8m7lR5j8Rp2J18j01P9J5K5J2j01q7J21j19J04p4J41p5n8
12119f7l6J40n7q9J38n9o9J17k3o2P9m4J03p5kP5j14J13j43R6O8j14Q8j19J09
12144E3k5n2J65j55j8RO7p8j6N4J35q4K0Lk1j05J89o6r9K6j05K18l3j02PN7j05
12171f1lJ54m4p6nL3J00q3k4J8j3k5k5O8k14K20l6L9n4OJ87j84J07k9K0o3m5R4
12199F2j06O7P1n1m2O0m9Q5j36R8o9l7L8M7Ol8J4q6J48p2m7K1p4K9J15J02j57
12226aM4j18J1P1l5J3j0M9N0j68P4J1Q0l3J8j74R3K01j42k8j06N4M2N1q7rK3k7
12254e3L8J13Pp0q5K3m7K3OmJ07j46j0L1J05r4p4J29jk9o5j1R2LQ2K3k10J00l6
$$ plain form
12283 -53 -4 -67 148 39 -34 -49 42 36 -68 -103 13 11 -25 54 -49 21 7 83 -22 37 12 12 -50 57 73 128 -49
12310 -49 -103 96 -102 -56 -30 -69 -15 -86 -62 -69 -18 -10 84 40 -158 41 68 76 44 -43 -50 22 -5 39 -10 -1 -115 32 -37
12339 -37 -56 27 -20 92 98 -9 36 -13 -107 19 -73 -5 -76 -11 -55 -35 -50 -56 53 50 13 -87 27 -50 18 -19 20 -54
12367 -54 -23 31 35 109 -23 95 57 -24 -20 -97 -108 -93 -30 0 0 -21 29 -10 -41 -14 76 31 13 12 40 -5 91 60 -30 -13 -17
12398 -17 16 60 30 18 -75 69 6 17 -8 118 -26 -67 31 -136 11 -36 -85 -72 -62 -11 88 -83 103 30 -92 -8
12424 -8 10 -77 2 5 -144 -61 -127 -107 -49 7 23 72 -60 7 39 -46 14 84 -107 52 94 108 15 -28 64 -29 27 -99
12452 -99 -8 -89 78 12 19 -51 -56 25 -99 -22 -38 -5 -61 3 -73 35 2 -23 22 0 79 28 -83 -13 -120 60 97 -55
12480 -55 -12 -24 -65 72 -27 -65 -33 -21 -95 2 53 -57 0 33 -23 -81 63 -71 46 1 55 -28 -25 19 55 64 -49 73
$$ packed form
12283e3M9o3K15j09p3j5R1oj04l5J16kl6P9j03P0j4P6j05N9k5%o2J07J6N5j77
12310d9n4J99j98M6K6l9N4p1K4pN1QR4m4j98J99K7Ql2q7pP2k7M4m9Rj14J47o9
12339c7j9Q3m7J12Oj07M5m9r4J26r2O8p1O5m4K0j5oJ09ll7j00J14p7O8l7L9p4
12367e4L1N4MP4j32J18l8q1Mp7j1J5O3L0%k1N0l9l1K7R0m5j8jK8m5R6l1r0J7m
12398a7L3M4l0j2r3J44o3J1k5J26j44m1R8j67J47m7m9J3J0N1R9j71J86p3j22Q4
12424hJ8q7P9Lj49Q3o6K0N8N6J6M9j32O7L2q5O0P0j91J59M2J4r3m3R2r3N6j26
12452i9R1q1J67o6Pp0nQ1j24P7j6L3n6O4p6J08l3k5M5k2P9n1j11P0j07J80L7j52
12480e5M3j2m1J37r9l8L2J2p4R7N1j10N7L3n6n8J44j34J17m5N4q3LM4L6Rj13J22
$$ plain form
12508 73 -39 20 -70 52 -123 -42 92 62 -22 175 30 -71 -45 -76 -93 62 26 -26 -47 56 33 -136 -135 22 -10
12533 -10 -17 -40 83 76 0 0 -49 63 94 -42 128 76 94 -8 -66 -15 -1 -12 43 -21 71 36 -8 -149 -101 35 -159
12560 -159 -6 22 27 -65 -131 -50 -131 -44 37 52 4 -51 -15 -7 -97 -35 62 -3 3 62 6 -117 24 -49 54 3 4 11 21 -80
12590 -80 39 45 -129 -108 162 -36 -69 -29 -39 -22 -5 -33 -8 -36 -74 -48 14 37 -70 69 47 -12 -25 46 -1 -50 24
12617 24 -3 -14 -28 -52 3 -29 24 -118 105 -23 41 24 95 107 -20 71 7 -58 54 -25 -60 -29 48 35 34 10 -43 -13
12645 -13 13 8 -26 26 -23 75 -128 -82 -38 23 31 -175 47 57 -87 -156 60 14 -4 -47 -40 15 -12 106 -94 -57 -24 -70
12673 -70 12 -156 -11 -20 75 30 114 75 -94 -9 51 -8 -56 11 35 -22 32 52 28 -100 41 0 -43 -83 -133 -16 -20 26
12701 26 -171 -59 -44 -128 26 -21 -29 -40 -98 -5 -138 -39 16 103 -64 -19 -61 -165 28 30 -40 -10 61 -38 18 -64 -7
$$ packed form
12508G3j12N9r0J22j75Q1J34l0q4J97j45j01K6l1j7J55l6n2k1J03k3j69JJ57l2
12533a0pk3J23pp6%m9J12L1j36J70n2J8j02n8N1J4j1N5o4R2l5m4j41M8J36j94
12560a59J53K8Nr2o6Q1q1Q7Q1J5m8n5L6Qr0O2R7o5ON9n6j23J41p3J03n1JPJ0j01
12590h0J19Oj74K1K70j98l3M0j0J7J7k8K5k8l8K6O2K3j07J39k2n9j3P1m7m9P4
12617B4k7j1j4k4N5l2N3j42K23j28O4j7P1J2j27R1o4o5J12p9l5L1P7j3jk4n3L0
12645a3K6nl4N2m9R8k03M6M4O1Qk06K22J0j44o9K16m6j8m3PN5k7J18k00L7L3m6
12673g0Q2j68J45rR5m5Q4l9j69Q5O0n9m8O7K4n7N4K0k4j28J41m1m3m0n0J17mM6
12701B6j97J12J5q4J54m7qj1n8R3j33R9N5Q7j67M5m2j04J93Kp0L0P1r9N6q2N7
$$ plain form
12728 -7 -63 25 13 -42 -53 -89 -56 19 104 -68 89 32 -67 -156 78 26 56 24 -99 51 8 23 61 -43 16 -19 -31
12755 -31 -117 68 71 -55 -26 -79 -89 -97 -43 7 -49 -20 107 -14 76 27 -43 -59 39 15 64 104 -36 -32 -21 50 25 95 58
12784 58 -23 -12 -27 29 128 22 13 30 -113 -63 -22 94 -55 -5 -139 -8 111 75 -107 14 -1 -38 22 4 55 13
12810 13 -50 83 9 -91 34 10 23 -25 55 -14 30 -97 -41 -209 3 76 99 -61 92 3 5 5 -146 33 33 -76
12836 -76 -8 83 64 131 2 -44 25 -159 -89 110 5 -16 58 66 -18 14 -15 -167 81 -147 82 40 12 -82 -61 93
12862 93 -15 84 31 54 -77 127 59 18 -73 -39 -6 -12 -43 6 -99 28 -77 37 -93 -74 -23 -75 21 -82 -72 -53
12888 -53 142 33 -32 -33 29 -82 2 -10 -47 -88 66 42 -95 -31 -34 -46 37 18 91 -27 43 1 -30 52 30 1 119
12915 119 108 -80 39 -31 25 21 -81 -40 -28 -15 -34 4 -109 70 44 -51 -49 -143 78 22 42 98 65 26 -83 106
$$ packed form
12728gn6Q8j2n5j1l6L3P5Q5j72J57n7r9q9K34n2L0l2j23J50m3J5L8j04N9l5j2
12755c1q6J85Lj26K9n3j0qN4N0n6K9J27j21R0m9p0j6R8k4M9M0j40MJ1P1k5P0l7
12784E8q1J1j5N6R9j06rJ7j43N0M1J16j49N0j34J31J19l6j82J21j5l7O0j8N1m2
12810A3o3J33p4j00J25k4J3m8Q0o9M4j27N6j68K12P3K3j60J53q9K%j51J79%j09
12836g6O8R1j9O7j29m6O9j84P0J99j05k1P4Qq4L2k9j52K48k28K29m2k8r4K1J54
12862I3j08R9n3K3j31K04o8m1r1L4L3ol1M9j05J27j05J14j30J9N1n2R6j03J0J9
12888e3J95j09o5jO2j11Q4j2l7m1J54k4j37O4lj2Q3j9P3j18P0m2l1Q2k2k9J18
12915A19j1j88J19p0N6mj02M1J2J3j9L8j13J79k6r5Kr4K21n6K0N6l3l9j09J89
$$ plain form
12941 106 -98 -31 38 -64 37 31 -97 -53 38 -18 -235 -4 3 -58 35 5 -37 -8 38 -39 34 -58 35 -51 16 -134 41
12968 41 -71 -65 17 42 7 -104 -33 -54 66 27 6 -87 -59 -9 62 -9 121 33 76 -37 -21 -131 -20 2 -19 33 27
12995 27 21 -53 -13 -43 -51 253 -63 26 -23 -37 -41 71 68 -54 1 48 -72 -28 133 54 -83 -63 -11 41 55 -15 94 -81
13023 -81 45 -29 101 -17 -4 -41 -13 -47 -34 -167 108 -58 8 41 -142 5 -51 -65 6 -41 -129 -86 65 39 27
13048 27 3 -18 -75 -40 -18 34 -7 26 82 -52 -29 -145 28 -97 88 -37 -24 -25 84 -55 74 40 -5 17 -57 2
13074 2 3 -25 21 -5 39 52 -47 -18 26 -115 16 54 -48 6 -88 -94 -40 -18 -45 78 106 -117 -16 -58 -120 -30 124 35
13102 35 -87 -93 52 45 -13 83 7 60 -41 -31 -48 46 -49 -23 28 -6 12 34 -110 25 -13 4 -14 -38 -69 -35 -22 -110
13130 -110 -46 33 -56 36 12 -10 11 -37 -13 77 35 -63 -50 21 20 40 5 -16 -14 -8 76 26 -4 44 -28 114 -31 46 22 18
$$ packed form
12941A06k04O7O9j02J01oj28M4R1n6k17K31Po1R3l0m2K9M6p7P3r2R3q6O7j50J75
12968D1j12OQ2K5l5j11P1k1J20l9k1r3K8N0P1p1J30q8M3j13J6j10J11K2k1N2o
12995B7op4M0l0qL04l16Q9m9j4mJ12lj22N5M7j20M4J61p9j37K0N2N2J4p0J09j75
13023h1J26p4J30j18J3l7K8l4J3j33K75j66O6L3j83J47n6j4P1m7q8M3J51k6j2
13048B7k4k1n7L5K2N2m1L3N6j34K3j16J73j25J85j25J3jJ09j39J29l4m5K2p4N9
13074BJk8M6k6M4J3r9K9M4j41J31L8j02N4r4oN4K2k7J23K8k23J01m2o2R0J54q9
13102C5j22oJ45pn8R6p6N3j01J0j7R4r5K6N1l4J8K2j44J35l8J7j8k4l1L4J3q8
13130a10O4P9q9R2k4k2K1m8K4R0m2r8J3P1jK0l5k1KOQ4n0l0M8p2J42j45P7k4m
$$ plain form
13160 18 -37 -56 -6 98 47 62 55 -45 -29 7 82 -81 -42 -84 -204 -48 18 -165 -21 39 -39 -15 -27 173 42 -51
13186 -51 -118 12 -27 104 -78 64 2 -73 51 -138 26 -43 52 -62 -82 -201 30 11 11 17 -63 -78 -69 -35 -22 -5
13212 -5 -28 79 233 7 95 22 90 48 10 77 53 -118 -96 -82 -68 98 56 -106 13 67 97 -119 48 -78 83
13237 83 14 -123 61 -86 -4 55 75 -71 26 -5 34 -29 13 54 17 -20 178 19 27 101 27 14 -99 58 -78 -47
13263 -47 32 73 -35 92 -70 13 8 -52 -9 -103 -1 -87 -34 -102 39 6 36 -33 -68 -31 -32 11 -107 -93 -157 -32 9
13290 9 27 -130 -56 -42 79 -11 81 -41 -92 2 31 -89 -85 -103 -80 -9 32 -26 12 -48 41 7 -12 -65 -71 6 -39 3 -53
$$ packed form
13160A8n5j9N0J04n1J5pj00J6L6P5j63L9m2j20J56O6j83J44O0p8K4j2K00j31r3
13186e1o7J30l9J31j82J42o2p5J24j89J64o9R5j14k0j19K31j9%Oq0j5RL4J3J7
13212ek3J07J54k26Q8p3O8m2l8O7k4j71K2J4J4J66m2j62J19N4L0k16J67j26J61
13237H3o9j37J84j47Q2N9K0j46R7l1L9o3M2M1l7l7J98j59QP4p4j3j13J57j36L1
13263d7P9M1j08J27j62Q3no0M3r4J02q6N3o8J41l3L0o9l5L7jM3j18J4o4J25M1
13290IJ8j57P4J4J21r0R2j22n1R4K9j20Mj8K3P1M1n8L8o0Q9l4j9n3oP7m5M2n6
$$ [...]
16383a
##END NTUPLES=NMR FID
##END=
