##TITLE=abcd
##JCAMPDX= 6.0         $$ Bruker NMR JCAMP-DX V2.0
##DATA TYPE= NMR FID
##DATA CLASS= NTUPLES
##ORIGIN= UXNMR, Bruker Analytische Messtechnik GmbH
##OWNER= root
$$ XWIN-NMR		Version 3.5
$$ Tue Oct 14 13:23:01 2025 Russian Standard Time (UT+4h)  servis@DPX200
##.OBSERVE FREQUENCY= 200.131235884673
##.OBSERVE NUCLEUS= ^1H
##.DELAY= (6, 6)
##.ACQUISITION MODE= SIMULTANEOUS
##.ACQUISITION SCHEME= undefined
##.AVERAGES= 22
##.DIGITISER RES= 18
##SPECTROMETER/DATA SYSTEM= spect
##.PULSE SEQUENCE= zg
##.SOLVENT NAME= DMSO
##.SHIFT REFERENCE= (INTERNAL, DMSO, 0, 16.5164)
##AUDIT TRAIL= $$ (NUMBER, WHEN, WHO, WHERE, WHAT)
$$ ##TITLE= Audit trail, XWIN-NMR		Version 3.5
$$ ##JCAMPDX= 5.01
$$ ##ORIGIN= Bruker BioSpin GmbH
$$ ##OWNER= servis
$$ F:\spectra/data/av/nmr/H1/1/audita.txt
$$ ##AUDIT TRAIL=  $$ (NUMBER, WHEN, WHO, WHERE, WHAT)
(   1,<2025-10-14 13:21:54.67 +0400>,<servis>,<DPX200>,
      <created by zg, POWCHK disabled, PULCHK disabled
       terminated by command 'halt'
       configuration hash MD5:
       00 E9 B6 7A A2 85 ED C7 34 08 36 98 17 FE 4E 26
       data hash MD5: 32K
       74 91 8B 46 80 14 D1 78 53 FF 1A 69 1F 94 3D 74>)
$$ ##END=
$$ 
$$ hash MD5
$$ 73 F2 61 14 C1 75 36 68 45 B2 9A 84 D6 87 8D 5C
##$RELAX= 
##$RELAX= 
##$RELAX= 
##$RELAX= 
##$RELAX= 
##$RELAX= 
##$RELAX= 
##$RELAX= 
$$ Bruker specific parameters
$$ --------------------------
##$DU= <F:\spectra>
##$EXPNO= 1
##$NAME= <H1>
##$PROCNO= 1
##$TYPE= <nmr>
##$USER= <av>
##$AMP= (0..31)
100 100 100 100 100 100 100 100 100 100 100 100 100 100 100 100 100 100 
100 100 100 100 100 100 100 100 100 100 100 100 100 100 
##$AQSEQ= 0
##$AQ_mod= 1
##$AUNM= <au_zg>
##$AUTOPOS= <>
##$BF1= 200.13
##$BF2= 200.13
##$BF3= 200.13
##$BF4= 200.13
##$BF5= 500.13
##$BF6= 500.13
##$BF7= 500.13
##$BF8= 500.13
##$BYTORDA= 1
##$CFDGTYP= 0
##$CFRGTYP= 5
##$CHEMSTR= <none>
##$CNST= (0..31)
1 1 145 1 1 1 1 1 1 1 1 1 1 1 1 1 1 1 1 1 1 1 1 1 1 1 1 1 1 1 1 1 
##$CPDPRG= <>
##$CPDPRG1= <>
##$CPDPRG2= <>
##$CPDPRG3= <>
##$CPDPRG4= <mlev>
##$CPDPRG5= <mlev>
##$CPDPRG6= <mlev>
##$CPDPRG7= <mlev>
##$CPDPRG8= <mlev>
##$CPDPRGB= <>
##$CPDPRGT= <>
##$D= (0..31)
0 2 0 0 0 0 0 0 0 0.06 0 0 0 0 0 0 0.0002 0 0 0 0 0 0 0 0 0 0 0 0 0 0 
0 
##$DATE= 1760433714
##$DBL= (0..7)
120 120 120 120 120 120 120 120 
##$DBP= (0..7)
150 150 150 150 150 150 150 150 
##$DBP07= 0
##$DBPNAM0= <>
##$DBPNAM1= <>
##$DBPNAM2= <>
##$DBPNAM3= <>
##$DBPNAM4= <>
##$DBPNAM5= <>
##$DBPNAM6= <>
##$DBPNAM7= <>
##$DBPOAL= (0..7)
0.5 0.5 0.5 0.5 0.5 0.5 0.5 0.5 
##$DBPOFFS= (0..7)
0 0 0 0 0 0 0 0 
##$DE= 6
##$DECBNUC= <off>
##$DECIM= 32
##$DECNUC= <off>
##$DECSTAT= 4
##$DIGMOD= 1
##$DIGTYP= 9
##$DL= (0..7)
0 120 120 120 120 120 120 120 
##$DP= (0..7)
150 150 150 150 150 150 150 150 
##$DP07= 0
##$DPNAME0= <>
##$DPNAME1= <>
##$DPNAME2= <>
##$DPNAME3= <>
##$DPNAME4= <>
##$DPNAME5= <>
##$DPNAME6= <>
##$DPNAME7= <>
##$DPOAL= (0..7)
0.5 0.5 0.5 0.5 0.5 0.5 0.5 0.5 
##$DPOFFS= (0..7)
0 0 0 0 0 0 0 0 
##$DQDMODE= 0
##$DR= 18
##$DS= 0
$$ [...]
##$SUBNAM0= <"">
##$SUBNAM1= <"">
##$SUBNAM2= <"">
##$SUBNAM3= <"">
##$SUBNAM4= <"">
##$SUBNAM5= <"">
##$SUBNAM6= <"">
##$SUBNAM7= <"">
##$SUBNAM8= <"">
##$SUBNAM9= <"">
##$SW= 20.6817932712277
##$SWIBOX= (0..15)
0 0 3 0 0 0 0 0 0 0 0 0 0 0 0 0 
##$SW_h= 4139.07284768212
##$TD= 32768
##$TD0= 1
##$TE= 0
##$TE2= 300
##$TE3= 300
##$TEG= 300
##$TL= (0..7)
0 120 120 120 120 120 120 120 
##$TP= (0..7)
150 150 150 150 150 150 150 150 
##$TP07= 0
##$TPNAME0= <>
##$TPNAME1= <>
##$TPNAME2= <>
##$TPNAME3= <>
##$TPNAME4= <>
##$TPNAME5= <>
##$TPNAME6= <>
##$TPNAME7= <>
##$TPOAL= (0..7)
0.5 0.5 0.5 0.5 0.5 0.5 0.5 0.5 
##$TPOFFS= (0..7)
0 0 0 0 0 0 0 0 
##$TUNHIN= 0
##$TUNHOUT= 0
##$TUNXOUT= 0
##$USERA1= <user>
##$USERA2= <user>
##$USERA3= <user>
##$USERA4= <user>
##$USERA5= <user>
##$V9= 5
##$VALIST= <valist>
##$VCLIST= <CCCCCCCCCCCCCCC>
##$VD= 0
##$VDLIST= <DDDDDDDDDDDDDDD>
##$VPLIST= <PPPPPPPPPPPPPPP>
##$VTLIST= <TTTTTTTTTTTTTTT>
##$WBST= 1024
##$WBSW= 30
##$XGAIN= (0..3)
0 0 0 0 
##$XL= 0
##$YL= 0
##$YMAX_a= 137087
##$YMIN_a= -97746
##$ZGOPTNS= <>
##$ZL1= 120
##$ZL2= 120
##$ZL3= 120
##$ZL4= 120
##$ABSF1= 10
##$ABSF2= 0
##$ABSG= 5
##$ABSL= 3
##$ALPHA= 0
##$AQORDER= 0
##$ASSFAC= 0
##$ASSFACI= 0
##$ASSFACX= 0
##$ASSWID= 0
##$AUNMP= <proc_1d>
##$AZFE= 0.1
##$AZFW= 0.1
##$BCFW= 1
##$BC_mod= 2
##$BYTORDP= 0
##$COROFFS= 0
##$CY= 19
##$DATMOD= 1
##$DC= 2
##$DFILT= <>
##$DTYPP= 0
##$F1P= 11.0000007629395
##$F2P= -0.999999237060547
##$FCOR= 0.5
##$FTSIZE= 0
##$FT_mod= 4
##$GAMMA= 1
##$GB= 1
##$INTBC= 1
##$INTSCL= 1
##$ISEN= 128
##$LB= 0.05
##$LEV0= 0
##$LPBIN= 0
##$MAXI= 10000
##$MC2= 0
##$MEAN= 0
##$ME_mod= 0
##$MI= 0
##$NCOEF= 0
##$NC_proc= 0
##$NLEV= 6
##$NOISF1= 0
##$NOISF2= 0
##$NSP= 1
##$NTH_PI= 0
##$NZP= 0
##$OFFSET= 16.51637
##$PC= 1
##$PHC0= -274.2701
##$PHC1= 2.101565
##$PH_mod= 0
##$PKNL= yes
##$PPARMOD= 0
##$PSCAL= 4
##$PSIGN= 0
##$REVERSE= no
##$SF= 200.13
##$SI= 16384
##$SIGF1= 0
##$SIGF2= 0
##$SINO= 400
##$SIOLD= 16384
##$SREGLST= <1H.CDCl3>
##$SSB= 0
##$STSI= 0
##$STSR= 0
##$SW_p= 4139.07284768211
##$SYMM= 0
##$S_DEV= 0
##$TDeff= 0
##$TDoff= 0
##$TI= <>
##$TILT= no
##$TM1= 0
##$TM2= 0
##$TOPLEV= 0
##$USERP1= <user>
##$USERP2= <user>
##$USERP3= <user>
##$USERP4= <user>
##$USERP5= <user>
##$WDW= 1
##$XDIM= 8192
##$YMAX_p= 0
##$YMIN_p= 0
$$ End of Bruker specific parameters
$$ ---------------------------------
##NTUPLES= NMR FID
##VAR_NAME=  TIME,          FID/REAL,        FID/IMAG
##SYMBOL=    X,             R,               I
##VAR_TYPE=  INDEPENDENT,   DEPENDENT,       DEPENDENT
##VAR_FORM=  AFFN,          ASDF,            ASDF
##VAR_DIM=   16384,         16384,           16384
##UNITS=     SECONDS,       ARBITRARY UNITS, ARBITRARY UNITS
##FACTOR=    0.0002416,     1,               1
##FIRST=     0,             0,               0
##LAST=      3.9581328,     0,               0
##MIN=       0,             -97746,          0
##MAX=       3.9581328,     137087,          0
$$ Real data points
##PAGE= N=1
##DATA TABLE= (X++(R..R)), XYDATA
$$ [...]
8804B3N0j14J37j69Q2m7Q2p0P0q6P3j03O1K9n7J42n4n0k6L3N6j8L8Oj50RQ0pp1
8833e1M3K3q2J11j1pJ30j38j28J42k5q8OQ5N4j90P7R0Ko0J04r6j2K1K5M2r3P0
8861D4j63R3jJ03k2mL9j76M8k9N2n9P3J7q5J11l0p2J27j34L0l7J09j5j04L4J01
8888E0j09J03J0No1P8k6kpmq7j1J2J01k4j8j01P8O9q6O4m1N6m3j31J61n6J5l3
8917c8p7K04j30j9J21j34J6M2l9L8P8non4o8PJ43o6J0K1mJ4o1J3N2Q2p4n2k3K3
8947A4m5RO5l3K2q6O4l2Oj9K1q3j0Q2J06j20R8L5j33J36j15p4moP7M9r0R2On8
8977b6npo3R2K8J9n1O7n3J0L3p4J3n6J20r2k2Q0J3p4J54j59j0L4J12j47P9o2J4
9006c3M1n5j2l9J15m3J20j20K2m5K2J24j40Q8q5pN8J4npQ5j05j9O9M2j30LO5o6
$$ y = [23, 73, -41, 96, -73, 9, -38, 44, -26, 44, -42, 31, -72, -11, 18, -39, 103, 49, -1, -27, 6, 62, 44, 82, 88, -62, -53, 27, 20, -51, -8, 15, -67, 44, 33, 26, 156, 18, -110, 32, 7, -81, -75, 10, 64, -126, -49, 41, 43, -17, 87, -9, -21, 0, 25, 67, -26, 44, -119, -26, -27, 76, 54, 50, 89, -87, -39, -68, -16, -75, -2, 15, -70, 41, 11, -61, 66, -68, -38, -75, 34, 19, -85, -51, 50, -59, 44, 54, 59, -2, 76, 50, 48, 41, 37, -50, -61, -49, 52, 28, 10, -91, -13, 56, -30, 34, -7, 49, 6, -125, 36, -20, -5, -38, -115, 89, -41, -60, 61, -73, -57, -15, -54, -16, 62, 57, 51, -3, -71, -64, 79, 13, 23, 44, 40, 54, -7, 6, 58, 140, 66, 14, -9, 14, -31, -22, 43, 10, 32, -54, 10, -22, -16, -35, -14, -97, -107, -25, 81, -39, 59, 94, -39, 97, -18, -92, -96, -102, -25, 24, -66, 26, 32, -26, -31, -38, -101, -9, 19, 38, -13, 54, 1, 11, 44, -30, -17, -73, 47, -45, -67, 13, 26, -48, 106, -53, -63, -29, 83, -64, 15, -47, -33, 8, -47, -59, -98, 17, -26, 94, -26, -4, -49, -27, 97, -43, 45, -40, -47, 11, 25, 20, 13, 98, -7, -26, 43, 85, -45, -42, 23, -43]
9035d3N7k2Q4L8r5l8R5l3o2qN0M3qn1J3k4qrk9mlJ09j57J30m4m3N3P9j35J07M
9066D6r6LJ8J06Q1k37rJ33m9M7l4M2k7L5j09J38n4l3J30m1o5r4R4L2q8J49k08
9093i0P4q1J06l8J4J50j44n1Q2o7N8K9p3mk2R6o4L1J4j28J24m9%M4k6N5p0R0m8
9122A2Q8j20P7ll2l1J45m9q8JQ7l9j78K31j12M8j6r3J10n5R5r5mP1j12M1j5j4
9150e0K0M6j00J37p2N4n7O1m9q0J4RJ5J2Po5J2oJ44Qm0n7k6J26p1K9o1k9KJ57
9180I0j33L1R4Oj58M7K0n1J13J9p0Lk3l3O5j4p6pM9J01j06%R3l1L0o3OPr7J17
9210B9n1r6K34j58o3O3K8P0J8o5P7o2n0J5P5o7M9q5N5K9Lr8P7O9k7r5RR1%q9k7
9241d2J3L2O7j35P6M5j18K7O0j45M5R7p2j7J3MJ24r5n6N6Q7o5M1L4p8RQ6k64K54
$$ y = [-43, 14, -8, 76, 114, 19, -19, 76, 43, -19, -27, 23, 66, 58, 7, 20, -4, -12, -21, -50, -54, -57, 52, -105, 25, -19, -62, -9, 70, -65, 42, 46, -50, -47, -29, 77, 158, -79, -88, 45, -4, 43, 9, 51, 24, 59, -50, 88, 34, 1, 131, 90, 25, -69, 25, 57, -31, 118, -90, -16, -97, 9, -29, -15, 135, -9, -60, 22, -45, 13, 42, -31, -35, -57, 39, -25, 6, 20, -108, 16, -33, -33, 11, -15, 40, -30, 60, 12, 100, -20, 57, 54, 22, -9, 136, 87, -1, 0, 87, 48, -130, 101, -11, 37, 21, -72, 38, -17, 78, -17, -21, 50, -62, -21, -36, -50, -30, 16, -84, 53, -19, 35, -22, 39, -10, -90, -76, -67, -52, -40, -33, -98, -86, -92, 52, 60, 20, -37, -63, 63, -8, 21, -40, -69, -67, 90, -43, -12, 82, 88, -70, -23, -3, -54, 59, 78, 8, 11, -12, -45, 20, 6, -70, -77, -28, 73, -33, -33, 60, 29, 59, -4, 2, 9, -88, 29, -22, -118, 116, -42, -105, -42, -14, 56, 74, 9, 86, 24, -26, -11, 64, -3, 46, -39, 16, 45, 48, -50, 27, 96, 69, -26, -17, 74, 74, -15, -42, -29, 3, 70, -65, 11, 56, -62, -35, 25, -120, -75, 22, -50, -67, -54, -50, 74, -21, -77, -21, 66, 1, 42, 76, -2, 7, 93, -171, 83]
9270H3p4rJ1K4l7j2J87j67O8o4K0j61O5J37m2l8np3jJ7Q3p6kL2M9m6Q8j18L4j04
9300a31lP7Q5l0K4o4J1P8l7n0J27j65J3J75p0k5J58j55o6J73n9L1p1P1l2r5J08
9327G8K2j39J11j51M2J1N9m4K6N6l5m0n5K0P0n5J9q8L6N4QJ5k8k6K9m6N6mp8P8
9357AMP2p0O2l9l8J0l9J20n7L1n0k7J8K3M6J07k06N4M9j04J28L6r4p2j0n4Q2j9
9386c6m3M2N0p9L8q5J2J03l0j29J52K3m7J5N3M3n3m7j7L2O1k7m5R3q1p7M5KM7
9415A5Kj61K77p0K6n5K5j97N0J64j05J8J1k8L9m7M2L6j5L4l2k3n3k1M7P8J6j98
9443a25J00J2J13o6p9J16j33J14p1n7P3K8MJ06j40m2J01J5P4j04k5j4m7N9J6k
9469B6o7QJ34r3m5J68j22r0J00O7p6O6p8k0qM6l3O0J3%o5r7R6M9r7N1o0N7O4n6
$$ y = [83, 9, 0, 11, 35, -2, -14, 173, 6, 74, 10, 30, -131, -66, 71, 29, -9, -14, -87, -88, -71, 12, -64, -66, -34, 15, -31, 57, -61, -27, -131, -134, -57, 28, -2, 22, -42, -31, 47, 10, -40, 87, -78, -65, 110, 40, 15, 173, 18, -48, 125, 66, 97, 26, 97, 65, -30, 78, 100, -39, 72, -79, -37, -26, 33, -11, 15, 71, 36, -4, -59, -39, 31, -24, -5, -93, -57, -3, 5, 20, -8, -34, -5, -51, 5, 1, -77, 1, 5, 77, 7, 69, 30, -8, 2, -37, 83, 26, 57, 7, -20, -2, 21, 67, 174, -32, 22, 71, -33, 95, 131, 37, -35, -45, -99, -17, -36, -79, -37, 13, -66, -28, -113, -101, 2, -28, -157, -5, 18, -29, -14, 39, 82, 29, -18, -35, -3, 58, 31, -14, 79, -2, -79, -34, -32, 15, 17, -144, 133, 63, 89, 34, 59, -138, -88, 76, -29, -11, 0, -28, 11, -36, 6, 42, 27, 61, 29, 6, -47, -68, -21, 57, 73, -125, -25, -13, 100, 34, -45, 71, -62, 52, -19, -76, -3, 25, 29, 135, -5, -47, 54, 69, 143, 39, 14, 0, -47, 12, 28, 26, -41, -33, 101, 8, -37, 131, 9, -81, 19, 86, 10, 76, -2, -22, -30, 16, -17, 43, 56, 56, -9, -106, -10, 39, -58, -7, -67, -10, 54, -2]
9499bM9j23J05n0J6j1K1M8k8N2j4l3l4L8l7J29l8q5JP6q9OR7J0j38Q3J1k7K7o
9529E4n0O1o2p9Q8jl7q4J05R9j44Q5j11l0P1k5J11n8lJ14j01PO3o6l2m7L7J25
9557I0j07J14k2q6M1J5l1Q9o4NRp7K0O4j11J32J6p7p7L9N6q6M3m8L6J1q0J11J4
9586C9j38OJ40j28J9Q7m7q8J14J1J09j16M2L3l4j05M5k7M2J47k04O7l3K8n6J47
9612A00q2LK6n3R7n9joo4O8M3J5j89Q5p7P4l6o5rK04j45L5L2pM6j43R2M0j00O9
9642gJ0M6r7n2J75j77M5J37n9o2J28q2n6J53j12Qq8J84k12J53Ol8m3L1n6J39o6
9669HM3k3n7J03p2q3J86j63L7j13P0k4K6N8l2O7j2M3n3Pk3j8j4N9L9m9pl9J54
9698A18q2N2j04j4N2j6KR9o3rL8k0J6j73J46mo5QM1l7M0r8L4N3kk0m4J48j26N6
$$ y = [-2, 47, -76, 29, -21, -5, -16, 5, 53, 25, 77, 63, 30, -4, 34, -3, 126, 88, 3, 4, 80, -9, -3, 94, 104, -34, 49, 60, 33, 60, 54, 4, 65, 3, -76, 12, 11, -26, -110, -5, 94, -50, 35, -76, -106, -35, -60, 51, -7, -10, 104, 3, 10, 73, 7, -25, -72, -35, 90, -17, 97, 75, -11, 30, 45, 14, 103, 39, 44, 53, -24, -4, 60, -51, 81, 97, 20, -57, -18, 38, -48, -5, -53, -17, -6, -86, 25, 39, -99, -93, 47, -81, -62, 25, -22, -110, 4, 15, 124, 8, 50, 83, 49, -56, -11, -38, 4, 151, -53, 14, -19, 9, -47, 100, 18, 21, 47, -6, 91, 32, 31, 25, -39, 29, 72, 87, -102, -17, -94, -20, -56, -121, -130, 74, -71, -36, -4, -11, 35, -108, -16, 24, -76, -7, 3, 49, -48, -100, 75, -102, -57, 80, 21, -41, 87, 5, -51, 102, -10, -2, -90, 94, -118, 35, 41, 3, -40, -9, -65, 74, 8, 51, 28, -29, 74, 2, -81, 105, -58, -21, -134, -64, -88, -62, -4, -36, 31, 19, 62, 9, 16, -7, -25, -39, 20, 59, 10, 3, -36, 118, 36, 88, -16, -30, 22, 6, 8, 107, 44, 35, 73, 53, 69, -104, 42, 38, -27, -19, 22, -15, 25, -73, -39, 14, 12, -8, -52, 96, -30, 26]
9728B6n6L5J13j80J17l8J4M7p4p8J00Jj7o0P8J2n9L9j2l6P3j9o0PJ02o3K8J5K0
9757G5q8l1N7Qn7kP3p5pm4J97o4r3O3j55J60O7j65L0K8n9o8J50j1L3j87K01r9
9785f3P6J2l4J0J5J0l2k3K7pR2Nj02m5J43j5p2M8N3o1j27P0O6l4Ok0l8K6P6j45
9815h3J21n4k3J4P1m4k3J29j31J53o6q2O4j34K3J30p5J4K0j5pp8O0M5rl8M3j0
9843A5N3l9j6J8Jj08J10l5r2P4R8l9m5kl6J03m2J1Mp7M2P2o6N4j44L3J05o3j5
9872b6O1l7n3oRM0Q1j35J60ro0p4NN4P8m5j14M5J44j64J27p2j04J33r3R8nM3q9
9901hK2Q1l3q2O7o8R6m0j05K0J06r8k6N5j7j5j7L7o4J00k7K3r9J63j8J3l0K9j36
9930g1mQ1q3R5J9J4k2K9j06N1j1P0r2J21m0k1J6j49J12m9J1K0L2K8p6O5k4L5O1
$$ y = [26, -30, 5, 118, -62, 55, 17, 31, 78, 4, -74, 26, 27, 10, -50, 28, 40, -19, 20, 8, -28, 45, 26, -34, -27, 75, 12, 40, 55, 75, -13, -44, 13, 21, -36, -38, 35, -40, -47, -91, 106, 42, -51, 12, -143, 17, 84, -81, -51, -23, -82, -150, 0, -11, 22, -165, 36, -63, 13, 25, -9, 1, 16, 26, -6, -29, -2, -9, 83, 88, -14, -59, 84, 69, -3, 45, 98, 37, -90, -20, 46, 12, 18, -2, -40, -14, 62, -83, 38, -16, -39, -25, 46, 2, -21, 108, -23, 130, 64, -18, 46, -88, -65, 65, -10, 4, 24, 9, 2, -76, -16, 29, 20, -18, 25, 15, 68, 29, 13, 31, 32, -76, 34, -1, -93, -19, 79, 40, -5, -7, -43, 60, 18, 29, 33, -44, -2, 70, 4, 58, -86, -53, 52, -11, -26, 35, -2, -55, -61, -52, -12, 69, -66, 94, 85, 25, -49, -44, 10, 88, 43, -71, -26, 118, -46, 81, 9, -95, 38, -55, 43, 38, 81, -8, 14, 95, 62, -20, 47, -21, 75, 35, -70, -50, 56, -42, -68, -13, -30, -45, -62, -25, -89, 11, -16, 7, -92, 71, 53, 66, 36, 65, -71, -75, 6, -77, 18, 37, 51, 29, 58, -48, 3, -8, 62, -30, 91, 51, 30, 46, -103, 9, -40, -29, -9, 23, 51, -25, 40, 16, 51, 112]
9959A12j22J26j60j9J2Q1J0l8ol8Q1l7n7qj2J7J3O6o5n3J32pn3Qr4J14O2p6N0
9988C9M2j08j5J14m3K9N1q2Mj21J56q3L3J5Q8N7k39K9p0J25q2J42j91R9j8kM8
10015A7j14P4Q1r2r2J01O7L0m9J1o7kR1j28%Q8KJ06j64J32o5Q3j6j93J01k9l9
10042f6M3NK0j20J58k6J9O9j9j09MK4m3nP1J8J5k8p8l3J36r2l2O2n7oJ6kM7p6
10072h5P5j7j30K34j34K7J1N9j36M7N7L4j1q5k1P9J09o2K6J9jj60M6J28pq6nj6
10100eJ4l0K3n2K9ro4L4P4K3j03J4K4n2L4L8p6R2P5o2m0N8qo5O9p8L5l0j9k4Q7
10131Fo5L2J38j23N7l4P3l8o9R2l7O2p7k1M9q0Kj2L8Km2q0J51j1N3o3q8K9Q4l2
10161dj2K4L1pm3n5J12o2R4r9jL8p4O3o9J10m2lJ3jj06J22J0n4P1q2Q7j20J83
$$ y = [112, -10, 116, -44, -63, -51, 30, 40, 2, -4, -42, 39, 2, -55, -63, -75, -58, -45, 21, -44, -97, 35, 28, -25, -17, -111, 3, 65, -11, 39, 81, -27, -42, 72, 29, 58, 109, 27, 31, -90, 66, -17, 16, 31, 119, 176, -63, -34, -104, 21, -61, 81, -110, -11, -29, -31, 17, -97, -23, 58, -34, -126, -25, 42, 72, 23, 34, -33, -35, 56, -72, -72, 16, 18, 124, -40, 92, 27, 110, 94, -99, 2, -27, -66, -23, -18, 2, -118, 40, 14, 33, 102, 83, -26, -22, 2, -41, -46, 25, 43, 58, 30, -48, -81, 55, -37, -69, -7, -64, -70, -54, -56, -9, -85, -10, -27, -157, 77, -57, -30, -19, 40, -96, -49, 8, 42, 31, -54, -75, 4, 113, 51, 77, 96, 95, -65, -19, 109, 102, 16, 11, -5, 9, -21, 2, -50, -21, -30, -94, -60, 14, 37, -66, -52, -28, -80, -46, -8, -84, 8, 83, 21, -19, 39, 31, -34, 35, -43, -8, -38, -57, -81, 6, -59, -27, 111, -12, 45, 11, 84, 46, -23, 69, 32, 94, 17, -4, 45, -35, -33, -45, -7, -5, -47, -127, 24, 13, 66, 3, -85, -56, 28, -4, -16, 8, 39, 32, -11, -66, 46, -16, 78, -21, -22, 16, -58, 5, -64, 46, 4, 1, 14, 13, -93, 29, 39, -15, 56, -26, 61, -59, 124]
10190A24p8rj11J44j06J9k6m7J7R9n0L9p9L1mm2k0J53j29J5Qj01J64j5rj76J78
10217a1O9m2O8p1Pk2j7nM7r2R9l5R6q2M9j3m9J3NM8j33J72m6r4j2Q9L0k6j34J19
10247B7k4O1P2j29K6J2n0k9Om5O0k3p5J32J6r1RO6j09K17q7r2j4J44n9K6r4N9
10275A2l2K7j4J1m2M0n3o4J65l0K5rj4j2M7k8n2k5N8O6j74M2L6n6R1l5j9k0K1
10304c8r6J30p0J07j03n1J10P1j72J26lJ3K5J2p8J6L3K0n4m1M8Q1j92K27j57L7
10330AM2j6k8l3Q4o8J2q2J51j40J66p1j06Q4J7n5K3J5L1L8k0m1Qln6M2lL9L7l7
10360C1k8o4j6J13j2k1k4O5l2L0m3m3NJ00j3J9m2M9j2k1j20P2k5J38k01R8j0L
10388dJ4J0j2m0l9J1m2J73lm3j8pK6m0j1m2J33j32R5J2k2r4R7L4j06k5n7K08r7
$$ y = [124, 46, 37, -74, 70, -36, -17, -43, -90, -73, 26, -24, 15, -64, -33, -37, -79, -99, 54, -75, -60, -52, -153, 11, -4, -13, -189, -11, 58, 16, 84, 13, 20, -2, -19, -24, 23, -69, 30, -5, 91, 9, 58, 45, -4, 9, 14, 62, -71, 101, 55, -39, -51, 38, 68, 42, -92, 27, 3, 64, 136, 7, 33, 45, -5, -34, -28, -73, -13, -36, -111, 21, 37, -54, -45, 21, -88, 129, 42, -50, -64, 80, 21, 47, -47, 12, -20, 7, -7, 4, -38, 2, -51, -115, 50, 20, 45, 36, 22, 10, 57, 29, -23, -48, 10, 76, -98, -56, -20, -76, 15, -20, -39, -59, -38, -134, -4, -74, 33, -70, -121, -11, 60, -112, 14, 11, 24, 49, 61, -17, -1, 32, 52, -2, -43, 5, 86, -106, 121, -36, 1, 43, 27, -1, -34, 50, -18, -6, -88, 63, -77, 89, 18, -88, -4, 13, -42, -19, -4, 27, 65, 45, 4, 12, 9, -47, -5, -8, 31, 68, 31, 3, -61, -77, 36, 24, 3, -21, 44, 12, 42, -1, -44, -39, 61, 48, 67, 25, 74, 62, 41, -79, -7, -32, 106, -95, 3, -7, -4, 10, 20, 8, -32, -71, -60, -102, 71, 68, 25, 7, 0, 26, -14, -25, -67, 66, -66, 29, 41, 19, -75, 22, 56, -50, -75, -132, 76, -21]
10417b1l6J01j04L9J29m9L7m7j15K9J21q6m3P1l3MJ5R0j3l3l9pp0m7J18p6k4Q
10445h1R7pj3m0J8j24R2l2L1K9O7k3oj6j01L1j5L2M5K4j5n9J44j31L3M8k7kl8
10474c9N4L1n8O3m4L2j07J12m3o1R5mK2j3J6q9p8Q2p2Q6j06J26j33J57J8m3q3
10501g9J04q2K6J80j99J74j16J17j95J24r0R6k5Q2o5q9j5k4N3L3MP0q5O1j24N9
10527ePk3jN7j31J38j5pk2n3O6m1N2j7M5o4l2J03j17P3o6J32n4m1j11J03J42j37
10555a9R8o1o1J28p2R9j63J27m7m9N7m9M1M4q7P0j26J06K2o9J12p9Q7j37J32j15
10581a1om8N4k8J0O8p7m5J38n7R9p2m3k0J07q3j02Q0J6P3nn3l5K8mRj8Qk9L0j2
10612b8R1O3j30L6O9j83J07k4k7j7J41j22K7J9m5l4k8J82j62OL1J6k4j13J24K3
$$ y = [-21, -57, 44, -60, -21, 108, 59, 96, 49, -66, -37, 84, -2, -45, 26, -7, -3, 12, 102, 89, 56, 17, 10, -60, -107, 11, -65, -89, -81, 16, 9, -4, -44, -26, -150, -58, -90, -59, -30, 37, 14, 8, -8, -109, -78, -93, -61, -16, 8, -7, -66, 78, -53, -20, 28, 1, -1, -39, 15, 46, -12, 51, 7, 39, -68, 44, 1, -60, 35, 31, 53, 40, 56, -33, -111, -29, -101, -15, -121, 5, -128, 29, 47, 4, -79, 25, -57, -31, 149, -50, 124, 8, 125, -70, 54, -36, 60, 35, 117, 52, -37, -52, -76, -23, 10, 14, 84, -1, 60, -64, -5, 2, -21, -22, 35, -96, 42, 27, 20, -2, -55, 11, -30, 22, 5, 50, -14, -46, 57, -60, 13, -53, 79, 25, -16, -127, -24, 118, -19, 79, 18, -43, 85, 13, 112, -51, 76, 29, -20, 37, -12, 29, 73, -14, 56, -70, 36, 58, -11, 101, 22, 109, -28, 104, -11, -17, -65, -11, -39, -29, 39, -38, -83, 55, -2, 97, 25, -18, -38, 69, -14, -116, -36, -20, 53, 48, -5, -40, -12, -16, -7, -25, -17, -46, -16, -28, 63, 126, -4, 32, 101, -82, 25, 1, -26, -43, 98, -24, 3, 22, -23, -57, -85, 97, -65, -59, -28, -12, -36, -149, -25, -2]
10638bK6j3q5O0L5n3J8q6kJ09J0K1j3l9K4k2j8K5n4P5J8po5J30o8n8N8O2k05J63
10668D4k2P5j47R8j25N5K1Nl9L0LP1L5j76L6O5r0PP3M8j28P2P0j53R4N4j04o2
10696i0L2k9J23o8N3M4j14J8M9l7rk4K5N9q4J09J4k6j17M4J6J03l9m1K7j43K24
10723A19j66Q7PM1j48R8j09J02p9j0P6o8Q0r5P4q2l0J9R2O4n2j23L2O7L9j00Q3
10750A8L0k5L0j14J5R4m5N2o4%O4N1n8m2P5j08J0J37p1l4J0k1oq1R9j01k8J68
10778E5q0m2J11j42P0n9P6m9J7k9PJ05o6M2n5O0Lq8N4o5L9KJ31l5n9M6l6%k3j3
10808b3N6j01K7J3J22j15m5J26m1n3J02p4j4O0Pj01J29n1l9O5o2mMj1p5R8J6m0
10836b4N2l6K6j8j3L5l4l1O0J8j46J27K6k0k9m2MM9L3J4j05J06M5j53J8P6p2O
$$ y = [-2, 24, 11, -74, -14, 21, -32, -14, -100, -102, 7, 17, 38, 25, -14, 10, -12, -30, -5, -59, 16, 34, 27, -38, 92, 24, -34, 24, 86, -119, 44, 22, 97, -50, 48, -77, -22, -1, 4, -35, -5, -2, 69, 104, -72, -36, 29, -61, -54, 19, 67, -61, 11, 81, -72, 22, 76, -28, -90, -58, -87, 36, -32, 21, 65, -49, -31, 18, -19, -28, -52, -27, 32, -52, 57, 71, 45, -72, -28, -12, 91, 52, 11, 38, -105, 119, -47, 40, 47, 88, -60, 38, -71, 31, -48, -58, 18, -50, 30, -65, 9, -73, -103, -84, 8, 72, 20, -103, -71, -4, 35, -65, 18, 48, 23, 53, -61, -46, 48, 3, 55, -9, -9, 55, 106, 48, 6, 81, -27, -17, 120, 49, 15, 25, 4, -2, -83, 16, -85, -113, 55, -25, -67, 44, -98, -28, -87, -11, -60, -43, -72, -65, 40, -26, 16, -39, 21, 24, -64, -10, -75, -36, -34, 97, 62, 3, 49, 13, 13, -10, -23, 33, -68, -41, -28, 94, -21, -66, 60, 19, -34, 68, -6, -20, 40, 47, -54, 75, 24, -15, 50, -12, -16, -12, -23, -98, 0, 16, -24, 28, -8, 18, 0, -13, 22, -12, -43, 17, 35, -111, 16, 42, 22, -7, -49, -45, 4, 37, 51, -54, 52, 97, -56, -38, 38, -34, -28]
10864b8Q5k2m0J6kk0J9o2Q1lm0L8j1J8q2p0J59Jj20K5J03j89R3M8j0n3Q7J1K3
10893E5l8P0j61J67J6j33KO2o6O7j01k1Q1l8K6J00j35P6M3q3q2Q1o5J10J2k7K5
10920D3k6l1J7J6q1pR2lNp6Q3q0J3QL1m3K4O1j00K3K3K1j13Q5J07k0n8K4m3k1
10950b6j3J26q0L0R4j35R5q8M2n9j0K0R%K9kOj21J7Q0p5K4Q2Pj87P9j3N2pQ2p7
10981a9J8j9N0j32M1O8k8N4j28N9J49j47PK0J63j84L4k8O4o5J12j08J4M4k2l8
11007b1l2R0k2J8J4n5K6L3l8J5k4p3J1K2J0Q7j10L6k9J48j39J19j95K6M4N6r1
11034g4qP2p1J93q4OL5n6j5M0j1L7j27L6Ql4K3O7Oq2Q1O1o0m4M9o6J02q6J8n2
11064c6P3k9r8J08j46K02j07j8P9j22J1N6o5j7O7J3k5oqQ1Rl2rj6N2o9Q4M6j76
$$ y = [-28, 57, 35, -5, 11, 9, -11, 8, -54, 27, 24, -16, 22, 11, 29, -53, -123, 36, 37, -83, -58, 45, -144, -51, -3, -13, -66, 21, 32, 55, 17, 87, -74, 93, 109, -24, -22, 40, -26, 41, -60, -81, 0, -38, -12, 88, -47, 29, 72, -11, -93, -12, -77, 33, 45, 18, 43, 17, -14, 3, 19, -62, -69, 23, 20, 25, -51, 32, -48, -35, -27, 4, -39, -15, 46, -54, -31, -8, 13, -100, -15, 92, 72, 14, 38, -5, -26, -39, 87, 7, 37, 131, -4, 91, 3, 45, -14, -24, -4, 5, 5, 34, 32, 38, -83, -66, 14, -61, -37, 45, 52, -135, -56, -69, -17, -24, 58, -19, -1, -20, 30, -102, -61, 7, -21, 33, -95, -36, 113, -34, -27, -7, 156, -28, 6, -22, 42, -23, 89, -19, -5, 39, 17, -21, -53, 37, 15, 33, 47, -8, 18, 51, 13, 28, 4, -69, -58, -36, -26, 61, -49, -13, -42, 106, -33, 86, -109, -83, -39, 17, -74, -82, -10, -81, 112, 28, 34, 69, 13, -2, 38, 27, 64, -63, -27, -19, -53, -30, 37, 43, -39, 42, 103, 43, -1, 48, -18, 84, -2, 16, -36, 37, 8, -90, 18, -128, 74, -33, -51, 28, -94, -83, -27, -92, -109, -42, -29, -54, -60, -68, 13, 22, -10, -19, -35, 17, -52, 32, 78, -98]
11093i8J39j6J0K8Rq1O7Rj70Q1l1M4P3l1o5%L1l3l3j4N5k7P0L2o8lL0k2L5m2R
11124a2QJ9Pj3N3j3n1j30J36n1m1N7q3J22N4m0L4r6Q1O9o5O0k2j13jJ26m7q3M0
11153EJ2j17J17m5o3O8Mm8O6J7m2n4Q5k5L7N3p7M2k0l3K8kJ4k4j2Kj0P7j7mj8
11184A6MK1m5n6R4j05K8K3OJ22p4n5L9%O6n3j1o2M4L9k6r7P4KM2p6P0r5q0J43
11214bJ3L2j25K4QL7lM5mO2n2q1P2q7Q4m9j9J23m8j4l2l8J99r8n2N5j11N6rK8
11244A4J3m4L9k8RMp0n0R6J4qm4J7O0n5NmN6j3Qp1K2oL8m1o1J34j03L2J2JJ01
11276G7j9p5Pm2M6K3n7J14j54N5M6N5j47J38r1j6R4j23J66j7j15K5M9k8J4q0L1
11303b4M7j32J13l8n0J10j45L6L7M4qp2j5J01k3m2k8j8rl0J46l8j4KJ19p8J6k0
$$ y = [-98, 41, 25, 35, 63, 72, -9, 58, 67, -103, -22, -53, -9, 64, 33, -32, -32, -1, -34, -67, -81, -26, -53, 17, 49, -19, -22, 8, -14, 21, -21, -12, -4, 15, 22, 9, 62, 49, -2, -132, 4, -47, -88, -31, -114, 8, 62, 22, 56, -40, 41, 110, 45, 105, 83, -30, -31, 95, 48, -35, 5, 17, -100, 17, -28, -91, -23, -19, -67, -1, 16, -26, -80, 5, -20, 17, 70, -7, 35, 15, -18, 10, 8, 22, -2, -14, -12, -22, 55, 38, 34, 16, 20, 41, -4, -60, 34, -71, -43, -20, -14, 108, 34, -21, 18, 18, 84, 31, 20, -42, 2, 41, 15, -82, -8, -6, 36, -40, 30, -65, -145, -2, 11, 43, -82, -58, -50, -13, -16, 29, 25, 87, 35, -46, 26, -61, 23, -26, -45, 78, 30, 16, -16, -54, 145, 47, -5, 50, -61, -5, -14, 14, 27, -17, 22, -6, 3, 7, -63, -113, -17, -3, -11, -55, -38, 22, -33, -28, -32, 24, 11, 19, -52, -30, -36, 2, -39, -100, 34, -69, -37, -25, -24, 77, 58, -17, -10, -52, -6, 17, -40, 74, -80, -25, 21, 76, -71, 67, -24, -40, 54, -69, 97, 80, -35, -10, 39, 11, 25, -55, -24, 23, -109, 4, -34, -84, 26, -119, -83, -46, -2, -10, -82, -97, 4, -19, -61, -89, -107, -116, -146, 0, -38, -52, -50, 69, -9, 7, -13]
11331a3J7o0P5L8q6L2k2J16j31J28n6jp2RL7r6J03q4J8J35p3j5L1n9J2J03j10
11358b4M7n8jK5m7L9M4j3or5J02n4K6rL7Jj17J03q2J60r4N0p5J11j9k9K6l9N2
11387F1j56J75j42J04j21R4r9P1L4j1k0L4j15J02N6j52J18L2m3J2l9n8Q0o6K8
11412b1L5l0Q1K6j08L3l8P7K9j72Q3M4RJ8q5K1J30p1n4l9Q3MJ9J12j54l2J9N0
11440F9p4J8j3O4J5j34N0L7K2n9l1K3J7r4Q9L7m8K3R7j23L%l3J17n1O7kj51J2
11469e3K7l2P4k1m7O0qK6m0M1n3R1L5J4j54M3j6q0Q7l3J46j8j09L7J4k3J5k8N
11498@j9Ok0oL8p8Q6MJ01j12k3j2nk9P6R6j03L9k8L6q3J00n0J3j41R3N7r7NP9
11528B3M7q0J1m0J17m0p%l4rJ01n7R5j68J13p3J9m5K2L2j00J24o8N4o1o6Q8p7
$$ y = [-13, 4, -56, 19, 57, -29, 3, -19, 97, -34, 94, 38, 37, -35, -26, 11, -85, 18, -66, -48, 87, 14, -1, 30, -29, -17, 86, -24, 23, -35, -36, -11, -58, -19, 25, 12, 6, -89, 13, -41, -15, -24, 13, 14, -103, 0, -82, 78, -16, 34, -41, 70, 51, 22, 48, 9, 61, -95, 80, -62, 42, -79, 15, -84, -13, 21, 10, -10, 24, -91, 11, 67, -85, 33, 65, 22, 34, -5, -63, 17, -49, -21, 14, -16, 65, 91, -17, 16, -22, 55, 84, -88, -5, 39, 48, 66, -19, 2, 132, 61, 7, -32, 51, 55, 74, 186, 32, 0, 19, 69, -5, 13, 0, 64, 79, -55, -5, 32, 54, -5, -36, -13, 4, -90, -1, 36, -12, 11, 108, -15, -12, -12, -45, 72, 21, 88, 86, -65, -53, -26, -58, 16, -5, -52, 8, 0, 26, -14, 27, -26, 65, 100, 114, -40, 3, -13, -93, -6, -39, 107, 89, -20, 17, 31, 8, 23, -5, 0, -19, -13, -33, -39, -1, -79, 7, 11, 112, 0, -23, -35, -40, -69, 7, 103, 0, 39, 11, 47, -36, 64, 14, 27, -114, -21, 36, -61, -56, 23, 70, -10, 1, -39, 78, 38, 31, 31, -3, -12, 89, 32, 127, -41, 72, -1, 18, -27, -5, 27, -73, 51, -17, 37, -24, -90, -2, -79]
11556g9qK8M2o7J0RJ15r2q2J27K4o1M4K8j00M3K9O5j50O3Q1L6q4qm7O0K2p9R7
11585F6j04N7r8Q4o2O1%N9j19QQ6n4l7J14j42P5n3m4M8kJ17r3J07j63K19r7Qk1
11613B0q6J5O2K2m6L7o9J11j3K1j32M4L8k0JO2j0j19Q3j3L0o8L2K0j30J15m6J7
11641b2j7R2q9pK2M1L4j3J6q7J3j0n1k6R1l3O1mL9k8j7J4Mr4L0Q9K6n9K7M2n5
11672B9o7J04%ln4%K6j1l7N6r6O5o5Q2o1N8K6q9N9n9k8J06l3K9k5J0o5M2J2K7
11702C8l6K7j22P7p1L8J3P4QRk1n9R1j10N1k6P9l0K3M9j11o2J09j07P6l4JJ15
11730H9j26O9Nk6m4OQ5j2q0P5Rj45O8P7p1M1N1o7p4P0K9o0J07n5r8J60j20k2J9
11759d0K9n1J79l9j28N3L3K9j3K9o3q7R2m6K0M2N3l0K7p5o4M0k1K5l8M2lJ07p8
$$ y = [-79, -87, -59, -17, -84, -74, -65, 50, -42, -124, 3, 27, -34, 10, 38, -62, -19, 10, 75, -75, -12, 69, 105, 21, 13, -34, 26, 48, -31, 66, -38, 19, -79, 5, -57, 4, 4, 63, -56, -48, 38, -16, -53, 61, -81, -6, -59, -103, -55, -57, 60, -33, 74, -89, 130, 33, 41, 20, -66, -51, 11, 33, -13, 24, -45, 66, 53, 74, -58, -14, 24, 4, 5, 67, 57, -62, 21, 8, 38, -30, 2, 22, -108, 7, -39, -22, -39, 53, -36, -43, -21, 20, 54, 41, 57, -30, -17, -27, -78, -104, -13, -46, 15, 11, 50, 22, 5, 19, 23, -71, -41, 48, 74, 15, 42, 84, 29, -38, 66, 66, 63, 9, 9, 35, 24, -13, 43, -53, 12, -53, 29, -32, 26, 52, -37, 22, -37, -65, 41, 8, 37, 12, 22, -43, -1, 11, 38, 2, 29, -93, -16, -87, -49, -36, 38, 46, 55, 34, -25, 66, -44, 7, -19, 60, 30, 53, 102, -9, -71, 38, -69, 7, -27, -26, 89, -37, 32, 37, 11, -33, -27, 58, 46, -34, 41, 50, -95, -27, 50, -21, 20, 71, 4, -70, 0, 29, -31, 76, 21, -77, 83, -37, -59, -40, -11, -62, 117, 78, -50, 3, 36, 65, 52, 81, 18, -69, 23, -23, -3, 39, 92, 62, 89, 14, -50, -10, -31, -6, -44, -2, -5, 102, 24]
11788B4k8Om8n0N7M5K1L0l6p5J36r6j47J47lO4r9L4MP3n2O7K2j40M2n7J7Q1j06
11817f7O2O2o1m5J14n2m1J41k8j25L8o3L9j8N3L3m9M3j16J93j05q1M3j1K03j83
11843b1Nl9N5N7n1jJ2j8j5N2r7MN3l5R9k17J39o9J95m4q0R7rkm0L2j41L4Q6m3
11873bl8J87k15qJ18n6n6K1N2J1k0q6M9j8J57q3k5K6m0m5N3J18k41K41j15J3q7
11900h9O3p0J55o7M5j8M5J2p0j5K8n7J53k3r7p3J32Q1q1j0m2k4L3l2L4JJ3o9k4
11929f6J02qjr2Q1jj04k8P6P1o1q0J25o2J45m8P2p9p5N6rj4LJ4m9K6J5K1l5k8
11959c3K4O2r1PKK6J32q4o0O6r2RK4L3j63P9M6j2Q1p8l0K9L2mJ9o9O1j01Q8k5
11989b2Q6q6nR1j55Q2J6L5r0Q3K5J28j33n6Q1j22R7L9n9ro5J5J7O6No6K1o2N8
$$ y = [24, -4, 2, -46, -96, -39, 6, 27, 57, 21, -54, 82, -14, -161, -14, -17, 47, -52, -18, -14, 59, 7, 74, 96, -44, -2, -59, -42, 39, -67, -5, 57, -4, -49, 65, 13, -28, 113, 85, -40, -2, -65, -26, -44, 9, 42, -7, 36, -80, 113, 8, -73, -30, -41, 162, -21, -16, -55, 0, 57, 6, 5, 17, -1, -16, 36, -61, -57, -4, -39, 60, -157, -18, -87, 108, 64, -16, 81, 72, 70, 30, 62, -79, -45, 41, -2, -40, 147, -68, -76, 42, -14, -70, -49, 3, 14, -6, -92, -43, -61, 96, 13, -12, 14, -26, -71, -18, 100, -141, 100, -15, -2, -89, -26, -96, 59, -8, 37, 19, 64, 76, 6, -9, 19, -38, 115, 92, -5, -78, 54, 135, 54, 44, 2, -22, 11, -21, 13, 14, 27, -42, -66, 36, 28, 27, -65, 16, 15, -89, -117, -41, 30, -31, -111, 14, -48, 97, 49, 121, 42, -33, 23, 14, 0, 3, 17, -32, -6, 9, 30, -5, -33, -9, 53, -38, -31, -29, -3, 129, 45, -15, 51, -41, -32, -8, 25, -138, -59, -13, -25, 56, -22, -52, -23, 9, 5, 24, -45, 16, -85, 3, -22, 64, -22, -27, 64, -91, -9, 7, 42, -48, 35, 60, 188, 55, -1, 80, -42, 55, 94, 35, 26, -39, -24, -7, 59, 64, -2, 19, -43, 15]
12018A5P6q8jq9R0j12J11l5N8o5K2N2o2l1P5R0j06L3m6k4J4j1P1p6N6K7r0j5l
12047f4R9j02O9o1O5m5P7o8O6o5J6P1m1k8Qj4M3j00Q8K7o7P1NK2j03J01q0l2P2
12076C0O3q5N7o2q3R7M1j06N4M9M5j61M9o4P4o3O9m1J03j02L5rK2R2j22RJ2m7
12104d4j6P7n3J35j18N4N8j27oK2o7J48j15N8P0j04R3q3L8L1j08J30m5l4m3J27
12130G8j37L1L3L2j1mj20J5J12J2m7l9N0N2n4K0k5L2J9p0j2J07j14O2Mr7J00k9
12158@m2O5pK1r6J1N1k7m5J15r4JQ3J5j22J95j66n5L7jL4Q9m5rP0q0p8M6M7n6
12188d3K6Qn4R0mP2qm6p8J12o7Q1o7l7J4J76j10j51Q4M0j14O7k9K2rN7Ol7k2J5
12218fm2J1L0M0o2J0m9PP2p2R8j00O9On1N7K9l9p3j4R9p8M5O3q6L1J16j90J15
$$ y = [15, 91, 3, 2, -87, 3, -109, 2, -33, 25, -40, -18, 34, -28, -59, 16, 106, 0, 33, -13, -37, -23, -34, 37, -39, 17, 44, -46, -61, -64, 35, -67, 2, -59, 6, -39, 38, -30, 36, -29, -13, 58, 17, -11, -3, -17, 26, -74, 14, 41, -26, 45, 50, 72, -31, 70, -10, -42, 30, 93, 8, 65, 3, -80, 17, 58, -48, 6, 55, 100, -61, -12, -76, -2, -65, 4, -37, 66, -36, -1, -10, 12, 104, -18, -9, 3, -44, -60, 17, -36, 99, -19, 35, 93, -34, -40, -18, -85, 63, -52, 6, 76, -28, 65, -18, 20, 51, -57, 73, 28, -6, -49, 78, -59, -28, 5, 37, 26, 22, -98, -83, 29, 41, -6, -45, 5, 57, 3, 23, -2, 30, 49, -21, -33, 74, -40, 22, 26, -71, 29, 0, -42, 23, 16, 37, -59, -48, 3, -24, -69, 46, -48, -47, 36, 51, -71, 124, -42, -97, -60, -61, -27, 62, 17, 8, 78, -2, -80, -34, 13, -43, -17, -9, -63, 27, 23, 95, 87, 41, -37, 75, 8, 89, 22, -15, -1, 175, 65, -86, -2, 38, -76, -9, -38, -16, -25, 32, 38, 1, -21, -6, -48, -37, -7, 33, -29, -19, -68, -61, 11, -61, 37, -63, 6, 12, -39, 18, 47, 8, -65, -79, 20, -58, -13, 50, -36, -5, 111, -79, 36]
12247C6K2lm5Lk0K6p7K0P6j59J92lj29J02j5PJ7pL5r6k0qQ5q3l8O2N9q1K1Q3j14
12278e2Nkj2j8R9k0K7p1K2K0L2j23L0J20j17J4L4l9K6NJ7P3L5r5j9lK1M1j06J09
12308E3q0L0jj6r0J04j7P3j45J4J05pj0rj36J37J7m4N8j16L8j1p1P1L8m8OJ31
12336G4k2p7L2O6r7O5q2r0Q0J35j42P0R6j67N9J9LJ4j13j0J1J43j30R5q1J22n7
12363A6lk1j30J38l4R6ok2r1K3ol8K0L8o4J01j41R8J0QJ47j54M2k0l4P0j3M4j08
12392c4j5M8M5jj4n8L4Lm4J2q0K16l0l5o7N6r0J03k1k9N3r4O3o7J79j53N7q5K2
12421b6J88k19K1k7J63p2m4N0j0j5o3M2JK8O7n8m6n4K7J14j21O7npk9O4O1j28
12449c1j7J02K2p5o4L8J27r1j58J41j13J42L0n2l3j3J46r1n2J6k3J1L6K3o1J0
$$ y = [36, 58, 55, 10, 13, -7, 19, -58, -38, 38, -121, 71, 68, -61, 41, 26, 33, 50, 43, 78, -18, -38, -46, 39, -44, -82, -20, 39, -42, -21, 62, -52, -47, -49, -61, -79, 20, 0, 27, -44, -22, -2, 30, -93, -63, 57, -60, -46, -12, -51, -25, -20, -3, 70, 105, 10, -9, -12, 9, 50, -56, 53, -27, 3, 2, -14, -104, 0, -17, 56, -89, -75, 30, 23, 13, 4, -132, 5, 22, -22, 36, -80, -42, -53, -124, -53, -15, -63, -57, 74, 52, -25, 7, 73, -24, 41, -41, -131, -51, 84, -58, 12, 108, -59, 0, 19, 22, 36, -77, -87, -76, 67, -63, 32, -49, 73, 16, 13, -8, -138, 0, -34, 62, 56, 34, -57, -34, -40, -78, -58, -20, -84, 17, -124, -26, -16, -8, 139, -15, 27, 7, -27, 43, 30, 74, -34, -49, -1, 44, 43, 29, -29, 5, 8, -36, -24, -104, 112, 82, 47, -20, 36, -54, 49, 28, -1, 52, -42, 21, -46, 133, -20, 37, -48, -26, 162, -57, -36, -63, 100, 28, -16, 34, 24, 9, -54, -12, -11, 17, 84, 26, -20, -74, -47, 67, -54, 13, 8, 1, -28, 36, 97, -31, -48, 54, 76, 1, -63, -25, 102, 11, -147, -6, -119, 23, 53, 1, -32, -45, 101, 10, -42, -26, -49, -38, -2, 21, -40, -30]
12475c0N7j6KL2n7M1n7r4Q2j2J44j2n7m2k7OK0N3l5M8j25M7k1J50l5j05K4K3o
12504bp4M0k1p7J24M4q0J9P8n4L2m2l4N6m6N6p1Q6n7O7m8j8M5q2R3j7o7n0O3K8
12534im5Q8l4nj1K4l7J06j52JM1N0Q9l7m4l8j4RK3n4K9p3J65k53K65p5p2N5n2
12563f0L5J3r1J24j08R4k8l1l5M4QK4Lk9R7j8MQj28K4J37o9l1M1oq5J6J24r8n2
12593g3J3K5J72r2n0k7Q2p1N9lj44J23j10P3M6r8J12o9N5j01J15l5jm8Km4K3J09
12621D3k5j18O2P1o7J38k34J13J1J65j86j86J33J99j9l92K74J99QJ69m40J09L18
12644C45n83L57J86n09J53J3K11k61J53K6l25M87l69J72m9J42k26k72L42K2k43
12665b28J47J54j56L3J80k31R4q4P6j56N07m22J61K77j36m25j13P44o55J90K38
$$ y = [-30, 27, 11, 13, 45, -12, 29, -28, -122, -40, -52, 92, 80, 23, -19, -46, -40, -20, 33, -2, 46, -79, -32, -53, 97, 62, -43, -19, 4, -2, -76, -36, -57, -134, -10, 34, -46, -27, 51, -3, 29, -13, -47, 9, -37, 19, -52, 34, -23, 44, -4, -22, 23, -59, 34, 17, -50, -100, -37, -9, -54, 34, 0, -5, -16, 8, -29, 77, -75, -74, -33, 17, 106, 69, 25, -13, -27, -18, 5, -49, -20, -93, 72, -181, 84, 9, -63, -8, -60, -25, -12, -103, 21, -87, 7, -21, -52, -87, -43, -35, -11, -8, -37, 60, 42, 46, 54, -74, -50, 87, 18, -13, 28, 22, -63, -47, 77, -21, -73, -60, -35, 137, 45, -5, -32, 50, -21, 38, 35, -109, 14, -96, -23, 23, -75, 37, -32, 23, -78, 37, 2, 1, -47, -45, -89, -66, 43, 18, -100, -38, 33, -34, 104, -130, -17, -6, 159, -27, -213, -80, 119, 100, -292, -18, 181, 189, 358, -82, 27, 345, -238, 119, 305, -204, -51, -38, 173, -88, 65, 91, -234, 253, -116, 56, 7, 149, -77, -349, -7, 15, -228, -81, 73, -83, -50, 130, -101, -7, -91, -15, -171, 336, -86, 75, 352, 216, -209, -322, 422, -233, -43, 195]
12686A95k48K06k94r4M3M23k91k55L42o1j24k8N67l72j11j2J50l57M08k65M60
12707B82p35K91J01k50O01Ql17K02k59Q5m6j27J3l17P21j89J24k9J1j31L41l91
12729a1M5m9J19n48L40J96K52k73LM8O8j47r5o5pK02Q5l67K21m9L3L7j08K27l63
12754b06J49N9k1J74j68J33j00K7P5j95P1N5o2j8P9k0N1J7Qj54O3j5l1M0o4J14
12780F1j52J78l6n3Mj8mM6mo6j6O5K1J5l6q6OK3K6n6M9N9l8J6r2Q4j0R2q6j1N0
12811C1L0p3l3M8O0k4j8jN1k13J90p4M2n5K9L7o6kK5O4j34J29j25O4j4Q4j24M3
12839b9P9o9k7J06k18M03k82J05j4j57rJ89J4k24J54M0p9K89k25j95K21k76L32
12862A28L1j99K9r4J53j23P3L1r0L0o1J75p5m0R5j08J09j53K6J42p5j2jOq1Q7
$$ y = [195, -53, 153, -141, -235, -192, 231, -60, -315, 27, -34, -158, -186, 381, 9, -102, -114, 36, -321, 87, -178, 282, -453, -162, -61, -311, 290, 298, -19, 183, -76, 9, -37, -164, -151, -468, 253, 64, 188, 159, 170, 39, 380, -11, 34, -15, 104, -444, -104, 92, 344, 71, 74, 122, 190, 43, -52, -117, -124, 78, 163, -204, 17, -32, 1, 38, -70, 157, -206, -57, 2, -19, 155, -13, 120, 20, 47, 122, -73, -2, 53, -9, -27, 52, 32, 83, 100, 108, -46, 17, 2, -29, 11, -53, 61, -91, 87, 51, -2, 2, -16, -20, 26, 22, -44, -60, 5, 26, 41, 5, -81, -75, -52, -26, -82, -33, 26, -12, 4, -88, -4, -14, 78, -8, -19, 31, 61, -12, -45, 3, 63, 39, 21, 20, 71, -142, 48, -26, 16, -39, -10, 27, -39, -41, -16, 48, -86, 43, -82, -18, -32, 52, -72, -29, 50, -19, -46, 60, -158, 245, -37, 68, 54, -103, -112, 77, 91, -133, 21, 61, -18, 271, 46, -149, 72, -204, 128, 159, -40, -11, -105, 48, -75, -2, 29, -61, -31, -92, 83, 8, -32, 63, -45, 64, -89, -63, 79, 4, -8, -9, -3, -84, 3]
12888Cj1o7KJ06j47Q2O6%j88R6j3MJ24M0j16J07n4j12J0K8OJ12r1l9mP1P9k9o9
12917dKkMM3J1o8O9j04J37n5l2L6j08J17j20L6O0l8K4p8L2J41j31n5J31m3j4R
12945@l3L5N8n8OO3p7M2Lo2j85K38p2J0m2K9P2j61J28j0R8r7N2j21K5M4M4n0J2
12974iN8r0N5k8K7M6j7j1o9LJ8Jo1K5j2J9K4P4n4mk3K5r7R8J0J8j16L7K6%Pj8
13006c8OPn0J26J7o4m0JL4l8P3o9ON0j9L6p3N5O5j47J12j02Q9m2Kqj19Q7nQ2N5
13037H9o1k0n7P7m2N9m6k9J9n7lJ54j49m5R7pJ7L6j12R7k3J18p3K4l9N7j28K6
13065b1j3N7Nj8MJ9p1k2Q5k9%l0L5N1j44Q9N9q5n7J06o5O2k4m6P1q3Q3o2M0l9
13095d3Q0j11M1p5K9J29N7j48R0l0k9N7k3L4j2o4L1j2L4K9qk6K3Q4j13j8J3N3
$$ y = [3, -8, -75, -73, 33, -114, -32, 34, 34, -154, -58, -71, -67, 57, 97, -19, 88, 34, -78, -68, -40, -34, 78, -13, -52, -56, 15, 94, 65, -4, -2, -4, 0, 43, 54, -14, 55, -49, 88, 33, 1, 37, -71, 46, -74, -38, 22, -16, 8, -70, -38, 103, -28, -83, 48, 5, -9, 0, -33, 2, 60, 2, 8, 71, -6, 36, 39, -23, -208, 30, -42, -32, -74, -45, 27, -134, -6, -16, 82, -15, 37, -84, -59, -15, 29, -21, -9, 49, -41, 14, -14, 13, 59, 42, 31, -38, -35, -17, -16, -77, -52, -64, -45, -21, 53, -1, -5, -28, -3, -100, -2, 8, 26, -90, -53, -27, -27, -20, -38, -32, -25, -75, 51, 68, 4, -36, -35, -1, -39, 34, -35, -29, 21, 2, 38, -35, 20, 85, -62, 50, -52, 37, -5, -3, -11, -130, -43, -48, 34, 89, 28, 8, -49, 28, -14, 45, -1, -30, -11, -68, -71, 83, -66, -111, -14, -21, -4, 32, -80, 17, -6, 112, 39, 63, 24, 81, -47, -21, -34, 23, 28, 10, 14, 33, -38, -60, 25, -4, -4, -34, 1, 52, -92, -3, 56, -29, -86, 20, -45, 17, -7, -53, 18, -65, 18, -44, -4, -43, 37, -74, -33, -108, -79, 50, 107, -41, 49, 19, -10, 47, 24, 58, 46, -18, 13, 1, 35, 64, 56, 30, 53, 137, 24, 6, 19, 72]
13123G2j20jj4N5J2N8r5M1l7J1J7k6oK3Kp4N3O3j22kO4l9n8Q5O4o2j9M8N6kl5
13154A2Q1q1o4R9l9qp0mR3L3l8L1l5j09J38k3K7j2o8m6L9k3K3K7J2Pq4R1Nj11
13184i7J23q3M4J16j31J2l6J02k6k4k6J9Pj1P5Q8j22o9K6k0jL2J2l5KJ06L2o1
13212E4j39L5J31J0j26ok0K3kl9J53j03mjM3qj9K2J4M1q0qJ8p8J28q7qM7P3p9
13242a5r0Q6n3P7n7J05q4j0j1N4r8J06M4k8j3q8N6J7MQ6j21lJ12n1k5n9Q9KO1
13271I3j02p6Q0m2P6j4m6K9k7J02j82p7J80j4mM3n1nK2K0l2L4N7j06J8M8rm4L3
13300DP1p7J02j03l3m0J57m2p1M1L3j80J29l3L1k8nj11J42O9j6M0l6j17R9m1m0
13327e5Q4p9J07N5j38mp6J05r4J52j00K2QK4M3j27L2o2J28k2K5Q1r5q0J57j31
$$ y = [72, -48, -49, -63, -8, 4, 62, -33, 8, -29, -18, -1, -27, -33, -10, -8, -82, -29, 34, -88, -90, -26, -65, -123, -38, 26, -36, -55, -7, 49, 47, 12, 93, 12, -52, 47, 8, 0, -70, -74, 19, 52, 14, 45, 10, -99, 39, 16, 43, 31, -37, -83, -44, -67, -44, -17, -5, 2, -82, 9, 14, -97, 26, -57, -13, 103, -28, -16, -52, 50, 24, 0, -26, -7, 0, -11, 64, 152, 30, -39, -13, -33, -34, -2, 10, -25, -23, 83, 115, 54, -85, -50, 81, 91, -35, -41, -61, -38, -40, -79, 74, -29, -33, -34, 9, 1, -18, 4, 18, 59, -21, -29, -11, -89, 39, -48, -56, -9, 64, -15, -105, -19, -72, 5, -52, 53, -31, -41, -52, 2, -96, 10, 54, 26, 13, -75, -19, -2, 2, 88, -33, -36, 76, 25, 0, -59, 30, 32, 93, -9, -85, -5, -47, 29, 15, -31, -2, -29, 73, -109, -186, -6, -20, -24, 19, -32, -37, -15, 5, -27, 7, 64, -42, -24, 24, 15, -29, 4, 75, -2, 100, -3, -36, -76, 81, 39, -32, 9, 42, -138, -9, -42, -11, -39, -44, -155, -13, 56, 40, 80, 44, -73, 26, -15, -55, 29, -50, 57, 112, -26, -30, -106, -1, -95, 57, -43, -21, -13, 11, 54, -73, -41, -103, 25, 3, 28, 109, 14, -66, 91, -40]
13353d0Q8L6j75J6J22r5J77p7j7m2o2O7q9R4K5q1Q5r8j2J01j20K9O5p0n6J44O
13380B1n5l1L5P6j59J19L7nKm0n4L1J5M7j23P2q1R6LQmj4m4P4O6q6o5J72j06n6
13410d9J27j10L6N0p6o4k0N9J9L6j6o5N9k7J3mK4K2M5j22K2l8K5R4Jl9KL8o5M8
13440B5J05o2j40J10j48J72Mj09q9P9R0n4L9o6N6m%Rj7j4j1K6l3N0m5rmO3P7j28
13470b8M1j2L3m7LL5o5PJ44j55N8q5Q1M4N9k31J07q1K6J14o2L8q1O1LQK3k2Q5
13499A01j30J9Q5j43J12N5j56Kk2R5j6O3n7K3k1j6m9L3K7L7n0m2N7n6N9J8Pj15
13527h0k4R2p1J31l9n4O9q3J26p8k2P2p2%J13l1l0l0O1m5r0N7N0p2K5lk2l9J23
13556C4n5J6K0l8j9m8Mj9M6R1k0L3j5o6j9j5NJ08l6l9j6N2k0O0j0n6K1oM6j34
$$ y = [-40, 48, 84, -91, -75, 47, -48, 129, 52, 35, -7, -69, -2, -91, 3, 28, -53, 32, -66, -78, 23, -97, -68, -3, -73, -129, 15, 21, -34, -65, -30, 46, -113, 6, 43, 38, 40, 0, -54, -23, -8, 39, -84, -12, -93, 3, 6, 14, 10, -4, -48, 26, 92, 6, -59, 113, 7, -49, 78, -32, 4, 54, -22, -86, -106, -47, -28, 8, -8, -73, -14, -41, -28, -32, -8, 14, 59, -63, -41, -79, -54, 40, 41, 2, 4, 42, -23, 25, 130, 68, -72, 38, -110, 62, 66, -43, -132, -53, 37, -17, 22, -44, 12, 8, 8, 17, 0, -14, -25, 1, -32, 18, -27, -36, -40, 23, 100, -28, 13, 1, 34, -13, -10, 25, -40, -33, 111, -44, 14, -71, 10, 54, 113, -118, -11, -92, -66, 48, -14, 24, -57, 4, 7, 15, 38, 16, 101, -29, -10, 75, -68, 44, 99, -57, -55, -77, 18, 2, 65, 8, 31, 10, -6, -55, -22, 5, 42, -8, -50, 7, -49, 10, 28, 35, -80, -104, -12, -83, 48, 9, -45, 24, -59, 67, -11, -33, 39, -33, -33, 80, 49, 19, -11, 50, 5, -85, -28, 22, -50, -25, -28, -50, -89, 34, -21, -5, 15, -23, -42, -90, -86, -105, -59, 32, 12, 45, 30, -36, -55, -70, -65, 43, 7, -32, -48, 4, -16, 44, 34, -22, -1, -7, 39, -95]
13586i5N2P4r0j7J18M6j66P9k5N1j4rn4K6K8%l8N4j04K8OK5o2KK3j1O2O3o1K1
13616A2K9l4J7k9n2q7J66n1k6k7P6k6L6R9k13J95k3p2L7j4o7N4J6j7k1N6l9Q3
13644G8j03j6J01q5M1j28P6Q1K8k5j7qo8j5L3lM7n9L3L0j8o0r0J44m6KO6K4om0
13674ck9m2l2J04l4L5K9p7J06M8j24o5J30k0N3n1k4M9l9m4Q0j05M9j4M8l2j05
13701a09l%Q0K7Q7j11J6rj2J03m1j25K8j8L1Q8l4p9NN5O1k5l7r4J75p4l1J6qM4
13731FM7j51J27O9j0o4J9r1K8m6J06k2N2J6j34PJ07J7r6l6k1N3O4q0NP1j30m9
13759a36J68j1o0N9q4P2j04JN4N4nNj47J68o1m4J45q0J06j00j10J11mJ2jR5j59
13786e6L4P5m0m0O4l0l2P5j1mj05R4p9LL3j12J71k7R0j45k1O5p2R3k6mj15K09
$$ y = [-95, -43, 31, -59, -76, 42, 88, -78, 1, -24, 27, 13, 4, -50, -24, 4, 4, -34, 20, -84, -56, -50, -25, -87, -85, -62, -73, -11, 52, -9, 12, 41, 7, 24, -5, -57, -144, 22, -29, -55, -82, -6, -32, 4, 103, -110, 85, 62, -10, 27, 13, -54, 0, 16, -1, -22, 34, -5, 78, -25, -41, 60, -25, 16, -112, -36, 45, 73, 48, 31, 23, -45, -60, -27, -30, 17, -42, -9, 21, 3, -57, -147, -3, -49, -47, 19, 43, 37, -3, -32, -74, -106, -2, -36, -1, 28, -49, 57, 105, -19, -84, 46, 26, 79, 28, 4, 53, 14, -30, 50, -55, -6, -20, 28, -4, -109, -112, -112, -32, -5, 82, -29, -13, -22, -34, 69, 28, -97, -69, -87, -56, 32, -2, -81, -76, -21, 40, 15, -22, -116, 59, -15, -46, -30, -38, 6, 53, -98, 29, 98, 88, 24, 43, -48, -20, -66, 40, 18, 70, 86, -48, -41, 66, 83, -13, -49, -70, -17, 47, -33, -28, 43, -87, -136, 32, 21, -39, 20, -64, 8, -96, -95, -41, 13, 8, 13, -134, 34, -27, -71, 74, -6, 100, 0, -110, 1, -3, 9, 8, 103, -56, -22, 53, 13, -27, 37, 7, -25, 50, 39, 35, -70, 24, -55, -52, -19, -131, 40, 13, 103, -42, -63, 2, -70, 23, -3, -7, -122, 87]
13814H7q1p4J44j10p0J67J4r8k6MN6N2q8P6j23P8P2J8n1pjl1j03Q%J01l3o4Q0
13843cqJ11j05L5o5N0J7l8N2k0k8l9o7Q8M7m2J0j21R3l5J25l0m8jo7K3L7nJ4k3
13873d3O7M2qj13O2j26J31qn6J07m5J1o7K0pJ09k2p2J4n7J00j10O8KJN1m0m0J
13902b8J6K1m7%j2QQK4J03j74L3N3q7J40l0l8K9Rj03M9J03j04Q8l0j08O4M4l7
13930fr2J39J6j3N9j01K1m2On2LL4J18p8%n7J08o4o7OL0M0m5K1l5N3n4K4M4m1
13960b5N0p0J05j02m0O4R7%j15m7N8O6N7j38N3o3O9K1j35P4M4j03L1L0J9OK8J2
13988D6q3K3K5n0Q8j43O4K6M3K9j64k3J69p7n9M1RK1J6o3R3j15J17m3m9K7j2M1
14016cM5K8o2Q3r6j3lj8R2p6J7j7N2M7J06k24j7Q0k8l7NQ0LO5o6j62nJ04M4r3
$$ y = [87, 6, -68, 76, -34, -104, 63, 77, -21, -47, -43, 13, 65, -23, 53, -70, 8, 80, 98, 47, 40, 39, 8, -95, -87, -87, 14, -19, -83, -3, -11, 100, -5, 30, -35, 15, 32, -6, 46, 26, -2, -41, -108, -20, 27, -15, -5, -126, -33, -68, 57, 27, -21, -22, -89, -66, -29, -34, -20, -43, 24, 66, 58, -55, 7, -119, 12, 4, -52, 55, 10, 21, -46, -26, -33, 76, 54, -18, -4, -61, 39, -71, -3, -1, 0, 51, 11, -29, -28, -12, 9, -38, -38, -50, -42, -34, -10, 93, -81, -48, 5, -82, 58, 28, -10, 19, 28, -75, -26, 77, -27, 61, 31, -77, -13, 31, -6, -98, 41, 57, 44, 103, 2, 23, -19, -13, -65, -62, -28, 90, 12, 12, -45, 63, -1, -68, -62, -32, 8, -37, -16, -51, 2, -52, -28, 16, -25, 25, -45, 60, -42, -82, -18, 79, 79, -36, -83, -25, 41, 98, -40, 13, -50, 19, 40, -95, -21, 23, -80, -49, -19, 0, 6, 34, 46, -37, -14, 11, -39, 49, -94, -30, -4, 39, 68, -96, -119, 50, -27, -86, -45, -36, -15, 1, -62, 31, -84, 33, -10, -59, -32, -44, -3, 42, 70, 8, 91, -5, -18, -21, -39, 53, -23, -6, -23, 29, 76, 182, -42, -59, 21, -7, -44, -39, 41, 44, 109, 43, -119, -124, -20, 24, -69]
14046f9K4M2N1m8J4P7j18KO2j45O1m7k8J70j00N6J2k3pj0%mJ7o1Q8N1r1J62j36
14075BrjN6o8J46k26L6PP0Q5r0P6r7PP4j48K1L9J5J8K6J9o2o5Q3M5j38K4mO8J7
14106B6rj10N4J7O4j36N3J0KR1n8O3Jp0K8O1Nm9K8p7M3n5nQ0j13J11o7j0jR5k7
14137D5o7L1L4M9j14J8J3j3mn9P6K3j74J04O1O8k21J19M9n4N3L0l1M5r1m2n3O7
14165c8L9K7OJ7k4K6o0M1kk4Jj4P3l6O7j7m9j15J38n7o0M8n8L1R5j05K5j7j8R7
14195C7j44J00K1k3K6J1Ml1j4J2j7k5n5J48l7j17J93r1j1J45j86J65p8k1n2L3
14221gl7O2L7j24M4L9Jj9j25J81J9m7j7K3n4J7q3M5J35q3K4j6R0m0n9J3o3O3J0
14250B9j06L8N9R5j67k7P6K0m2J49j01j7J8o7P4Q8j30M1j2j3M1k1P9j82pO4j8
$$ y = [-69, -45, -3, 48, 0, 14, 91, -27, -25, 37, -108, -47, -94, -122, 48, -52, 4, 16, -7, -14, -24, -24, -28, -11, -72, 16, 67, -24, 138, 2, -7, -8, 48, -20, 126, -100, -64, -57, 13, 98, 8, 84, -13, -6, 68, -80, -59, -20, -5, 13, 39, 58, -4, -69, 14, 59, -79, -55, -59, 9, 26, 17, -93, -39, -22, 42, -94, -41, -31, -29, 62, 4, 67, 68, -2, 26, 87, 92, 43, 71, -6, 37, -18, -23, 57, -56, 55, -12, -22, -23, 72, 45, -22, 9, 43, 92, -22, -4, 9, -4, -8, -67, 9, 32, -142, -38, 23, 91, -130, -11, 38, -16, 37, 67, 36, 81, -10, -52, -105, -38, 1, 28, 34, 51, 27, 53, -7, 34, 32, 8, 9, -5, 68, 32, 99, 82, 33, -82, 56, -1, -61, -13, -71, -40, 55, -50, -25, -42, -60, 37, -107, -7, 14, -9, 17, 28, 32, 1, -13, -1, -18, -43, -98, 50, 13, -104, 89, -2, -13, 132, -54, 111, 33, 12, -40, -7, -44, 18, 55, -69, -25, 14, 15, -4, -129, 52, 71, 24, 7, 30, -24, -7, -90, -45, 90, 7, 31, 15, 105, 65, 6, 19, -44, 19, 29, -77, -39, 20, 115, -52, -79, -3, 17, -25, 124, 23, 6, 24, -43, 31, 119, -11, 30, 18, 5, 46, 25, 104, -78, -85, -21, -39]
14277c9P9O4j44R9j34lJ03l2j18NM8RR9j08J26j19R6p3J6L2o7L0N8k1K4M1j40
14304f9Ml4pP7l3N4J1Q3q6j8O6k0p8J05m2m9L1nj14J35RL1n4qo8J10j9L2j19L2
14334d3j9K4P5o9J03p6k7J3J11n5o3o7M8J01j59J31K9o2k4P0l0J8l7m2N8J2O1
14361H1j29M3P4j00J4pmRJ20j18r4J7L9P3LJ2n3J09m5j12M2j3K7N2n5L2Q1j25
14389b7L8K8j08n4Q8Lp9J75j52P1J8J18k43K74j35n7J60p5n4L4l7O4K8r6K4M0
14415D6J2r5J15q5n0N8p1J8Rl5M2o4L4R5o4L3k3L4L0j1q8J04p8J6O1K0k5l4k1
14444a7K8J9j12J18p0RK0Pp6R3j4r5R9QQ6j15O6P8j34Q7K3j18O5q9J44r0M2m5
14472A7l4ok5QO2p0k4J8J02q5M2L5n9J2q2J01j03J13o5K5R0rn5j41K20mr5k3L0
$$ y = [-39, 40, 104, -40, 59, -75, -78, 25, -7, -125, -120, -72, -63, 36, -72, 54, -65, 31, -42, -26, 6, -61, -31, 27, 6, 30, 71, -69, -65, -99, -106, -29, -62, -8, 3, 86, 0, -18, 48, 28, -50, 55, 13, -36, -5, -10, -124, 11, 20, 51, -3, -11, -79, 31, 12, 44, -75, -43, -62, -38, 37, -32, 71, -5, -32, -19, 92, 37, -26, -93, -45, 56, -103, 28, 57, -5, -29, 41, 11, 29, -8, -50, 8, 20, 81, -48, -5, 69, -31, -17, -24, -28, -19, 101, -17, -111, -94, -55, 18, 21, 33, -20, 89, 44, -68, -26, -39, -12, 40, -15, 17, 98, -27, 11, 39, -69, -123, -35, -32, -111, 64, -88, -17, 1, 119, -124, 150, 15, -42, 118, 43, -11, 23, -14, 50, 78, -18, 6, 46, 58, -37, 78, -7, -57, 1, -70, -52, -43, -78, -36, -100, -66, 29, -35, -2, -25, 9, 39, 28, -60, 44, -34, -18, 43, 63, 38, 4, -17, 11, 30, -82, 36, -34, -25, -5, 2, -74, 19, 5, -90, 9, 17, 103, -12, 54, 132, -2, 85, 108, -10, 55, -34, 110, 20, 62, 17, -17, -23, -48, -40, 22, -48, -72, -54, 48, -37, 5, 40, -19, -7, -89, 12, -91, 22, -43, -18, 72, 63, 8, -133, 87, 83, -12, -35, -5]
14501ej9k0N2m0J42j37R2pm9N0o9kP2o2mP5o9J0k8j06J48l4j43J89l3j25J14O9
14529F1m7q8Q1Mj4o0K8M5K6o3l9M3L9m1K4pj1k7lo6J43m6J6J9K7jn4L1J5L9q6
14560a2P5J1J2j12k6nJ0M4N8m8J6j2m8M7k0NP1q1Q8k2p9n0N6O7n0M4n6Qk6O8j05
14591g2M4O6r5l9P3K4Q0q9J49j63J26j06j8K3L1j18J59j36J07o5k4L1P6j67M7
14616e6J05Mp6Q6n1q0L7k2j9k1K05j25O1j4j4k1j5J1M6l1m7kL8O2o8M2k8O2k9
14645D0O6j56M2m9N3l4pK7j3j1N6RJ17o4q2k1R4m7n3O5L4n8o0Q8p1L7K5N7l7j0
14675C7lp4J0Mj5M8J1j2O4n7K4q7J06r0qP5p4Q1j20L2L4j9L9L7rO2q1j7N2o4Q2
14706F8l6M5L8p6lj14J33j41J48j28J32n6m6pJ2M4%oK5l3q0J44n2k4n0O1k7N7
$$ y = [-5, -24, -44, 8, -32, 110, -27, 65, 58, 9, 59, -10, -12, 60, -2, -6, 69, 0, 10, -18, -124, 24, -10, -153, 36, 3, -122, -8, 61, 14, -74, 7, 11, -3, -63, -35, 10, 36, -27, -66, -23, 16, -25, -1, -8, -19, -46, -49, -115, 28, -18, -2, 17, 44, 43, -11, 20, 35, 74, -12, 63, 74, 86, -26, -52, -57, -47, -3, 55, 7, 23, 11, -37, 10, -10, -5, 66, -15, 73, 51, -28, -78, -22, 45, -5, 39, -17, -9, -35, 33, -72, -28, 38, -57, -96, -23, 1, 81, -8, 141, -22, 104, -2, -20, 3, 34, -84, 75, -61, 46, -19, -43, -12, 64, -103, -56, 49, 53, -23, 63, 12, -68, -31, -53, -72, -93, 112, -13, 48, 34, 20, -1, -16, -5, 41, 10, -37, -39, -1, 61, -7, 35, 7, 69, 40, 106, -50, -8, -57, -4, -38, -45, -18, -31, -42, 14, 23, 140, 76, -6, -27, 67, 20, -33, 32, 66, 8, -52, 36, -35, 2, 27, 84, 47, 37, 34, -40, -30, -26, -41, 7, 18, 6, 70, 13, 37, -50, 56, -34, -42, 33, -41, 40, -80, -48, -14, -33, 6, 43, 34, 96, 15, -2, 50, -14, 68, 32, 77, 115, 39, 36, -78, 55, -86, 62, -66, 66, 10, -36, -43, -31, 13, 13, 7, 32, -1, -81, 63, 11, -13, -63, -2, -29, 28]
14734B8k6o1M5r0J01K8MLL2m0r7J32m1mJL0r3P0j0N8p4L7J7m6n3L1j6k2%P3Kn4
14766c5Q5q2M6j05L4P5L5j1L1o6j8j2n8R4m5J27p2j4Q2r6O5j31M5J66q9l9O3k2
14794E3O8m8j4j7o3m9LN2K7j20M6J21q8m1P4P2r7K2j51J87k4q0O2l5L4l1P3PK1
14823F4q3K3l6k6J01j8n7QQj2J78j57q3N0M8K3o4j9N0P4p4N3j4Nl8l0J03M3j2
14852A08q3j9j2K4m1l2O5N3o5j5R8p1m7n5J13j41J2M3R7o9L%N2k5j8KN0j25R4
14881dP2j58J40n0j07%J83J9q9k7k2M6n8L9m5N5l6PJ35j41O8n5kQL4j2nmP6j85
14911a18Q1N3m8KN5Oj45j6J01L5J28l5j50P6p9O2l1m2J49j53J27j6p0J7J4m7n8
14938a02R7j2Q1Ql7J7j2N2j25Q4q0Q7r9l2k9Q5q4R0p6K1J30r8K5l6M9m1Rk8J9
$$ y = [28, 2, -59, -14, -104, -3, 25, 29, 32, 64, 24, -73, 59, 18, 14, 15, 45, -48, 22, 12, 70, -4, 33, 50, 4, -49, -18, -34, -56, -56, 17, 19, -35, 50, -32, 14, -91, -57, 18, 53, 42, 73, 7, -11, -23, -81, 13, -32, 95, 23, 9, 91, -5, 60, -71, -26, 140, 51, 12, 75, 53, 121, 73, 59, 42, -21, -70, -67, -15, 12, -108, -62, 59, -29, -70, 4, 76, -21, 1, -150, 37, 13, -67, -5, -40, -6, -37, 36, 43, 64, -19, 4, -32, -58, 43, 25, -32, -24, -16, -28, 150, -7, -90, -40, 8, 31, -33, -52, -2, 72, -2, 51, 37, 42, 4, -26, 77, 120, 108, 25, 6, -6, 18, -23, -55, 10, 63, -2, -17, 81, 10, -37, -92, 21, -120, -108, -65, 32, -37, -34, -34, 18, -7, -25, -23, 27, -98, -4, 68, -90, 50, 0, -107, -107, 76, 95, 6, -21, -43, 3, -55, -16, -61, -6, -42, -35, 100, -41, 27, -28, -30, -22, 12, 0, -5, -9, 67, -118, -37, 16, -32, -30, 25, 31, -114, -130, -29, 6, 134, 99, -51, 25, -54, 8, -23, -65, 84, -69, 58, 42, -28, -11, 3, -44, -102, -5, -17, 64, 72, 35, 52, 40, 92, -33, 51, -29, 58, -41, -73, -102, -17, -101, -11, -87, -66, 64, -34, -9, -45, 4, -37, -28, -56, -37]
14967c7J7m8jK7M9L8R1j40j9O3q3k6R8N4l9J4j08j7L3l0J01q2L3O6K0p7K5J9l3
14996Hj3q9J30J24p1q8RM4q4%l4Q3o2Q2n1L8m0O9l5j18O4k5Q9m0J9N9l6k1R0j62
15026f1R7j0rj5J5Rr2M6M4n9p0J00M7j66L9J9M0P7n0LP1N0r4n0M4J32k64L1k8
15055a04J68o0Koq0Q1M7J6p9k1L7nL2p6J27n5r3M7J2r4J39Q3Pm7j15P8j15M4M8
15084A8o4Q2M4p7J8j04L2O7j8O0j18N0k23J25J83n6l7M0l8m8N6j1l1J2L5n1J0
15111d4p8K5R8k0K8j6o4K1O2kJ6k7N6q9Q4N0j54j9R2m2K3j1K6n0l0J04q6M8J5
15140A6K6j03N2r9N9m2O8M5L3K4j80J75p7J1j1N9n1M4p6o8J72n8P6l3p9M6o9O3
15168B3n8J04km1r2N0M8q6%O4K5p8J26j26k3k8Q0J3Q0j31Q2m9P4m7r0R7J4O5j23
$$ y = [-37, -20, -68, -69, -42, 7, 45, 136, -4, -23, 40, -43, -69, 29, 83, 44, 58, -50, -67, -34, -64, 37, -45, -12, 54, 74, -3, 22, 41, 8, -5, -94, 36, 160, 89, 1, 10, 54, -30, -30, -64, 19, -43, 39, -12, 26, -14, 55, 20, -98, -34, -59, 30, -10, 9, 68, 32, 11, 101, -61, 36, 26, 17, 2, 17, 26, -66, -20, 24, -35, -105, -5, 42, -124, -85, -66, -26, 51, 1, 4, 75, 125, 31, -19, 25, 157, -107, -76, -104, 64, 4, 6, 0, -80, 1, 48, 64, -15, -36, 1, -4, 28, -48, 79, 24, -69, -22, -10, -104, 35, 118, 125, 78, -37, 41, -74, -30, 18, -46, 36, 80, 3, 21, -83, -51, 16, -2, 58, -60, -10, -233, -108, 75, 19, -18, 22, -16, -64, -8, -19, -50, -38, -3, -54, -44, -122, -97, 1, -19, 9, -7, -71, -50, 12, 10, 26, -1, 55, -34, 50, 100, -54, -73, 19, -23, 0, -11, 15, -35, -65, 39, -47, 1, 16, 42, -61, -9, -108, -49, -91, -23, 22, 55, 79, -101, 74, -3, 8, -3, 56, 5, 49, -27, -95, 77, 19, 95, 62, -17, 29, -40, 23, -35, 69, 67, 26, -66, -16, 32, -54, -54, 10, 35, -43, 83, -43, -66, -94, -14, -1, 79, -52, 30, -19, 55, 8, -82, 15, 29, 94, -29]
15197b9J1pL4k4L9P1j65Q4o9N5M4p1j04J74k9n8rP4o2l8J23k5J5j7J02r7L5r2
15225c5J42r2j7Q9n2j3j0l7N3m0K2lk2M2l3M4Rm7lJ5p2J4J5J8k0k6N4q7l1J26
15255CK7o4K3k8K9K4rM6p0P7r9o9K4O8J25j4q6m5R3l5J2m7J3Q7k11R5O3K3j1k3
15285B1r9J23j4j7P9k9n0j8k8R1j4o4o2L7M2J02k07k3J50n0q7N1Q9Nm2k8J06o5
15313aJ6J2k0%k7O0%M3J6Qj42J3J13J4q8J8j8J1j9j5m2J17mj64J39k2O4m0M6q0
15343HL1On9J3n6O6o5Q0J01j46R7j41P7K8j9l5p1QR3M6j37J26oK1o0nRK4o8R8
15373F4q1M6K0p5k8M3O1q7R5n1n8M7M3M5qj21O9p8M3J04j43R1kpNq5L5J70j39
15402A8l0L3r1P1MK4rL0M1j07q6J50L2j16lO3j5O2r4L5L9k8k0K5n4j4Jrn9J31
$$ y = [-29, -18, -25, 9, -15, 24, 95, -70, 14, -55, 0, 44, -27, -131, 43, 14, -44, -53, 21, -41, -79, 44, 19, 34, 17, 119, 22, 57, -35, 107, 15, -2, 87, 35, 22, 12, -25, 28, -12, 10, 7, -15, 27, -6, 38, 47, 0, -3, 12, -60, -46, -31, -13, -33, -59, -5, -92, -123, 3, 30, -34, -11, -39, -10, 14, 5, 51, -19, 58, -41, -110, -86, -18, 107, 93, 7, -38, 55, 20, 32, -15, -2, 85, -126, -31, 32, 55, 44, 21, -78, 45, 31, 14, 93, 64, 14, -4, -32, 59, 45, -19, -81, -44, -2, 100, -107, -130, 20, -30, -117, -66, 23, 28, -14, -42, 64, -1, 15, 27, 7, 7, -20, 40, 40, 83, 99, 107, -35, -22, 91, 105, 17, 35, 17, 28, 9, -6, -48, 69, 65, -99, 40, 18, 82, 42, 88, 8, 39, 45, -14, -1, -57, 9, -56, 24, 125, -21, 76, -65, 12, 40, 21, -14, -85, -77, 16, 62, -75, 51, 45, 66, 6, 1, 10, 34, -34, 64, -17, 29, 49, -26, -54, -11, 50, -37, 58, 7, -51, -4, 39, 84, 76, -45, 24, -54, -11, 93, -50, 41, 39, 32, 37, -48, -13, 157, 18, -12, 21, -70, 1, 5, 29, 20, 50, 91, -16, -102, 48, 80, -36, -39, 24, 9, 71, -23, 12, 51, 23, 3, 28, -26, -40, -39, -48, -107, 24]
15432B4J6l9q0O5RP5L3j00pj01R1o0O0j6n6O2l4J6rK9OL0kj11J23k0Mr5M6J7j0
15463c4P9l7j31J04K8m3RO6p6J20j38K0Q5j7r9p2Q2J1Q9r2j3N8K5Kl8nn1R8l9
15492iK7o2L8o4J58k11J33K5m4KO5p4K7lN2n6L6K3J8n3p9L9l9K0O9n3q1P7M6L3
15522F0p7J2p8L8O2l7M7N7k48J27P6j11KQ9q7pJ48j44J4O6J01j53OmO6mJ25j31
15550A5q3P4k3L1P2j29QO6K0l8l6Q1j11M4K5Ql5J8Rq3J00l7LL7J2p3r5J77r5L7
15580aLj3O6K5j5L5j05j6M8p5J28q8j3K2k4j7J9P9j03K7o5P1pj8NK1o1M7R4Lk0
15611E2n3L6k1n8O4jo8Q3P2q6o2M5M5j15J36j64Q5K6p7K8p7J14kO3j08Q3lL9p1
15640Ej9J01j68P3J03l6n0N9n5k9M2n1J55l8o3Rj9Nj00J02j3n8J82j18j7O2j66
$$ y = [24, 40, 1, -79, -14, -5, 70, 103, 3, -4, -105, -14, -74, -14, -30, -86, -24, -58, -42, -51, -22, -16, 14, 12, -99, 24, 4, 8, -87, -41, -24, -34, 45, 8, -123, -19, 9, -34, -25, 41, -35, 85, -53, -33, 52, 35, -64, -136, -54, -43, 46, -46, -59, -1, 24, 26, -12, -17, -68, 30, -9, 18, -44, -6, -70, 88, -123, 10, 35, -9, -7, 58, -16, 11, 8, 60, 4, 40, 63, 81, 28, -51, -12, -51, -31, 38, -15, -96, -19, 27, 60, -17, -5, -83, -45, 17, -20, 27, 84, -164, -37, 39, -72, -70, 19, -68, -75, 73, -71, -57, 9, 110, -43, -37, -41, 25, 21, 146, 15, -68, 6, -17, 14, 86, -43, -35, 31, 51, 13, -23, 58, -53, -9, 16, 24, -11, 7, 16, -67, 33, -4, -1, 36, 48, -25, -120, 57, -38, -1, 2, -11, 55, 80, 65, 100, -5, -21, 27, -48, 80, -8, -21, 1, -23, -40, -21, 58, -45, -18, -83, -12, -19, -37, -32, -11, -72, -25, 69, 72, 52, -1, 35, 14, -44, 20, 19, -49, 34, 106, 20, -42, 3, 48, -67, 69, -95, -10, 16, -61, -33, -110, 4, 2, 65, -43, 40, 37, 76, 5, -14, 87, -81, -8, 95, 59, 9, 68, 13, -16, 26, -25, 130, 92, 29, 38, 19, 24, -76, 26, 13, -45, 137, 19, 2, 64, -102]
15667a02L3P4J4l0l0P7q1M0L1p9N4j1R0j37O6M5o8m2RO7j38Q3o4n0J67J0n1P1
15695D8Oj02O0mm3k8L0K0J1pJk6j5O1%o3R4Lj34L6M7L1J0j56J53m1N3l4k6n2N6
15726a1pj8N8m3Q8l2m7O4n1Poo6P9m3K1O2j42J15O5p1l0J1q3M4O1o2P1j18N7q
15756c5J8P2n2j2N9o7n3N0J0N1m5l5O0J1p1k4J3R7k0j20M2O1K5m1j10K00q9N2
15784D7l3J0j16R2K2j1pm7m6R8M4j31N8N9r7J4R9L5q3K0j0o4PJ25p8J9N8j5n5
15813A4n4R5l4j5J10j39j4l0O0M1L5m6j48M5MO1P1r1P4r7J00o1P8o1JOLK3p8J19
15843G2r0K8k2l2lM8M4n3p8L7P8q5J99j92L9L7m7RK9m8P7j50J25k0K4kj17J64
15871G1j44M2M3O4l6Q1p8r3P3n3n8J9L0J39n5n6N6n8r2J71j34Q5Q1m0L9o6N7j84
$$ y = [-102, -69, 5, 19, -11, -41, 36, -45, -5, 26, -53, 1, -10, 80, -57, 9, 54, -14, -56, -47, 20, -118, -35, -99, -149, 18, 28, -23, 48, 54, -48, 12, 8, -35, -63, -33, -13, -2, -9, -8, -34, -49, 12, 12, -51, 43, 46, -88, -52, -5, 26, 36, -120, 33, -8, 45, 11, -15, -67, -11, -18, -36, 22, -21, 67, 35, -12, 52, 1, 8, 2, -64, 15, -28, -7, 55, -87, 28, 93, 22, -8, 3, -80, -36, 25, -37, 34, -84, -27, -35, -17, 55, 3, -9, 50, -17, -70, -20, -10, 41, -4, -39, 21, 32, -39, -63, -50, 47, 27, -93, -51, 10, 35, -6, -116, 84, -5, 47, 14, 24, -92, 0, 22, 11, 4, -43, -89, 9, 53, -78, -20, 39, -58, -44, 55, 90, 7, 27, 17, -47, -40, 85, 7, 26, 84, 69, 14, -40, 55, 21, 6, 116, -23, -37, -67, -7, 34, 69, 23, -125, -80, -76, -15, 56, -35, 39, -58, 42, -19, 59, -2, -1, 5, 8, 31, -47, 72, -18, 10, -12, -44, -47, 1, 45, -8, -86, -49, 29, -56, 143, -49, -10, 27, -20, -11, 18, -30, 47, -103, 22, 2, 26, 24, -93, 71, -73, -31, 12, 76, 40, 121, 43, -50, 23, -30, -88, -69, -39, 100, 45, -11, 45, -13, -105, 66, -68, 17, 98, 58, 97, 31, 88, -96]
15899i6J50o1O3j5j86R7L5K7j6J0p8L1O8J7p2lJ8O7n5L0l4k8Q4k9m0no0J06j01
15928g6P2m2N8J5m2n7J0P3Q6r8k4p3O3K9R9j79J37n1m4nR6j3l3n4O5qpmQ5j61
15958h3J01K1j55L2J10r6R3n0o1J88j45L4R6m6Q5j63N1R9j16R1j29M2%j11J66
15983E4o8Jo1L7N7Nj24N6M2M6m2k1J0R0l6k7j1k4O7j1r8m9R6K9K0M2kp4oO7N3
16014A18j03L1%n3qN5j61J08jP3j10J8O1r9J16j9r2N7P0n3m3J9k0R4j5Nj1o6J54
16043A25j47lm0M1J43q0l8NK8j4L2k2r0l5J02L1n7O1r8L7O4q1KQ9j95K30r3p1
16071g4Q1k3m4J68r4p1J17j14l3O7M3k5J15k11J94o8O5o2rj5m9L9P4r9O6j01N
16098e8Q2r3L6O7o1K4j08R5j5l5J1j4j5n3K02n6O7r2P1j16M0q3J22l1R2k4k1L9
$$ y = [-96, 54, -7, 56, 41, -145, -48, -13, 14, -2, 8, -70, -39, 29, 46, -26, -29, -11, 56, 1, 31, -3, -31, 53, 24, -16, -21, -81, 25, -76, -4, -46, 12, 27, -15, -72, -62, 11, 97, -1, -25, -98, -35, -6, 93, -86, 51, 0, -44, -49, 47, 34, 1, -53, 12, 4, -3, -7, 78, -83, 18, 39, -116, -84, 26, -70, 23, -27, -88, 100, -45, -11, 85, 39, 124, -39, 12, 111, -5, 86, -43, -1, -1, -112, 54, -14, -13, -74, -37, 20, 25, -99, -43, -1, 45, 3, -18, -8, 82, 46, 19, 8, -16, 51, 40, -58, -107, -11, 18, 38, 80, 78, 4, -2, 65, 118, 15, 46, 46, -7, -15, 40, -121, -13, -14, 59, -51, -33, 28, -71, 45, 26, -66, -9, 61, 8, -35, -16, -36, 58, 43, 48, 37, -29, 125, -22, -25, -65, -24, 119, 39, 1, 6, 34, 20, 52, 30, -60, -95, 7, 38, -19, 42, -56, -19, 45, -36, -34, 55, -140, 90, -3, -74, 7, -16, -60, 108, 14, -57, 60, -54, -87, -20, 23, -2, 113, -98, 96, 28, 93, 31, 22, 7, -42, -3, 71, -28, 38, -63, -58, 24, -69, -33, 34, -27, -3, -111, -16, -31, -66, -55, -69, -84, -137, 65, 9, 76, -16, 55, -61, -21, -104, 18, -13, 79, 55, 34, 73]
16126G3j57J28k4o7O4L3lm0l7J26L2j70Q1j27Q9j02O2J7j8Q2n3P3j30J24j18J17
16152E5j59N8M7j47J99j31J73j25l8O9j5O6j08rN1k9P5j3L8j39J02p5l1R2n9P3
16178B0l0J36j67R6j24M4P8m2P4n7%o3M1p7K4J6mRj2J6j1M2qM9k4Rn4P8q0P4p6
16209b3P0j52O1J27q0N9Qj71R4J03k4o9P8j21j6l4J14l2N4k5J6J1o1L4k3K8l7
16236a1m5Q4j24Q0J4k6P6K9j42L0K9r7J58q7J50j38M0J2Oj50J87p3o6M3L6l2j6
16263c3l1O3mk0k7L2k2O1p0NP8j8l3P8l2l6QKL7r1J31o9J15j51L1M6r5L9M2kr1
16294e7%O0M0j07J51p5q9R8j21N7L2Mj2q1M2L9M2op9M2p1R4o4L4O5p2J0PQ4j00
16324c3J6k0P1q1J6kl1M7L0Jn9k4J8L6O6Mj00K2l2R5Oj75J98j25J36r4L2lj04
$$ y = [73, -84, 44, 20, -47, 17, 50, 47, 7, -30, 96, 128, -42, 39, -88, 1, -101, -39, -22, -40, 42, -11, 62, -68, 56, -62, 55, -104, -46, 1, -146, 53, -78, 95, -30, -68, 1, -14, 52, -56, -65, -14, -43, 32, 19, 57, -82, 20, -55, -86, 6, -53, 20, -10, 126, -41, 55, -69, -25, 53, 11, 85, 28, 28, -35, 6, -71, -47, -31, -35, -26, -38, -22, -33, 9, 1, 50, 26, 35, -19, 59, -21, 53, -23, 47, -105, -44, 83, 3, 62, 70, -101, -7, 96, 72, 3, 81, -40, -56, -90, 24, -8, 46, 21, 37, 48, -13, 21, -2, 26, -11, -56, 28, -96, -16, -2, -28, 48, 77, -65, -35, -6, -103, 55, -32, 118, -20, 20, 32, 38, -112, 75, 2, -64, -21, 15, -17, -33, -64, -1, -5, -25, -52, -20, -42, 19, -51, -46, 32, 14, -19, 59, 27, -9, -1, 1, 38, -53, 78, 9, 124, -27, 4, 50, -45, -6, 36, 34, -57, -57, 3, 43, -64, 87, 12, -77, 21, -100, -43, -11, -7, -19, -100, -58, -19, 23, 17, -62, -20, -91, 3, -61, -27, 38, -34, -24, -17, 67, -33, -17, -37, 34, -47, -31, -33, -64, -17, 13, 14, -45, -69, -51, -15, 51, 55, -45, -23, -55, 40, 46, -129, 69, -56, 80, -14, 18, 15, -89]
16353h9O6N9k9n1J14n1l3k5O4N5r0O0K2j18k0J00j01O0K9j3M5k9KJ12j61N9o3
16380b6R5j14L6
$$ y = [-89, -23, 36, 7, -44, 70, 19, -14, -39, 25, 80, -10, 50, 72, -46, -66, 34, -67, -7, 22, 9, 54, 25, 27, 139, -22, 37, -26, 69, -45, -9]
16383i
$$ Imaginary data points
##PAGE= N=2
##DATA TABLE= (X++(I..I)), XYDATA
0@%%%%%%%%%%%%%%%%%K1m3M4m4M4m4M6o8Q8q9J10j31J53j75J97k20K42k84L28
36A75l72M16m61N06n56O21o98P68q41R34j040J144j256J386j528J684j855K050
54A077k266K506k777L087l448L874m379M992n758O745q074R963j2880J8053k9970
69a9255J10534K0962j95387j4600O3903P0398r956l1289k0941L8065J1422l1298
81g442j0199M6800k734n2782j7704M5060L8786M313m6449n6720R593P6028K7952
94E4502m1041l3900J087N209J5588J2779j0091n532J5875r853k9708M933K5023
107D871n24l554R624p90j953Q969j5371l1510O509K7033k954p715J6989J1249
121B0873p534j1938j8466m411L3881J8588m1923l4566K9806L8954M22j6207j4534
$$ y = [0, 0, 0, 0, 0, 0, 0, 0, 0, 0, 0, 0, 0, 0, 0, 0, 0, 0, 21, -22, 22, -22, 22, -22, 24, -44, 44, -45, 65, -66, 87, -88, 109, -111, 131, -153, 175, -197, 219, -242, 264, -292, 329, -369, 399, -442, 492, -548, 596, -660, 726, -802, 882, -973, 1077, -1189, 1317, -1460, 1627, -1821, 2053, -2326, 2666, -3092, 3653, -4421, 5542, -7338, 10715, -19255, 91279, 112241, -83146, -97746, -33843, 36555, 26599, -4690, -25631, 12434, 23856, -7442, -17641, 29159, 26425, -26357, -44061, 999, 39785, 44098, -2351, -59071, -49478, 26550, 54502, 13461, -20439, -19352, -14143, 1445, 14224, 4133, -1399, 14476, 4623, -25085, -20152, 4871, 4347, 793, 10417, 9627, 7674, 16643, 1272, -30238, -23729, 3304, 350, -7365, 9624, 20873, 13339, 1401, -17065, -21476, 12405, 30993, -10930, -45496, -15690, 23264, 23686, 7479, -7055]
134g055m326J4706L978k2213K027L4099k142l9823m592L2905J5209j2354k4792
147a4373j7416K3584M6509j955m4321j2748J8988K892o766K630L44L364J0138
160A0870q083j4853J5342J7979j7808j8827Q526P251q40N924m302j4048R051J7849
174A4031p377j1143O698o72r286M766L548p249P173J1444j2262r799J4642M601
188I115j3875o05P407k546L227N614j1759p762J3251K629j2157N280J1709o802
202B726m047P435n250q541O804l08r797J0006J5723q788j1815M837J226k292P202
217E121k550j2771O447J3532q628r518Q432J318o533P692O741q162j870L535r254
232f468k626J3971J245j2313L469Q658n230j014N349p196m512J2051J966j2866
$$ y = [-7055, -11381, 3325, 7303, -14910, -12883, 21216, 19074, -20749, -25341, 7564, 22773, 10419, -14373, -31789, -8205, 38304, 36349, -7972, -20720, -1732, 1160, -5606, -2976, -2632, 732, 10870, 2787, -12066, 3276, 21255, 3447, -15380, -6854, 397, -443, 5481, 1179, -12869, -3818, 14031, 6654, -4489, 2209, 1537, -7749, -2983, 565, -6684, 489, 11933, -329, -10128, 4514, 9115, -4760, -5365, 2042, -504, 2723, 8337, -3422, -11184, 2067, 4696, -7461, -2181, 9528, 2726, -1321, 6114, 864, -7677, -873, -1181, -10978, -972, 14751, 5963, -5852, -1015, 211, -2081, 5121, 2571, -10200, -3753, 9779, 1151, -8367, 65, 1383, -5150, 2542, 9283, 1121, -749, 2786, -6468, -9094, 4877, 6122, -6191, -2722, 5936, 706, -308, 5041, -2155, -6667, 5384, 7350, -5516]
246e516j85O950m715M21R248l770o672P587K195r163K369M994r640k103J4010
261F010J824r797K86M10m709Q150R623j0329r601P596K729m497M552J77j1172
276h748K026J2835r65m659L942m830r132P971R536p478m982M087l114m34J1692
291G747K94j2678N80P891l379j444M676o212n887R557N384p347O96M077p058j996
307e099R560r41p521L884K921n969K455M796p852l415J0901K873p112J445J621
322B547p019J774P603n301n684O952K218n574L967L325p666q08Q318k308n428
337c084M381j228p561N677Q441n107l887M843k283l722O367O74q892K302P915
352D836l718l307M717k873n427O867M425o895L1M881m882k691O685j051o641M307
$$ y = [-5516, -5701, 1249, -3466, -3045, 6203, 2433, -4239, 3348, 5543, -3620, -1251, 3743, -5897, -8000, 6010, 7834, -1963, -1677, -1267, -5976, 2174, 11797, 1468, -8133, -537, 2192, -2305, 2247, 2424, -8748, -6722, 6113, 5148, 489, 4431, -399, -9531, -1560, 7976, 498, -4484, -397, -3511, -3945, 7747, 8041, -4637, -4057, 3834, 455, -989, 3687, -2525, -8412, 1145, 6529, -818, -122, 3955, -3103, -5099, 4461, 3520, -4001, -117, 2804, -3165, -710, 4086, -3766, -7181, 3720, 6593, -519, 926, 2547, -4472, -2698, 4905, -396, -6080, 872, 3090, -2484, 1483, 4808, -2858, -3666, 4652, 2344, -3084, 1297, 69, -7492, -1815, 6626, 1519, -2368, 2475, 192, -3530, 2837, 3511, -5381, -3079, 4836, 1118, -2189, 2528, -345, -5772, 1095, 5520, -1375, -1344, 3537, -1345, -4036, 2649, 1598, -5043, -736]
368g36M645n226L11N259m946m061P238J660o730J306K881m884J387O849l967n520
384d534N878K365n458J731K994o321j186P600r58n087L974J297n513K979N511
399E272n490l772N604l87m256M494J806o596P24O083l104k407N236j638n966M211
415a86L872n808q12N492k239k610N018r46n986L546M741n169j188N282k394l947
431c334M611O45n673K320M805l838n70N065l495n789M759L702m536N28L216m311
447a895j082O366j200n112L432K291n003J024M636m192l668N187J393l254K798
462A721J199n924J90N384k576k983N377J45n506K260L837m704j246N082j167k935
478a846L900k09n213K446M230m536j683N301j063l910L631J161n395J579N106
$$ y = [-736, 3909, -1317, -1006, 4253, -693, -4754, 2484, 4144, -2586, -1280, 1601, -3283, -1896, 4953, 986, -4534, 1344, 3709, -1749, -18, 2976, -3345, -4531, 3069, 2111, -2976, 998, 2295, -3218, -239, 5272, -218, -3990, 1614, 1227, -3029, 1465, 3271, -3325, -2601, 3482, 378, -2029, 3207, 1569, -4397, -186, 3686, -2122, -2934, 2558, 319, -2291, 2727, 1781, -4205, -659, 4082, -1087, -2275, 3007, 613, -3334, 1277, 1922, -3751, -1431, 3374, -464, -1034, 4031, 536, -5253, -494, 3208, -1328, -800, 2416, -1895, -2977, 3389, 2189, -2923, 509, 2800, -2203, -1179, 3457, -735, -4403, 784, 2177, -1077, 1721, 2920, -3004, -2814, 2570, -6, -2989, 2388, 2533, -2973, -713, 3124, -1580, -2826, 2256, 1089, -1846, 2054, 1845, -3368, -922, 3308, -1228, -2911, 2390, 1327, -2583, 1048, 2209, -3186, -1607, 3499]
493C499k877k221L667k088m554M265L867l995M3L031l747j594N488q74n633K491
509a232L745l226j03L859l060l473M010J083l268K690J878n319o28N231j177l400
525b390L682R63m576J566L605l795j576M278p14k961L062O95m268J622L618l813
541a002j969M883J21l804K157J475m406Q33M536k111k711L441m11l794K786K694
557B718l608m15L287k663j843M858J35n536J174L888k398j32L378k583l589L452
573A23J773l403J348K431l498p59M252j208l468K854J359l908J278L797k888k507
589b424L402j69k842K565J892l484jK775k716j410M577k57m228K240K549l597
605a128r49L582j258j952L176K03l555J518K441l359n34L536j302k086L354J59
$$ y = [3499, 622, -1599, 2068, -20, -4574, -309, 3558, -437, -394, 2637, -1110, -2704, 2784, 1910, -3723, -1232, 2513, -713, -816, 3043, -17, -3490, 520, 1603, -1665, 1025, 2903, -2416, -3044, 2187, 1010, -2390, 1292, 2255, -2321, -755, 2850, -945, -2521, 1757, 1043, -1918, 1144, 1839, -2429, -807, 2811, -1002, -2971, 1912, 2033, -1771, 386, 1861, -2545, -1712, 2824, 713, -1998, 1443, 1032, -2762, 24, 2718, -890, -1305, 1982, -681, -2524, 2334, 2469, -3067, -1893, 1995, -403, -535, 2843, 260, -3329, 123, 1896, -1507, -159, 2272, -1226, -1985, 2267, 1059, -2409, 445, 1804, -2104, -826, 2971, 83, -2424, 978, 809, -2033, 532, 2424, -1060, -1061, 1714, -1002, -2412, 2165, 1908, -2320, -80, 2469, -1128, -2077, 1505, 247, -1705, 1471, 1674, -1881, -363, 2078, -1281, -1815, 1721, 419, -1667, 1687, 1846]
621A846m662J501M104k585j944L035o45k520K331Q66l172J419L127l027j744L434
637A364n20l218K689J771l516L01L581k024k906K799O12k305J719J245l008N33
653h83L148k513k258L624P38l668J081K653k705p61L159j064k483K419J019k652
669a146J089J735k942n10L593r38l043K635J455l369M93K978k343j759K834K40
685A002k325J767J156l126M86K828k024j509L169k38l395J889K403k634n73K581
701A457j439j934K793O43l220J115K221k194k18K672j942k385K852J092k893Q61
717e19K445k177j211K785p05k441K093R82k413N74K373k008j208K633n40k358
733a695K130J341l060k11L172j385j747K277J27k439J491J566k560j39K642j446
$$ y = [1846, -2816, -1315, 2789, 204, -1740, 1295, 650, -1870, 461, 1327, -1845, -426, 2701, -326, -2070, 1364, 844, -2374, 315, 2086, -1430, -1129, 2452, 428, -2478, 321, 933, -1372, 347, 1592, -1416, -883, 2265, -248, -2506, 1118, 1856, -1812, -731, 1922, -783, -1544, 1615, 551, -1932, 487, 1506, -1146, -57, 1678, -1264, -1774, 1819, 881, -2162, 473, 1928, -1441, -948, 2030, -313, -2072, 762, 1002, -1323, 444, 1600, -1526, -1040, 1788, -236, -1745, 1424, 1186, -2209, -320, 2083, -551, -1124, 1457, 18, -1916, 877, 1520, -1700, -585, 1636, -558, -776, 1896, -46, -2431, 421, 1513, -1380, -519, 1926, -251, -1462, 1323, 618, -1823, 270, 1252, -1161, -587, 1786, -222, -1430, 1203, 663, -1695, 435, 1776, -1284, -1495, 1677, 292, -1455, 822, 949, -1490, 1, 1567, -993, -1132, 1510, 64]
749F4j624K539J75k878J447K118k660q24L002n69k272J833Q06k351P90J697k031
766g38n32K741q09k466K137J249k841N11K365j833j272K657j77k487J396J332
782A233k115K91K208j647j411K641l78k536J626J712k392m27K570j067j703J965
798E70M61k286J094J663j973p60K338r64j672K278O87k615N31K103j843r12K436
815A136n22k111J718J083k307M68J755j691q24K571l27k358J566J180k387J08
831i42K290j208j622K196J11k146J443J401k228k88K162j000j433J946J89k219
847a348R87J857k038n00K325q89j813J709O94k088P30J750j841o81K299m52k089
864a388J572Q95k083M98J956j582j153K006O2k037J270J188j968Q8J826j233j119
$$ y = [64, -1560, 979, 1154, -1724, -277, 1841, -819, -1643, 1359, 790, -1482, 351, 1157, -1194, -404, 1293, -738, -1270, 1471, 662, -1804, 333, 1582, -1259, -748, 1617, -216, -1488, 1169, 992, -1495, -99, 1233, -882, -591, 1617, -30, -1441, 1200, 822, -1714, -88, 1624, -768, -1195, 1375, 308, -1395, 570, 1031, -1255, -161, 1502, -471, -1231, 1107, 143, -1529, 749, 1436, -1179, -648, 1455, -388, -1300, 1136, 614, -1497, 221, 1304, -1003, -535, 1220, -471, -1295, 1276, 949, -1409, 157, 1337, -1050, -942, 1348, 140, -1482, 714, 825, -1321, 122, 1523, -705, -993, 1169, 169, -1264, 682, 871, -1348, -361, 1496, -542, -1042, 1283, 394, -1419, 290, 984, -1104, -374, 1376, -465, -1146, 1153, 701, -1388, 184, 1079, -1004, -506, 1450, -132, -1285, 721, 783, -1254, 16, 1204, -764, -676, 1150, -83, -1202]
881a202K067p9k091J145J455j857l89K099j008j522K018M21k062P30J511j848
897f12m23K010m89j684J721O15k226O03J840j685p87J928n06j602J646Q15k044
914h80J47J991j203j015J872l53k006J466J164j906M4J883j066j406J925L5j858
931a166J044J244j709j95K037r53j582J584M50j766Q17J540j726n64J764n83j339
948a103J572O08k039N03J640j455q07J983k91j616J235Q43j997K88J627j264r70
965a243K098m3j856J110R57j756O6J811j255j033J726J93j837Q81J359j781o2
982f65J771r28j311J551M34j873Q40J270j458l30J772q91j455J550P42j771K69
999d83J427j178o88J647m93j321J333Q93j951K46J552r46r86J491j01j327J122
$$ y = [-1202, 865, 786, -1305, -160, 1295, -562, -951, 1148, 140, -1382, 636, 1057, -1005, -275, 1236, -612, -1035, 975, 486, -1198, 523, 1138, -1088, -485, 1355, -330, -1117, 811, 305, -1297, 349, 1164, -880, -733, 1258, 55, -960, 912, 559, -1447, 19, 1183, -723, -679, 1204, 138, -1268, 657, 692, -1166, -122, 1122, -587, -782, 1255, 302, -1280, 304, 754, -1012, -195, 1345, -381, -945, 819, 236, -1103, 469, 1077, -962, -459, 1181, -274, -1081, 902, 611, -1005, 230, 1073, -924, -636, 991, -273, -1243, 855, 812, -1044, 66, 1023, -733, -667, 1144, -111, -1144, 582, 775, -1062, -181, 1178, -603, -665, 1106, 178, -1133, 418, 852, -1021, -181, 1089, -369, -699, 1073, 182, -1273, 277, 1019, -752, -483, 944, -234, -922, 725, 232, -1089, 244, 1137, -814, -568, 984, 38, -948, 543, 442, -885, 237]
1016B37P08j673r3J864q14j201J530K88j730O21J204j401k80J544p94r56J526
1033E80L02j869P55J333j383n28J716n53j440J375O33j629M79J325j350p86J747
1050G07l08j367J247O90j590K55J435j160p14J602l31j559J068J061j483j74J706
1067A085j000r57J369J5j384R23Q71j528n4J774p02j538J403N23j640M33J145
1084G38j087k14J422n55j357J443N62j863L07J462r27o62J477l74j331J214P65
1101A020j502n1J211p43q45J550r3j380Q95Q10j554J41J394o96j126J418Q2j293
1119g62O81J059j265l55J318l95j160J230L14j503P17J043j302n15J666l36j259
1136h24R65M79j291L15J246j007n03J327l89j261J092O21j334J74J399r72r37
$$ y = [237, 945, -728, -821, 1043, 229, -972, 558, 846, -884, -263, 941, -460, -740, 804, 10, -946, 580, 882, -987, -232, 1101, -282, -810, 906, 353, -1087, 288, 921, -708, -229, 1096, -254, -1040, 707, 399, -968, 279, 969, -621, -366, 1069, -91, -805, 797, 466, -1093, -25, 1036, -447, -621, 1085, 85, -872, 497, 512, -872, 51, 922, -606, -660, 1114, 412, -1126, 277, 800, -840, -407, 738, -349, -563, 859, 304, -1053, 390, 952, -911, -604, 858, -69, -731, 746, 372, -959, 255, 1020, -482, -533, 678, -65, -910, 640, 547, -833, 62, 872, -682, -541, 853, 157, -969, 449, 531, -762, -81, 978, -287, -642, 676, 281, -879, 351, 665, -838, -121, 922, -380, -895, 771, 435, -824, 141, 620, -671, -356, 890, -117, -620, 707, 318, -943, 149, 770, -564, -390, 1009, 37, -900]
1153i00J457m0j262P25P97j264j57J420o49q32J145K1j212P48R26j361o1J267
1171G68o45j119J393M68j461L74R57j016l25J300n01j052J091M56j273M06J070
1188H91j149o19J498k00j179P80Q54j420L1J147n27p07R62r1j051R73O22j443
1206f28K31J212p36r38J156M40j491M27R75q45l71J153m65q03R52J56j220P80
1224a5Q68j236m12J446k55j144P41N99j155J68J025p69m24J087l71q84R80M31
1242F80j198J61J154r04o16J201J78j284N59Q23j162j7J043o85o43J086P2j045
1260e97O92O59j271m5J308n47j001J055L58j132K76Q59o80l66R45l91q31J001
1278B92L70j150K93R47j003n13J319k58j105Q15O95j025j25J024n63n39R97j16
$$ y = [-900, 557, 517, -745, -20, 777, -487, -644, 776, 127, -705, 440, 461, -751, -3, 923, -438, -499, 768, 123, -996, 397, 865, -596, -222, 735, -281, -606, 694, 193, -859, 232, 688, -585, -179, 891, -258, -877, 621, 421, -758, 22, 876, -544, -513, 634, 107, -600, 362, 271, -780, 193, 815, -628, -397, 815, 79, -859, 297, 737, -754, -327, 648, -197, -568, 585, 120, -683, 269, 425, -795, -15, 853, -383, -795, 651, 396, -748, -7, 592, -563, -395, 630, -139, -563, 524, 153, -731, 249, 680, -518, -357, 797, -107, -723, 478, 656, -628, -69, 754, -408, -425, 618, -67, -710, 376, 448, -597, 95, 754, -517, -562, 746, 199, -802, 253, 611, -521, -245, 614, -66, -432, 513, 122, -709, 292, 662, -488, -195, 752, -251, -764, 555, 297, -808, 7, 702, -323, -448, 576, 13, -526, 471, 355]
1296C55j015P21N35j073m7J146m37q03R92J47j102M01Q87q92k21R14m33p33Q64
1315B06L53j099M45P44j012j99J124m40q31P80O25j132J27R10p18m67Q70n0q13
1334e77O89M42r43J74R89o50p49R32J64j119M90Q15r79j12J017l71p49Q23K3r20
1354f11M39O64p92l7R82m06r79Q90K89j001L70P29p22k58R31k48q69P57K99r04
1374d77K73P69p26l76R41mj026O69N53q33j95Q97m64n50R22l6q64O20N69j019
1394c57%R23n49p13R50J68q74L85P30q88k71R65k82p09P05J97q61L81P09p53l41
1415d85R84l25p68P14L44q70P7Q23m55m32P52j61p33O38L27p72P3P40n10m30P47
1436B78J25q78M59N33q44q3R18m30n96Q03J33p81K45N57n51l28R54l81n92O09
$$ y = [355, -660, 61, 596, -477, -524, 622, 185, -618, 374, 521, -581, -180, 707, -185, -406, 508, 75, -658, 206, 559, -540, -95, 649, -363, -562, 562, 122, -709, 71, 696, -436, -309, 601, -117, -584, 286, 236, -577, 112, 554, -389, -215, 774, 124, -625, 307, 471, -648, -158, 657, -322, -434, 583, 212, -537, 286, 309, -611, -172, 492, -300, -337, 645, 239, -740, 150, 439, -562, -192, 537, -185, -443, 488, 240, -629, 128, 427, -477, -204, 565, -161, -537, 404, 400, -626, 43, 596, -237, -432, 465, 1, -549, 373, 337, -527, 93, 662, -357, -357, 566, 17, -696, 254, 422, -452, -67, 663, -225, -496, 469, 187, -522, 183, 380, -481, -100, 609, -144, -485, 499, 174, -594, 120, 464, -406, -329, 494, 39, -393, 359, 198, -535, 103, 430, -342, -269, 471, -39, -469, 278, 403, -475, -16, 517, -327, -410, 508, 78, -518, 285, 418, -363, -118, 439, -112, -440, 514, 133, -459, 150]
1456A50L36r30K17O93n78k96Q19k57q63Q26L22q31K15O38o35l55Q88o2q86N78
1476a1N40p95l0Q60o38m53P72Pp67N40M68p64j36Q42m39l74O39J2p13K67P42o32
1498f3l60Q46k80o85O28L03p11J86M93m74l70P98p2p86O30L18p25R2O60m63l73
1519d08O01O8p17N38L86q17J2N85k41m93O97rn23L41M27o62j2O89m03n07O81J95
1541D28p75K08N98n17k69P41k55o23O17J22o06J31O01n00k86P38j21o95M89K87
1561C13o24J63N52m55l20O97q5p61M73L85o64P4O32l79l54O42P2o93L08M13n71
1582a82r6P12l54n27O35J37o69L44M26o38j68P31l01m25M74J85o39K26N09m57
1602g7k55O08j73n65N66K24n85R1O36m72k97N27l9o01L69L08m55L9N31l62l85
$$ y = [150, 486, -444, -227, 466, -112, -408, 411, 154, -709, 117, 439, -392, -177, 461, -174, -529, 359, 297, -589, -11, 529, -266, -296, 564, -74, -527, 245, 252, -515, 25, 493, -271, -407, 435, -4, -378, 261, 273, -440, -173, 569, -63, -423, 423, 143, -542, 86, 389, -322, -136, 357, -117, -487, 311, 239, -547, 83, 401, -324, -232, 428, -35, -408, 193, 261, -456, 82, 468, -349, -337, 248, 7, -486, 211, 202, -321, 20, 447, -215, -227, 462, 59, -448, 233, 428, -347, -139, 459, -58, -327, 414, 159, -464, 153, 275, -331, -200, 401, -99, -385, 353, 232, -463, 26, 313, -311, -148, 404, -51, -371, 326, 241, -520, -47, 338, -326, -252, 380, 1, -353, 289, 361, -332, -24, 389, -182, -278, 434, 80, -447, 188, 325, -344, 0, 426, -212, -380, 351, 50, -375, 99, 284, -355, -129, 380, -77, -332, 276, 103, -462, 104, 328, -257, -166, 470, -2, -299, 228, 189, -412, -43, 265, -190, -151, 380, 18, -367]
1623c67N54Nm68K78L76n79k15P34k85l97N27J08n22J46N80n21j43N20k90l24L38
1644E5L30o64R4M42l79j80O37j67n62M58K81m95K7M29k77l99N67o5n08L83L36
1665C43o07q1P54l99l32N57o1m23K27M58o35o6N84l20m29N99J87p34K14M86l23
1686al01O09k07l95L86J87n31J83L82l91q8L61m2n24M41K51o03J26M88k45l28
1707b42M91j21m16L44K76n58Q6M88l35k47M73n8n85M35K50m58o1M97j32l93K87
1728B1K18m62J79L79n72k5M88m6m36M12K8m84K59L89m71k16N12Ll98L04Q1l21
1750a58J11L41l37j89M04j4m26L25J91m34R6M55k65l39L71M9m79K15L96m43rL50
1772B11k32k14M21L5m88K27L75m43m9M43q6m02L17Q6m53P9M17l27j06N10j92m61
$$ y = [-367, 187, 192, -276, 2, 378, -201, -416, 318, 33, -364, 163, 271, -251, -105, 475, -46, -189, 331, 41, -283, 55, 385, -279, -185, 257, -122, -302, 335, 168, -394, 64, 345, -150, -123, 306, 29, -370, 197, 132, -376, 7, 343, -264, -345, 409, 10, -322, 235, 174, -249, -22, 436, -199, -265, 319, -1, -430, 169, 356, -378, -164, 322, -1, -302, 307, 100, -295, 91, 278, -253, -70, 312, -79, -167, 194, 152, -372, 69, 320, -283, -157, 331, 86, -242, 249, 128, -288, 56, 332, -226, -140, 348, 13, -234, 239, 181, -404, 31, 281, -177, -238, 259, 127, -266, 21, 239, -223, -44, 335, -237, -262, 226, 180, -256, 156, 184, -300, -41, 348, -123, -339, 173, 176, -222, 82, 163, -158, -47, 294, -43, -232, 172, 158, -268, 57, 248, -186, -90, 365, 100, -239, 132, 181, -298, -83, 313, -130, -139, 211, -21, -235, 186, 221, -267, -40, 335, -108, -157, 286, 200, -202, 115, 201, -252, -173, 244, -83, -189, 321, 129, -332]
1794c32M85J32n95J49M24k84k08L12K8l15K08J95k59o6L45k56k15L98L0m48L30
1815E8L35n79l6M05p1l26L72j5l98K17K88l65L2K51j69k91M67P8m38M0M45l01
1837ak80N76j45m45K55L44m19L1L69l67j82N46j63m09M07J56m41J02K26j50j68
1858a58L16l6l22K51J61l54J25K44k93j71L07J70m71K21K53m14n3M02n5l42L84
1879A65j0m41J25L37k47o0L02j60k99M92L2n01J23L18j02l02L55p5l29L96L3l21
1901a69M8K88j71j86L97n2l84K63J18k33j7M29k63l30L96J21m67K06K46l96Q6
1922g0L82k59l44L83J1j96M2K73l57k5L02j2l03K35k4k01J44K31j81j83L21K2
1944A91m19L40O9k72j36M45k16k24L07j9m10M61J02l47m1K91k00p6M47j70l12
$$ y = [-332, 153, 285, -310, -161, 263, -21, -229, 83, 111, -204, 4, 199, -60, -126, 219, -37, -252, 146, 176, -272, 58, 393, -186, -222, 183, 112, -214, 158, 143, -255, -38, 250, -115, -83, 168, -1, -292, 175, 253, -185, -145, 300, -1, -281, 295, 150, -295, -40, 304, -115, -84, 285, -82, -264, 282, 119, -290, 117, 273, -168, -66, 160, 10, -158, 158, 122, -200, 51, 212, -142, -17, 227, -66, -237, 70, 240, -231, -10, 243, -171, -224, 178, 123, -219, 165, 155, -286, -161, 176, -71, -131, 171, 11, -288, 204, 236, -265, -142, 176, 74, -228, 127, 52, -277, 119, 152, -169, -121, 167, -4, -190, 207, 155, -229, 34, 152, -81, -98, 331, 68, -262, 134, 255, -212, -6, 240, -156, -70, 312, 53, -291, 92, 103, -93, -51, 222, -135, -160, 142, 130, -173, 62, 38, -163, -19, 212, 31, -152, 169, 191, -228, 112, 181, -91, -227, 218, 2, -222, 85, 66, -344, 117, 219, -128, -169, 122, -78, -154, 293, 123, -189]
1965a89J39L55m25L4K22k20j78K75J67k51m4K39j59LK43r7l32K73M1k65J11K46
1987A88k95j32L53J0l17K44R9l11J04K64k10j96L10j52k98L30J42j93j17L64k53
2008f6j68K88P2k52J43J66l15J15J58m2k02K21Lk12J3L12l07q9L05j86n2K28M4
2031A77k61p2L68l19K9J87j61j15O3K77k75k3L29k47j09L46N0n05K18J55k49Q9
2053d8L56l44j60M12j82n0O2J45l71j1L78j70j71J59M9k31K31J83l35n6L85k35
2075dj56L53l8m92K75J78k02m4L10j83k04K88L0l42N6K99j73j4K18m3l26L40M
2098A30k18R1K03k34j27L37Ll37O4K95k77J7K75k46k24L70o0j97J04P1j59M9K87
2121B17j80k25J43J54k63J08K32k73l3K14P2k75J62N2k94J99J48j44q2K77j24
$$ y = [-189, -50, 305, -120, -86, 136, -84, -262, 13, 180, -71, -115, 124, -35, -32, 211, 114, -218, 55, 96, -169, -58, 188, -107, -239, 114, 124, -193, 51, 150, -161, -57, 207, -3, -199, 111, -41, -339, -9, 133, -60, -177, 187, -66, -234, 54, 126, -126, 17, 183, -132, -17, 141, 99, -103, 118, 121, -91, -78, 234, -73, -162, 143, -43, -95, 133, 177, -84, -156, 212, -107, -78, 109, -52, -167, -104, 173, -102, -125, 204, -43, -152, 194, 244, -261, -43, 112, -137, -48, 308, -36, -196, 216, 34, -16, 46, 191, -180, -191, 187, 17, -154, 5, 54, -177, 54, 237, -98, -154, 231, -4, -160, 193, 155, -337, -62, 116, -86, -130, 180, -3, -207, 81, 111, -231, -175, 124, -49, -63, 155, 112, -214, 126, 130, -88, 3, 206, -28, -155, 182, 185, -152, -88, 207, -70, -53, 222, -24, -248, 122, 62, -135, -31, 40, -119, -70, 217, 37, -188, -45, 109, -154, -46, 186, -87, -120, 94, 166, -109, 53, 105, -189, 10, 158, 14, -68, 209, 85]
2142H5j27O0K14m43N8L80k20j31K33L2l64K49J06l61J93J72k10o9L32q4k48O9
2164g4K81k90p5L60k52j29K65Q0l62J82J80k08j29L68j60r9J22O4l38J80J89k63
2186a08o2K97p7k38J79J58l41Q5K76k29j61J84P6k37L10K5l06J2L69j89j02J21
2208D2j42r1K01K03l36o1L23j08j66K47J08l37J13O9q6j23K34m9k33J98K09l24
2230a09J05Q4j11j07L22j44l42K66K18l02K7K22k05PK25p4k61K54k7j46J4L90
2252C06l43j53L80j00k32J33J21k45nL40j60k43K90q9j26J92J77l41l8K44j15
2273gr2K29J3l24N8K40j35p5J62j38m0J10J67l56R9J56p0o4J09J07k26LJ76k16
2297a14L5K55k01j09K54j3k25K18K4j98O7J85k96p5J72P9j83J23R0j38OK60j85
$$ y = [85, -42, 18, 232, -211, -153, 227, 7, -124, 109, 141, -223, 26, 132, -229, -36, 136, -74, -143, 189, 105, -143, -74, 207, -83, -158, 202, -50, -179, 86, 166, -196, -14, 166, -42, -171, 197, 37, -62, 60, 124, -214, -34, 155, -108, -170, 127, 50, -188, -9, 149, -192, -107, 169, -60, -221, -37, 39, -198, 112, 137, -169, -157, 212, 23, -79, 42, -100, -191, 10, 213, -123, -184, 139, 31, -135, 112, 220, -117, -4, 65, -21, -144, 90, 41, -192, 6, 215, -109, -4, 80, -31, -138, 184, 40, -302, -36, 182, -120, -93, 129, -76, -69, 156, 82, -179, 75, 48, -98, -84, 306, -37, -190, 190, 90, -142, -9, 112, -133, -138, 202, 42, -201, 89, 0, -126, 66, 243, -98, -136, 108, -7, -99, 130, 143, -181, -123, 117, -18, -93, 69, -69, -109, 1, 168, -188, -89, 67, -3, -67, 42, 149, -77, -74, 102, -114, -79, 176, -25, -134, 120, 107, -118, 100, 124, -74, -7, 178, -118, -193, -21, 58, -125, -2, 88, -50, -44, 216, 31]
2320C1j87K63r8r0N4K08k67l2K40p6k12J30O3k57J56J94k9j54J25q2k5J61J9j76
2344d1k1J89j85j63L18j8k96J92K08j54j31K62j57r9K03J8k64qK42k24J9K57j34
2367A3k61L31mk39R5K09j4k93L16j01k60K24P1k88J27J78k21oK06O6k69N1K31
2390A62k51l2K77j18j48K13p3j50J78R9k56j5K93j30k19K02O2k65J13J80j83m0
2412a01J28n1j10K82q1k40J10J82k42r9L54o2k35J86R8j69J5J41j95K8K11p5k31
2435a56J97J09j56q4K34k22p4L16r9j75Q6J53k22J12J43j52j02J45J9j73J94J07
2457B00l77J07R7M2k14J74o7j07Q5K37k25QJ85o1k02J13J03j96P8J45j38j08K05
2480H4k0l31L30J21k77MJ29j09k5K67j08j98J45J01j80l7K94k48p6K40L1k73J11
$$ y = [31, -156, 107, 9, -81, -27, 181, -86, -118, 122, 46, -166, -36, 27, -230, -74, 120, 91, -63, 62, -20, -45, 116, 135, -41, -62, 127, -58, -221, 97, 79, -217, -25, 183, 29, -102, 160, 3, -96, 107, 125, -139, -147, 95, -129, -110, 147, 13, -248, 83, 79, -160, -65, 144, 130, -163, 153, 52, -208, 16, 87, -201, -74, 104, -117, -123, 83, 149, -120, -69, 162, -89, -121, 156, 38, -110, 103, 30, -120, 58, 157, -99, -114, 179, 49, -170, 32, 94, -171, -58, 122, -61, -101, 27, -24, -134, 148, 67, -173, -63, 119, -123, -222, 132, 70, -165, 21, 119, -50, -35, 106, -89, -61, 150, 75, -156, 41, 150, -6, -90, 144, -78, -152, 164, 65, -110, -24, 129, -93, 19, 162, 10, -92, 53, 72, -101, 93, 200, -177, -70, 27, 69, -145, 29, -38, -145, -60, 177, -48, -40, 145, 84, -118, -5, 98, -98, -20, 125, -13, -121, 84, 64, -267, 63, 184, -93, -89, 40, -69, -94, 173, 65, -133, 12, 113, -67, -104, 190, -58, -134, 106, 137, -136, -25]
2503b5J83k41N9J53j25K2o4J32j96N9R8j91R9K42j60k57K40J05k83N1K44k09o6
2526a30K32J7k10J17J2j57N7K01j05r9N7P9j90J31J76k26k9K14j99k2J39m8k11
2549a94K15J18j73j4K51k16j93K20J29k23J8K59k20j73M07j75k85L02J0k15J42
2570a0N9j63M0J72p5k07J99J15k51j7K38r0j33J61j1j00J07J71m14J15K50j51
2592Ej84K46l6j85K00J29k38p8L28k24j39K36J2k01J53J18k29j2K14j30k01K30
2614A4P0j94J29M1j68L6K95j67k18J10J09j17P1R4j07q3J61k0j72J07P6k13J33
2637a3J27j1k54J75m5j76K14N0k34M4K12o3j61K02rj66J23J1j0n7J89j34j72K38
2661H0n3j89J06J19j32o5K57m8k35K23J01k30R4J56j64j30K56k07qJ29L3j65j1
$$ y = [-25, 158, -83, -24, 129, 4, 26, -38, 94, -102, -43, 55, -136, -37, 205, 45, -212, 28, 133, -150, -99, 145, -64, -130, 102, 119, -91, 26, 38, -119, -62, 139, 34, -65, -8, 71, -119, 12, 188, -38, -67, 147, -52, -74, 65, 17, -194, 21, 139, -34, -48, 203, -13, -206, 14, 143, -80, -62, 197, -23, -196, 211, 36, -249, 53, 63, -152, -10, 49, -114, -74, 98, 23, -184, 15, 130, -121, -138, 100, 10, -123, 38, 27, -73, 34, 205, -209, -94, 156, 5, -179, 67, 31, -154, 46, 175, -63, -141, 187, -37, -176, 60, 72, -129, 24, 142, -87, -99, 115, -15, -216, 14, 84, -110, 19, 60, -108, -72, 223, 56, -162, -52, 57, -60, 11, 105, -2, -85, 76, 56, -116, -9, 67, -146, -13, 114, 103, -151, 24, -21, -197, 17, 67, -167, -123, 89, 26, -135, 67, 58, -108, 15, 26, 16, -41, 148, 14, -158, 80, 27, -162, -56, 63, -69, -134, 123, 75, -160, 63, 164, -66, 28, 184, 20, -110, 146, -61, -69, 60, 93, -72, -83]
2684h3J21m7q5J18Q7k31J21J52j57n0J43j66r3J59J60k99J02J34j73K4K72k30
2706b1j88K01qr2J66K2j23k09M27k23j32J97J3k06K33O3j50P3JR1k77J84J17k28
2730f9R4O0l4j38J84N8k39J1O8j20R6RN3j19J18M7j14K3L0j14J7Q8L7j61J26L4
2756D5j80Q2J65j45q6K02j23k12K68J18k51J12Q0j81k3K13o5q5N8J06j68j5K10
2779A25j30l9R3n7r0J34J44k39K2J37Lk38J89n9r4J43j0o7m8J74j61j04J97Lj18
2804i0Q9j3J9n0O3k8k44K95n4n8J19n8j09N8J34q7j99J47J54k28N8J44q4l8J25
2829F5L5j20L8K7l3k8J16J6k49K30n8j85J30L7J0j34J71o4j7K7N4j95J3K46k51
2854a19J04J6o0q1J49N0p4p0K08p6j69K10j35qM2J74k28PR9k0j03J07K5j49O3
$$ y = [-83, 38, -9, -94, 24, 111, -120, 1, 153, -4, -54, 89, -77, -170, -11, 149, -150, -48, 86, -87, -63, 209, -21, -209, -8, -16, -108, 58, 80, -43, -252, 175, -48, -180, 17, 30, -176, 57, 120, -30, 43, 44, 135, -142, 42, 159, -69, 25, 85, 51, -87, 97, 155, -84, -73, -5, -125, -29, -20, 33, -86, 32, 79, -35, -12, 18, -96, -79, 9, 46, -115, 11, 45, -135, -53, 112, -33, -119, 83, -40, -252, 16, 134, -117, -5, 75, -106, -129, 84, 19, -66, -8, 98, -70, -85, 125, -5, -44, 49, -8, -98, 36, 180, -59, -37, 100, 103, -135, 54, -5, -99, 44, 34, -33, -81, 93, -68, -172, 25, 28, -90, -1, -14, 5, -45, 18, -10, -254, 41, -13, -71, 48, -10, -119, -61, 73, -14, -213, -66, 88, -140, -82, 62, -22, -60, 65, 100, -20, 18, 45, 12, -16, 100, 116, -133, 97, 39, -146, -16, 21, 31, -103, 68, 4, -13, 14, 68, -127, -114, 132, -119, -15, 1, -59, -140, 9, 59, -15, -85, 123, 47, -122, 88, -47, -55, -13, 161, -67, -60, 39, 19, -84, 23, 48, -101, -38]
2879c8K25k74J10pn3o5J94j6j46J11R4k25L1M5P6j45K05m1j49N2L9j1j31J46m5
2904a8M4k8K1o4J9Q8j39l2J16K1k7k9J28j61m8J88j22j2L1J81k25J24j0j00N0
2929dJ35j02k4J24l7j28M8Q8j43j4J50l3j63N5J12k02Q2N0k5jJ51p3k13J84K3
2954D0p5M2J28j80j7J38r0K7r9K01k45J28J63j46o1Q4j3q6L2K13k79Q3J3J10k41
2979a30J82mj71O3P7P2j29J82j28j16J2J43p1q5J74r0j09J15N2MJ0r1kP0K1J7
3005F8n4O5p7j01M0K48k81J5P4K5o3Q5M1j75o0K84k57k8K48o8n7J32l0r8L7J2
3031B5l2j1Q8j2j72K11o8k9J7J21j40m7Q2K3p2J9p9n0J08Q2j09N3L8m1j58J59
3057FN0r4M7M7j43j2J28q2J21p4M9j98J22J02r9K3J2Mj18J00J10o8l6Q1k2j22
$$ y = [-38, 187, -87, 23, 16, -37, -102, 92, 76, -70, 41, 135, -90, -59, -14, 62, -83, 122, 81, -68, -16, 23, 12, -119, 27, -18, 26, -2, 19, -45, -26, 62, -77, -109, 7, 28, 1, -28, 100, -61, -109, 79, -43, -55, -24, 157, -68, 56, 46, -54, -4, 131, 29, 5, 129, 92, -36, 12, 100, -43, -57, 93, 60, -103, -48, 64, -138, -56, -6, -31, -32, 119, 46, -167, 17, 40, -35, 7, 135, -45, -62, 76, -14, 13, -86, 115, -130, -2, 161, 15, -46, 38, 25, -61, -29, 184, -95, -12, 1, 111, -130, 52, 48, -123, -60, 17, 89, -40, 142, 14, -102, -90, 53, -18, -103, 71, -19, -128, -13, 39, 43, 53, -38, -40, 30, 51, 68, 14, 79, 2, -99, -59, 189, -92, -77, -3, 22, -41, 44, 85, -90, -150, 134, -123, -151, 97, 29, -28, 104, 74, -24, 13, 25, -7, -18, 70, 58, -114, 97, 29, 0, 17, 138, -2, -49, 33, 56, -16, 3, -76, -126, -18, 64, -45, 8, 46, 5, -153, 6, 56, -38, 9, 56, -87, -99, 29, -53, 68, -6, 43, -155, -33, 69, -30, -7, 5, 9, -109, -9, 101, 33, -3, 78, 56, -66]
3083f6R4O9j39J0J8Q6r2n1J13m0O1j9r5J31q7p6JJ05j06K6qR8p3m1J04m1m9K00
3111A33o7m9lO5j09R6j4K0n8p2O8m0M4J7l6l0J13n6p9L2O4lj32J92j15j84L22
3138A19p0j26L5O6p3J17N9k03K5J73K3k34Q7J28j38q6J19k8l3J05jj72J58M6j31
3163c5N8J03j59l8J05l0K6oK6o7KLp3l3Q0J10m5l8O0j11L4J53j23qj3J14j37K2
3191b0J6k8R3j07O7p6J48Lj17l9Q2j34O6J35n8p7J0Q4n1J9k1N3j71J05l6oL1Q9
3219F0p2q2J58m3J4R2k51J89j45J30j8p0P0p6O6j3Q8j00pnj5q3O7J92j60N9N3
3246I8j47LJ63k27Q4L3o2QP3L5r1JM4kr0Q8L7m0J21j25m0K7K5k2m1J31j8j18Q7
3275C5J04j25o5J49q6j27R7j0l5m9J92k05M1J11l8K1L1l6m9M7m0J04j28Q5N8j00
$$ y = [-66, 28, 97, -42, -32, -14, 72, -20, -71, 42, 2, 63, 44, -51, 80, -7, -83, -82, 23, -83, -57, -65, 33, -40, -81, 23, -18, -67, 133, 66, 17, 14, 79, -30, 66, 52, 72, 14, -58, 10, -30, 14, 31, -5, -35, 78, 22, -57, -25, 39, 36, -96, 96, -19, -203, 119, 49, -77, -42, 24, -49, 68, 127, -76, -51, 122, 145, -89, -2, 126, -12, -98, 21, -7, -40, 65, 64, -108, 50, 96, -35, 23, 126, -33, -71, 34, 4, 30, 24, 50, -17, -15, -12, -85, -118, -38, 72, 27, -11, 49, -62, -28, 125, 2, -6, -19, 95, -42, -20, -4, -32, 61, -46, 21, -55, 93, 96, -21, -60, 22, -112, -46, 89, 31, -46, -36, 48, -3, 16, -5, 48, -123, -18, -54, -60, -29, 60, -12, -94, 64, 21, 35, 127, -124, 65, -80, 50, 32, -38, 32, -44, 22, 9, 97, -3, -10, -15, -30, -113, -46, 146, -14, 45, 98, -49, -46, 117, -110, -26, 7, -55, -47, 26, 61, -30, -29, 15, 13, -77, 11, 48, 8, 129, 4, -36, -9, 16, -6, -47, 84, 66, -52, 35, 139, 14, -51, 98, 12, -115, -18, -28, -63, -112, 80, -125, -84, 27, -11, 10, 41, 5, -44, 3, -37, 67, -61, 24, 82, -18]
3301a8j6j6J9J08n0q2j0Q0Q1pj22J10rr6P5p6L1j04K06j32kJ22j17n1J70j38j17
3328a61K24l8l2q1Q0J4Om0J0n2P3j0m8L6j8j7MN5j33J07N7K4j05k4J13J3j11J09
3356E5M3rj52J09mp2O3M1p2L2L8j40Q1J8q2N1M6qJ6m9Rq2K2Q0j14J03L9j7j6n8
3386b9N6j06M3J45j53J9LN9j1n5J39j79N0j5n5Q5O4k0o6L1J18j51J4J18q6L6o7
3413a3R5j22l4R7P3r2k8L8Pj41J68j28M2M7p2Q6n9J42j50R8NL4r7j7l4k6P1rm5
3442f4J08nr4O5j4l0O4m3R2j34O0K7n5o9J30p3j7O3R7j38Pj2k2M2j7j0M0l6rL3
3472a4L1K1j33J11O3o0j14J61j08M0k6M5m2q3J52J7k9r0J27j36J26L1o1p1Q7q
3498C7m3O1j2n6O5P5j62L4Qm9J3K7k5L1m4J9P3j55R6J46j94P8L3%k0l3k9L0jM1
$$ y = [-18, -34, -50, -31, 77, 27, -55, -65, 15, 96, 89, -33, 77, 68, -28, 47, -29, 2, -102, 104, -28, -30, 92, -25, -76, 94, -44, -161, 63, 25, -7, -88, -8, 6, 12, -28, -18, -70, 3, -7, -55, -19, -37, -54, -50, 5, -128, -21, 36, 60, -45, -69, 44, 57, -54, 55, 98, 89, -63, 46, 42, -30, 33, 74, 2, 34, 72, -68, 13, 31, -51, 0, 46, 38, 54, 5, 14, -68, -46, 34, -80, 23, 62, 45, 29, -29, 27, -79, -36, 109, -44, -25, -22, 37, 26, -29, 110, -69, -19, -34, -89, -4, 60, 40, -26, 5, 123, -28, -14, 104, 18, 54, -13, 82, -40, -74, 23, 96, 4, -24, 14, 21, -120, 48, -80, -38, 9, -63, 23, -36, 106, -44, 54, 59, 93, -4, -21, -55, -81, -10, -19, -64, 44, 39, -55, 10, -4, -34, 30, -13, 79, -55, 5, 32, -23, -92, 38, -35, -52, 11, 108, -30, -23, -35, -57, -15, -32, -42, -2, -38, -47, -14, 17, 38, -95, 16, 79, 19, -95, 66, -42, -2, -28, 17, -25, -108, 44, 61, 32, -58, 69, -67, 59, 90, 29, -42, 45, 37, -6, 55, 43, -13, 52, 127, -35, -1, 7, -42, -29, -2, -27, 4, -40, -21, 52, -103, -7, 139, -55, 23, 56, 56, 36, 3, -26, 4, 3, 44]
3528D4O7j75L3m1L5N8L2q8J14m8o3PJ14M9q3o0O6Rn9R0r8k7K2m4M7k6m6j1O7N0
3558C5l3N0q4O5n2J45j49k7lm5J78p0Q0j54P3L3p2N5j05O8q2R6k7J17q1j4k0J8
3586en4R5j02N0M0J00j29o1K07j73K9p0L8j6J38l1p0m3J79j62J74j80L8J6k5N4
3612C7k9L5m6l4l8J33k3j00J24rj02M1k3R9r1J00j24L1N9L3q9Q6j9K2j21j9R7
3639C0J5n7P0n9O3r3P6j09J43o8m3jK3N3j16O8J0M3q5K7ol0Q1k4m9M5L3m1OJ9
3669B4q5M7LQ9p1J2n3J1N9r4M0LJ14o3j8M3m9pL0M6k1q9J26o6om4J6n0O3o2J00
3700D8Mm7O6l8r8O0l3oK7P1n3m1J70k37N2N6m6M8K1M5J17k59J10r9L8J47k08J35
3728E0M1j09JnL8o6J2j1J07p0J8p9P5J8m0R1l7mj07O8m0P7O9q2M0r5M1J1K0q7
$$ y = [44, 111, -64, -31, -72, -37, 21, 53, -35, 79, 31, -32, -25, 89, 138, 55, -5, 61, 70, 11, 101, 3, -24, -2, -46, 1, -25, -71, -82, -15, 35, 2, 52, -32, 33, -19, 126, -23, -50, -53, -98, 80, 10, 90, -64, 9, 42, -30, 25, -80, -12, -94, 2, -25, 92, 11, -3, -23, -5, -59, 36, -66, -16, 24, 124, -5, -66, 141, -32, -3, -73, -35, -51, 87, 56, -14, -57, 122, -40, 134, -46, -8, 8, -17, 37, 8, 43, -3, -37, -75, 58, 35, -65, 59, 50, -52, -11, -34, 65, -26, 74, -50, -19, 40, 73, -16, 70, 51, 73, -48, -67, 30, 45, -12, 58, -1, 62, -31, 45, -64, 79, 11, -32, -33, -10, 43, -73, -5, 5, 48, -37, -10, -16, -46, 35, 11, -38, 7, 40, -1, 5, 24, -61, -14, -11, 78, 7, 19, -34, -23, 36, -58, -18, -15, 99, 36, 18, 61, 12, 5, 35, 81, 60, -29, 97, 31, 25, -19, -3, -53, 10, -52, 48, 52, 5, 71, 33, -65, -5, -38, -44, -17, 54, 1, -40, 130, -107, -55, 1, -45, 3, 24, 69, 186, -73, 37, -62, -24, 123, -85, 50, 91, -18, -17, -22, 16, -50, -38, -49, 58, -12, 6, -73, 2, 20, -20, 71, 34, 30, -77, -9, -49, 28, 97, 15, 55, -40, 1, 12, 32, -55]
3758e5Q7n8l6P3k7rr5J58n9Q6l0J09j61J4Q3J0r2j2Q9j66M1J04k1j0q9N0n7P9
3786Fq2L6J12j24M4p0nO4J3j9m1L2O5O6n8j28M4mk0J9k1O0j9N7r5N5K1m4jK7J
3817ip2M1J01q9l3l5J29L4pMj90J60p2O9j44J11j06J48o6K3ljkO6L2j27N6q2L
3846f1J27p6O7l7J5M3j38P9j2J7m0l3J36q3J6j8k2qJ8M2m7j51K30k0k5Q6k28J05
3874a8Qq1Q8m8K2M1o3K7K9l1N8o6k4P7n5P3p5L3j06K11j71M8P4j7p2j7K6O2qo
3904A9m1N8l7N9k2k6Q8j26O8j04M4n0J26k14Q7kl0J4O9J6L2L2k26K29r6P3Q0j15
3932Eo1R5n1O6r2O0p3O3p6L6K5N0j48J93o0j4Nj9J0m4P6o4rP1j69J23J8n5J6J8
3962eK8j18N1k2J42l4k9J7r6J87j62L6K1j0p5K9K4OM1O6r2q4O1m5J39j21l1J50
$$ y = [-55, 32, -26, -62, 11, -16, -25, -120, 38, -21, 65, 35, 144, -17, -3, 80, 90, -2, -14, 75, -91, -50, 54, 33, 23, -66, -16, -73, 6, -76, -40, 72, -52, -8, -78, -83, -19, -6, -25, -66, -34, 31, 97, 39, -89, -45, -49, -69, -50, -71, -11, -30, 27, -68, -13, 8, -36, -37, -10, -9, -81, -40, 61, -28, -61, -96, 33, 67, 60, 64, -126, 34, -38, 31, -113, -2, -108, 40, -26, -3, -6, -7, -9, 57, 89, -38, 18, -64, -61, 66, -10, 57, 20, 35, 78, -60, 19, 7, 24, -16, -49, 87, 4, 20, 2, -20, -28, -10, 32, -15, -166, 64, 44, 19, 105, -123, -18, -10, -91, -3, -51, -29, 12, -51, -24, 5, -26, 32, -34, -58, 19, -36, 37, -38, -5, -111, 100, -71, -23, 51, 34, -38, -55, -29, 33, 25, 19, -22, 36, -1, 58, 36, 10, 98, -28, 40, -64, -20, -70, 56, -158, -71, -73, -103, -89, -20, -4, 28, 60, -166, 63, -33, 40, 120, 5, -56, 39, -12, 54, -38, 22, -51, 12, -64, -28, -3, 47, -101, 92, 32, 18, 23, 4, 14, -30, 46, -18, -27, 44, -125, -2, 16, -39, -23, -5, 23, -95, -44, -66, 76, 42, 13, 30, -66, 121, -41, -5, 16, 6, -69, -40, -16, -10, 31, 97, 5, -79, -18, -63, 76, -45, -76, 74]
3990G4j78P3J04j9J7j21R5q3jQ4j4J6j05M6L9rQ8n7k5m7j09J12m3J13j33M0R5
4017E2p0M1K3M0j22M8J7Mj5p9R6j07K2J33j15K4J7L5o3P4o4j7L7RKL4o3K9p6Q5
4047C1N4n3Nk7qr2J70MRo7p5L1OJ07j22nJ51m1p1M9j7K1q9k8Q4L8m9jN0m9L3r6
4079d7J16m5J4L1j30OJ12n2J3Mq5N2nm6R2n7J8K5nL1m7n8N6l5J16l0q3P1k2j21
4109a11M8P7K1p7M8l8l6Q8n1K2k5J6P4p0J2J14p0L9m0N7p1J2O4o7j06l1MJ45l2
4138A6k7J4r3J34j01J87j08j12J97j09k9O9q2j4M8j9n3J18k2J4O7p1J5Nj10J37
4164G1o7m3Q2q1K5lq3J52q2P1P8m5L6l2op6L2M1j19PL0NJ12j13P1po0l4K8q9J96
4195I7p1J8j46Q9p9R7kK9r9J29r8P2LM3j59N5J01m1m1k4J17j27J56j39K0%Q3j57
$$ y = [74, -104, -31, 73, 54, 71, -50, 45, -38, -39, 45, 31, 47, -58, -12, 27, 18, 106, 49, 24, -23, -132, -20, -63, 50, -83, -43, 52, -18, 23, 46, 86, -36, 12, 29, 33, 18, -61, 35, -72, -50, 83, -32, -8, 9, 44, -19, 55, -9, -26, 11, 20, 22, 56, -7, 22, -54, 31, 85, 32, 37, 10, 2, -90, 80, 84, 93, 26, -49, -18, -12, 95, -27, -32, 119, 78, 7, 56, 39, 60, -29, -57, 27, 65, 16, 15, 65, 16, 49, -47, 69, 24, 38, 69, -61, -55, 57, 5, 18, 22, -63, -11, -16, -62, 30, -27, -9, 16, 11, 42, -5, -63, -7, -42, 74, 44, -39, 32, 10, -111, -63, 14, 35, -42, 6, -32, -68, 20, -31, -9, -34, -18, 56, -14, -2, 112, 42, 81, 41, 98, 27, 39, 103, 36, -70, -101, -97, 48, 16, -11, 3, -90, 44, -57, 130, 22, -90, 107, -2, -31, 38, -44, -58, -10, -29, -82, 36, 14, 28, 95, 24, 39, 44, -66, 71, 4, -39, 43, -38, -13, -16, -99, 53, -29, 42, 120, 75, 111, 79, 73, -3, 29, 70, -49, -42, -12, -7, 105, -8, 63, 56, -4, -38, -10, -99, 97, 26, 44, -102, -13, -92, 5, 3, 32, -67, 62, -36, 36, 39, 82, -77, -22, 79, 38, -3, -27, 90, -37, 119, -20, 0, 0, 83, -74]
4223g4q5K19j0k3J4m6o5J42j74K19j82rrJ84j24P8o2J06Jj43J3O3j2p6Q4n6N5
4250B8j47K06j22P6o2M1k02J44N5k7Q4n8o7L8Q1j17Q9k4o0J15K5p7qQ2moj05k
4278b4J7N3q5L8rJ3pJ0m7lJ5J1P9n3j17J23N0j30L2%R7n2L0o2K6j1L7n6l5N1J4
4309Ep7J07R1Qj52L2M8k9k9np8J71j69J50o4Ok6O6n8j6M9o2J05o1l9J97j79j4
4337b3M8k2j6k6QQ1k0m3K3rp7J15m3M7l8MJ7j2J0o3k6J17j04J39r5pm1J39j13
4366c0P6p1L0M3j32Q6l0j0M6N2j00R0k08K14r1P6j5m4l9J11j04qM6n6J23n0Rk3
4394iq5J06n2Q6L0n5L2NM0j37nJ05rk3Q8j11m1KQ0N7l3m5p1PL8P1o9L2nK5p0J29
4426A13j76K8K8qk0K4n4O4K1ol1oo6L2q5K22p7o0N1L9p4P5plJ8ll8K5M1r2N1j45
$$ y = [-74, -159, 60, 50, 27, 41, -5, -70, 72, -102, 117, -65, -74, -83, 101, -23, 55, -7, 99, 100, -43, -30, 33, 21, -55, 29, -27, 28, -119, 87, -35, 41, -21, 20, -182, -38, 17, -10, 74, 16, -51, -13, 68, -49, 40, 16, -44, 71, 96, 19, 11, 93, 89, 83, -22, -24, -7, 46, -39, -1, -10, 3, -4, 6, -41, -44, -29, -18, 61, 8, -109, 14, 64, -66, -34, -34, 63, 11, 41, -21, 5, -6, 31, -25, -60, -9, 5, -72, 35, 126, 134, -18, 14, 62, 33, 4, -1, -79, 92, -77, 73, 9, 15, -11, 55, -3, -19, 30, -32, 73, 12, -27, 170, -9, -23, 25, 3, -13, -39, -31, 50, 30, -13, 10, 1, -76, 39, -4, 43, 5, 9, 26, 14, 24, -39, -65, 52, -52, 87, -8, -15, -56, 83, -30, 46, -25, 5, 48, -84, 2, -28, -38, 8, 60, -40, 50, -158, 56, -35, 41, 26, -18, -57, 54, -50, -58, -12, -68, 55, 5, 14, -9, -94, 12, -40, 46, 76, 21, 53, 58, 98, -39, -44, 61, 52, 29, 117, 6, -35, -33, 47, 104, 71, 26, -45, -38, 0, 71, 2, 34, 29, 54, -16, 113, -63, -35, -7, -15, -35, -11, -65, -1, 20, 14, -17, -23, -89, -57, -142, 80, 3, -57, -6, 33, -41, 34, 27, 24, 42, 39, 1, 26, 67, -25, 26, -119]
4458a19Q8l1J09l3k0N5J11j36m4L0m7J02n4l9K7J4nN8n1m6O2p0P2r1J23n6l3o6
4486i0k0M0K8J09n1J5p8K3M3L7m0m3nl6M0M2L3np2K2QP3J2n3j0j92K22J1j5k7
4516B1l3J0kL7r5K5M7P6q0o6J24j15J5L7mMj6M3j79Q3J90nj38l9J29m1j58J19
4544a1j35K52l5r9m6R9K7L1o2j57J52n5P6j01M8M4k6rp1J25J4k6Rr2MJ8R9j60
4572h7J33k5j30J64o5R7j04J6Jq2Q0R5j54k6J66J3j54L0Q9j9j16J04k6L4j8Jj1
4599FK9m4l4J04K4j04l9J06kM8j54J20n5M4m5K3n7P7q4J9j7L8k1J8r0J31j13P8
4627FM4o0J2k1K8P7Pm9q9Q1l1l0J03j06j7L9O3j09L6P2j10Kk4J75j46Q6Or5J37
4656H7j9p6p1J60q9m8J8OqRoO6J7j5pm4k1o0J18j43J27N7j49J38m1q7R1O2r7N8
$$ y = [-119, -31, -62, 47, 14, -6, 49, 160, 24, -20, 10, -37, 65, 11, -28, -1, 13, 8, 66, 15, -31, 31, -39, 33, -58, 65, 9, -24, -90, -110, -70, -42, 67, 16, 31, -47, -24, 19, 56, 16, -27, -32, -68, -28, 14, 47, 42, -30, -8, 0, 73, 85, 32, 22, -170, 52, 63, 48, 21, -12, -2, -4, 33, -62, -37, 10, 86, 6, -60, 64, -51, -36, 1, -3, 1, -15, 28, -151, -68, 122, 117, -21, -60, 69, 28, -130, -11, -146, 106, 71, -28, -74, 25, 52, 83, 21, -136, 16, -39, 37, -64, -16, 28, 2, -7, -78, 47, 61, 35, 44, -48, -44, -26, 73, -87, 46, 21, -109, 55, -10, 87, -17, -1, 0, -82, -2, 93, -61, -87, 79, 92, -62, -32, 57, 38, -78, 26, 0, 34, 16, 17, 6, 35, -9, -43, 61, 85, -19, -58, 48, 46, 94, -60, 60, 5, 49, 4, 27, -30, 47, -37, -18, -35, 3, -18, 0, -90, 41, -72, 6, 50, -10, 2, -19, 9, 86, 93, 44, -45, 36, 5, -25, 78, -28, -45, -6, 57, -52, -16, 56, -54, -52, -76, 99, -47, 39, 45, -50, 87, 68, -8, -79, 81, -8, -56, -38, -32, -40, -31, -37, 29, 46, 31, 24, -20, -41, -101, 17, -126, 1, 58, -91, 47, 6, -81, 10, 72, -25, 33]
4686C3r1R0l1o3J38r7j23R5o4J20N7o1j40J66m4k2J7M9pl0j7L7n2o4J56m5o7Q0
4714B0l4Pj5O8r4PP9m8j8JQ9r8q6J03M5Lj4M1j56J38J9o0Kl4k0nQ7l8P7r8M7r
4746Fo6O5O3rL5p5k5J4N7j24m3J25q0L2R4L5j72J05n8L7j36J41q0L1KL2J5j5j5
4775ik0l4Q5M9q6N9K5q0J7r3N2kJ24p5L3o0l4L4j5J19m6r6P6M5j63R6Mn3O7q8
4805f9O1N4o7R6j16LJ19j14J05j25J29j11k7L2N0O2oq5j1J03o0m6MJ4om4M6J2
4833CPj3O1j37J10J1N8L0r6j12K7J11L7j03J1l4k8N4P4j7p4%P4q3K9j10L4J67
4861I1o1j02nJ92j52Q7n9m1N7j0j4K7l2K0l6j2RR3K7q5k8J39m0j64P5O8q6kM9
4890EkM9L2j28K4J24r7p7L2K0N1j6L1j41J07L5q7O2j7k6M5j1N4l5j70J17P3q0
$$ y = [33, -58, 32, 1, -62, 76, -21, -144, -49, -113, 7, 64, 3, -137, 29, -15, -37, -20, 29, 22, -8, -25, 12, -40, -104, 52, 7, -60, 20, -14, -7, -22, 46, -48, -41, 38, -10, -28, -27, 62, -36, -122, -19, 26, 29, 15, 56, -100, 38, 57, -3, -1, -35, -55, -60, 27, -11, 66, -32, 15, 6, -60, 5, 68, 59, 94, 19, -6, 8, 65, -59, -102, 23, -57, -25, 69, 104, -68, 37, -21, 16, -120, 21, -59, -28, -26, 6, 21, 6, -9, -29, -63, 22, 71, -15, 44, 69, -11, 6, -87, -35, -37, 87, 12, 45, -15, -49, -15, -30, 89, 43, -53, 23, 68, -95, 1, 5, -48, 19, -69, -8, 46, -21, 75, -41, -38, 81, -33, 72, -53, 76, -35, -62, -30, 20, 82, 76, -9, -20, 83, 23, -23, -19, -5, -11, -55, -9, 3, 10, -3, 58, -79, 31, 42, 100, 130, 34, -78, -51, 60, 97, -6, 5, -29, -57, -3, 71, 54, -20, -20, 54, -29, 0, -110, -76, 91, 30, -72, -77, 115, -37, 50, -9, -50, 7, -3, -17, 10, -22, -2, -38, -50, -41, 52, 79, -6, -34, 105, 65, -99, -24, 44, -42, -44, 5, 3, 52, 84, -44, -20, 104, 7, -70, -38, -18, 33, 17, 48, -93, 14, 49, -38, 24, 7, -19, 26, 15, 69, 34, -136, -19, 54, -26]
4918b6L8M1n0K0kp2M1O4j08J03j3n4Q5j39N5K4j5L5j6Pk9J24p6j1m3J47j44j7
4946c1m6R7Ro9L9l9R8m6K2%j26J06RK6n8K1l7Q2m4J08j27K2Q0j32P5o8NlqJ08
4976G3q4jLrj5Q2k3m0Ln5N6OJ35j5j40kO4J10j95J15p5p5J20r8QN0N2K1j49l7
5006a15J26m0p0J80r2k8N4n1NM9mM2l7Qjm6KL3k4o1Q2j1L4km8N0j6M7l5n8J04
5037G7m4ml5rk5jJ06n7j7N6j4M2K4r9J2K8n6j0Q8Jq3j08Q2RN4k2l0J2L7L1p8L
5069c0l9J57j65R4p9Q2n8P4Kq6l0O8M2j7M2k3m6P8j24J23o5L2m5Q9l3J2m4J02
5097A13j61J16m8j15J61j27J01pn7L4j25N8J3M7J5p1J86j25j3r1P0J49r8rK3p9
5123d0J15j14L8M5O9k8j45N8m4O8l3J2k6Q9n2k0l1J5O3j00J56q0k3M8k0j5l2N6
$$ y = [-26, 12, 53, 3, 23, 21, -51, -10, 54, -54, 49, 36, -18, 67, -72, -17, 7, -8, 27, 11, 18, -11, 113, 37, 26, -17, 130, -14, -31, -77, 20, 29, -40, -1, -40, 58, 12, 34, 34, -92, 14, 23, 49, -9, 12, -25, 57, 13, 121, -6, 16, 96, -36, 39, -29, -24, -27, -35, 73, -11, -12, -9, -18, -33, 49, 26, -14, -11, -66, -10, -4, 131, 116, -24, -26, 38, 148, -47, 68, -7, -82, 38, -60, -52, -2, 50, 71, -78, -115, 11, -29, -99, 81, -11, -39, 15, -36, -31, 18, 14, 56, 19, 27, 26, -20, -18, 15, -9, -70, 12, 1, 35, 33, -15, 35, 19, 66, 31, -27, 77, 33, 29, -6, -15, -40, -41, 65, 8, -9, 47, 33, 75, 99, 0, 12, 40, -16, -26, 62, 63, -20, -128, -46, -37, 17, -5, -35, -23, 14, 45, -33, -30, -69, 88, -77, 17, -62, 20, -38, 36, 38, -48, -78, -10, 32, 15, 57, 34, -12, 66, -58, 65, 0, 32, -13, 76, 43, 55, 11, 113, -48, 68, 20, -95, 66, -61, 40, 33, -24, 10, -115, -57, -44, 3, 18, -53, 133, 8, -5, -96, -26, 123, 25, 16, 39, -40, 75, -39, -1, 44, 113, 85, -60, -2, -46, 22, -11, 1, -25, 64, 12, -8, -39, -24, 39, -61, 95, 15, -8, 40, 20, 5, -27, 29]
5151B9r8R5J5m9L4M3j04M9o1M8o9n3J93r6q6M6J19j79P9N9o5M2n3Q9k7K2k2j4
5179a4O4j0j15R9l9j3L0O8m4m4q7J17L5n3K5o2Qm7M2J18j10P9n9MM4pj18P0N7
5208C8j10J20n4K4K5l3N6p6N4m4K8r6P7M3j20M6q8J02M1j0j4j4O2k0m1J09m5m5
5236A5p0P5%q1K9J9J1k8nJ03j98J40j05J26n0M2k6J9N1n5Q8n8p0J31j02P8K5j95
5264i1R8n5M2o0J52j16KJ18j41nK4K5m9Q1Mjn3J04j99J26J49j22p5J26j8p3n5
5291f2J44j13K1l8n2J12O4r0J03j42P2q2M4Rj9j8M1O2o9j9K0N7p0RL1l0J32r9
5319A8K9n9J18j50lRPO1NJ1j7N5j2j29l5R1rK5p7J30m1m0MJ77j97pK6J02k2J0
5349H0Qm4k0J8j23R2R6q7k7p1O8J2J8L3l4p1Q8l9M3p9L9n0P3j5m8J0J07o0p7N4
$$ y = [29, -69, 26, 41, -8, 26, 69, -35, 14, -47, 1, -68, -121, 72, -24, -110, -64, 55, -124, -45, 14, -51, -9, -62, 27, 0, 22, 0, -14, 50, 40, -75, 24, -15, -28, 2, 70, 26, -18, -105, 12, 47, -6, 19, -43, -35, -82, -40, 78, -32, 47, -12, -8, 36, 29, -89, -19, 38, -72, 48, -6, 18, 43, 10, 66, -10, 44, 0, 28, -68, 9, 52, -68, -22, -110, -8, 33, 23, 9, -5, 57, 37, -4, 105, 60, 15, -55, 20, 20, -61, -32, -13, -2, -30, -35, 68, -130, 10, -95, 31, -19, 23, -3, 16, 67, 12, 100, 42, -28, 103, 1, 79, 104, -91, 7, -48, -6, -66, 86, -30, -28, 90, -51, -56, -32, -7, -56, 25, 29, 28, -25, 79, -120, 6, 155, 33, -42, 84, 66, -7, -62, 82, -31, -10, -48, -100, 12, 76, -14, 89, -53, 19, -63, -19, -10, -29, -47, -6, 56, -13, -32, -12, 45, -25, -16, 15, -15, 117, 18, 47, -12, 106, -44, -47, -38, -31, 30, 35, 46, 29, 84, 72, -57, -92, -1, -10, 15, -62, 68, 27, -13, -9, 168, -29, -36, -10, 92, 70, 80, 88, 44, 24, 42, -81, 11, 107, 20, -7, -78, -10, 2, 20, 53, 19, -52, 36, -3, 40, -39, 0, -50, 23, 8, -40, -30, 77, 17, -60, -6]
5379fJ5k7pl7R0k1m0J8O6J1r5J4O4q4R1k0L2j26P9m6R4r7O4j0jk9m4L6N1m1pk0
5411c3O0Jm3N6q2M0j9j5L3J15j37N4p0J35Lr6J25j54J08j55J60q1m8K9%l3k2M7
5439b2N2o1L4j7j5k1P6n9M6Mp5L9o3J26p5J0r3J37L8L5q7K5j44J15%j48J83Ml1
5468A3k7J24k01R9M7m4M8m4m6k4MJ7K3J6j5M0l1L4p5J5j8P4K1o8O3J8r8J4l3J75
5498A21j26O0p1j6j6Q3m1O9l0n3J6R5o4j37P1J03J4P4j47M6o0L2q3l1J24q7P9
5525B5m8K5k9n7oO8O5L2J5p4L3j90P4R9L2k6M8j05LO4J8j29l5J24m4L4ll9O9j77
5555a34J81o0l4QJ24n0r1J02n5L8K2P0j10P6p2J8o2Q1m8L3m2J9j03J26j01O4j9
5582a9N2n5K5q4J04J0lJj9nJ25k02q9J07M0l7L9M3J01j88L1R1r7k9L6N7p7K3L8
$$ y = [-6, 9, -18, -25, -62, 28, 7, -33, -15, 51, 62, -33, -19, 45, -39, 52, 32, 64, -62, 17, -29, 65, -32, 32, 22, 21, -8, -52, -16, 35, -6, -13, -33, 27, 28, -15, 41, -41, -1, -20, -35, -2, 113, -24, 30, -40, 95, 98, 2, 127, -27, 81, -74, 86, 5, -43, -14, -14, -47, -69, -22, 30, -31, 3, -14, -29, -50, 26, -33, 13, 17, -58, -19, -82, 44, -31, -21, -114, 23, 61, 96, 9, 34, -110, 5, 5, -143, 40, 44, 13, -14, 110, -91, 8, 55, 11, 59, 15, -31, -55, -51, -34, -11, 5, -10, 30, -1, 33, -42, -27, -45, 29, 50, -18, 45, 63, -35, -21, -54, 121, -5, 55, -16, -32, -48, 35, -6, 63, 33, -20, -4, 91, 27, -110, -39, 64, 78, 152, 5, 51, -9, 23, -60, -91, 33, -54, 25, -23, 2, -27, -84, -90, -22, 43, 75, 90, 16, 49, -141, -67, 32, 64, 38, 86, -19, -16, 48, 66, -63, -98, 26, -18, 16, 13, -26, 43, -134, 47, -13, -47, -39, 85, 35, -56, 46, -9, 29, 51, 121, 11, 87, 15, 33, -29, 52, 4, 37, -5, 14, -89, 37, -64, 0, -19, 33, -22, 3, -81, 23, 33, 30, 31, 12, 7, 132, -70, -159, -52, -12, -49, -10, 33, 134, -54, -23, 68, -29, -58, -22, 35, -42, -19, 19]
5611A9N3m4k9J06o9L0k3J0nj02J26k0m7p5O2L1m5R9j44N8K6m7n1M7L2J2j2k4P5
5640D9k9Qp6M9J1p4Q5%qp6J55m0p0R8Nn5o1Q3m6P6l2QJ4k3j8J4m9L5j3J7nn7m9
5673g4Q2j15L4R9o3p5R1M1j8p9J05k5L3o1M9j19OL9O0o2NJ16j48J11NK3j84K21
5701I7r7O4K6p2K0O9k22J13K1m4N9p2M3k7j1pP8j8L5n7K1j51M2O0r0N0N2M9oJ8
5731D3l9N3j14kJ02K1p1L9n9j3L3m1L7PM4j16L4l3K5k0J30r1j6P6J0j7J1L6j16
5760d7r7J60r8rR1l7K2N2n4OQ5m4r5KM0K1k6J04o9q8J03L0o5j5J00l9mj1k9p8
5790h9M7O3prJ8m4j59J92N1r7O6Km3jl5K0j9Q3q6jQ2Lq0K9J06j49L1Pkl1O7K8
5822D3n5n1P8J3n1n5J97p7j07J5N6ro9N8j9l6L0P8k0qp8j1PM6J3Q1j48R9n5J03
$$ y = [19, 72, 28, -1, 105, 36, 66, 43, 53, 48, -54, 72, 52, 5, -70, -8, 23, -22, 77, -67, -9, 17, -30, -81, -34, -2, 10, -2, -26, 49, 20, 28, -48, 1, 12, -62, 23, 23, 15, -61, 94, 54, -16, 82, 87, 32, -29, 54, 8, 84, 52, 60, 74, 51, 33, 47, -2, 33, 20, 37, 32, -25, -74, 8, -107, -73, 26, -37, -112, -21, 20, 2, -77, 28, 3, 36, -25, 24, -95, -89, -50, 10, -52, -47, 69, -79, 32, 37, 60, -124, 97, 0, 64, 90, 18, 38, 107, -115, -2, 19, -25, 34, -38, 5, -22, -33, -40, 38, 20, 55, -2, 19, -132, -90, -30, -120, -70, -18, 31, 25, 43, 4, 57, -57, -59, 43, 64, -7, 32, -27, -40, -7, -48, -11, -4, 40, -76, -42, -75, -50, -70, 60, -31, -47, 29, 39, 22, 33, 69, -47, -144, 16, -82, -91, 0, -37, -15, 37, -17, -11, 74, 30, -65, -63, -23, -2, -28, 76, 7, -81, 22, 52, -13, -28, 72, 33, 29, 18, -11, -89, -42, 21, 14, 5, 23, -21, -180, 12, 63, -34, 32, 34, -9, -10, -45, -25, -44, 39, -47, -48, 34, 37, -43, -14, 92, -57, -26, -19, -21, -52, 15, 43, -12, -63, 15, 28, -23, -78, 119, 42, -65, -50, 6, -3, -72, -14, -33, -69, -39, 39, 19, 11, -67, -78, -71, -25, -12, 69, -79, 20, -35, 68]
5852F8l0j9l2J00j50L2J19j13%M9O3j27J8O2Kj12j3P3K9N9o9j1J0q2l6N7J03n5
5880eL7qn7p3J95q5o7j7J0j4Q2O2o0n7R5n2m9K32j57j5n8k0J57m1pK9Km7N0ro4
5911a1M2p0J30m8m9q1J2M8Q6j00ON6N8Qp3K2mK2q7J47r1m4K8Nk0o4N3J4kK0j7
5942dj4m7n6J59l9J5K3L1k9pj4km3R6j29O6j3k0j4L6l7kJ5j2N1l8j9M1q2LJ40
5973E5q0J17j13Qk7J0mM8l7J8L4o5M1J28k10k3K1P6n6J95k9j77N5P4r6l4J14k9
6001A4k6j9jL4O0l4m6J09n4oj43R0JJ29j07m7J4L6o5J52j38J1N7l6J5J3L2n9j3
6030b7J08n6rj4L2p5P5m3k3K4k8k3J49r2k3N1K0N9j37N1k5j02M5m3L4J12j2J4
6058D2m3m8L2M8m8O7l0rJ6n7N3K3p4O2m7l0r1O6P4M7j5O1j34R0n8J43j30M0m9
$$ y = [68, 38, 19, -13, 87, -63, -31, 88, -25, -25, 24, 87, -40, -22, 40, 42, -70, -83, -10, 19, 78, 9, -2, 8, -74, -110, -53, 50, -5, 32, 24, -33, -106, 89, 4, -63, -80, -70, -84, -2, 60, 0, -57, 38, -14, -63, 169, 12, -3, -61, -81, 76, 35, 28, 57, 59, 12, 62, 53, -11, 31, -39, 91, 43, -6, -87, -75, -27, 59, -41, -35, 21, 79, 87, 14, 36, 32, 54, -33, 114, 23, -21, 7, 12, -8, -72, -19, -5, -7, 13, -4, -18, -65, -121, 38, -1, 14, 37, 68, 39, 32, 18, 16, -27, 69, -60, 6, -7, -27, -41, -5, -42, -44, -29, -41, 10, -28, -47, -6, -88, -85, 55, -25, 92, -21, -13, -40, -30, -34, 14, -23, -5, 29, -36, 5, 133, -77, -100, -79, -3, -59, 136, 107, -70, -15, 59, -37, -71, 43, 14, -12, -31, -32, 2, 62, 28, -18, 91, 37, 31, -112, -22, -21, 108, 1, -46, -32, 4, -61, 91, -47, -36, 21, -15, 0, 13, 45, -14, -27, 81, 25, 16, 2, 34, -41, 34, -9, -32, -8, -36, -59, 90, -2, -25, 26, 46, 105, -32, 19, -6, -108, -63, -106, -72, 40, 28, 42, -1, -49, -17, 31, -17, 50, 20, 11, 27, -30, 23, 46, -28, 34, -13, -43, -134, -68, 6, 53, 38, 99, -35, 55, -3, 140, 10, 50, 1]
6087AN5l7J3O2j46O5q1J22p5J10j40nJ61j16Kk7J38j66J46rkp7N3n3K1j7K8o5
6115c9J0J7O7m7K8m5r8J35j8nJ7R%Ql9L5J1j29O6m4L1M2K7j2M4j08J3P2q3R0j04
6146d9J09Q7j90J00P8j04j13Q0k5L3p3J37j11Q2j36J47k2r4J0J11j19Q9o4k5N4
6171hK1o6N5K6M6l0r9L3j1JK3r1J64r9J8O5K6j06LK9KJ3j07J41%%OK6j71R8k4
6202a6R0p3j6l1J13k4n7P7o8J6p5Q8j0M1p2j0l7N2J03q5J2k5K5p3J20k5l8l3P9
6231D8m3Jk6Q3k0m7k6j4m4M5N5j16J77J3j32J7J71j00j00J7J58k13M8K5lk2O4
6258A6Oq4J05l5k2J2j8j01K22r0p2K5l1O0J7L9m4j66J84P5o8o5JJ09m6K5o3O3
6286E4j11J1M1J8nj04M9M4p0J01oq5K7J2n7N1N2o6J1M8N7n4jj24J70j56J31l7
$$ y = [1, 56, 19, 32, 94, -52, 13, -68, 54, -21, 89, -51, -56, 105, -11, -9, -36, 102, -64, 82, 73, 71, -6, 47, -6, 15, -2, 26, -39, -29, -12, 55, 8, 36, -9, -107, 28, 10, 5, 22, 31, 31, 39, 0, 35, 46, -83, -17, -61, -30, 12, 39, 27, 71, -37, -24, 48, -35, 55, -49, 60, 147, -43, 57, 135, 31, -82, -2, -27, 6, -67, 70, -41, 41, -95, 52, 30, -64, -54, 57, -62, 27, -37, -62, -8, 13, -53, 2, 28, 74, 44, -55, -22, -33, -32, -9, -100, 64, -35, -17, 48, 74, -32, -29, 0, 2, 15, -92, 49, 49, 49, 55, 81, -90, 8, -16, 74, 1, -15, -46, 67, 43, -14, 63, -5, 11, -64, 24, 14, 55, -17, -27, -64, -12, 91, 6, 18, -7, 18, -55, 65, 40, 2, -31, 48, 5, 6, -20, 63, 43, -4, -30, -44, -88, -43, 12, -104, 73, 86, -46, -29, 142, 42, -58, -41, 117, -96, -48, -23, -26, -48, 16, 22, -62, 43, 8, -14, -2, -20, -121, 101, 11, -61, -36, -67, -7, 10, 49, 5, -161, 23, 98, 30, -35, -34, 75, 29, 54, -9, 54, -57, -46, -5, 13, 8, -96, -47, -3, -73, 28, 22, -63, -36, -24, -81, -30, 22, -44, -33, 15, 72, 18, 17, -107, 63, -93, 38, 1]
6314Ak4J1R5j05J34l6p6O9p6m9P7j9m4Q7k0m6j4Q5on4J07q9M3j11J19m6m6j7P4
6343B4j6J8j13J2J14l0m2rQ3j02J01q6O1L2K5Jk01N7J25K9r4n1J06o4j47J65o4
6370f6J04M1j17N5L6l2R3k9o1n5R0r3j4M0J8J51j14n1P4j18N1L5R8j54O0m2J7
6397A7l4LK1j5M0Mk3Kk2p8L0J6O0l9N3j32QJ66j8j70J18j0mO2k5l8m5O2N3n3J
6428A0Q5j15Nj6L9K6o4J04l8K7j67N8K1O3j8j0m7L0j9m3mJ55j29O5Kk2j8o1N5
6457b6J6j32J48M6l2K6n5k6P2j35P4N7j3lK8p8Q7p9l1J05r8J7j3j9J49K0j81O9
6485gK4l2J2n4j4P1NJ3q2J42j06j5O0rrq4R4M1m2m2N6l4po6J67j5m8o9K7%O1n0
6517a2K1k0jL3k8m4Q3j00J65k9Lp4K5L0j45J19j0p7J12p8k6J20j36P0pK2r4R1
$$ y = [1, -23, -12, 83, -22, 112, 76, 0, 69, -7, -56, 21, 2, -42, 45, 25, -21, -35, 50, 44, -10, 97, 8, 51, -60, 59, 13, -33, -50, 24, 8, 26, -87, -75, 39, 9, -33, -42, 41, -61, 40, -46, 15, 47, 72, 73, -128, -71, 54, 83, -11, -62, 44, -20, -167, -2, -66, 38, 79, -38, 17, 53, 21, 114, 85, 24, -31, 59, -34, -48, -8, 10, 161, 47, -4, 70, -48, 3, 38, 136, -18, 42, 0, 17, -17, -14, 7, -8, 32, 36, 13, 15, -7, -85, -55, -39, 21, -18, 35, -97, -89, 77, 59, -111, 7, -3, -7, 55, 30, -8, -53, 9, 62, 9, 10, 95, -20, -15, -31, 8, 34, -30, 74, 36, 63, -104, -46, -25, 38, 20, 10, -37, -7, -26, -69, -73, 82, -47, 18, 20, -2, -20, -81, -26, -10, -142, 6, 52, 20, 46, -9, -35, 37, -98, -24, 33, 20, 17, 45, -33, 54, -25, -56, 49, -49, -32, -45, -64, 85, 105, -76, -7, 17, -15, -3, -57, -71, 0, 5, 18, -64, 78, -28, -43, 17, 8, -1, -85, 9, 50, 8, -34, 22, -12, -19, -85, 82, 67, 19, -50, -23, -23, 38, -12, 9, -11, -12, 21, -7, -51, 32, -68, 97, 68, 71, -3, 22, 52, -93, 26, 16, -61, 51, -27, -53, 67, -69, 1, -6, 16, -78, 13]
6545A3J1K9n9l9Q6q0OO3k6M6j36J5Q2q6M5K9j8J33j13n5K07p1j05l2J40n7op0
6573d8j4J20n1M2j29O5N2m2p4L7O4k3J3k5J13o3l6N7o0P6q1j16J62l7o5M6P5j56
$$ y = [13, 24, 53, -6, -45, 41, -39, -33, 30, 4, 50, -86, -71, 11, -75, -30, -1, -19, 114, 1, -54, 153, 82, -23, -55, 85, 28, 22, -48, -62, 58, 7, 49, -80, -15, 37, -5, -79, -42, 22, -1, 12, -13, 100, 37, 1, 58, -2, 74, -7, -123, 39, 2, -63, -17, 58, -98]
$$ [...]
16383G3
##END NTUPLES=NMR FID
##END=
