##TITLE=abcd
##JCAMPDX= 6.0         $$ Bruker NMR JCAMP-DX V2.0
##DATA TYPE= NMR FID
##DATA CLASS= NTUPLES
##ORIGIN= UXNMR, Bruker Analytische Messtechnik GmbH
##OWNER= root
$$ XWIN-NMR		Version 3.5
$$ Fri May 30 17:39:54 2025 Russian Standard Time (UT+4h)  servis@DPX200
##.OBSERVE FREQUENCY= 200.131235884673
##.OBSERVE NUCLEUS= ^1H
##.DELAY= (6, 6)
##.ACQUISITION MODE= SIMULTANEOUS
##.ACQUISITION SCHEME= undefined
##.AVERAGES= 32
##.DIGITISER RES= 18
##SPECTROMETER/DATA SYSTEM= spect
##.PULSE SEQUENCE= zg
##.SOLVENT NAME= CDCl3
##.SHIFT REFERENCE= (INTERNAL, CDCl3, 0, 16.5164)
##AUDIT TRAIL= $$ (NUMBER, WHEN, WHO, WHERE, WHAT)
$$ ##TITLE= Audit trail, XWIN-NMR		Version 3.5
$$ ##JCAMPDX= 5.01
$$ ##ORIGIN= Bruker BioSpin GmbH
$$ ##OWNER= servis
$$ F:\spectra/data/av/nmr/H1/1/audita.txt
$$ ##AUDIT TRAIL=  $$ (NUMBER, WHEN, WHO, WHERE, WHAT)
(   1,<2025-05-30 17:39:27.26 +0400>,<servis>,<DPX200>,
      <created by zg, POWCHK disabled, PULCHK disabled
       configuration hash MD5:
       00 E9 B6 7A A2 85 ED C7 34 08 36 98 17 FE 4E 26
       data hash MD5: 32K
       3A 18 BE 28 93 17 FF 6D D0 7B 8C 33 DC F7 A0 40>)
$$ ##END=
$$ 
$$ hash MD5
$$ E2 5D 95 2E 0A 22 A1 49 74 EE EE 7B EF 68 DF 40
##$RELAX= 
##$RELAX= 
##$RELAX= 
##$RELAX= 
##$RELAX= 
##$RELAX= 
##$RELAX= 
##$RELAX= 
$$ Bruker specific parameters
$$ --------------------------
##$DU= <F:\spectra>
##$EXPNO= 1
##$NAME= <H1>
##$PROCNO= 1
##$TYPE= <nmr>
##$USER= <av>
##$AMP= (0..31)
100 100 100 100 100 100 100 100 100 100 100 100 100 100 100 100 100 100 
100 100 100 100 100 100 100 100 100 100 100 100 100 100 
##$AQSEQ= 0
##$AQ_mod= 1
##$AUNM= <au_zg>
##$AUTOPOS= <>
##$BF1= 200.13
##$BF2= 200.13
##$BF3= 200.13
##$BF4= 200.13
##$BF5= 500.13
##$BF6= 500.13
##$BF7= 500.13
##$BF8= 500.13
##$BYTORDA= 1
##$CFDGTYP= 0
##$CFRGTYP= 5
##$CHEMSTR= <none>
##$CNST= (0..31)
1 1 145 1 1 1 1 1 1 1 1 1 1 1 1 1 1 1 1 1 1 1 1 1 1 1 1 1 1 1 1 1 
##$CPDPRG= <>
##$CPDPRG1= <>
##$CPDPRG2= <>
##$CPDPRG3= <>
##$CPDPRG4= <mlev>
##$CPDPRG5= <mlev>
##$CPDPRG6= <mlev>
##$CPDPRG7= <mlev>
##$CPDPRG8= <mlev>
##$CPDPRGB= <>
##$CPDPRGT= <>
##$D= (0..31)
0 2 0 0 0 0 0 0 0 0.06 0 0 0 0 0 0 0.0002 0 0 0 0 0 0 0 0 0 0 0 0 0 0 
0 
##$DATE= 1748612366
##$DBL= (0..7)
120 120 120 120 120 120 120 120 
##$DBP= (0..7)
150 150 150 150 150 150 150 150 
##$DBP07= 0
##$DBPNAM0= <>
##$DBPNAM1= <>
##$DBPNAM2= <>
##$DBPNAM3= <>
##$DBPNAM4= <>
##$DBPNAM5= <>
##$DBPNAM6= <>
##$DBPNAM7= <>
##$DBPOAL= (0..7)
0.5 0.5 0.5 0.5 0.5 0.5 0.5 0.5 
##$DBPOFFS= (0..7)
0 0 0 0 0 0 0 0 
##$DE= 6
##$DECBNUC= <off>
##$DECIM= 32
##$DECNUC= <off>
##$DECSTAT= 4
##$DIGMOD= 1
##$DIGTYP= 9
##$DL= (0..7)
0 120 120 120 120 120 120 120 
##$DP= (0..7)
150 150 150 150 150 150 150 150 
##$DP07= 0
##$DPNAME0= <>
##$DPNAME1= <>
##$DPNAME2= <>
##$DPNAME3= <>
##$DPNAME4= <>
##$DPNAME5= <>
##$DPNAME6= <>
##$DPNAME7= <>
##$DPOAL= (0..7)
0.5 0.5 0.5 0.5 0.5 0.5 0.5 0.5 
##$DPOFFS= (0..7)
0 0 0 0 0 0 0 0 
##$DQDMODE= 0
##$DR= 18
##$DS= 0
##$DSLIST= <SSSSSSSSSSSSSSS>
##$DSPFIRM= 0
$$ [...]
##$SUBNAM0= <"">
##$SUBNAM1= <"">
##$SUBNAM2= <"">
##$SUBNAM3= <"">
##$SUBNAM4= <"">
##$SUBNAM5= <"">
##$SUBNAM6= <"">
##$SUBNAM7= <"">
##$SUBNAM8= <"">
##$SUBNAM9= <"">
##$SW= 20.6817932712277
##$SWIBOX= (0..15)
0 0 3 0 0 0 0 0 0 0 0 0 0 0 0 0 
##$SW_h= 4139.07284768212
##$TD= 32768
##$TD0= 1
##$TE= 0
##$TE2= 300
##$TE3= 300
##$TEG= 300
##$TL= (0..7)
0 120 120 120 120 120 120 120 
##$TP= (0..7)
150 150 150 150 150 150 150 150 
##$TP07= 0
##$TPNAME0= <>
##$TPNAME1= <>
##$TPNAME2= <>
##$TPNAME3= <>
##$TPNAME4= <>
##$TPNAME5= <>
##$TPNAME6= <>
##$TPNAME7= <>
##$TPOAL= (0..7)
0.5 0.5 0.5 0.5 0.5 0.5 0.5 0.5 
##$TPOFFS= (0..7)
0 0 0 0 0 0 0 0 
##$TUNHIN= 0
##$TUNHOUT= 0
##$TUNXOUT= 0
##$USERA1= <user>
##$USERA2= <user>
##$USERA3= <user>
##$USERA4= <user>
##$USERA5= <user>
##$V9= 5
##$VALIST= <valist>
##$VCLIST= <CCCCCCCCCCCCCCC>
##$VD= 0
##$VDLIST= <DDDDDDDDDDDDDDD>
##$VPLIST= <PPPPPPPPPPPPPPP>
##$VTLIST= <TTTTTTTTTTTTTTT>
##$WBST= 1024
##$WBSW= 30
##$XGAIN= (0..3)
0 0 0 0 
##$XL= 0
##$YL= 0
##$YMAX_a= 787541
##$YMIN_a= -655384
##$ZGOPTNS= <>
##$ZL1= 120
##$ZL2= 120
##$ZL3= 120
##$ZL4= 120
##$ABSF1= 10
##$ABSF2= 0
##$ABSG= 5
##$ABSL= 3
##$ALPHA= 0
##$AQORDER= 0
##$ASSFAC= 0
##$ASSFACI= 0
##$ASSFACX= 0
##$ASSWID= 0
##$AUNMP= <proc_1d>
##$AZFE= 0.1
##$AZFW= 0.1
##$BCFW= 1
##$BC_mod= 2
##$BYTORDP= 0
##$COROFFS= 0
##$CY= 19
##$DATMOD= 1
##$DC= 2
##$DFILT= <>
##$DTYPP= 0
##$F1P= 11.0000007629395
##$F2P= -0.999999237060547
##$FCOR= 0.5
##$FTSIZE= 0
##$FT_mod= 4
##$GAMMA= 1
##$GB= 1
##$INTBC= 1
##$INTSCL= 1
##$ISEN= 128
##$LB= 0.05
##$LEV0= 0
##$LPBIN= 0
##$MAXI= 10000
##$MC2= 0
##$MEAN= 0
##$ME_mod= 0
##$MI= 0
##$NCOEF= 0
##$NC_proc= 0
##$NLEV= 6
##$NOISF1= 0
##$NOISF2= 0
##$NSP= 1
##$NTH_PI= 0
##$NZP= 0
##$OFFSET= 16.51637
##$PC= 1
##$PHC0= -263.3773
##$PHC1= -4.898466
##$PH_mod= 0
##$PKNL= yes
##$PPARMOD= 0
##$PSCAL= 4
##$PSIGN= 0
##$REVERSE= no
##$SF= 200.13
##$SI= 16384
##$SIGF1= 0
##$SIGF2= 0
##$SINO= 400
##$SIOLD= 16384
##$SREGLST= <1H.CDCl3>
##$SSB= 0
##$STSI= 0
##$STSR= 0
##$SW_p= 4139.07284768211
##$SYMM= 0
##$S_DEV= 0
##$TDeff= 0
##$TDoff= 0
##$TI= <>
##$TILT= no
##$TM1= 0
##$TM2= 0
##$TOPLEV= 0
##$USERP1= <user>
##$USERP2= <user>
##$USERP3= <user>
##$USERP4= <user>
##$USERP5= <user>
##$WDW= 1
##$XDIM= 8192
##$YMAX_p= 0
##$YMIN_p= 0
$$ End of Bruker specific parameters
$$ ---------------------------------
##NTUPLES= NMR FID
##VAR_NAME=  TIME,          FID/REAL,        FID/IMAG
##SYMBOL=    X,             R,               I
##VAR_TYPE=  INDEPENDENT,   DEPENDENT,       DEPENDENT
##VAR_FORM=  AFFN,          ASDF,            ASDF
##VAR_DIM=   16384,         16384,           16384
##UNITS=     SECONDS,       ARBITRARY UNITS, ARBITRARY UNITS
##FACTOR=    0.0002416,     1,               1
##FIRST=     0,             0,               0
##LAST=      3.9581328,     0,               0
##MIN=       0,             -655384,         0
##MAX=       3.9581328,     787541,          0
$$ Real data points
##PAGE= N=1
##DATA TABLE= (X++(R..R)), XYDATA
$$ [...]
$$ plain form
8907 -12 62 -53 37 -2 -47 -187 -79 24 71 -29 63 25 -34 221 94 27 -92 -31 65 22 50 -48 8 -24 -62 -42
8933 -42 1 38 47 -24 81 -78 -13 12 30 -55 -95 75 1 -38 49 -35 94 13 -45 -4 -28 61 -22 -15 -15 -22 -64 17 31 -2
8963 -2 -130 77 15 127 101 -107 -21 24 -28 32 -26 51 112 6 1 -32 -97 34 -16 20 23 -32 -61 -87 -189 -5 8 -8
8991 -8 29 -58 9 -16 -38 34 78 -62 -112 8 -34 -18 -17 12 -4 -27 -8 170 -3 60 30 -45 52 -7 30 -7 -7 52 -38 -20
9021 -20 66 39 -58 89 104 65 -8 72 -54 83 -61 18 -78 -48 50 -72 33 -45 -36 26 -32 38 -10 -19 2 53 23 116
9049 116 -17 -57 6 121 5 145 62 58 44 183 -60 -101 -14 114 -96 150 53 50 46 -46 23 -123 -78 -5 -143 40
9075 40 18 19 8 50 23 -65 69 -60 15 -19 -81 -56 -37 -20 124 7 -96 47 68 22 23 -11 -5 -37 35 -27 38 51 -1
9104 -1 25 46 38 -27 49 -30 -53 -1 97 -26 16 -10 33 -101 89 19 7 -14 62 -24 -109 -52 74 23 8 117 39 35 -7
$$ packed form
8907a2P4j15R0l9m5j40J08J03M7j00R2l8n9K55j27o7j19O1R6m3K8r8N6l2l8K0
8933d2M3L7Rp1J05j59O5K5J8q5m0J70p4l9Q7q4J29q1n8M1k4Q9q3P%pm2Q1J4l3
8963bj28K07o2J12k6k08Q6M5n2O0n8P7O1j06nl3o5J31n0L6Ln5k9k6j02J84J3j6
8991hL7q7O7k5k2P2M4j40n0J20m2J6JK9j6k3J9J78j73O3l0p5R7n9L7l7%N9r0J8
9021b0Q6k7r7J47J5l9p3Q0j26J37j44P9r6L0R8j22J05p8RO2n8P0m8rK1N1l0R3
9049A16j33m0O3J15j16J40q3mj4J39k43m1Q7J28k10K46r7lmr2O9j46M5P3j38J83
9075D0k2Jj1M2k7q8J34j29P5l4o2K5J9J7J44j17j03J43K1m6Jl4Ol2P2o2O5J3n2
9104aK6K1qo5P6p9k3N2R8j23M2k6M3j34J90p0j2k1P6q6q5N7J26n1j5J09p8mm2
$$ plain form
9133 -7 28 -74 143 -29 -115 -112 77 106 42 114 -24 -84 66 -17 15 113 16 58 -2 24 16 28 116 34 1 49 71 13 21
9162 21 -48 27 -40 72 96 117 -44 -95 -79 -26 -82 53 -28 75 59 -23 -130 81 54 -46 -32 169 21 36 23 9
9188 9 -71 -30 -61 -21 79 114 136 -34 74 -9 40 -16 -8 -34 -128 35 -21 -17 41 61 67 55 30 -149 -52 12 -97 52 -52
9217 -52 -62 8 14 49 38 26 -44 -51 -22 177 -19 -54 102 38 -65 44 -12 -133 61 125 3 -68 134 52 23 97 42
9244 42 -103 -68 26 -90 -19 64 82 66 48 -76 -23 41 66 54 -53 -67 -29 -63 -68 58 108 21 -85 22 -57 -74 -10
9271 -10 -60 67 48 -100 -116 -67 -84 -64 -90 -119 38 78 38 59 38 19 51 -21 39 11 -52 97 61 -75 3 -88 109
9298 109 -54 95 85 -90 -104 7 48 -55 -64 3 -24 9 -25 -4 15 59 -12 -50 -97 95 -93 -50 25 -192 30 1
9324 1 -37 -133 26 4 -57 -62 -18 -68 75 32 -10 -94 36 79 -64 -12 71 37 49 -16 29 19 51 44 9 81 1 -32 8 -78
$$ packed form
9133gL5j02K17j72q6LJ89K9o4P2j38o0J50q3L2R8r7M2o0K6qJ2Q8q2l3M8K2n8Q
9162B1o9P5o7J12K4K1j61n1J6N3n6J35q1J03j6q2j07K11k7j00J4K01j48J5j3j4
9188Iq0M1l1M0J00L5K2j70J08q3M9n6Qk6r4J63n6MN8K0Oj2k5j79R7O4j09J49j04
9217e2j0P0OL5j1j2p0pK9J99j96l5J56o4j03J09n6j21J94O4j22p1K02q2k9P4n5
9244D2j45L5R4j16P1Q3J8j6j8j24N3O4K5j2j07j4L8l4nJ26N0q7j06J07p9j7O4
9271a0n0J27j9j48j6M9j7K0k6k9J57M0m0K1k1j9L2p2O0k8o3J49l6j36P8r1J97
9298A09j63J49j0j75j4J11M1j03rO7k7L3l4K1J9M4p1l8m7J92j88M3P5k17K22k9
9324Al8r6J59k2o1nM4n0J43m3m2q4J30M3j43N2Q3l4J2o5M5j0L2pl5P2q0l3M0q6
$$ plain form
9354 -78 -27 10 95 74 36 -78 -60 18 -113 6 37 -56 -68 121 -34 81 -44 81 1 -30 26 -88 -24 42 51 -62
9380 -62 30 -55 2 10 -9 63 -61 107 28 -17 19 -43 135 -33 85 -177 117 132 7 -65 -93 97 -45 54 124 -27
9406 -27 12 14 -41 68 -5 33 30 -36 -93 -72 35 -73 -99 -15 -1 53 -50 -46 -27 -9 -36 129 -56 79 -45 118 20
9433 20 -29 -23 80 13 -5 49 13 13 115 -24 -25 -46 -16 -68 -64 93 42 73 21 39 96 77 25 19 226 24 18 -1 51 -69
9463 -69 -170 84 39 54 49 21 -4 16 74 18 -88 4 49 65 53 50 5 -24 129 80 2 25 -29 24 -66 -44 -76 -54 21
9492 21 -12 124 92 74 60 -152 143 79 140 64 -3 19 20 -28 -17 34 -25 -21 47 61 5 14 5 156 -41 -67 -25 -69 -26 39
9522 39 75 -76 -17 50 23 -72 -2 72 -119 98 6 -44 58 49 26 -122 146 41 -162 54 -64 -93 -27 54 46 -64
9548 -64 54 15 -70 -4 -94 111 33 -33 -101 -220 19 -98 -80 -46 106 41 -33 142 12 -69 -35 -84 -41 -92 59 44
$$ packed form
9354g8N1L7Q5k1l8j14J8P8j31J19L1r3j2J89j55J15j25J25q0l1N6j14O4O6Rj13
9380f2R2q5N7Qj9P2j24J68p9m5L6o2J78j68J18k62K94J5j25p2k8J90j42R9P0j51
9406b7L9Kn5J09p3L8lo6n7K1J07j08k6Q4J4N4j03MJ9J8k7J65j85J35j24J63r8
9433B0m9OJ03o7j8N4l6%J02j39jk1L0n2MJ57n1L1n2J8N7j9n2oK07k02oj9N2j20
9463f9j01K54m5J5nk8k5K0N8n6j06R2M5J6j2lm5k9J53m9p8K3n4N3r0K2l2K2P5
9492B1l3J36l2j8j4k12K95o4O1p6o7K2Jm8J1N1n9MO8J4n6RrJ51j97k6M2m4M3O5
9522C9L6j51N9O7k7r5P0P4j91K17r2n0J02rk3j48K68j05k03K16j18k9O6Q1qj10
9548f4J18l9q5O6r0K05p8o6o8j19K39j17J8L4J52o5p4J75j30q1L4m9M3n1J51j5
$$ plain form
9574 44 -71 160 64 38 5 1 -6 -60 36 2 51 52 30 38 30 32 -33 16 152 20 -38 2 -5 4 21 -27 82 36 -15 -36 -25 51
9606 51 69 -49 42 76 7 60 48 67 44 13 8 15 10 -41 -9 21 73 -44 -30 79 56 16 -67 15 6 14 -14 -14 -64 57 47
9637 47 -89 -93 -12 10 -46 91 33 101 -37 6 55 9 84 -55 31 41 33 -38 -60 166 -28 30 40 -139 -113 47 60
9664 60 -28 -50 85 50 -87 46 -24 16 5 50 -29 103 62 62 -6 89 -29 64 82 33 5 86 1 -70 70 82 -5 -104
9692 -104 -61 126 -49 5 78 64 17 23 50 45 -76 -59 22 -36 64 163 0 42 12 -73 -92 41 -31 44 70 8 -67 -48
9720 -48 98 18 -24 153 88 -135 0 80 76 -43 -49 10 -20 -22 103 -64 -123 68 51 -28 82 17 -79 23 -81 -49
9746 -49 -61 63 -91 16 6 -2 -191 95 -23 46 70 26 -27 23 34 8 35 -25 -30 -39 50 31 77 -64 42 -14 -55 77
9774 77 101 -62 14 37 -113 77 -40 73 -76 -57 116 -65 -13 30 1 -51 46 -30 -4 -34 -47 -48 20 128 -97 -134
$$ packed form
9574D4j15K31r6k6l3mpn4R6l4M9Jk2QqKo5M9J36j32n8M0pRJ7m8J09m6n1k1J1P6
9606E1J8j18R1L4o9N3j2J9k3l1nPnn1L2L0N2j17J4J09k3m0q3Q2rQk8%n0J21j0
9637D7j36mQ1K2n6J37n8O8j38M3M9m6P5j39Q6J0qp1k2K26j94N8J0j79K6J60J3
9664F0q8k2J35l5j37J33p0M0j1M5p9J32m1%o8R5j18R3J8m9k8Q1q5p1J40J2q7r9
9692a04M3J87j75N4P3j4m7OK7nj21J7Q1n8J00R9j63M2l0q5j9J33p2P5K6o2p5J9
9720d8J46q0m2J77o5k23J35Q0mj19oN9l0kJ25j67n9J91j7p9J10o5r6J02j04L2
9746d9j2J24j54J07j0qj89K86j18O9K4m4n3N0J1k6K7o0nrQ9j9M6j41J06n6m1J32
9774G7K4j63P6K3j50J90j17J13j49J9J73j81N2M3k9n2R7p6K6l0j3jO8J08k25l7
$$ plain form
9800 -134 85 -76 -165 -17 56 -112 76 51 -51 30 37 -40 34 30 -22 -6 -5 75 70 -36 34 92 47 -16 169 70 -11 1
9828 1 35 -86 105 51 20 102 116 -58 -58 -38 82 -17 14 -63 -2 56 15 54 -57 32 -39 -58 -68 50 -55 -2 43 -64
9856 -64 -56 39 80 15 95 -9 62 15 132 69 -83 30 9 -72 18 68 -60 14 -12 28 -81 6 -134 -27 150 -20
9882 -20 6 5 46 -50 -42 34 -12 29 13 -63 -83 -63 153 3 87 90 -70 24 -15 55 -14 -81 -68 14 -32 13 56 65 103 88 -34
9913 -34 42 -60 110 -94 78 84 52 -100 -33 31 -139 -33 76 -67 18 -29 -113 -56 89 -3 3 -42 0 -29 5 -6
9939 -6 -29 -6 -91 18 -126 -44 -42 15 24 76 -111 -27 -4 -16 65 34 -64 13 52 26 -40 16 -127 -19 14 3 -7 -42 70
9968 70 -42 69 134 -10 134 -4 15 -80 17 -49 -53 167 -13 -19 3 104 -29 -53 -1 -75 -12 25 64 -126 38 -112
9994 -112 -27 25 -93 8 69 3 -109 45 100 7 1 22 86 -60 211 18 -1 -46 81 -9 -59 5 70 -67 -4 98
$$ packed form
9800a34K19j61q9J48P3j68J88k5j02Q1Pp7P4mn2J6JQ0nj06P0N8m5o3J85r9q1J2
9828AL4j21J91n4l1Q2J4j74%K0J20r9L1p7O1N8m1L9j11Q9p1j9j0J18j05N3M5j07
9856f4QR5M1o5Q0j04P1m7J17o3j52J13k1q1R0N0j28P4k6M0j09Q7j40J07J77j70
9882b0K6jM1r6QP6m6M1j6p6k0K0K16j50Q4Lj60R4l9P0o9o7J3Q2m6M5M3RL8j5j22
9913c4P6j02J70k04J72Ol2j52O7O4j70J06J09j43Q5m7q4N7J45r2Om5M2k9L4j1
9939fk3K3q5J09j44Q2KN7RN2j87Q4K3j2Q1l1r8P7L9k6o6N6j43J08L3j1j0l5J12
9968G0j12J11O5j44J44j38J9r5R7o6mK20j80oK2J01j33k4N2p4O3L7L9j90J64j50
9994a12Q5N2j18J01O1o6j12J54N5r3oK1O4j46K71j93j9m5J27r0n0O4O5j37O3J02
$$ plain form
10020 98 81 61 -39 -21 -77 15 126 -41 27 -23 44 -34 -38 24 -48 56 4 34 -44 36 12 29 203 55 133 16 -88
10047 -88 -58 4 -43 15 99 27 10 -30 108 94 -22 87 16 -11 -58 -26 0 -9 -81 -36 -42 148 46 -23 -6 35 -12 108
10075 108 32 -13 42 107 -64 18 -72 5 52 78 68 49 60 4 68 12 -65 35 -49 -48 -19 15 47 -49 24 -46 -25 77
10103 77 183 34 9 -7 103 -16 -16 -12 19 -12 -35 -53 -96 -104 59 -16 -2 81 -28 -39 86 21 40 21 -62 -71 -44 45
10131 45 -123 -46 43 -200 -11 -35 -147 -15 -80 -2 -66 -26 39 -35 18 49 42 6 -8 51 -74 -9 111 -18 -5 -60
10157 -60 5 -59 49 66 14 -50 -63 9 -83 39 74 -47 -29 64 -45 1 -18 -13 -36 21 -20 -128 -71 82 -39 -143
10183 -143 59 -71 -19 -82 45 -6 -74 78 -78 -20 51 -32 -69 10 59 -51 159 32 10 24 22 136 75 12 -79
10208 -79 -25 16 2 -83 -23 103 -36 -137 -53 -6 -101 20 106 -96 48 -14 -152 140 21 -22 -59 -69 10 -123 -82
$$ packed form
10020I8j7k0j00J8n6R2J11j67O8n0O7p8mO2p2J04n2L0p8Q0k4J7J74j48P8j17j04
10047h8L0O2m7N8Q4p2j7m0J38j4j16J09p1k7m7L2K6rp2M5oJ90j02o9J7M1m7J20
10075A08p6m5N5O5j71Q2r0P7M7K6j0j9J1n6O4n6p7J00q4JK9L4L2r6P3p0K1J02
10103G7J06j49k5j6J10j19%ML1l1k3j8m3qJ63p5J4Q3j09j1J25o5J9j9q3rK7Q9
10131D5j68P7Q9k43J89k4j12J32o5P8o4M0O5p4N3L1pl6j4N9j25O5J20j29J3n5
10157f0O5o4J08J7n2o4j3P2r2J22L5j21J8R3j09M6j9Nk3N7m1j08N7J53j21j04
10183a43K02j30N2o3J27n1o8J52j56N8P1q3l7P9M9j10K10j27k2J4kJ14o1o3r1
10208g9N4M1j4q5O0J26j39j01Q4M7r5J21Q6k02J44o2j38K92j19m3l7j0P9j33M1
$$ plain form
10233 -82 -6 45 -63 -7 128 -72 31 142 -19 10 -17 38 44 35 -60 107 131 48 -95 70 34 40 -2 105 91 12
10259 12 -110 12 -37 -32 -27 -23 5 9 7 53 64 76 -49 -9 11 -62 5 21 33 -84 -94 34 19 -77 0 74 108 24 -9 140
10289 140 -56 21 -38 -151 68 42 17 -100 142 61 -15 14 195 14 -43 36 78 -1 129 -187 -36 -28 -56 -78 -33
10314 -33 39 -24 -100 -52 -61 17 35 77 94 27 -4 134 -20 -17 17 -100 21 12 -13 -57 67 53 -67 60 98 29 25 104
10342 104 -30 -25 109 104 -144 27 106 -131 -16 -80 44 25 104 12 46 125 63 18 119 46 82 -122 55 -107 -68
10367 -68 108 -188 15 -24 138 -124 -66 26 -51 -23 42 -38 -21 75 -81 -56 -93 -97 120 9 -124 56 -47 15 153
10392 153 39 -51 36 9 -15 150 51 -55 36 43 128 -40 65 20 8 -78 187 30 -28 -147 18 68 -61 -52 11
10417 11 -67 165 -36 -152 -7 -140 31 -8 -11 66 -65 19 -15 77 -76 9 3 44 9 -34 -50 98 18 18 -157 28
$$ packed form
10233h2P6N1j08N6J35k00J03J11j61K9k7N5Orr5J67K4q3j43J65l6Om2J07j4p9
10259A2j22J22m9NNMK8MkM6J1J2j25M0K0p3O7J6J2j17j0J28j5r6P7P4L4q4l3J49
10289A40j96P7n9j13K19k6k5j17K42q1p6K9J81j81n7P9M2p9J30l16J51Qk8k2M5
10314c3P2o3p6M8rP8J8M2J7o7l1J38j54LL4j17J21rk5m4J24j4j20J27L8o9mP9
10342A04j34NJ34nk48J71P9k37J15o4J24j9P9r2L4P9o2m5J01p3L6k04J77j62L9
10367f8J76k96K03l9J62k62N8R2p7K8O5q0J7R6j56K5l7mK17j11j33J80j03O2J38
10392A53j14r0Q7k7k4J65r9j06R1PQ5j68J05m5j2q6K65j57n8j19J65N0j29RO3
10417A1p8K32k01j16J45j33J71l9lP7j31Q4l4R2j53Q5oM1l5m3j6J48q0%j75J85
$$ plain form
10443 28 -58 8 75 48 18 89 77 -8 -10 29 55 -129 -11 -114 -49 66 -93 30 -120 -8 -114 -36 15 -24 -38 -36
10469 -36 -16 -34 -61 -59 -191 -105 -28 -100 -66 81 21 48 -91 36 132 27 112 115 4 -34 37 49 90 108 84 -92 -9
10496 -9 44 37 78 2 52 -14 111 -29 -172 -46 38 9 -21 -45 -107 9 -10 -50 -75 -17 54 17 50 54 -74 73 -3 109
10524 109 -137 -98 150 69 -23 -39 99 -30 87 174 49 40 130 39 105 -28 -60 3 51 74 165 -59 -39 20 -12 -83
10550 -83 -94 -117 -136 86 59 12 -22 -4 63 67 -86 2 -72 -65 77 -19 -1 50 -75 -86 -38 -9 -27 7 -103 116 -92
10577 -92 0 59 -58 -49 32 0 -93 -75 106 30 104 -11 2 57 70 -33 14 79 -90 3 -52 71 77 -80 -151 33 85
10604 85 -83 180 34 -59 -62 -9 16 -22 -48 29 -59 -60 70 47 10 -21 -27 -18 -60 43 -18 -33 -66 60 -29 -7 111 104 152
10633 152 -10 150 93 33 81 -68 28 35 79 -16 35 -70 50 11 -36 39 39 37 -142 -123 -38 19 -78 127 -66 -105 2
$$ packed form
10443B8q6O6O7k7l0P1j2q5kL9K6j84J18j03O5J15j59J23j50J12j06P8N1l9j4K
10469c6K0j8k7Kj32Q6P7p2L4J47o0K7j39J27R6j05Q5Lj11l8P1J2M1J8k4j76Q3
10496iN3pM1p6N0o6J25j40j43J26Q4k9l0k4o2J16j9m0k5N8P1l7L3Mj28J47p6J12
10524A09k46L9K48q1r2j6J38j29J17Q7j25rR0r1O6j33l2O3M8K3R1k24K0N9l2p1
10550h3j1k3j9K22k7m7l4J8O7Mj53Q8p4PJ42r6J8N1j25j1M8K9j8L4j10K19k08
10577i2R2N9j17RQ1l2r3J8J81p6P4j15J3N5J3j03M7O5j69R3n5J23Oj57p1J84N2
10604H5j68K63j46r3lN3K5l8k6P7q8jJ30k3l7l1oRm2J03o1j5l3J26q9K2J18pM8
10633A52j62J60n7o0M8j49R6PM4r5N1j05J20l9m7P5%kj79J9Q5N7r7K05j93l9J07
$$ plain form
10660 2 8 3 36 17 -48 -48 113 -56 85 146 4 -43 130 99 -123 16 -4 54 -21 3 63 62 44 25 -32 -85 99 134
10688 134 -41 30 2 -16 -86 92 4 -43 -65 -53 -94 -46 -42 46 28 -2 -22 17 -11 90 -80 -2 25 -27 22 34 -103
10715 -103 -69 -69 -24 -86 89 157 -35 148 51 62 -41 7 51 -101 -48 45 123 7 22 26 -19 -62 60 -13 -76 225
10741 225 25 -61 -35 10 14 2 4 87 -65 114 15 -33 43 28 10 -27 5 -23 35 67 66 41 -11 77 -6 24 -3 10 43
10770 43 127 156 6 -8 36 50 -19 63 -19 51 38 41 -46 20 113 55 1 70 -6 -185 23 59 7 50 32 31 -39 6 -18
10799 -18 -31 -79 110 132 77 -99 71 -35 -41 -35 -43 -82 -69 90 -20 -18 23 158 56 -10 23 126 85 84 119 4 -24
10826 -24 -152 -2 0 19 -92 66 -22 -137 4 -20 168 -27 36 82 -125 -17 58 50 -50 34 43 24 59 -57 -90
10851 -90 5 -15 -72 30 -48 103 -41 51 17 -10 70 1 -69 -44 43 38 -19 81 37 2 -3 34 -14 -6 48 -68 -242 0
$$ packed form
10660BOnL3j9o5%J61j69J41O1j42m7J73l1k22J39k0N8p5K4O0jj8j9n7n3J84L5
10688A34j75P1k8j8p0J78q8m7k2J2m1M8MQ8j8l0k0L9k8J01j70P8K7n2M9J2j37
10715a03L4%M5o2J75O8j92J83r7J1j03M8M4j52N3R3P8j16J5Mm5m3J22p3o3L01
10741B25k00q6K6M5Mj2KQ3j52J79r9m8P6j5j8l7L2k8N8L2jk5n2Q8q3L0k7J3L3
10770D3Q4K9j50j4M4J4o9Q2q2P0j3Lq7O6R3n8n4O9p6j79K08L6n2M3j8jp0M5k4
10799a8j3m8J89K2n5j76J70j06oOql9J3J59j10KM1J35j02o6L3J03m1jL5j15k8
10826b4j28J50KJ9j11J58q8j15J41k4J88j95O3M6k07J08P5qj00Q4Rj9L5j16l3
10851i0R5k0n7J02p8J51j44R2l4k7Q0o9p0K5Q7nn7J00m4l5nL7m8QN4j16j74K42
$$ plain form
10879 0 -136 -33 -3 -37 5 7 -4 -64 123 5 -97 -4 136 -16 -64 -13 3 -67 -144 -2 -128 -2 28 25 -68 27
10905 27 -17 -146 -37 52 -70 155 144 -7 -37 -26 21 11 -38 68 -37 69 212 27 153 -41 2 23 -82
10928 -82 16 20 -5 97 60 -25 19 34 -114 -40 -55 -28 -23 -129 -105 62 -80 6 100 -148 -19 -55 -93 -25 -44 -96 -44
10955 -44 2 16 -12 -48 107 21 43 -57 16 14 11 103 -34 132 73 -122 77 6 -16 -106 40 99 74 13 -8 13 -6
10982 -6 68 -33 -63 4 156 -40 -67 -45 -108 -65 -15 -25 107 -103 -20 8 23 50 8 0 56 20 -98 -43 -20 50 14 2
11010 2 28 2 11 11 -6 107 90 -3 14 72 129 -47 15 27 -95 -9 56 48 -101 -47 -109 -96 60 -72 -18 46 45 -22 58
11039 58 15 19 -47 -78 67 4 -64 44 11 45 34 -30 -89 37 11 39 56 29 -62 -4 71 -98 -31 17 123 24 -4 -29
11067 -29 -87 -108 53 -51 -13 27 142 -1 -89 0 -19 -128 77 32 29 90 -50 -124 -76 -37 -83 -82 46 21 18 35 -80
$$ packed form
10879@j36J03L0l4M2Kj1o0J87j18j02R3J40j52m8N1J6p0p7J42j26J26L0lr3R5
10905B7m4j29J09Q9j22K25j1j51l0J1M7j0m9J06j05J06J43j85J26j94M3K1j05
10928h2R8Mk5J02l7q5M4J5j48P4j5K7Nj06K4J67j42Q6R4k48J29l6l8O8j9n2N2
10955d4M6J4k8l6J55q6K2j00P3klR2j37J66n9j95J99p1k2r0J46N9k5o1k1K1j9
10982fP4j01l0O7J52j96k7K2o3M3N0j0J32k10Q3K8J5K7m2qN6l6j18N5K3P0l6j2
11010BK6k6R%j7J13j7r3J7N8N7j76O2J2j22Q6O5qj49N4o2J3J56j32N4O4jo7Q0
11039E8m3Mo6l1J45o3o8J08l3L4j1o4n9J26k6K8J7k7r1N8P5j69O7M8J06r9k8k5
11067b9n8k1J61j04L8M0J15j43q8Q9j9j09K05m5lO1j40p4M8L9m6JJ28k5lJ7j15
$$ plain form
11094 -80 -40 -39 -18 27 52 20 -5 -85 6 -104 23 -47 23 47 -24 -39 11 235 -28 76 70 85 77 -2 -49 70 141 15
11122 15 -44 17 -28 -66 -24 -12 45 8 74 -45 54 -32 15 -53 -22 -31 -93 70 -14 -71 33 -20 73 166 -48 87 58 167
11150 167 -36 39 -23 -23 -137 21 -20 -31 -25 -28 26 110 165 40 15 -5 15 69 -78 -172 -58 -54 -40 35 150 -69 -73 21
11178 21 -24 6 7 39 -16 -8 13 -8 -59 115 56 19 -87 40 -13 46 42 -6 -68 -42 -33 45 29 7 -67 81 66 -11 -22 89
11208 89 -81 -51 78 2 -2 10 -78 61 -16 -22 38 68 -8 33 -60 93 16 28 -29 107 -96 45 -82 -94 -55 -42 94
11235 94 -69 -107 88 100 -26 -108 -192 -17 7 -18 34 -25 27 -72 -15 58 72 90 16 23 -28 12 128 47 65 120 -63
11262 -63 3 -27 -112 16 45 44 -206 -54 -46 -36 -5 -5 -15 -37 -100 83 87 -77 -7 35 -11 8 88 34 -135 67 -74 -66
11290 -66 -32 -9 25 35 57 30 112 96 18 77 30 80 -33 14 141 100 30 -96 32 65 99 61 -26 -47 23 103 52 68
$$ packed form
11094h0M0JK1M5K5l2k5q0R1j10J27p0P0K4p1j5N0K24k63J04oJ5qp9m7J19P1j26
11122A5n9O1m5l8M2J2N7l7O6j19R9q6M7o8L1ro2J63q4n7J04n3R3R3k14J35k9J09
11150A67k03P5o2%j14J58m1j1OlN4Q4N5j25k5k0K0N4j47r4J14MJ4P5J15k19mR4
11178B1m5L0JL2n5QK1k1n1J74n9l7j06J27n3N9mm8o2K6RP8j6k2p4J48j5p7j1J11
11208H9j70L0J29p6mJ2q8J39p7oO0L0p6M1r3J53p7J2n7J36k03J41j27j2L9J3J36
11235I4j63l8J95J2j26q2q4J75K4k5N2n9N2r9N7P3J4J8p4Pn1M0J16q1J8N5j83
11262f3O6l0q5J28K9jk50J52QJ0L1%j0k2o3J83Mj64P0M2m6J9Q0n4j69K02j41Q
11290f6L4K3L4J0K2k7Q2j6p8N9m7N0j13M7J27m1p0j26J28L3L4l8q7k1P0Q0n1J6
$$ plain form
11318 68 48 -7 25 -33 -10 -9 -137 -79 114 -6 -18 -58 65 -80 23 45 109 18 -10 -43 82 -99 -39 73 -46
11343 -46 41 83 19 37 127 87 51 53 26 5 21 67 56 15 11 21 -40 57 32 -102 -86 -80 -41 -18 46 -70 17 -36 39 -30
11373 -30 -8 -25 112 -21 -30 32 -39 23 -32 29 -135 63 52 1 -25 59 10 17 105 84 72 -153 -43 8 -36 54 6 -53
11401 -53 89 99 -95 -4 -1 -88 -46 50 31 -44 50 147 25 29 -66 -7 -126 20 115 -82 37 46 -62 -59 16 -37 -68 13
11429 13 -59 -35 -77 -76 -141 48 -125 69 -16 54 -7 -119 110 -62 -9 -44 58 -96 124 -1 -53 83 149 65 13
11454 13 69 -58 155 -85 -4 99 31 11 48 6 -97 -130 84 -42 -34 -103 -18 -113 -71 36 41 -3 59 -15 25 14 -5
11481 -5 6 0 100 -43 71 -65 28 64 119 19 -34 44 176 -40 126 35 -4 7 48 7 -35 52 -25 -72 -49 -85 32
11508 32 20 95 18 17 14 116 -10 -63 53 28 -44 -67 -1 -20 33 17 58 32 -64 -29 43 11 95 72 -47 163 55 19
$$ packed form
11318F8k0n5L2n8K3Jj28N8J93j20j2m0J23j45J03K2O4r1k8l3J25j81O0J12j19
11343d6Q7M2o4J8R0m0l6Kk7k1J6M6j1m1mJ0o1R7k5j34J6OL9K3O4j16Q7n3P5o9
11373c0K2j7J37j33rO2p1O2n5O1j64J98j1n1k6Q4m9PQ8k1j2k25J10N1m4R0m8n9
11401e3J42J0j94R1Lq7M2R6j9p5R4R7j22Mr5N9j19J46R5j97J19Rj08LP5n3l1Q1
11429A3p2K4m2Jo5J89j73J94q5P0o1j12K29j72N3l5J02j54K20j25n2J36O6q4n2
11454A3N6j27K13k40Q1J03o8k0L7m2j03l3K14j26Qo9Q5r5M2J07Nm4O2p4M0j1j9
11481eJ1oJ00j43J14j36R3L6N5j00n3P8J32k16J66r1l9J1M1m1m2Q7p7m7K3l6J17
11508C2j2P5p7jlJ02j26n3J16k5p2k3O6j9N3j6M1k6r6L5P2l2Q4k3j19K10j08l6
$$ plain form
11536 19 -23 -94 10 -12 88 -34 -38 -1 -38 62 0 49 41 46 -27 3 103 2 -15 -107 -23 -18 95 22 7 47 28 -48
11564 -48 -11 33 34 101 32 51 67 3 -14 33 -26 61 55 39 51 -16 91 -84 24 -69 -22 40 48 101 -42 -2 39 -118 25
11593 25 54 -12 -39 11 69 72 34 -15 29 -15 116 9 -66 9 -11 23 -51 -10 -11 -81 -32 -43 -15 123 -22 -114 32 39 31
11622 31 19 75 82 -41 43 39 -23 76 1 -16 -36 14 -25 38 -28 44 28 47 -18 -108 29 -20 -8 -5 32 33 26 116 -19 87
11652 87 -64 -54 45 38 -37 35 -129 3 -7 46 -115 -35 27 -28 105 -22 30 43 -82 -139 -141 -30 52 62 9 -25 -91
11679 -91 11 49 100 85 -66 45 46 -32 182 51 113 29 123 14 -5 -21 133 -42 8 -83 -82 -63 44 -69 -99 93
11705 93 74 59 122 -67 -106 3 -35 -51 21 146 42 -28 107 87 40 36 93 61 24 165 74 -12 -32 67 -25 -29 79
11732 79 -29 -186 76 49 -10 47 134 56 -48 72 -2 116 91 -90 20 -26 15 -175 43 61 17 -76 50 -92
$$ packed form
11536A9m2p1J04k2J00j22mL7l7J00o2M9qNp3L0J00j01j7r2Q4NJ13p3j5M0j9p6
11564d8L7M4JO7o9J9J6o4j7M7n9Q7oj6J2o7J07j75J08r3M7O2QN3j43M0M1j57J43
11593B5K9o6k7N0N8Ll8m9M4m4J31j07p5P5k0L4p4M1jp0M9j1K8J38j45r2J46Pq
11622C1j2N6Pj23Q4mo2R9p5j7k0N0l9O3o6P2j6J9o5r0J37m9J2LL7JpR0j35J06
11652H7j51J0R9pp5P2j64J32j0N3j61Q0O2n5J33j27N2J3j25n7kJ11Q2J0n3l4o6
11679i1J02L8N1j5j51J11Jp8K14j31O2q4R4j09j9j6J54j75N0r1JJ9J07j13l0J92
11705I3j9j5O3j89l9J09l8j6P2J25j04p0J35k0m7mN7l2l7J41r1q6k0R9r2mJ08
11732G9j08j57K62k7n9N7Q7p8j04J20p4J18k5j81J10m6M1j90K18J8m4r3J26j42
$$ plain form
11756 -92 12 -15 -8 17 -31 -23 73 -33 52 -23 -103 -47 -38 4 11 16 -2 -56 -27 47 52 150 66 -47 6 -6 -44 -17 -3 53 -85
11787 -85 -52 120 19 53 19 42 -76 63 121 -54 49 46 67 45 29 89 11 -78 91 -48 -88 26 -134 -56 19
11812 19 -64 -97 58 72 -28 20 10 -15 -103 -43 80 -99 148 -19 34 -48 89 0 -93 44 0 -35 -34 -12 -26 -67
11838 -67 -9 101 -21 -130 113 -80 -146 70 -2 -65 -91 -11 -35 -30 -30 36 -106 11 79 -111 -113 16 59 -28 75 70
11864 70 -71 48 -76 37 26 149 54 -31 -51 -9 -88 93 27 35 62 62 -20 18 16 42 -35 90 113 33 -68 76 -20
11891 -20 -56 12 -7 35 157 -86 -190 -8 16 -20 -27 -16 -89 6 54 78 -116 -48 33 15 -25 28 63 44 49 -54 -37 3
11919 3 35 40 53 99 48 62 -13 -63 38 72 -57 3 26 33 126 59 23 55 2 -46 13 7 -93 -39 -28 -108 96 84 -4 20
11949 20 -128 -15 166 -25 -27 22 -119 -40 -26 -182 -26 115 -2 -13 157 -2 14 39 30 11 -29 130 -39 -20
$$ packed form
11756i2J04k7PK5m8QR6j06Q5p5q0N6RM2PNj8n4K9P4NR8q4j13N3j2l8K7J4N6j38
11787h5L3J72j01L4l4K3j18J39N8j75J03lK1k2j6O0p8q9J69j39m0J14j60P8P5
11812A9q3l3J55J4j00M8j0k5q8O0J23j79K47j67N3q2J37q9r3J37m4l5JK2j4m1
11838f7N8J10j22j09K43j93o6K16p2o3k6Q0k4N%O6j42J17O8j90kJ29M3q7J03n
11864G0j41J19j24J13j1J23r5q5k0M2p9J81o6QK7%q2L8kK6p7J25K3q0j01J44r6
11891b0l6O8j9M2J22k43j04J82K4l6pJ1p3R5M8K4j94O8Q1j8m0N3L5j9Nj03J7M0
11919CL2NJ3M6n1J4p5n0J01L4j29O0K3PR3o7l6L2n3m8N9oj00N4J1q0K04j2q8K4
11949B0j48J13J81j91kM9j41P9J4j56J56J41j17j1J70j59J6K5rj9m0J59j69J9
$$ plain form
11973 -20 75 126 11 65 126 -36 63 -25 -86 16 103 97 65 -54 87 107 -24 -99 -81 82 9 -27 80 104 5 -61
11999 -61 -40 -30 -188 -59 50 8 -63 -48 3 51 74 72 -17 -44 151 -36 23 68 58 121 104 -22 -76 -59 -68 82 -190
12026 -190 -2 -51 -73 -74 81 58 72 78 -14 -6 -66 -26 98 -19 93 -35 -36 93 -66 -21 -18 68 -8 31 48 -50 -36 106
12054 106 69 13 -58 29 57 -20 20 23 -61 70 -64 22 51 96 18 -41 65 -54 -35 -29 -100 -24 45 -75 -8 -59 22 60
12082 60 31 15 75 -77 117 4 26 51 68 -46 -129 -70 -77 -96 -133 -116 30 27 -5 -73 24 2 62 57 24 131 -6 -71
12110 -71 52 -70 -89 0 10 55 -10 -90 -18 -29 48 -43 51 85 -1 68 -15 73 -23 -86 -53 -23 25 59 -60 -46 -129 -51
12138 -51 26 154 -1 30 50 -79 18 36 -120 -1 4 53 -134 -62 -9 -26 8 -30 105 -3 -6 -61 23 5 -70 -67 169
12165 169 11 -16 -33 -41 -127 -76 187 32 -82 -2 -45 -163 -37 95 58 28 -30 -29 -41 -6 12 -22 37 -73 -54 51
$$ packed form
11973b0R5N1j15N4O1j62R9q8o1J02Q7ol2j19J41K0j31p5J8J63p3l6J07K4r9o6
11999f1K1J0j58J29J09m2p1J5N1M8K3kq9k7J95j87N9M5j0O3j7j26n4J7rJ50k72
12026a90J88m9k2jJ55k3J4Or2Qo0M0J24j17J12j28jJ29j59M5LQ6p6L9J7r8J4J42
12054A06l7n6p1Q7K8p7M0Lq4J31j34Q6K9M5p8n9J06j19J9Op1P6O9j20O7n1Q1L8
12082F0k9j6O0j52J94j13K2K5J7j14q3N9pj9l7J7J46ll2o8R7k2O0nl3J07j37o5
12110g1J23j22j9Q9J0M5o5q0P2j1P7r1R4L4q6O9q3Q8r6o3L3L0M8L4j19J4q3P8
12138e1P7J28j55L1K0j29R7J8j56J19NM9j87P2N3j7L4l8J35j08ln5Q4j8p5LK36
12165A69j58k7j7qq6N1K63j55j14Q0m3j18J26J32l7l0n8Jj2L5J8l4N9j10J9J05
$$ plain form
12191 51 51 -75 -82 7 71 -46 38 103 1 -1 77 -71 -90 -34 85 -13 24 63 124 70 76 124 70 -4 53 -19 -8 64 12
12220 12 175 -3 22 -3 -60 78 -198 72 137 -159 144 -3 -41 -41 -26 -25 -60 -52 49 -29 -28 -97 -102 -212 -8 59 79
12247 79 94 -31 54 44 -8 -27 12 35 -37 -27 16 61 -37 -75 -1 108 -35 14 -33 54 4 15 -58 -11 -56 44 -13 75
12275 75 -65 16 -8 84 89 -84 68 -103 -157 0 145 -57 -81 -37 -116 -11 -84 37 79 -12 34 -137 -51 77 -17
12300 -17 14 17 73 -79 62 34 35 -130 15 22 59 31 -16 78 -20 -39 -62 -72 48 -13 97 -85 83 22 -56 85 17
12327 17 -16 49 -7 53 62 -98 -87 103 -66 26 24 73 128 -14 -77 133 -35 -63 -55 31 -94 -77 -58 -54 47 -32 -95 23
12355 23 89 67 -106 -7 -9 -44 77 0 25 -44 69 45 32 -77 108 26 -60 -99 13 -75 90 61 -45 -40 1 -138
12381 -138 -10 111 4 32 -46 13 -44 -17 -24 -85 -23 103 60 17 24 56 -84 -59 -4 55 34 1 -54 18 2 -14 3 2
$$ packed form
12191E1%j26pQ9O4j17Q4O5j02kP8j48j9N6J19r8L7L9O1n4OM8n4p4N7p2J1P2n2
12220A2J63j78K5k5n7J38k76K70O5k96L03j47l8%J5Jl5QJ01p8Jo9nj10K04O7K0
12247G9J5j25Q5j0n2j9L9K3p2J0M3M5r8l8P4J09j43M9m7Q7n0J1p3M7m5J00n7Q8
12275G5j40Q1k4R2Nj73J52j71n4J57J45k02k4M4p9J05p3J21M2r1M6j71Q6J28r4
12300a7L1LN6j52J41k8Jj65J45PL7k8m7R4r8j9k3j0J20o1J10j82J68o1p8J41o8
12327A7l3O5n6O0Rj60J1J90j69R2kM9N5j42o3K10j68k8QQ6j25J7J9MJ01p9o3J18
12355B3O6k2j73R9kl5J21p7K5o9J13k4j3j09J85q2q6l9J12q8J65k9j06NM1j39
12381a38J28J21j07K8p8N9n7K7po1O2J26m3m3PL2j40K5N5N9k1l3n5P2j6j6J7j
$$ plain form
12409 2 116 114 114 -76 -40 107 0 102 54 22 36 -56 19 -92 -110 -87 80 21 16 -20 86 -40 -65 44 10 -47 99
12436 99 -103 -40 -195 -136 -42 29 190 -106 -24 41 33 5 54 46 88 65 160 -103 -25 -16 -35 -22 21 102 34 -16 33 -77
12464 -77 20 76 -4 -120 -9 -42 10 -18 -107 49 -23 16 57 -51 -95 -35 -65 -100 53 9 -104 34 -113 -39 66
12489 66 -10 78 80 76 62 -54 -93 -54 -13 50 40 -15 -100 -7 -45 56 0 -33 44 -55 11 -50 87 56 -38 -23 -91 -49 -81
12518 -81 43 -66 -10 -44 -17 -4 -170 -13 -35 142 -90 -42 -42 99 94 151 -11 -125 -84 11 147 76 108 -42 -90
12543 -90 -85 125 220 11 93 47 -4 -87 74 3 120 -31 -154 -74 77 -31 -70 -70 -76 43 -2 5 -66 90 54 -23 -16
12570 -16 46 8 27 -44 107 -145 136 13 -5 9 4 -49 -22 71 165 -23 -2 76 51 28 77 134 -10 77 32 86 -4
12597 -4 36 -6 -9 14 71 -94 4 19 16 -5 37 30 -74 47 52 -45 -106 -22 -53 -38 39 -10 -98 48 -63 -23 53 104 -49
$$ packed form
12409BJ14k%j90L6J47j07J02m8l2J4r2P5j11j8K3J67n9nl6J06j26k5J09l4n7J46
12436I9k02O3j55N9R4P1J61k96Q2O5qk8M9qM2k3R5k63P8Rj9J3M3Q1o8n0M9j10
12464g7R7N6q0j16J11l3N2k8q9J56p2L9M1j08m4O0l0l5J53m4j13J38j47P4J05
12489F6p6Q8Kmj4j16l9L9M1O3j0n5q5R3l8J01n6l3P7r9O6o1J37l1r4J5o8M2l2
12518h1J24j09N6l4K7J3j66J57k2J77k32M8%J41nN7j62j14M1R5J36p1L2j50m8
12543i0NK10R5k09Q2m6n1q3J61p1J17j51j23Q0J51j08l9%oJ19m5Pp1J56l6p7P
12570a6O2l8J9p1J51k52K81j23j8J4nn3K7R3R4j88K1P8k5k3M9N7j44Q7m5N4r0
12597dM0m2lK3N7j65R8J5lk1M2pj04J21Nr7o1Q4l1J5P7m9q8J46j11M0P6N1j53
$$ plain form
12626 -49 11 -3 15 -9 -45 46 2 136 -73 -30 -72 82 -18 10 0 53 40 14 57 -43 27 -30 82 -32 5 62
12652 62 -25 -86 -117 -39 -75 98 46 15 -12 -143 -113 31 -15 -129 76 -18 -62 -69 100 8 -44 17 93 36 -22 12 -16
12679 -16 119 75 -7 -35 118 110 -113 -14 38 96 -19 17 66 -74 1 -23 -39 -97 -82 166 -35 91 64 26 -62 120
12705 120 45 62 12 -67 60 -25 24 85 47 -76 -86 0 80 131 -93 -36 -25 -13 -83 10 35 43 -98 166 99 -36 58
12732 58 5 50 29 93 38 55 75 -81 -57 43 58 40 38 70 46 -2 77 -97 -74 69 62 6 105 -73 -43 43 96 117
12760 117 -38 33 -7 -61 100 157 -59 21 -8 20 -68 92 77 -64 -10 -18 -14 46 31 50 -74 -42 101 -30 32 13
12786 13 9 -106 89 93 20 45 -47 -31 -24 -45 -57 -15 10 -87 60 11 20 -110 44 -11 -37 -48 -37 29 -15 -67 -68 -80 143
12815 143 69 -87 16 79 85 37 -41 135 -2 99 135 -32 -60 -30 113 -155 -7 84 -24 116 -27 129 -18
$$ packed form
12626d9O0j4J8k4l6R1m4J34k09M3m2J54j00K8j0N3j3k6M3j00P0n7J12j14L7N7
12652F2q7o1l1P8l6J73n2l1k7j31L0J44m6j14K05r4m4pJ69r2n2O1P6n7n8L4k8
12679a6J35m4q2k8J53qk23R9N2N8j15L6M9j40P5k4j6n8J5K48k01J26k7l8q8J82
12705A20p5J7n0p9J27q5M9O1l8j23j0Q6Q0N1k24N7J1J2p0R3K5Qj41K64o7j35R4
12732E8n3M5k1O4n5J7K0j56K4J00J5j8kL2k4m8P9j74K3J43pn6R9j78L0Q6N3K1
12760A17j55P1m0n4J61N7k16Q0k9K8q8J60j5j41N4qMO0j5J9j24L2J43j31O2j9
12786A3mj15J95Mp3K5r2J6Pk1j2M2K5r7J47m9Rj30J54n5k6j1J1O6m4n2jj2K23
12815A43p4j56J03O3Om8p8J76j37J01L6j67k8L0J43k68J48R1j08J40j43J56j47
$$ plain form
12838 -18 53 75 49 -14 -64 23 70 64 -101 -8 55 37 28 13 24 49 -63 66 -10 11 -76 47 26 -33 49 42 27 55 92
12867 92 -18 52 31 150 26 78 114 -96 117 -64 134 -35 -122 77 44 55 5 84 17 140 77 50 36 5 -90
12892 -90 -34 -61 3 64 -52 -91 -73 -52 -160 -44 -8 -19 -101 64 108 30 -74 -46 120 -96 1 -36 -68 -184 -12
12917 -12 -179 40 39 -32 39 -83 84 58 -54 -2 112 -144 113 77 -28 43 42 89 1 106 0 -39 -64 4 -30
12942 -30 42 14 -123 13 4 -67 -15 16 53 65 -75 91 -2 53 -17 24 -10 23 -65 -39 32 39 -73 40 19 75 -5 -55
12970 -55 84 -80 76 96 -64 -31 191 57 35 65 -11 91 -5 -20 55 -16 24 22 -81 67 75 36 -27 -83 37 82
12996 82 -45 -3 -50 -108 -31 -14 -16 76 47 -110 -54 -5 109 -9 -78 -151 -84 24 -117 22 -6 48 62 -4 51 6 5
13023 5 6 58 -101 -48 -30 -36 48 2 -67 -20 66 49 -47 3 21 27 -5 51 27 -60 -39 -118 55 -90 -150 -47 58 77 45
$$ packed form
12838a8P1K2k6o3n0Q7M7oj65R3O3j8rj5J1K5j12J29p6K1q7J23k1n9Q2pj5K8L7
12867I2j10P0k1J19j24N2L6k10K13j81J98j69q7J99l3J1n0P9o7J23o3k7j4l1r5
12892i0N6k7O4O1j16l9J8K1j08J16L6j1q2J65M4p8j04K8J66k16R7l7l2j16J72
12917a2j67K19jp1P1j22J67k6j12N2J14k56K57l6j05P1jM7q8J05j06l9k5O8l4
12942c0P2k8j37J36rp1N2L1L7J2j40J66r3N5p0M1l4L3q8K6P1Pj12J13k1N6q0n0
12970e5J39j64J56K0j60L3K22j34k2L0p6J02r6j5P5p1M0kj03J48Ql9o3n6J20M5
12996H2j27M2m7n8P7J7kR2k9j57N6M9J14j18o9p3O7J08j41J39k8N4J4o6N5m5j
13023EJN2j59N3J8oQ4m6o9M7Q6j7r6N0J8Ol2N6k4q7K1p9J73j45o0J03J05J9l2
$$ plain form
13052 45 138 -66 -9 -62 -114 7 10 38 -4 -44 -73 51 26 40 111 -25 72 -57 155 -65 -4 123 41 68 95 78
13078 78 12 82 65 22 29 69 -5 -27 59 -47 68 -73 -122 194 -147 -37 -49 -62 110 -36 -52 -68 16 -35 -2 127
13104 127 -34 1 -17 78 29 -66 27 10 -87 72 -62 -99 14 55 83 -51 81 -38 -6 -49 24 50 5 -24 3 129
13130 129 -75 -8 -65 -60 49 18 -45 -16 52 60 -66 -70 -39 -56 35 16 -27 -61 -62 67 -65 -65 25 -89 -59 -54 -67 64 26
13159 26 10 32 40 -17 67 65 -22 -33 -43 -30 61 -138 -95 -1 50 35 144 43 -9 -35 -144 -45 35 58 23 65 -38 -46 -75
13188 -75 -13 -50 5 -75 38 17 -134 30 78 16 -8 28 -41 40 31 -197 163 34 1 -164 -18 29 -13 121 72 -36
13214 -36 35 142 69 -26 42 10 59 29 58 7 31 -44 -37 24 -109 117 -6 110 -13 -74 15 -41 -79 -111 14 70 15
13241 15 -19 25 -14 -86 -45 -49 49 -7 83 68 -55 -84 -60 69 -10 -39 -20 2 -59 52 103 -63 -15 17 -57 -37 98 -20
$$ packed form
13052D5R3k04N7n3n2J21LK8m2m0k9J24k5J4P1j36R7j29K12k20O1J27q2K7K7j7
13078G8o6P0j7m3PM0p4k2Q6j06J15j41m9L16l41J10j2j3J72j46j6j6Q4n1L3J29
13104A27j61L5j8R5m9r5R3j7r7J59j34l7J13M1K8j34J32j19L2m3P3K6m5k9K7J26
13130A29k04O7n7NJ09l1o3K9O8Qj26mL1j7R1j9m3l4jJ29j32%R0j14L0Nj3J31l8
13159B6j6K2Qn7Q4kq7j1j0J3R1j99M3R4N1j5J09j01n2k6j09R9Q0K3l5M2j03qk9
13188g5O2l7N5q0J13k1j51J64M8o2k4L6o9Q1rk28L60j29l3j65J46M7m2J34m9j08
13214c6P1J07p3r5O8l2M9l0K9n1K4p5PO1j33K26j23J16j23o1Q9n6l8l2J25N6n5
13241A5l4M4l9p2M1mR8n6R0j5j23k9K4J29p9k9J9K2o1J11N1j66M8L2p4K0J35j18
$$ plain form
13269 -20 78 81 -56 60 63 133 -31 29 21 39 81 106 105 44 -88 21 77 60 -82 132 150 -29 94 -34 -82 12 -20
13296 -20 -64 -60 17 15 -65 0 31 -100 -83 -1 11 -47 -6 -84 33 19 183 57 11 24 7 -98 -9 -69 25 90 76 33
13324 33 -104 -40 -99 48 8 -30 -35 42 -20 -45 -66 -148 55 -69 32 -7 -68 -76 -12 -49 -48 11 -39 -2 -12 -41 129 4
13352 4 4 26 -168 105 32 37 102 135 -12 123 33 15 -4 -38 -4 42 11 65 107 20 158 -78 -151 -69 15 -69 22 33
13380 33 -73 -85 -100 20 -39 -42 36 -3 110 -41 -21 -28 1 40 0 24 -13 26 36 183 -23 -32 30 43 51 66 83 11 71
13409 71 -58 51 60 -48 41 -112 -17 49 -102 -16 -11 -92 64 -27 -18 -18 -11 63 -8 56 17 -46 98 -49 -6 -37 -31 54 -50
13438 -50 78 41 30 116 33 37 23 -11 -85 41 6 -55 11 21 -81 34 77 54 -40 -26 40 32 120 -49 58 -68 -28
13465 -28 -37 -183 -100 -15 68 57 53 -106 7 13 -39 -59 5 209 47 -65 61 -68 83 -93 -36 -56 -68 37 147
$$ packed form
13269b0R8Lj37J16LP0j64O0qJ8M2K5jo1j32J09N6j7j42K14J8j79J23j28m8R4l2
13296b0m4MP7kq0O5L1j31J7Q2J2n8M1p8J17j4J64j26m6J3j7j05Q9o0R4O5j4m3
13324C3j37O4n9J47m0l8nP7o2k5k1q2K03j24J01l9o1qO4l7JN9n0L7j0k9J70j25
13352D%K2j94K73p3NO5L3j47J35r0j8j9l4L4M6l1N4M2q7J38k36p3Q2Q4q4R1J1
13380C3j06j2j5J20n9lP8l9J13j51K0pK9L9m0K4l7L9J0J47k06rO2J3QJ5J7p2O0
13409G1j29J09Rj08Q9j53R5O6j51Q6Nq1J56r1R%PP4p1O4l9o3J44j47M3l1OQ5j04
13438e0J28l7j1Q6q3Mj4l4p4J26l5o1O6J0j02J15M3k3r4J4O6qQ8j69J07j26M0
13465b8rj46Q3Q5Q3j1mj59J13On2k0O4K04j62j12J26j29J51j76N7k0j2J05J10
$$ plain form
13490 147 -97 -46 72 -14 18 -77 51 -29 -31 51 72 33 68 86 -81 96 -24 -22 185 -30 70 83 -11 2 115
13515 115 9 28 -45 0 -70 134 20 60 27 -11 -103 16 -28 -29 44 95 80 -68 -15 150 15 37 -14 -62 -85 10
13541 10 -10 71 64 19 7 -36 126 35 12 -21 1 102 -50 -7 141 -27 156 -41 28 155 101 -43 -149 72 9
13566 9 -45 41 -44 -48 -18 -75 -52 -42 31 -3 -47 -86 2 -63 -155 83 29 38 -32 64 90 1 -5 -106 18 15 -3 53 15 59 -98
13597 -98 -53 -12 98 102 53 -2 -6 63 -29 -70 3 12 -18 22 -19 26 -44 20 43 15 -76 144 -50 -61 -48 122 -37 -126 62
13626 62 -60 -63 -3 8 92 69 3 -6 71 64 38 100 67 142 70 -62 74 66 89 -143 65 113 69 -24 7 60 48 64 52
13655 52 41 -92 -54 16 -24 -56 3 -170 -59 68 37 -99 4 87 -64 -71 35 -65 -42 -38 52 -9 85 39 37 -24 56
13682 56 18 -48 22 70 26 76 78 51 -3 85 110 -36 -17 68 159 72 80 40 7 -19 96 32 -22 17 22 21 83 -17 34 46
$$ packed form
13490A47k44N1J18q6L2r5J28q0kQ2K1l9L5J8j67J77j20KK07k15J00J3r4J3J13
13515A15j06J9p3M5p0K04j14M0l3l8r2J19m4jP3N1j5j48N3J65j35K2n1m8k3R5
13541A0k0Q1pm5j2m3J62r1k3l3K2J01j52M3J48j68J83j97O9J27n4j44j06K21o3
13566In4Q6q5mL0n7K3J0P3l4m4l9Q8o5r2K38n4Rp0R6K6q9oj01J24lj8N6l8M4j57
13597i8M5M1J10Mm9n5mO9r2m1P3Rl0M0m1M5p0O4K3k8r1K20j94j1J3J70j59q9J88
13626F2j22lO0J1Q4k3o6rP7pk6O2l3P5p2j32J36qK3k32K08M8m4r3L1N3j2J6j2
13655E2j1j33L8P0m0l2N9j73J11J27l1j36J03Q3j51pJ06j00K3MR0o1R4m6ko1Q0
13682E6l8o6P0M8m4N0Kk7n4Q8K5j46J9Q5R1q7Qm0l3k6J15o4n4L9NjO2j00N1J2
$$ plain form
13712 46 54 -95 -21 12 14 5 60 58 -121 38 -99 -49 1 14 27 60 28 17 71 28 -70 -62 -73 70 -52 79 29 -75
13740 -75 82 -42 61 80 12 -46 -29 -1 -115 -64 77 -62 22 133 105 28 -41 -26 115 -57 10 37 100 -14 13
13765 13 188 -26 -9 92 -40 -29 1 35 41 11 16 -60 -21 -130 58 66 77 -135 -19 54 139 126 34 103 25 113 -73
13792 -73 -55 40 -45 41 -43 -36 -39 -47 46 -62 4 -120 -64 32 89 -101 -48 -20 84 126 43 29 -74 -83 -15 16 -52 -66 -117
13821 -117 -49 22 105 64 30 -26 73 -47 81 46 -26 57 62 -65 -67 137 59 -5 94 -1 -3 123 68 42 -104 68 -9
13848 -9 -118 70 12 -110 22 -22 61 43 37 -39 93 0 -9 -49 44 19 37 76 -40 21 -51 19 13 -74 5 -94 29 5
13876 5 69 -60 -32 7 70 -63 63 -176 33 7 -40 29 -74 47 54 76 98 4 31 -73 100 10 33 45 85 53
13902 53 0 53 -21 24 -25 -4 -117 -32 -39 -82 -68 -191 2 119 -37 -60 -24 1 4 74 4 -23 -124 -8 115 13
$$ packed form
13712D6Qj49P4L3KrN5kj79J59j37N0N0J3J3L3l2j1N4m3r8Qj1J43j22J31n0j04
13740g5J57j24J03J9o8n8J7K8j14N1J41j39Q4J11k8p7o9J5J41j72O7K7O3j14K7
13765A3J75k14J7J01j32J1L0L4Ol0Np6L9j09J88QJ1k12J16P3Q5j3r2O9p8Q8j86
13792g3J8R5q5Q6q4PlqR3j08O6j24N6R6N7j90N3K8J04M2q3j4j03rO8L1o8j4n1
13821a17O8P1Q3m1l4n6R9j20J28l5p2Q3Nj27kK04p8o4R9r5kJ26n5k6j46J72p7
13848ij09J88n8j22J32m4Q3j8op6J32r3rm0R3k5J8L9j16O1p2P0oq7P9r9J23k4
13876EO4j29K8L9O3j33J26k39K09k6m7O9j03J21PK2K2r4K7j04J73r0K3J2M0l2
13902E3n3N3p4M5m9K1j13Q5pm3J4j23J93J17j56k3L6K5LP0p0k7j01J16J23j02
$$ plain form
13928 13 -16 10 185 56 -20 35 -40 38 -61 -29 -51 70 -98 44 94 -58 16 68 -50 -144 -100 33 107 -153 -49
13953 -49 35 39 -44 -19 46 -89 6 -60 -59 44 0 -51 4 45 46 87 81 96 188 -45 103 5 -17 47 30 36 67 210 103
13982 103 31 -67 38 -105 58 1 15 63 85 66 22 109 128 76 95 29 20 -98 60 62 -8 -44 81 90 -53 79 -55
14009 -55 -101 -68 29 -40 11 43 -30 -10 3 145 -16 -42 -4 34 -18 87 25 -79 80 -22 13 -16 52 17 -3 55 63
14036 63 10 -62 -59 -44 -191 -112 17 -52 -70 -38 -75 -42 -91 -60 -40 -31 -68 68 23 90 3 -85 30 -74 61 12 23 107
14064 107 -35 35 -156 -82 28 -102 -43 -19 -20 -77 58 98 -97 -72 4 35 15 34 4 51 -67 54 45 -30 -94 2
14090 2 45 -90 -128 -19 0 97 170 12 -22 38 -60 153 -33 -86 51 -17 -214 -14 -66 -84 -32 3 107 -104 28
14115 28 -54 34 43 51 -69 -50 40 20 38 31 -118 51 119 73 18 33 -86 2 -81 -10 103 -78 44 50 -24 -83 19 -44
$$ packed form
13928A3k9K6J75j29p6N5p5P8r9L2k2J21j68J42N0j52P4N2j18r4M4J33P4k60J04
13953d9Q4Mq3K5O5j35R5o6JJ03m4n1N5M1JM1oJ5R2k33J48r8k2O4j7OL1J43j07
13982A03p2r8J05j43J63n7J4M8K2j9m4Q7J9n2J9o6rj18J58Kp0l6J25Rj43J32j34
14009e5m6L3R7o9N1L2p3K0J3J42j61k6L8L8n2J05o2j04J59j02L5k9O8l5k0N8Q
14036F3n3p2LJ5j47P9J29o9j8L2l7L3m9L1K0Rl7J36m5O7q7q8J15j04J35m9J1Q4
14064A07j42P0j91P4J10j30N9K4jn7J35M0j95K5P6L1k0J9l0M7j18J21rp5o4R6
14090BM3j35l8J09J9R7P3j58l4O0r8K13j86n3J37o8j97K00n2j8N2L5J04k11J32
14115B8q2Q8RQj20J9R0k0J8pj49J69O8m6n5J5j19Q8q3P1J13j81J22Op4n9J02o3
$$ plain form
14143 -44 2 76 15 68 16 -85 -27 -5 -32 69 57 -63 108 -22 -10 -50 6 -69 -32 91 -24 -31 -11 73 84 66 -64
14170 -64 24 18 34 -47 37 133 -8 23 78 43 -4 57 -75 11 65 -98 -15 -9 -119 -25 59 -107 -13 24 -59 -11 -112 -38
14198 -38 -20 -18 -117 -51 32 56 69 -67 105 1 -7 -33 -54 -36 101 20 11 94 20 24 90 -37 47 -17 -18 47 49 57 17 -23 69
14229 69 -81 121 -103 88 -34 -109 62 -126 -91 -88 -70 -43 -132 -29 -40 -47 98 -68 -89 -104 61 -16 -17 57 -51
14254 -51 21 -73 97 -37 52 -57 -57 -74 -8 13 -21 42 33 0 31 68 67 -49 -21 38 -64 59 -52 -214 101 162 -54
14281 -54 -25 17 -70 -18 24 -27 -28 43 5 -39 -66 -89 -144 -32 -14 14 16 83 -27 75 -51 -98 59 -25 -55 24 -6 -76
14309 -76 76 -21 14 82 162 127 -19 -47 78 -115 -29 81 111 1 -71 14 -107 -68 -54 73 38 77 -57 22 13 -154
14335 -154 0 -49 -46 -4 -75 -69 87 -43 55 -115 -43 -16 -103 -45 -43 -49 45 -57 -16 -78 16 50 54 20 -38 38 137 24 38
$$ packed form
14143d4M6P4o1N3n2j01N8K2k7J01j2j20J71j30J2m0N6p5L7J23j15pK0Q4J1j8j30
14170f4Q8oJ6q1Q4R6j41L1N5l5m7O1j32Q6N4j63Q3Oj10R4Q4j66R4L7q3M8j01P4
14198c8J8Kr9O6Q3K4J3j36J72j04qk6k1J8J37q1rQ3p4MO6j27Q4o4jO5KQm0m0R2
14229F9j50K02k24J91j22p5J71j88L5LJ8K7q9J03j1pJ45j66k1j5J65p7jP4j08
14254e1P2r4J70j34Q9j09%j7O6K1l4O3rl3L1L7jj16K8N9j02J23j11j62L15O1k16
14281e4K9M2q7N2M2n1jP1l8m4k7k3n5J12J8K8KO7j10J02j26m7J57q4l0P9l0p0
14309g6J52r7L5O8Q0l5j46k8J25j93Q6J10L0j10p2Q5j21L9J4J27l5L9j34P9rj67
14335a54J54m9LM2p1OJ56j30R8j70P2K7q7N8KoR4j02M1o2R4L4Ml4n8P6R9j13J4
$$ plain form
14364 38 85 -51 -92 -22 94 -90 23 -53 77 22 15 -84 4 -48 52 0 -86 -97 15 41 5 -16 -53 -38 -90 45
14390 45 88 96 33 -52 14 -33 -29 -74 7 55 -98 -30 -20 -7 -34 38 87 -105 112 23 -61 -41 133 10 -10 154 31
14417 31 -10 102 6 54 -38 -51 52 49 -9 16 -23 -45 -49 -16 -42 -39 5 72 -37 -136 -20 -5 110 -9 -140 -57 195
14444 195 -40 39 -52 -50 -64 -24 -11 28 35 6 -57 28 83 42 -28 -34 5 63 -27 70 -14 60 84 11 121 -17 19 -30 -37 -92
14474 -92 -33 -15 -10 -133 -46 -80 -68 -34 -8 -6 -44 83 -25 56 -21 39 -106 18 22 21 -49 6 -88 31 15 50 -10 -1 21
14503 21 13 -124 51 -11 -3 -47 -53 -90 -35 -22 -46 28 14 -5 -82 -43 65 -43 -52 71 69 52 112 -50 -20 -25 -183 18 49
14532 49 48 -59 23 8 -109 8 111 -118 -4 -23 -95 -5 -7 35 71 111 -58 -70 35 87 17 2 -92 144 -11 37
14558 37 73 64 -58 56 -83 -45 40 -30 77 33 11 53 -187 57 -65 -21 1 -65 19 -52 -73 -10 -92 -42 87 -55
$$ packed form
14364C8M7j36m1P0J16j84J13p6J30n5pr9Q8n2J00n2q6j1J12K6l6k1l7J5n2J35
14390D5M3Qo3q5O6m7Mm5Q1M8j53O8J0J3k7P2M9j92K17q9q4K0J74j23k0J64j23
14417C1m1J12r6M8r2j3J03ln8K5l9k2mL3k6LM4O7j09r9J16J5J15j19j31Q3K52
14444A95k35P9r1Kj4M0J3L9Pk9o3Q5N5m1p0oL9N8r0R7q4P4K4p3J10j38L6m9pn5
14474i2N9J8Nj23Q7l4J2L4K6Kl8J27j08Q1p7O0j45J24Mjp0N5r4J19j6L5o0RK2
14503B1qj37J75o2Qm4ol7N5J3k4P4j4j9p7L9J08j08rJ23kj7O0j62L0nj58K01L1
14532D9jj07Q2j5j17J17J03k29J14j9p2R0kM2L6M0j69j2J05N2p0j5r4K36j55M8
14558C7L6rj22J14j39L8Q5p0J07m4k2M2k40K44j22M4K2o6Q4p1k1O3q2N0J29j42
$$ plain form
14584 -55 -63 -3 -73 -72 97 -121 13 45 -25 45 -41 19 -71 64 -7 44 31 -39 125 51 -8 75 43 10 20 28 52 77 -49
14613 -49 -21 -8 31 -82 46 2 78 -41 47 32 -63 -29 5 -112 54 30 -38 -47 18 48 -15 3 5 45 -38 6 -36 53
14641 53 -35 -53 50 108 199 -82 154 -51 -81 12 -11 8 61 -97 62 -44 -79 -9 -34 -28 -59 -60 -55 2 -99 14 67
14668 67 44 21 -91 -11 21 -50 -7 -95 -4 -89 99 -106 14 57 1 -9 -68 -41 4 -34 85 7 122 -44 -33 62
14694 62 -108 112 -3 25 65 2 -40 -147 -17 88 19 71 10 -9 10 -48 46 -35 52 -5 70 125 -92 -109 42 20
14720 20 -122 -25 60 61 -27 -93 76 -17 -78 66 34 23 14 46 12 6 -12 44 20 114 59 -1 212 101 97 28 32 -95 -17
14749 -17 -47 19 -1 76 0 0 56 38 50 31 21 -33 -40 -102 -89 -85 -54 -33 -19 -127 -12 37 -70 -35 -51 67 51 105 -125
14778 -125 -91 -12 83 -47 -38 -156 39 -36 25 31 4 -24 -44 -133 -37 -114 -97 12 35 68 -46 -25 -6 58 48 -1 -55 45
$$ packed form
14584e5qO0p0JJ69k18J34L2p0P0q6O0r0J35p1N1j3p0J64p4n9Q3l2l3J0QK4K5j26
14613d9K8J3L9j13J28m4P6j19Q8j5r5L4L4j17J66k4o8rO5L0o3J8KM0q3M4m2Q9
14641E3q8j8J03N8R1k81K36k05l0R3k3J9N3j58J59j06l5P0k5Ol1jNN7j01J13N3
14668F7k3k3j12Q0L2p1M3q8R1q5J88k05J20M3n6j0n9K7M5l8J19p8J15j66J1R5
14694F2j70K20j15K8M0o3m2j07J30J05o9N2o1j9J9n8R4q1Q7n7P5N5k17j7J51k2
14720B0j42R7Q5Jq8o6J69r3o1J44l2j1rL2l4oj8N6k4R4n5o0K13j11mo9Mj27P8
14749a7l0O6k0P7p6%N6j8J2j9j0n4po2J3ML1K1J4j08J15M9j07L5j6J18j6N4k30
14778a25L4P9R5j30Rj18J95p5O1Ok7k8k0q9R6p7J7J09K3L3j14K1J9O4j0m9n4J00
$$ plain form
14806 45 -50 -68 30 9 70 -5 -79 -62 56 14 7 -53 -40 -105 -1 37 -54 -3 -44 0 58 -29 8 72 3 -4 71 -99 90
14835 90 20 91 74 -50 -17 -86 25 -57 73 -2 41 -22 92 -113 63 0 54 -1 -54 -42 13 -60 71 -30 30 82
14861 82 116 -109 38 -12 107 53 -102 40 -61 125 -122 -90 43 -54 5 -31 49 -4 -8 28 -104 23 -3 -77 -10
14886 -10 37 64 -56 12 -15 2 118 -63 -28 -21 -130 -55 86 94 33 38 -5 -119 -71 98 -78 81 12 12 4 2 -22 5
14914 5 56 1 -45 -48 69 -8 -169 -17 -29 49 -27 -66 40 -121 -57 -183 93 -31 24 132 138 -78 1 -104 -85 40
14940 40 123 -43 50 -63 -77 33 -24 -33 -67 -30 122 29 70 52 -13 -42 26 -46 -110 -12 -119 -103 17 -55 10 -29 19
14967 19 -5 -51 -53 -19 -48 45 -120 63 93 142 20 -1 80 -8 9 -16 -33 6 117 89 10 38 27 -34 62 -31 32 63
14995 63 91 56 58 74 67 33 -12 -67 -56 24 -143 41 49 -9 -43 -97 -64 -10 -36 -52 54 50 -10 -70 -1 67 -19 -52 53 46
$$ packed form
14806D5r5j8R8k1O1p5p4J7J18m2po0J3o5J04L8r1N1m1M4N8q7L7O4o9pP5j70J89
14835I0p0P1j7j24L3o9J11q2J30p5M3o3J14k05J76o3N4n5n3J2N5p3J31j01O0N2
14861H2L4k25J47n0J19n4j55J42j01J86k47L2J33r7N9l6Q0n3mL6j32J27k6p4O7
14886a0M7K7j20O8k7J7J16j81L5Pj09P5J41Qo1Nm3j14M8J69j76J59o9%qkk4K7
14914EN1n5m6lJ17p7j61J52j2P8p6l9J06j61O4j26K76j24N5J08Ok16P9j05J9J25
14940D0Q3j66R3j13j4J10n7rl4L7J52r3M1j8o5k9O8p2o4R8j07J6J20p2O5l9M8
14967A9k4m6kL4k9R3j65J83L0M9j22k1Q1q8J7k5j7L9J11k8p9K8j1o1R6r3O3L1
14995F3K8l5KJ6pl4m5n5J1Q0j67J84Qn8l4n4L3N4k6j6J06mo0o0O9O8q6l3J05p
$$ plain form
15025 46 -22 -72 -93 87 41 -47 76 51 107 -38 57 23 -71 -88 84 14 12 -135 -57 -22 -49 116 6 -6 -99 -46 -92
15052 -92 -56 -66 149 95 -21 -103 -31 37 -21 -27 41 -7 -24 -37 4 46 -11 -75 42 -24 1 52 101 -22 -18 13 -80 0 22
15081 22 188 -6 -40 92 -23 34 -11 -98 45 48 148 -26 -11 -40 29 17 -79 4 -69 -108 24 -78 2 -64 79
15106 79 -102 -24 18 -47 19 -60 -58 -31 123 -61 8 -20 100 93 109 2 75 -26 -74 -9 7 -38 25 77 -76 23 34
15133 34 -115 22 83 131 -92 40 -71 -29 -86 -10 -3 -3 -41 -76 -42 -8 40 -75 -95 113 20 -1 117 -88 7 -8
15159 -8 -71 -37 34 21 32 25 -26 -43 94 16 -18 27 119 -26 68 -24 -55 52 -55 76 37 49 -39 -64 56 36 43 59
15187 59 -135 -32 141 -62 -136 -22 11 -59 96 -37 25 23 -20 -70 29 28 19 -73 -190 23 89 54 16 0 43 4 -79
15214 -79 -55 68 -9 -20 -123 -105 67 32 -100 61 2 38 -13 -83 -82 -2 -1 2 49 -29 47 53 6 -55 123 -22 22 -53
$$ packed form
15025D6o8n0k1J80m6q8J23k5N6j45R5l4r4j7J72p0kj47P8L5k7J65j10j2r3N3m6
15052i2L6j0K15n4j16q2P2O8n8oO8m8j7j3M1M2n7o4J17o6K5N1M9j23ML1r3Q0K2
15081B2J66j94l4J32j15N7m5q7J43LJ00j74J5k9O9j2r6Q3p3l9J32j02Q0o6J43
15106G9j81P8M2o5O6p9KK7J54j84O9k8J20pJ6j07P3j01m8O5J6m5O3N2j53R9J1
15133C4j49J37O1M8k23J32j11M2n7P6P%l8l5L4L4M8j15k0K08r3k1J18k05R5j5
15159ho3L4P1j3J1pn1j7J37p8l4M5R2j45R4r2l1J07j07J31l9J2q8k5J20k0PJ6
15187E9j94J03J73k03p4J14L3p0J55j33O2km3n0R9jrr2j17K13O6l5l8j6M3l9q3
15214g9K4J23p7j1j03J8J72l5j32J61n9L6n1p0JQ0JLM7p8P6Om7o1J78j45M4p5
$$ plain form
15242 -53 47 0 7 0 51 -82 139 -34 32 -70 116 -9 2 -10 -47 -79 -59 -26 50 -67 -19 -79 -76 66 39 42 37 24
15270 24 -22 70 29 88 -18 107 -137 106 55 -90 53 -94 -10 90 44 51 -69 45 -81 -15 -19 -3 -11 -45 -118 12
15296 12 54 -20 -7 -54 -51 -1 -14 -11 12 -61 6 -11 27 51 -38 -26 97 1 78 -32 121 116 5 46 -44 -49 116 -34 39
15325 39 44 -36 -6 70 61 1 46 -48 -50 23 -6 -23 -23 -74 32 52 -47 -74 -102 -7 -29 -59 -28 -109 79 -21 33 9 -46 -79
15355 -79 -49 151 -2 -15 7 -29 55 -1 -24 -41 -56 107 -36 46 -16 116 31 52 20 -116 -8 17 63 -168 -100 -35
15381 -35 130 24 -81 -80 7 51 -103 -147 74 41 -12 -39 2 -25 -151 -88 33 -63 149 30 81 -95 -72 -90 113
15406 113 -5 -95 90 111 29 -34 77 63 177 87 18 104 60 -54 48 -37 18 -7 -99 6 -4 150 29 50 193
15431 193 -76 -72 -139 -47 -32 -45 -29 18 47 0 80 71 36 -28 -29 52 3 -47 -5 21 14 -18 -76 -68 -50 -22 -30 -45 68 65 73 -25
$$ packed form
15242e3J00m7PpN1j33K21j73O6j02J86j25J1j2l7l2K0L3P6j17M8o0LJ42k7Lnj3
15270B4m6R2m1N9j06J25k44K43n1j45J43j47Q4J00m6Pj20J14j26O6mJ6ql4p3J30
15296A2M2p4J3m7LN0j3LK3p3O7j7L8K4q9J2J23r6P7j10J53nj11M1r0nJ65j50P3
15325C9Nq0L0P6ro0M5r4kP3k9j7%n1J06K0r9k7k8R5k2l0L1q1J88j00N4k4n5l3
15355g9L0K00j53j3K2l6Q4n6k3j7j5J63j43Q2o2J32q5K1l2j36J08K5M6k31O8O5
15381c5J65j06j05JQ7M4j54m4K21l3n3k7M1k7j26O3J21r6K12j19N1j76K3j8K03
15406A13j18r0J85K1q2o3J11j4J14r0o9Q6m4j14J02q5N5k5r2J05j0J54j21K1J43
15431A93k69Mo7R2J5j3J6M7K9m7Q0rl5o4jQ1m9n0M2K6pl2n8QJ8K8qj5J13lQr8
$$ plain form
15463 -25 92 91 -20 -103 113 14 -4 71 -51 21 19 51 -19 57 9 -194 21 42 76 -82 49 -14 -24 110 -11 -52
15489 -52 76 -7 -2 -61 -50 36 16 -57 -73 44 16 32 -34 45 -30 16 1 124 72 -30 71 8 106 39 -53 52 -84
15516 -84 13 75 71 -22 -15 74 19 13 -16 -28 6 28 -71 13 -31 36 -67 -48 -45 -131 49 -8 -21 -66 -5 2 30 54 -29 -9 17
15547 17 25 9 110 12 -25 29 100 11 119 64 36 116 -32 65 -9 -53 -35 -40 11 64 -37 -16 54 -17 -30 -71 15 9 54
15576 54 -95 -61 121 57 -106 24 -37 -164 -13 87 -53 -5 -9 -116 -50 -3 69 -71 144 -68 -4 43 74 36
15600 36 -19 35 70 105 73 6 -27 133 81 111 57 78 64 14 -81 62 -78 0 -71 -82 21 47 27 71 7 94 7 -61
15628 -61 -61 48 -17 113 -40 -76 -31 159 17 29 -35 15 133 32 7 -14 115 -122 85 -22 6 -102 21 9
15652 9 -2 131 57 65 49 101 -9 49 93 -46 -13 -109 -58 37 -14 -86 -126 90 54 47 169 -39 -44 -6 70 74 69 31 -16 -127
$$ packed form
15463b5J17jj11q3K16r9j8P5j22P2kL2p0P6m8k03K15K1L4j58J31o3j0J34j21m1
15489e2J28q3Nn9J1Q6k0p3j6J17k8J6o6P9p5M6j5J23n2j02J01o3R8o7r2J05j36
15516h4R7O2mr3PQ9n5ok9j2L4K2r9Q4m4O7j03J9Lq6J80n7j3m5O1PK8K4q3K0K6
15547A7Qj6J01r8l7N4P1q9J08n5k8Q0j48R7p4m4J8nN1N3j01K1P0p1j3m1Q6oM5
15576E4j49L4J82o4j63J30o1j27J51J00j40M8mj07O6M7P2j40K15k12O4M7L1l8
15600C6n5N4L5L5l2o7l3J60n2L0n4K1j4n0r5J43j40P8p1j1J03K6k0M4o4Q7q7o8
15628f1%J09o5J30j53l6M5J90j42J2o4N0J18j01k5k1J29k37K07j07K8j08J23j2
15652Ij1J33p4Qj6N2j10N8M4j39L3r6N1R5n1p2m0K16l6pJ22k08nL8P6Mnl8m7j11
$$ plain form
15682 -127 -14 -15 126 112 -38 15 -70 10 81 41 6 -19 27 51 -2 60 75 -17 -15 -34 -99 2 52 79 91 -26 38 26
15710 26 41 74 47 -26 76 -85 -64 -9 21 -61 -65 37 -29 48 -85 41 -115 -73 54 147 -59 18 25 -84 6 19
15736 19 -90 -53 -36 84 10 -11 -92 -56 -38 66 84 77 21 26 5 -21 -45 72 46 141 4 -71 -55 -48 41 14 61 31 66
15765 66 21 1 -25 -34 23 -150 9 1 40 -53 -17 -36 1 -48 -90 -19 -114 -18 -37 -49 25 -21 -10 -12 78 1 -51 -13 36 -22
15795 -22 -35 46 13 -84 -182 -140 72 -8 -18 103 -2 -20 -29 -12 -24 0 22 -23 111 108 30 -24 36 32 46 -11 -121 10
15823 10 -59 -5 -38 -90 12 20 -26 -6 36 -84 -24 -96 11 22 55 3 -57 -59 -1 139 -27 -32 -34 -63 19 -104 -111 22 32
15852 32 -85 21 -48 54 11 -11 -22 -48 26 -97 42 37 -21 29 -5 -71 -60 -128 16 10 -96 65 18 37 -104 24
15878 24 -141 52 54 108 24 50 81 -158 10 0 -68 10 -128 50 -52 -34 -10 -26 128 -72 -38 90 -65 72
$$ packed form
15682a27J13jJ41j4j50N3q5Q0P1m0l5k5M6K4n3O2J5r2Kj9o5J01N0K7J2j17O4j2
15710B6J5L3k7p3J02j61K1N5L0q2mJ02o6P7j33J26j56M2J27R3k06P7Pj09R0J3
15736A9j09L7J7J20p4k1q1L6J8J04J8pn6Nk1k6k4J17k6R5j37p5J6PQ9k7M7l0L5
15765F6m5k0k6rN7j73J59qL9r3L6j9L7m9m2P1r5R6j9j2P4m6J1kR0p7n2L8M9n8
15795b2j3Q1l3r7r8M2K12q0j0J21j05j8rJ7j2K4K2m5J34lp8n4O0mJ4n7j10J31
15823A0o9N4l3n2J02Qm6K0M2j20O0p2J07J1L3n2o0kN8J40j66nkk9Q2j23pJ33J0
15852C2j17J06o9J02m3k2j1k6P4j23J39nn8N0l4o6J1o8J44oj06J61m7J9j41J28
15878B4j65J93KN4q4K6L1k39J68j0o8P8j38J78j02J8K4j6J54k00L4J28j55J37
$$ plain form
15902 72 21 16 9 70 -25 -87 104 12 -82 -43 73 10 82 103 59 -164 -6 48 59 -151 -3 73 -130 -115 -20 -42 -8
15929 -8 -123 -56 -16 -89 -37 104 124 78 2 -24 2 -5 -112 2 -48 173 30 -9 12 24 45 -68 17 70 -9 34 45
15956 45 5 92 -66 -45 -33 -58 -8 -130 -57 -31 -44 -51 23 14 -33 47 -50 -89 -7 30 -110 37 95 -81 -1 142 47 35
15984 35 -62 3 -26 51 9 82 -16 13 56 -63 -79 27 26 29 90 88 2 -24 -15 -26 12 -12 3 -73 -15 -22 -16 -35 76 -22 9
16015 9 41 -3 48 8 -27 32 49 -19 76 -22 86 111 15 55 133 32 32 96 29 -54 -35 -79 -114 12 131 -6 76 66
16043 66 61 -18 54 62 58 28 0 -85 -28 5 -18 66 -151 -79 61 -76 7 -89 -41 -42 -162 -51 22 -55 47 68 -3 20 -38
16072 -38 -49 -61 24 18 25 79 68 -50 63 25 73 31 -139 13 -119 -7 -74 -12 -99 104 100 27 -49 2 29 -77 52
16099 52 -25 32 -138 -21 9 -33 -44 -62 -189 -67 55 -67 -155 -23 -56 -61 -85 21 -68 -23 51 -53 -72 17 23 21 64
$$ packed form
15902G2n1npO1r5o2J91r2r4L9J16o3P2K1m4k23J58N4J1k10J48P6k03J5R5k2L4
15929hj15O7M0p3N2J41K0m6p6k6K6pj07J14n0K21j43l9K1J2K1j13Q5N3p9M3J1
15956D5m0Q7j58K1J2k5N0j22P3K6j3pP4rm7Q0r7l9Q2L7j40J47N8j76Q0J43r5j2
15984C5r7O5k9P7m2P3r8K9M3j19j6J06jLO1kq6k6Rj1L8k4J5p6N8pOj9J11r8L1
16015IL2m4N1m0l5N9J7o8R5r8J08K5r6M0P8j01%O4o7q3J9m4l5J26J19j37Q2j0
16043F6np9P2Qml0k8q5N7L3k3Q4k17P2J40j37Q3r6M8jj20J11P3p7J02K1p1K3n8
16072c8j1j2Q5oPN4j1j18J13l8M8m2j70J52j32J12o7O2q7K03mp3p6N1K7j06J29
16099E2p7N7j70J17L0m2j1j8j27J22J22j22q8J32l3nk4J06q9M5P4j04j9Q9OkM3
$$ plain form
16126 64 26 -164 2 57 132 21 3 132 -22 -103 22 -28 23 1 -74 -72 74 14 52 158 -12 -13 58 58 -34 -21 23
16153 23 -14 -83 -128 39 38 16 32 -59 -160 -70 90 -79 87 -29 5 37 -8 -53 13 -37 -9 92 86 108 17 13 56 90
16181 90 -81 -77 -51 26 -8 -92 24 -11 43 -69 0 -101 -16 63 -70 -38 33 -107 -79 -38 -134 -81 179 50 56 -99
16207 -99 -50 -97 118 -4 -82 -7 -1 16 -113 -40 25 2 -118 -45 -102 -118 -80 32 -99 -31 57 -19 36 120 76 -100 -45
16234 -45 -39 10 -18 48 4 -48 59 15 -96 25 -109 11 36 -46 -63 -56 -48 26 -74 -22 30 -121 -114 -27 -12 -22 68 6
16262 6 -1 -105 -3 -42 -73 -37 20 -19 21 -9 6 -87 -5 10 -18 24 92 19 2 -63 -61 -98 106 23 -45 -100 61 5 -20
16291 -20 -127 -16 -41 59 104 92 -40 71 -135 -69 81 -99 -25 16 54 39 93 34 34 8 50 10 -10 70 8 -87
16317 -87 -20 23 118 17 -26 9 0 -79 -54 -32 -42 22 21 -240 86 41 30 -15 -14 17 -167 -35 -59 -28 45 -97 -114 -110 -33
$$ packed form
16126F4l8j90J66N5P5j11j8J29j54q1J25n0N1k2p5KJ46o0L8J06j70jP1%r2J3M4
16153B3l7o9m5J67jk2J6r1j01R0J60j69J66j16L4L2m5m5O6n0K8J01oK2r1mM3L4
16181I0j71MK6P7l4q4J16l5N4j12O9j01Q5P9j33L2P1j40K8M1r6N3K60j29Oj55
16207i9M9m7K15j22p8P5OJ7j29P3O5k3j20P3n7j6L8J12j31O8Q8p6N5Q4m4j76N5
16234d5OM9k8O6m4n2J07m4j11J21j34J20K5q2j7PQP4j00N2N2j51PQ7J5j0R0o2
16262Fpj04J02l9l1L6N7l9M0l0J5r3Q2J5k8M2O8p3j7o5Kl7K04q3o8n5J61n6k5
16291b0j07J11k5J00M5j2j32J11k06O6J50j80P4M1L8j5N4n9%k6M2m0k0Q0o2r5
16317h7O7M3R5j01m3L5rp9K5K2j0O4jk61L26m5j1m5JL1j84J32k4L1P3j42j7MP7
$$ plain form
16346 -33 -15 -14 -57 20 -49 -26 -18 16 10 1 40 44 -98 -34 37 -8 -36 28 29 -32 -44 39 -35 -7 -39 2 -2 57 7 22 -10 -12 59
16379 59 22 45 -21 -34
$$ packed form
16346c3J8Jm3P7o9K3QL4orL9Mj42O4P1m5k8O4Jo1j2Q3p4K8l2M1mN9n0J5l2kP1
16379E9l7K3o6j3
16383c4
$$ Imaginary data points
##PAGE= N=2
##DATA TABLE= (X++(I..I)), XYDATA
$$ plain form
0 0 0 0 0 0 0 0 0 0 0 0 0 0 -32 32 -32 32 -33 64 -64 96 -96 128 -129 160 -192 224 -257 320 -353 416 -474 532
32 532 -609 673 -769 865 -963 1090 -1218 1351 -1507 1675 -1859 2057 -2278 2521 -2782 3068
48 3068 -3380 3720 -4100 4517 -4981 5495 -6072 6726 -7465 8321 -9315 10488 -11898
61 -11898 13633 -15821 18690 -22629 28396 -37675 55090 -99226 456254 600005 -529919
72 -529919 -655384 -134358 401014 268345 -46999 -212142 -49132 40727 202 -40725 108281
83 108281 158288 -7555 -270893 -293635 -4223 386693 369447 -94121 -445501 -228126 185500
94 185500 296509 96081 -95110 -142616 -66240 2657 13428 41510 112096 47634 -144096
105 -144096 -181263 44526 242772 167719 -81837 -212212 -91842 88296 71672 -41331
$$ packed form
0@%%%%%%%%%%%%l2O4o4O4o5R7j28J60j92K24k57K89l52M16m81N77o73P69q90J006
32E32j141J282j442J634j828K053k308K569k858L182l534L916m335M799n303N850
48C068o448P100p820Q617r498J0476j1567J2798j4191J5786j7636J9803k2386
61a1898K5531k9454L4511m1319N1025o6071R2765j54316N55480J43751j129924
72e29919j25465N21026N35372j32669l15344j65143J63010Q9859m0525m0927J49006
83A08281N0007j65843k63338k2742K89412L90916j7246m63568l51380K17375M13626
94A85500J11009k00428j91191m7506P6376O8897J0771K8082P0586o4462j91730
105a44096l7167K25789J98246p5053k49556j30375J20370J80138j6624j13003
$$ plain form
115 -41331 4829 113810 17901 -167045 -139946 59073 162318 77562 -90727 -172957 -56681
126 -56681 143316 172362 3153 -131308 -83872 43618 68642 -34900 -80128 54077 152013
137 152013 -15393 -227372 -131201 155038 232355 25152 -182870 -160070 40036 166361
147 166361 74182 -77063 -72780 26209 38423 -21122 -23052 40518 67571 -9306 -121992 -107408
159 -107408 61933 174927 76076 -96076 -131968 -26269 84984 91594 -3294 -75783 -34426
170 -34426 31585 11262 -27525 12859 62559 18043 -68296 -70357 25372 91663 28253 -75031
182 -75031 -58839 42891 59821 -19406 -47401 14886 60721 22558 -53003 -76863 -11993 67612
194 67612 58014 -21916 -58149 -14259 37472 30008 -20325 -36637 13733 47106 -11448 -75184
$$ packed form
115d1331M6160J08981r5909j84946K7099J99019J03245q4756j68289q2230J16276
126e6681J99997K9046j69209j34461M7436J27490K5024j03542m5228J34205R7936
137A52013j67406k11979R6171K86239P7317k07203k08022K2800K00106J26325
147A66361r2179j51245M283R8989J2214n9545j930O3570K7053p6877j12686J4584
159a07408J69341J12994r8851j72152l5892J05699J11253O610r4888p2489M1357
170c4426O6011k0323l8787M0384M9700m4516q6339k061R5729O6291o3410j03284
182g5031J6192J01730J6930p9227k7995O2287M5835l8163p5561k3860O4870P9605
194F7612r598p9930l6233M3890N1731p464n0333j6312N0370L3373n8554o3736
$$ plain form
206 -75184 -21715 88049 92681 -25674 -119298 -70423 65103 119564 30126 -73668 -68394 -4039
218 -4039 21702 16832 23133 24822 -6577 -53831 -61247 3942 80506 62532 -39498 -98486 -48709
231 -48709 47849 98436 55807 -43923 -92107 -38175 34809 47498 26133 8598 -14121 -37210
243 -37210 -30305 13005 62143 56401 -29003 -99159 -43092 72785 92771 9633 -58073 -53474
255 -53474 -7522 27616 19144 -8823 -8453 1158 -18391 -27756 7299 35726 20645 -7505 -26686
268 -26686 -24399 18310 56255 21832 -40034 -38789 7936 29677 15098 -12752 -22811 3836
280 3836 21561 -15237 -40974 4347 43391 9539 -28329 -11738 18443 24677 7743 -20770
292 -20770 -22291 13411 22429 -14438 -24663 6386 15066 -3197 -9670 -12763 -10911 16595 28804
$$ packed form
206g5184N3469J09764M632j18355r3624M8875J35526N4461q9438j03794N274O4355
218d039K5741m870O301J689l1399m7254p416O5189P6564j7974j02030n8988M9777
231d8709R6558N0587m2629r9730m8184N3932P2984J2689k1365j7535k2719k3089
243c7210O905M3310M9138n742q5404p0156N6067J15877J9986q3138o7706M599
255e3474M5952L5138q472k7967L70R611j9549r365L5055K8427j5081k8150j9181
268b6686K287M2709L7945l4423o1866J245M6725K1741j4579k7850j0059K6647
280C836J7725l6798k5737M5321L9044l3852l7868J6591L0181O234j6934k8513
292b0770j521L5702R018l6867j0225L1049Q680j8263o473l093J852K7506J2209
$$ plain form
305 28804 -6244 -27473 755 22892 11936 -2914 -12808 -10880 12638 15816 -19837 -24439 17155
318 17155 20147 -22559 -27306 9879 26188 14084 -6089 -21179 -3382 31108 20068 -18280
330 -18280 -15223 7835 15 -7346 6243 1173 -13452 -4098 1406 -10587 -587 19958 6953
343 6953 -13801 -8734 1310 10994 24429 7205 -29053 -16919 24090 17450 -14633 -10955 3919
356 3919 -1457 -4350 -595 -595 9885 14174 -11412 -22799 10063 26443 382 -13478 -4400 -6501
370 -6501 -4309 12331 6025 -16075 -12122 3342 2963 4223 7308 -3913 -5651 9474 4429 -9304
384 -9304 6591 18711 -5980 -19914 2743 15180 2182 -8193 -11845 -8644 8216 12659 -7091
397 -7091 -9880 8567 4145 -12503 -1385 13278 2693 -6292 -1973 -4048 -3689 7605 5295 -8146
$$ packed form
305B8804l5048k1229K8228K2137j0956j4850r894J928K3518L178l5653m602M1594
318A7155K992m2706m747L7185J6309j2104k0173j5090J7797L4490j1040l8348
330a8280L057K3058p820p361J3589n070j4625R354N504j1993J0000K0545j3005
343F953k0754N067J0044R684J3435j7224l6258J2134M1009o640l2083L678J4874
356C919n376k893L755%J0480M289k5586j1387L2862J6380k6061j3860R078k101
370f501K192J6640o306k2100L953J5464l79J260L085j1221j738J5125n045j3733
384i304J5895J2120k4691j3934K2657J2437j2998j0375l652L201J6860M443j9750
397g091k789J8447m422j6648J1118J4663j0585q985M319k075L59J1294k310j3441
$$ plain form
411 -8146 -7132 -1768 -2040 8887 17442 -1356 -16360 21 11373 -526 -2206 8498 3937 -8667
425 -8667 -10225 -4522 5931 13155 -1241 -18779 -7765 10332 4020 -2537 7553 5363 -10664
438 -10664 -9002 6889 12400 8217 -392 -11195 -11646 -1406 3361 5661 12511 4944 -15830 -16202
452 -16202 4806 14737 9386 3246 -6255 -15837 -8437 9544 17977 12188 -6457 -25665 -19527 9899
466 9899 24070 10403 -5699 -11624 -12798 -4555 11134 18468 12186 -4516 -21935 -19353 7201
479 7201 24585 12119 -8240 -16770 -17267 -4906 18846 26824 5761 -19839 -24126 -6669 14863
492 14863 18893 6617 -1453 -3973 -14272 -16926 6402 26269 11982 -15729 -25830 -16195 6732
505 6732 29216 27459 -337 -26951 -28882 -2806 30232 31949 -4724 -32136 -20264 3242 12913
$$ packed form
411h146J014N364k72J0927Q555j8798j5004J6381J1352j1899j680J0704m561j2604
425h667j558N703J0453P224j4396j7538J1014J8097o312o557J0090k190j6027
438a0664J662J5891N511m183q609j0803m51J0240M767K300O850p567k0774l72
452a6202K1008R931n351o140r501r582P400J7981Q433n789j8645j9208O138K9426
466I899J4171j3667j6102n925j174Q243J5689P334o282j6702j7419K582K6554
479G201J7384j2466k0359q530m97J2361K3752P978k1063k5600m287J7457K1532
492A4863M030j2276q070k520j0299k654K3328J9867j4287k7711j0101R635K2927
505F732K2484j757k7796k6614j931K6076L3038J717l6673k7412J1872K3506R671
$$ plain form
518 12913 14926 8770 -6770 -14750 -10185 -4956 4244 18062 15897 -4486 -17329 -13919 423 23376
532 23376 31376 1733 -35588 -33944 -1480 23843 23834 515 -22048 -14084 9610 10848 2059 9825
546 9825 11412 -10872 -24756 -12378 7566 23139 26022 609 -32477 -31148 2305 31639 32212
559 32212 -2377 -44043 -36948 14265 39461 18685 -1685 -6714 -12484 -10267 3572 8181 4249
572 4249 3233 -7193 -22677 -14208 13007 27850 24278 2888 -32901 -41980 -514 40032 31617
585 31617 -1824 -24911 -26936 -1997 30001 26774 -4008 -19519 -18793 -17119 -639 22820 21135
598 21135 2056 -8407 -16088 -17434 7404 34284 21684 -15989 -38957 -29790 10035 46139 28761
611 28761 -22263 -34766 -5884 10857 9457 10023 3879 -8626 -8740 -5196 -5292 10032 29019 16589
$$ packed form
518A2913K013o156j5540p980M565N229R200J3818k165k0383j2843L410J4342K2953
532B3376Q000k9643l7321J644L2464K5323rk3319k2563P964K3694J238q789P766
546I825J587k2284j3884J2378J9944J5573K883k5413l3086J329L3453K9334N73
559C2212l4589m1666P095N1213K5196k0776k0370n029n770K217J3839M609l932
572D249j016j0426j5484Q469K7215J4843l572k1390l5789r079M1466M0546q415
585C1617l3441k3087k025K4939L1998l227l0782j5511P26J674J6480K3459j685
598B1135j9079j0463p681j346K4838K6880j2600l7673k2968R167L9825L6104j7378
611B8761n1024j2503K8882J6741j400N66o144j2505j14L544r6J5324J8987j2430
$$ plain form
625 16589 -16639 -32509 -22881 6021 36767 27912 -20546 -42996 -13199 21078 29320 20052 -4549
638 -4549 -27808 -20012 4442 11440 9404 10533 -1013 -17961 -14566 1429 12117 19699 12484 -19435
652 -19435 -37844 -12898 23541 34166 18733 -12282 -33615 -14415 22569 25978 1216 -14198
664 -14198 -18407 -16213 2646 21262 14758 -581 -4647 -9137 -14083 -3918 13368 19804 11933 -11896
678 -11896 -32941 -15149 28379 36340 416 -27017 -23858 -5734 14797 21573 2335 -17800 -11714
691 -11714 4617 9775 8944 4996 -2917 -5203 -4574 -9486 -5761 12562 17271 -892 -14378 -10163
705 -10163 -1432 7775 12400 2057 -11140 -7690 1664 3585 6543 9614 1297 -8317 -6643 -1977
719 -1977 -1337 1537 3414 -141 -3316 -4644 -4361 5069 16025 7483 -11329 -13392 -1912 4346 6542
$$ packed form
625A6589l3228j5870R628K8902L0746q855m8458k2450K9797L4277Q242r268k4601
638d549k3259P796K4454O998k036J129j1546j6948L395J5995J0688P582p215l1919
652a9435j8409K4946L6439J0625j5433l1015k1333J9200L6984L409k4762j5414
664a4198m209K194J8859J8616o504j5339m066m490m946J0165J7286O436p871k3829
678a1896k1045J7792M3528P961l5924k7433L159J8124K0531O776j9238k0135O086
691a1714J6331N158q31l948p913k286O29m912L725J8323M709j8163j3486M215
705a0163Q731R207M625j0343j3197L450R354J921K958L071q317r614J674M666
719a977O40K874J877l555l175j328K83R430J0956q542j8812k063J1480O258K196
$$ plain form
734 6542 7554 -563 -10850 -7280 4837 9536 4374 -4459 -8453 -4400 -1315 -2958 3465 15678
748 15678 11564 -7460 -14060 -2286 8473 7618 -1291 -11224 -12005 -560 9243 8943 4083 -2375 -7504
763 -7504 -4884 2103 4338 2946 2271 -2319 -6764 -2062 6777 8663 4480 -3232 -11618 -9832 2164
778 2164 6724 483 -1814 1580 1203 -284 2261 4450 3559 -867 -7339 -6934 2772 6248 -735 -2932
794 -2932 1583 -794 -4361 1432 5972 867 -3164 -1969 -1728 -57 3361 3533 2588 2503 -2700 -7272
810 -7272 -320 6318 -658 -7298 -3046 -184 -952 3516 6090 1906 -160 117 -3378 -2208 4516 2403
826 2403 -4839 -2120 2324 -565 443 5275 462 -7052 -4894 -776 978 5106 4469 -3647 -3604 3793
842 3793 2102 -1307 3607 2107 -8269 -7107 3605 4256 35 41 -2381 -2992 4234 6122 -1308 -2236
$$ packed form
734F542J012q117j0287L570J2117M699n162q833l994M053L085j643O423J2213
748A5678m114j9024o600J1774J0759q55q909r933p81J1445R803l00m860o458n129
763g504K620O987K235j392o75m590m445M702Q839J886m183p712q386J786J1996
778B164M560o241k297L394l77j487K545K189q91m426o472M05R706L476o983k197
794b932M515k377l567N793M540n105m031J195K41J671L418J72r45q5n203m572
810g272O952O638o976o640M252K862p68M468K574m184k066K77l495J170O724k113
826B403p242K719M444k889J008M832m813p514K158M118J754M128o37q116M3P397
842C793j691l409M914j500j0376J162J0712O51m221Ok422o11P226J888p430r28
$$ plain form
858 -2236 1213 -2367 -2452 6129 4524 -5255 -3819 2049 -1240 -2177 2413 -508 -4746 -287 1502 -850
874 -850 3880 6248 -2977 -5380 3469 4050 -2103 612 2523 -3858 -3963 2107 577 -1366 1839 -1157
890 -1157 -4599 2713 6179 -2490 -3697 3335 622 -3467 3407 5218 -3272 -4166 229 -1510 -1314 2519
906 2519 -957 -3820 3016 3982 -3066 -497 5698 -370 -4730 2219 3684 -1991 -136 1889 -3102
921 -3102 -2988 1712 -1167 -2766 3021 1329 -4781 410 6148 -215 -3601 2253 2045 -2199 991 2128
937 2128 -2434 -924 1532 -2893 -2642 4061 1600 -4663 -329 3416 -1602 -1142 4581 1568 -3528 -443
953 -443 1237 -491 1410 1369 -4071 -2979 2340 -616 -3069 3485 4285 -3536 -3102 3271 2538 137 1590
970 1590 -560 -2689 919 1573 -2501 -607 2638 -2289 -5025 450 2284 -406 1706 1848 -3860 -3525
$$ packed form
858b236L449l580q5Q581j605r779J436N868l289r37M590k921m238M459J789k352
874h50M730K368r225k403Q849N81o153K715J911o381j05O070j530j943L205k996
890a157l442P312L466q669j207P032k713m089O874J811q490q94M395j739J96L833
906B519l476k863O836R66p048K569O195o068m360O949J465n675J855K025m991
921c102J14M700k879j599N787j692o110N191N738o363l386N854k08m244L190J137
937B128m562J510K456m425K51O703k461o263M334L745n018M60N723l013n096L085
953d43J680j728J901m1n440J092N319k956k453O554Q00p821M34O373p33k401J453
970A590k150k129L608O54m074J894L245m927k736N475J834k690K112J42n708L35
$$ plain form
986 -3525 3626 5324 2338 53 -3504 -4950 1287 4383 -787 -2648 310 -1549 -3872 1536 5727
1001 5727 1930 -1949 -3013 -2558 2286 6111 1578 -3941 -1695 -77 -2372 -986 2564 1148 -1169
1016 -1169 -1061 -2444 -2672 2608 5751 2297 -2584 -3959 -1679 4583 7598 278 -7087 -3914 1412
1031 1412 -184 -1365 1254 2265 -20 -2963 -4264 132 6881 5811 -2420 -5955 -2622 1634 5228
1046 5228 5295 -1580 -7236 -3861 1772 2648 1924 394 -2221 -2478 -416 102 1587 5451 3933 -2574
1062 -2574 -4375 -1561 -32 1798 3318 -608 -5605 -4879 -1094 3672 8332 4433 -7779 -10698 764
1077 764 9461 6402 -231 -4313 -3924 1495 4174 -40 -1487 1733 -834 -5889 -4263 511 3586
1092 3586 6924 3742 -7925 -10094 4166 13290 5127 -6373 -9352 -4312 4395 6409 -1579 -4506
$$ packed form
986c525P151J698k986k285l557j446O237L096n170j861K958j859k323N408M191
1001E727l797l879j064M55M844L825m533n519K246J618k295J386L550j416k317
1016a169J08j383k28N280L143l454m881j375K280O262L015p320p365L173N326
1031A412j596j181K619J011k285k943j301M396O749j070q231l535L333M256L594
1046E228O7o875n656L375N633Q76p24j530k615k57K062N18J485L864j518o507
1062b574j801K814J529J830J520l926m997P26L785M766M660l899j2212k919J1462
1077G64Q697l059o633m082L89N419K679m214j447L220k567n055J626M774L075
1092C586L338l182j1667k169J4260R124q163j1500k979N040Q707K014p988k927
$$ plain form
1106 -4506 2605 3444 -3780 -4177 942 2832 3502 2010 -6121 -7839 5296 13524 5350 -5412 -9102
1121 -9102 -7514 1066 8950 3457 -6435 -5272 -188 431 3514 5757 -256 -4325 -213 568 -2012
1136 -2012 1415 3987 -423 -1396 -24 -4841 -4683 7026 10155 -2976 -11365 -6528 2501 9720 8679
1151 8679 -3646 -9489 944 7727 1279 -2474 -567 -2033 -2361 437 -2892 -4175 6903 11766
1165 11766 -2316 -13268 -5994 5592 10515 5625 -7116 -11946 1644 11803 3368 -5158 -2324
1178 -2324 -1191 -2600 228 -21 -2962 2262 6711 -1106 -6464 1004 6113 3714 1106 -3814 -9030
1193 -9030 -2985 7046 5004 -761 -271 -2118 -5201 5 4830 248 -2632 -505 -2232 -1092 6305
1208 6305 6036 -2427 -2079 2437 -2491 -6585 -512 4652 2631 -1513 -6127 -5549 5734 11999 1135
$$ packed form
1106d506P111Q39p224l97N119J890O70j492q131j718J3135Q228q174j0762l690
1121i102J588Q580P884n493r892J163N084O19L083K243o013m069M112P81k580
1136b012L427K572m410r73J372m817J58J1709L129j3131q389M837R029P219j041
1151H679j2325n843J0433O783o448l753J907j466l28K798l329j283J1078M863
1165A1766j4082j0952P274J1586M923m890j2741m830J3590J0159q435q526K834
1178b324J133j409K828k49k941N224M449p817n358P468N109k399k608m920n216
1193i030O045J0031k042n765M90j847l083N206M825m582k880K127j727J140P397
1208F305k69q463L48M516m928m094O073N164k021m144m614N78J1283O265j0864
$$ plain form
1223 1135 -8946 -4041 2310 2089 1840 -402 -4550 -593 5926 549 -6298 -788 6461 2924 -4457
1238 -4457 -8226 -5133 5744 11937 2314 -7399 -2075 5518 3178 -729 -2468 -4932 -3018 2170 1503
1253 1503 -1040 2616 3902 -2336 -4652 -425 1383 1072 1459 -1340 -3639 396 3894 1412 593 1945
1269 1945 -1252 -4920 -3358 -1327 362 3994 2746 -3665 -2721 5910 6821 -618 -4099 -1955 -21
1284 -21 292 -1694 -2848 1437 5606 964 -4602 -1796 2978 1685 -1978 -4038 -3631 1449 6443 3292
1300 3292 -2536 -1417 2646 1438 -1970 -3195 -1840 1033 1031 -3337 -4394 2505 7264 2910 -2055 -2043
1316 -2043 624 2470 539 -4061 -3940 2395 4034 -1145 -2524 1940 3931 729 -3409 -5347 -2449
1331 -2449 3309 3445 -1295 -1830 1712 3395 2649 602 -2745 -3009 756 77 -4610 -2733 3515 3762
$$ packed form
1223A135j0081M905O351k21k49k242m148L957O519n377o847N510P249l537p381
1238d457l769L093J0877O193r623r713N324P593k340l907j739k464J914N188o67
1253A503k543L656J286o238k316M227J808l11L87k799k299M035L498k482q19J352
1269A945l197l668J562K031J689L632j248o411R44Q631R11p439l481K144J934
1284b1L13j986j154M285M169m642n566K806M774j293l663k060M07N080M994l151
1300C292n828J119M063j208l408j225J355K873km368j057O899M759m354m965J2
1316b043K667J846j931m600J21O335J639n179j379M464J991l202m138j938K898
1331b449N758J36m740n35L542J683p46k047l347k64L765o79m687J877O248K47
$$ plain form
1347 3762 -289 -1231 -38 1629 1948 -1540 -3786 500 4360 399 -3022 133 2516 776 -728
1362 -728 -2144 -2846 1169 3192 -2304 -5296 654 5456 3544 570 -1160 -2178 819 2340 -2847
1377 -2847 -5260 1105 4415 101 -2546 -1413 19 2113 1945 -3300 -3643 3947 5018 -2446 -3628
1392 -3628 2064 3079 334 -485 -2214 -1680 2235 1068 -4364 -2673 3236 2535 -363 571 70 -882
1408 -882 2547 2171 -3893 -3070 3614 2211 -3303 -2062 525 474 1373 277 -3975 -1516 4325 1140
1424 1140 -4269 -189 4679 1961 -174 -139 -1832 -637 2665 -976 -4814 236 4204 -458 -2579
1439 -2579 419 111 -361 2708 991 -3104 275 4247 -301 -3018 380 997 86 748 -1557 -4397
1455 -4397 436 4227 -1886 -4481 2123 4446 121 -741 149 -718 1459 2836 -2569 -4178 2217 3302
$$ packed form
1347C762m051r42J193J667L19l488k246M286L860l961l421L155K383j740j504
1362g28j416p02M015K023n496k992N950M802j912k974j730j018K997J521n187
1377b847k413O365L310m314k647J133J432K094j68n245l43P590J071p464j182
1392c628N692J015k745q19j729N34L915j167n432J691N909p01k898R34n01r52
1408h82L429l76o064Q23O684j403n514J241K587n1Q99j096m252K459N841l185
1424A140n409M080M868k718k135L5j693J195L302l641l838N050L968m662k121
1439b579K998l08m72L069j717m095L379L972m548k717L398O17r11O62k305k840
1455d397M833L791o113k595O604K323m325q62Q90q67K177J377n405j609O395J085
$$ plain form
1471 3302 -1829 -2336 -83 -886 355 2473 -1325 -3340 2345 3635 -1440 -1790 1805 952 -203 718
1487 718 -1842 -2900 2030 2551 -3591 -3195 2559 1972 -1071 -30 288 -294 1566 1261 -2200 -559 3352
1504 3352 248 -3230 -96 1330 -1159 -425 515 -2094 -1745 2359 1471 -1259 342 1733 -501 -176
1520 -176 1179 -644 -195 2028 -823 -3875 -202 2885 -174 -1924 -127 100 93 1611 346 -1411
1536 -1411 965 2222 -739 -848 1584 435 -1556 -209 -368 -1899 -458 1576 -297 -1173 484 -12
1552 -12 -193 1847 1572 -911 -389 802 -614 -982 1355 803 -1417 -1072 -145 -277 667 926 -1089 -1175
1570 -1175 1290 982 -318 1154 1687 -726 -1190 101 -328 -437 621 170 -1359 -831 -210 -154 984
1587 984 1268 -986 -1261 1312 1603 -11 505 783 -1016 -1306 -348 -265 204 935 -638 -2060 -534 630
$$ packed form
1471C302n131n07K253q03J241K118l798k015N685J290n075l50L595q53j155R21
1487G18k560j058M930N21o142L96N754n87l043J041L18n82J860l05l461J641L911
1504C352l104l478L134J426k489P34R40k609L49M104q88k730J601J391k234L25
1520a76J355j823M49K223k851l052L673L087l059j750J797K27pJ518j265j757
1536a411K376J257k961j09K432j149j991J347j59j531J441K034j873q76J657m96
1552a2j81K040k75k483N22J191j416l68K337n52k220L45R27j32R44K59k015q6
1570a175K465l08j300J472N33k413m64J291m29j09J058m51j529N28O21N6J138
1587I84K84k254k75K573K91j614N16K78j799k90R58Q3M69P31j573j422J526J164
$$ plain form
1605 630 222 717 898 -1033 -1041 1672 2188 299 -335 -962 -1656 -169 1102 -798 -1093 1058 678 -1491
1623 -1491 -750 796 629 1108 1201 -1069 -1450 1247 1729 -42 -409 -1341 -2450 -32 2431 -64 -2184
1640 -2184 -78 874 -823 10 1907 905 428 867 -1023 -1570 1066 1209 -982 -674 -376 -2227 -697
1657 -697 2895 1179 -2393 -1308 565 406 1443 1921 -1037 -1115 2211 1270 -2030 -720 1233 42
1673 42 -351 -357 -2783 -1674 3274 3076 -1520 -2171 71 1221 3304 3015 -2760 -4919 776 3270 -728
1690 -728 -1685 180 -247 -159 1106 -985 -2692 546 2086 -400 -487 841 165 1423 3838 -345 -5049
1707 -5049 -1320 2939 594 -1253 -317 -1510 -1414 2270 1988 -1356 -453 1546 -57 -675 643 -1046
1723 -1046 -1049 2657 1901 -3306 -2330 1757 1554 -176 -399 -3040 -3134 2844 4865 -600 -2444 945 1593
$$ packed form
1605F30m08M95J81j931qK713N16j889o34o27o94J487J271j900k95K151l80k169
1623a491P41J546j67M79R3k270l81K697M82j771l67r32j109K418K463k495k120
1640b184K106R52j697Q33J897j002m77M39j890n47K636J43k191L08K98j851J530
1657f97L592j716l572J085J873j59J037M78k958p8L326r41l300J310J953j191
1673D2l93ok426J109M948j98m596o51K242J150K083k89n775k159N695K494l998
1690g28r57J865m27Q8J265k091j707L238J540k486q7J328o76J258K415m183m704
1707e049L729M259k345j847R36j193R6L684k82l344R03J999j603o18J318j689
1723a046lL706p56n207R76M087k03j730k23k641r4N978K021n465j844L389O48
$$ plain form
1740 1593 655 875 -1115 -3216 -230 1924 -882 -1650 773 746 381 1690 -1069 -4237 301 4637
1756 4637 240 -3150 -115 1891 732 1148 756 -1519 -1217 -100 -2130 -1974 1404 997 -923 924
1772 924 1853 -299 639 2511 -996 -3690 -652 1115 -890 62 1867 41 -791 707 163 -725 531
1789 531 -231 -2143 -88 2320 445 -613 1710 1562 -240 -53 -1011 -2828 -698 1792 -1573 -3672
1805 -3672 672 4112 2027 -215 -771 -789 759 1340 -1567 -2213 854 1428 -559 -362 876 101 803
1822 803 1327 -2050 -4107 60 3113 964 -1251 -274 1082 2096 1693 -1152 -2227 -85 350 -1786
1838 -1786 -1725 -44 488 1103 2034 69 -1550 339 1547 -428 -1675 -419 254 521 1168 590 -204
1855 -204 62 -371 -1882 -1069 343 -444 -1147 188 1377 1826 2105 715 -1372 -527 1148 -538 -2333
$$ packed form
1740A593r38K20j990k101K986K154k806p68K423k7l65J309k759l168M538M336
1756D637m397l390L035K006j159M16l92k275L02J117k030J56L378m07j920J847
1772I24R29k152R38J872l507k694L038J767k005R52J805j826q32J498n44q88J256
1789E31p62j912K055K408j875j058K323j48j802J87r58j817K130K490l365k099
1805c672M344L440k085k242n56j8J548N81k907o46L067N74j987J97J238p75P02
1822H03N24l377k057M167L053k149k215R77J356J014m03k845j075K142M35k136
1838a786O1J681N32O15R31j965j619J889J208j975j247J256O73K67O47n78p94
1855b04K66m33j511Q13J412p87p03J335J189M49K79j390k087Q45J675j686j795
$$ plain form
1872 -2333 -659 1086 782 -318 -860 -469 1419 1550 -1259 -2310 -37 967 312 571 485 45 1090
1889 1090 1509 -1125 -2587 -476 693 -927 -1724 -770 575 2071 1569 -859 -753 1956 1352 -1355
1905 -1355 -1086 412 271 73 307 -917 -627 1331 617 -1819 -1089 585 34 -299 267 -68 262 2132
1923 2132 1295 -1042 -494 902 -749 -1853 -674 -289 -143 1015 323 -1391 568 2434 -102 -1882
1939 -1882 52 711 -334 -61 365 -104 1143 1460 -1717 -2487 265 693 -1473 -596 871 320 1075
1956 1075 2017 -353 -1318 1132 1548 -1361 -1336 358 -14 143 751 -1097 -1577 1522 1651 -2120 -1909 1003
1974 1003 751 -211 672 97 -361 1623 1347 -1993 -1408 1282 -173 -1905 -91 322 -529 857 1377
1991 1377 -865 -497 2095 786 -1650 -288 676 -393 426 794 -1314 -632 2174 357 -2803 -823
$$ packed form
1872b333J674J745l04j100n42L91J888J31k809j051K273J004o55K59q6m40J045
1889A090M19k634j462K111J169j620p97R54J345J496n02k428J06K709o04k707
1905a355K69J498j41j98K34j224K90J958p14k436P30J674n51l33N66l35L30J870
1923B132q37k337N48J396j651j104J179L85J46J158o92j714J959J866k536j780
1939a882J934O59j045K73M26m69J247L17l177p70K752M28k166Q77J467n51P55
1956A075R42k370r65K450M16k909K5J694l72J57O08j848m80L099J29l771K11K912
1974A003k52r62Q83n75m58J984k76l340N85K690j455j732J814M13q51J386N20
1991A377k242L68K592j309k436J362R64j069Q19L68k108O82K806j817l160J980
$$ plain form
2007 -823 1302 -184 -567 525 -157 212 1938 347 -1730 759 1888 -1192 -2283 -30 -214 -637
2023 -637 877 170 -1332 933 2541 -461 -1658 418 642 -492 605 250 -1081 814 1918 -1163
2039 -1163 -2444 621 1036 -1138 -897 73 -411 849 1877 -512 -1007 1901 1395 -1863 -1289 1114 258
2056 258 -124 262 -1211 -1445 1268 1323 -1365 -826 1217 598 -36 426 -549 -1020 1448 1469 -1583 -1028 1386
2075 1386 269 -1751 -919 -250 -211 1122 791 -1124 -430 1543 268 -1079 386 1020 -174 -39 189
2092 189 -1006 -508 980 -509 -1669 226 1253 -117 -88 581 53 109 988 -57 -872 1076 1507 -519
2110 -519 -1655 -694 -141 568 429 -1280 -1659 1009 1998 -539 -1329 390 829 357 230 -148 -276 733
2128 733 687 -798 -1106 -101 -27 -156 66 -449 -489 927 1386 -229 -506 775 399 -573 -268 524 106
$$ packed form
2007h23K125j486l83J092o82L69J726j591k077K489J129l080j091K253j84m23
2023f37J514p07j502K265J608l002j197K076K24j134J097l55j331J895J104l081
2039a163j281L065M15k174K41R70m84J260J028k389m95K908n06l258N74K403q56
2056B58l82L86j473k34K713N5k688N39K043o19o34M62r75m71K468K1l052N55K414
2075A386j117k020Q32O69L9J333l31j915O94J973j275j347J465O34j194J35K28
2092A89j195M98J488j489j160J895J027j370K9O69n28N6Q79j045q15J948M31k026
2110e19j136R61N53P09j39j709l79K668R89k537p90J719M39m72j27l78j28J009
2128G33m6j485l08J005P4j29K22n15m0J416M59j615k77J281l76r72L05P92m18
$$ plain form
2147 106 181 -424 -1367 -442 791 -152 -882 84 508 100 288 280 4 850 1211 -554 -1434 391 1132 -209
2167 -209 -918 -724 -542 409 1034 -311 -1192 35 771 490 497 121 -748 480 1202 -612 -1463 522 937
2186 937 -714 -883 -15 -524 -205 680 347 -223 390 94 -320 927 1300 -716 -923 335 -96 -744 567
2205 567 540 -991 -496 891 -141 -778 530 597 -272 158 370 -419 561 1349 -827 -1775 159 724 -357
2224 -357 -146 -368 -1390 134 1934 78 -1408 715 1618 10 -339 279 -579 21 1118 -373 -1934
2241 -1934 -303 952 325 508 261 -1793 -663 1953 606 -1591 166 1628 -36 -375 705 -337
2257 -337 -853 499 -154 -1923 -555 1008 46 -180 678 -589 -525 2132 1401 -1574 -887 1254 45
2274 45 -427 484 -468 -1105 991 1176 -1441 -1056 1108 208 -642 149 -187 -871 1285 2066 -422 -761 347
$$ packed form
2147A06P5o05r43R25J233r43p30R66M24m08J88qk76Q46L61j765q80J825P41j341
2167b09p09J94J82R51O25j345q81J227P36k81Pl76q69J228P22j814q51J985M15
2186I37j651j69Q68n09L19Q85l33n70O13k96m14J247L73k016k07J258m31o48J311
2205E67k7j531M95J387j032o37J308O7q69M30K12p89R80P88k176r48J934N65j081
2224c57K11k22j022J524J800j856j486K123R03j608l49O18q58O00J097j491j561
2241a934J631J255o27J83k47k054J130K616j347k197J757J462j664l39J080j042
2257c37n16J352o53j769J368J563r62k26Q58j267O4K657p31k975O87K141j209
2274D5m72R11r52o37K096J85k617L85K164r00q50P91l36o84K156P81k488l39J108
$$ plain form
2293 347 -494 -988 658 46 -1903 -478 1389 -92 -110 1221 40 -1017 801 1112 -1023 -604 874
2310 874 154 -396 396 -280 -744 1075 925 -2099 -1684 1032 796 -296 296 -17 -577 1382 1745 -1098
2328 -1098 -1507 694 649 -946 -788 -866 -726 1459 1936 -1045 -1742 1076 1465 -126 -449 -684 -685 1211 2002
2347 2002 -435 -1370 855 771 -1204 -1052 -396 -671 -180 643 -309 -505 1455 1415 -261 -242 290 -805 -493
2366 -493 565 -382 -878 851 765 -816 -287 840 -333 -1093 -148 267 -50 490 533 -190 838 1217 -794
2385 -794 -1292 438 293 -891 -899 -678 -363 989 1540 -317 -803 789 1062 -227 -405 -361 -505 458 793
2404 793 -416 -826 568 915 -711 -847 -538 -218 499 334 -652 -423 1434 1496 -475 -901 146 -64
2422 -64 -320 -473 -830 -155 1087 431 -762 -130 624 6 -121 210 -314 -280 599 284 -303 207 950 -143
$$ packed form
2293C47q41m94J646o12j949J425J867j481j8J331j181j057J818L11k135M19J478
2310H74p20n50P92o76m64J819j50l024M15K716k36j092N92l13n60J959L63k843
2328a098m09K201m5j595J58p8J40K185M77k981o97K818L89j591l23k35jJ896P91
2347B002k437r35K225q4j975J52O56k75M91Q23r52j96J960m0j676J9N32j095L12
2366d93J058r47m96J729q6j581N29J127j173p60R45M15l17N40M3p23J028L79k011
2385g94m98J730j45j184qK21L15J352N51j857m86J592K73j289j78M4j44R63L35
2404G93j209m10J394L47j626j36L09L20P17j65r86K29J857O2j971m26J047k10
2422f4k56j53l57O75J242o56j193O32P54o18j27L31n24L4Q79l15n87N10P43j093
$$ plain form
2442 -143 -698 -362 -477 -494 -23 -573 -297 1164 1651 -11 -364 812 561 -503 -720 -849 -709 689 869
2461 869 -766 -604 1008 595 -831 -829 -574 -269 718 757 -410 -27 1770 1062 -653 -565 -371 -559 92
2480 92 145 -1326 -906 1300 1238 -416 -20 863 429 273 147 -1164 -705 859 229 -1142 195 1323
2498 1323 -150 -795 192 -590 -997 178 160 -616 656 1751 152 -184 850 330 -770 -108 -550 -1621
2516 -1621 -76 1283 -457 -1045 1234 1358 -328 -390 -310 -765 418 1261 -734 -978 1300 1609 -593
2533 -593 -560 -46 -655 -49 620 -1063 -1444 1005 1491 -293 219 1323 250 -207 367 -810 -1564 423
2551 423 804 -999 -398 1076 188 -565 94 -206 -704 732 566 -1193 -225 1801 572 -827 440
2568 440 710 -541 -124 -38 -1476 -840 1186 191 -947 674 1289 -184 -12 421 -777 -366 1252 -136
$$ packed form
2442a43n55L36j15j7M71n50K76J461M87j662l53J176k51j064k17j29J40J398J80
2461H69j635J62J612m13j426KK55L05R87L9j167L83J797p08j715Q8J94j88O51
2480I2N3j471M20K206o2j654L96Q83m34j56j26j311M59J564o30j371J337J128
2498A323j473o45R87p82m07J175j8p76J272J095j599l36J034n20j100O62m42j071
2516a621J545J359j740n88K279J24j686o2Q0m55J183Q43j995k44K278L09k202
2533e93L3N14o09O06O69j683l81K449M86j784N12J104j073m57N74j177p54J987
2551D23L81j803O01J474q88p53O59l00m98J436j66j759R68K026j229j399J267
2568D40K70j251M17Q6j438O36K026r95j138J621O15j473J72M33j198M11J618j388
$$ plain form
2586 -136 -1851 -5 1245 -219 -637 137 -525 -384 917 -8 -1315 349 1307 -105 -264 1108 446
2603 446 -489 362 -202 -1275 74 699 -887 -807 815 392 -771 296 540 -377 337 897 -601 -929
2621 -929 787 891 -555 -232 252 -340 13 423 -986 -891 1016 908 -600 -64 953 -30 -113 387 -181
2640 -181 -373 684 115 -1368 -457 829 -65 -262 281 -309 -625 514 546 -504 114 1071 167 -368 195
2659 195 -90 -530 105 130 -754 -94 839 -298 -730 546 605 -337 -45 395 133 607 603 -575 -865 608
2679 608 536 -584 -454 -123 -402 169 685 -286 -476 573 654 -222 -88 419 167 89 130 -644 -473 497 303
2700 303 -792 -450 222 -9 -44 244 -199 -271 635 336 -475 308 835 -118 -251 124 -395 -720 -140 37
2720 37 -286 124 356 -391 -146 629 308 -173 198 154 -340 455 727 -649 -857 428 464 -373 -225 -338
$$ packed form
2586a36j715J846J250j464m18P74o62J41J301r25j307J664R58j412j59J372o62
2603D46r35Q51n64j073J349O25j586Q0J622m23j163J067K44r17P14N60j498l28
2621i29J716J04j446L23M84n92L53M10j409R5J907j08j508N36J017r83q3N00n68
2640a81j92J057n69j483R11J286q94j97N43n90l16J139L2j050O18R57r04n35N63
2659A95k85m40O35K5q84O60R33j137m32J276N9r42K92M40k62M74mj178k90J473
2679F08p2j120J30L31k79N71N16r71j90J049Q1q76J34N07k52p8M1p74J71R70j94
2700C03j095L42O72k31l5K88m43p2R06k99q11P83N27r53j33L75n19l25N80J77
2720C7l23M10K32p47K45P75l21m81L71m4m94P95K72j376k08J285L6q37J48j13
$$ plain form
2740 -338 -530 255 577 -384 -104 1019 531 -520 -47 70 -376 87 560 -856 -1015 376 383 -459 -140
2759 -140 196 -235 95 720 -188 -391 731 540 -507 -20 211 -504 10 506 -369 -1038 378 358 -559
2778 -559 83 449 -420 -281 1145 653 -440 58 130 -445 51 526 -612 -485 538 -59 -936 251 478
2797 478 -573 -11 990 -240 -662 1079 762 -601 -212 244 -254 85 414 -924 -1024 646 537 -715
2815 -715 -178 777 -104 207 928 -251 -1031 557 933 -664 -586 279 -343 -93 837 -31 -1319 -20 720
2834 720 -135 2 472 -451 -373 1117 538 -817 164 767 -622 -476 520 -484 -1043 452 663 -658
2852 -658 -183 858 274 108 610 -307 -673 657 519 -915 -484 725 -192 -551 431 -67 -1037 166
2870 166 805 -542 -509 800 352 -44 731 28 -923 101 814 -333 -715 -18 -596 -357 912 508 -851
$$ packed form
2740c38j92P85L22r61K80J123m88j051M73J17m46M63M73j416j59J391Pq42L19
2759a40L36m31L30O25r08k03J122j91j047M87K31p15N14M96q75o69J416k0r17
2778e59O42L66q69J39J426m92j093M98P2n75M96M75j138J27J023n97q77J187K27
2797D78j051N62J001j230m22J741l17j363L89M56m98L39L29j338j00J670j09j252
2815g15N37R55q81L11P21j179p80J588L76j597P8Q65o22K50R30q68j288J299P40
2834G20q55J37M70r23P8J490n79j355R81O03j389J46R96j004n59J495K11j321
2852f58M75J041n84j66N02r17l66J330j38j434M31J209r17l59R82m98r70J203
2870A66O39j347L3J309m48l96P75p03r51J024P13j147l82O97n78K39J269m04j359
$$ plain form
2889 -851 -337 914 205 -317 316 -297 -645 659 752 -638 -473 437 -55 -700 -57 -292 -707 551 695
2908 695 -493 -167 1309 401 -376 312 357 -528 -144 194 -797 -488 760 290 -604 -252 14 5 502 316
2928 316 -838 -526 1071 700 -438 -44 356 -193 -12 236 -646 -1049 1 52 -453 337 783 182 113
2947 113 686 -24 -281 157 -310 -650 207 461 -566 -401 523 182 -238 -203 -286 -751 102 682 -232 -162 651
2968 651 706 232 -75 -350 -352 175 -143 -1144 -694 721 623 -182 42 143 62 606 377 -843 -790 439 619
2989 619 15 -118 -172 -164 512 257 -841 -783 267 49 -379 388 637 162 474 631 -199 -302 93 -538 -858
3010 -858 3 296 -350 -242 332 138 269 389 -310 -706 286 637 -500 -304 687 618 344 344 -360 -823 126
3031 126 206 -994 -959 374 567 433 391 122 95 807 457 -1197 -984 357 69 -466 56 110 -96 649
$$ packed form
2889h51N14J251p09n22O33o13l48J304R3j390J65R10m92o45O43k35m15J258J44
2908F95j188L26J476r08p77O88M5q85L84L38r91L09J248m70q94L52K66rM97j86
2928C16j154L12J597l71j138L94M00n49J81K48q82m03J050N1n05P90M46o01o9
2947A13N73p10k57M38m67l40Q57K54j027J65R24l41m20L5q3m65Q53N80r14P0Q13
2968F51N5m74l07k75kN27l18j001M50J415r8q05K24J01q1N44k29j220N3J229J80
2989F19o04j33n4QO76k55j098N8J050k18m28P67K49m75L12J57q30j03L95o31l20
3010h58Q61K93o46J08N74j94J31J20o99l96R92L51j137J96R91o9k74%p04m63R49
3031A26Q0j200L5J333J93j34m2k69k7P12l50j654K13J341k88n35N22N4k06P45
$$ plain form
3051 649 576 -746 -845 378 169 -464 196 508 166 630 817 -430 -576 447 -125 -1190 -398 182 -273
3070 -273 52 460 -58 180 1061 214 -955 29 648 -549 -512 302 313 195 594 -176 -1055 142 604 -714
3090 -714 -895 323 377 68 478 200 -539 468 1149 -636 -1307 -36 224 -292 -3 -51 -575 646 1154
3109 1154 -423 -878 585 577 -802 -220 493 -119 102 727 -345 -823 588 272 -1056 -583 312 -157
3127 -157 -120 654 15 -263 909 733 -701 -368 593 -133 -515 88 -74 -314 679 462 -832 -279 819
3146 819 -62 -876 165 569 219 390 369 -688 -162 930 -143 -1178 -63 277 -499 -124 450 -411
3164 -411 -19 1056 289 -689 138 730 -304 -353 221 -167 -148 638 -163 -1098 -17 572 -489 -437 342 200
3184 200 -76 414 124 -318 619 749 -548 -747 356 36 -591 30 -7 -397 254 609 -315 -371 610 88
$$ packed form
3051F49p3j322r9J223k09o33O60L12l42M64J87j247j46J023n72j065P92N80m55
3070b73L25M08n18K38Q81q47j169R84O19j197L7Q14J1j18L99p70q79J197M62j318
3090g14j81J218N4l09M10k78p39J007O81j785o71J271K60n16K89m8n24J221N08
3109A154j577m55J463qj379N82P13o12K21O25j072m78J411l16j328M73Q95m69
3127a57L7P74o39k78J172j76j434L33R61p26l82O03j62k40R93k17j294N53J098
3146H19q81q14J041M04l50J71k1j057N26J092j073j035J115L40p76L75N74q61
3164d11L92J075p67r78Q27N92j034m9N74l88J9P86q01r35J081N89j061N2P79j42
3184B00k76M90k90m42R37J30j297j99J103l20o27O21l7l90O51L55r24n6R81n22
$$ plain form
3204 88 -424 -67 380 89 226 385 -641 -474 655 376 -913 -441 223 -83 42 97 -158 198 787 196
3224 196 -631 -20 441 -282 -523 22 -211 -166 355 67 -678 -115 369 -193 -243 268 203 27 300 141 -270
3245 -270 322 608 -439 -643 107 35 -337 -82 -56 -34 366 494 -284 -390 524 606 -170 -291 -76 -23 346
3266 346 123 -682 -661 435 133 -362 -86 139 -47 151 231 -324 -4 771 345 -522 -309 175 36 -11 -171
3287 -171 -538 -202 470 -61 -505 87 397 20 102 299 -142 -162 534 145 -424 94 119 -378 -240 156 -67
3308 -67 -417 235 54 -90 562 371 -683 -297 697 317 -290 -144 -396 -336 491 392 -895 -776 383 354
3328 354 -166 -85 -62 -221 413 417 -462 -267 675 180 -596 -78 115 -385 13 410 -388 -467 704 400 -507
3349 -507 152 594 -109 114 236 -324 -170 709 210 -686 -108 277 -500 -455 575 -193 -348 426 421 -182 395
$$ packed form
3204H8n12L57M47k91J37J59j026J67J129k79j289M72O64l06J25N5k55L56N89n91
3224A96q27O11M61p23k41N45k33M5N21k88p45N63M84n62n0N11o5j76K73j59m11
3245b70N92K86j047k04P50p2l72K55K6K2M00J28p78j06R14Q2p76j21K15N3L69
3266C46k23q05K1J096l02m95K76K25j86J98Q0n55L20P75m26q67K13M84j39m7j60
3287a71l67L36O72n31m44N92L10l77Q2J97m41k0O96l89n69N18K5m97J38L96k23
3308f7l50O52j81j44O52j91j054L86R94l80o07J46k52O0Q27r9j287J19J159k9
3328C54n20Q1K3j59O34Mq79J95R42m95p76N18J93n00L98L97p98p9J171l04r07
3349e07O59M42p03K23J22n60J54Q79m99q96N78L85p77M5J030p68j55P74no03N77
$$ plain form
3370 395 616 -334 -407 597 259 -518 -104 102 -659 27 500 -497 -735 488 537 -365 127 307 -317 262
3390 262 865 -157 -690 418 373 -444 -176 215 -518 -293 452 -28 -271 530 475 -474 2 714 -193 -361
3410 -361 325 -102 -686 289 685 -698 -553 330 71 -305 448 78 -624 336 769 -280 -278 438 12 -242
3430 -242 452 213 -911 -308 269 -314 -181 380 -38 -519 602 694 -420 -148 402 -89 -117 505 -95 -619
3450 -619 -106 406 -348 -244 179 -354 -291 548 300 -645 91 579 -165 -237 400 48 -412 -5 -85 -707 -112
3471 -112 275 -223 -182 326 79 -265 297 386 -571 -93 604 -40 -345 152 101 -331 188 82 -646 -425 276
3492 276 37 -154 219 -18 -180 483 627 -216 -263 230 -130 -289 60 -64 -693 13 567 -34 -140 266
3512 266 71 -281 175 108 -223 190 276 41 23 299 -215 -414 35 -175 -730 -356 132 -157 -89 309 369 41
$$ packed form
3370C95K21r50p3J004l38p77M14K06p61O86M73r97k38J223M9r02M92J80o24N79
3390B62O03j022n33J108m5q17K68L91p33K25P45m80k43Q01n5r49M76P12r07j68
3410c61O86m27n84R75L96j383J45Q83k59l76P53l70p02R60M33j049KP16m26k54
3430b42O94k39j124O03N77n83J33N61m18m81J121R2j114K72N50m91k8O22o00n24
3450f19N13N12p54J04M23n33O3Q39k48r45P36M88p44p2O37l52m60M07q0o22N95
3471a12L87m98M1N08k47l44N62Q9r57M78O97o44l05M97n1m32N19j06p28K21P01
3492B76k39j91L73k37j62O63J44q43m7M93l60j59L49j24o29P06N54o01j06M06
3512B66j95l52M56o7l31M13Q6k35j8K76n14j99M49k10n55L74M88k89O8L98O0l28
$$ plain form
3534 41 494 237 -252 -198 173 -179 -251 83 -209 -140 264 183 -426 -344 284 6 -224 71 -111 -158 610 715
3556 715 -173 -420 -9 6 -372 -204 -562 -445 351 473 -61 -213 317 128 -42 374 8 -527 156 328
3576 328 -85 -152 144 -73 -201 222 -130 -562 -144 222 -261 134 488 74 -31 632 329 -400 -282 -50
3596 -50 -276 -156 149 -98 -300 561 360 -393 -37 293 -65 -107 304 -148 -393 490 547 -440 -278 275 -169
3617 -169 -426 -92 -351 -631 394 556 -199 69 762 102 -167 263 -87 -504 109 191 -657 -365 501 104
3637 104 -214 205 193 -670 -153 327 -255 -121 603 230 -334 399 307 -500 -331 220 -355 -471 325 157 -480
3658 -480 337 571 -222 -284 592 172 -364 386 -44 -605 406 583 -503 -509 471 1 -497 -30 74 -424
3678 -424 310 864 -92 -231 653 417 -417 -3 -126 -515 16 482 -520 -556 293 387 -289 95 339 -373
$$ packed form
3534D1M53k57m89N4L71l52p2L34k92O9M04q1o09Q2O28k78k30K95j82m7P68J05
3556G15q88k47M11J5l78J68l58J17P96J22n34j52N30j89j70M16l66n35O83J72
3576C28m13o7K96k17j28M23l52m32M18L66m83L95L54m14j05O63l03p29J18K32
3596e0k26J20L05k47k02Q61k01p53L56L30l58m2M11m52k45Q83N7r87J62N53m44
3617a69k57L34k59k80J025J62p55K68O93o60k69M30l50m17O13Q2q48K92Q66l97
3637A04l18M19j2q63N17M80n82J34P24l73n64P33r2q07J69N51n75j16P96j68o37
3658d80Q17K34p93o2Q76m20n36P50m30n61J011J77j086oR80m70m98M67J04m98
3678d24P34N54r56j39Q84k36q34M14j23l89N31M66j002l6Q49R4o76L84K44p12
$$ plain form
3698 -373 -87 437 -237 -428 426 395 -419 -56 356 -446 -406 305 -302 -601 206 298 -309 128 643 -1 -202
3719 -202 355 47 -511 59 -25 -549 -171 601 -16 -497 342 226 -353 51 124 -320 14 753 85 -310 444
3740 444 498 -291 -129 -1 -518 -382 293 -129 -376 304 460 -294 -140 442 -223 -131 426 -152 -453 201 442
3761 442 -297 -209 125 -58 -235 149 -144 -426 164 369 -248 -36 540 232 116 320 -7 -344 9 103 -216
3782 -216 -295 272 -89 -369 204 265 -130 -71 55 -207 -34 448 67 -435 95 209 -143 -28 -23 -506 -293 142
3804 142 -53 -143 278 320 -88 5 333 48 15 256 -150 -481 -42 88 -374 -179 201 -64 -51 264 -82 -326
3826 -326 211 409 -70 -42 354 122 10 33 -258 -382 28 124 -374 -14 163 -193 -217 234 191 -3 156 330
3848 330 -199 -57 415 -3 -356 -78 -15 -232 5 -51 -446 -64 414 81 -288 230 163 -126 281 312 -336
$$ packed form
3698c73K86N24o74j91Q54l1q14L63M12q02M0P11o07k99Q07R2o07M37N15o44k01
3719b02N57l08n58N70q4n24L78P72o17m81Q39j16n79M04P3m44L34P39o68l95P54
3740D44N4p89J62J28n17J36O75m22k47O80J56p54J54N82o65R2N57n78l01O54K41
3761D42p39Q8L34j83j77L84k93k82N90K05o17K12N76l08j16K04l27l37L53R4l19
3782b16p9N67l61k80N73O1l95N9J26k62J73M82l81n02N30J14l52J15Nm83K13M35
3804A42j95r0M21M2m08R3L28k85l3K41m06l31M39J30m62J95L80k65J3L15l46k44
3826c26N37J98m79K8L96k32j12K3k91j24M10R6m98L60J77l56k4M51m3j94J59J74
3848C30n29J42M72m18l53K78O3k17K37n6l95L82M78l33l69N18o7k89M07L1o48
$$ plain form
3869 -336 -241 337 11 -469 -76 32 -394 40 364 -30 -60 275 -79 -155 458 433 -233 -89 254 -110 -176 103
3891 103 -176 -513 -28 214 -272 -99 306 16 -166 186 229 -208 214 369 -318 -107 446 -154 -594 102
3911 102 184 -370 -57 113 -237 -164 640 195 -405 86 348 -174 19 393 -362 -424 240 -7 -421 115 190
3932 190 -422 -47 508 -27 -264 290 261 -234 286 501 -349 -369 203 -128 -357 63 -96 -461 -28 495 -368
3953 -368 -312 457 157 -207 293 216 -449 -73 346 49 -362 226 13 -396 29 236 -263 -67 326 -42 -196
3974 -196 467 317 -457 16 340 -227 -159 291 -295 -664 168 219 -488 -178 286 -102 -114 542 90 -440 229
3995 229 433 -241 29 183 -209 -424 410 143 -520 -90 137 -276 132 398 1 -290 388 471 -143 -17
4015 -17 231 -243 -93 331 -219 -503 173 88 -390 -103 402 48 -159 391 108 -210 265 348 -395 -194 170
$$ packed form
3869c36R5N78l26m80L93J08m26M34L24l94l0L35l54p6O13k5o66J44L43l64o6K79
3891A03k79l37M85K42m86J73M05k90j82L52M3m37M22J55o87K11N53o00m40O96
3911A02Q2n54L13J70l50P3Q04m45o00M91K62n22J93L74p55o2O64k47m14N36P5
3932A90o12L75N55n35k37N54k9m95N20K15q50k0N72l31k29M20j59l65M33N23q63
3953c68N6P69l00l64N00p7o65L76M19k97m11N88k13m09M25K07m99J96L93l68j54
3974a96O63j50p74M73L24n67O8M50n86l69Q32N1p07L10M64l88j2O56m52n30O69
3995B29K04o74K70J54l92k15Q34k67o63M30K27m13M08K66l97k91O78Q3o14J26
4015a7K48m74J50M24n50k84O76q5m78K87N05l54k07N50k83l18M75Q3p43K01L64
$$ plain form
4036 170 -77 -328 154 31 -509 50 248 -370 -209 231 69 8 434 196 -296 -44 377 -134 -121 141 -316
4057 -316 -330 273 225 -211 -182 219 65 92 409 -245 -158 312 391 -103 -153 123 -145 -134 21 -147 -422 81 189
4080 189 -100 66 267 96 174 373 154 -364 104 59 -201 -152 148 -49 -253 102 10 -146 205 177 -286 -97
4102 -97 196 -48 -81 329 115 -158 82 88 -160 -180 138 -318 -251 185 51 -122 181 288 -112 -90 253 -151
4124 -151 -148 178 32 -306 -20 63 -52 39 203 -228 -442 94 86 -149 92 343 46 -35 281 -153 -183 47 102
4147 102 -399 -251 87 -152 6 241 72 -203 278 290 -252 -32 143 -146 -8 429 -33 -228 245 251 -308
4168 -308 -292 19 -226 -178 331 6 -331 397 427 -90 -57 120 -222 -283 245 3 -532 -41 286 -122 -143 221
4190 221 -9 -136 278 83 -453 -70 467 -37 -157 297 80 -314 108 229 -615 -335 179 6 -230 494
$$ packed form
4036A70k47k51M82j23n40N59J98o18J61M40j62o1M26k38m92K52M21n11J3K62m57
4057c16j4O03m8m36K9M01j54K7L17o54Q7M70P9m94n0K76k68J1J55j68k75N03J08
4080A89k89J66K01j71P8J99k19n18M68m5k60M9L00j97k04L55r2j56L51k8m63J89
4102i7K93k44l3M10k14k73K40Ok48k0L18m56O7M36j34j73L03J07m00K2L43m04
4124a51LL26j46l38K86Q3j15R1J64m31k14N36qk35K41K51k97q1L16m34l0K30N5
4147A02n01J48L38k39J58K35j69k75M81J2n42K20J75k89J38M37m62j95M73On59
4168c08J6L11k45M8N09l25l37P28L0n17L3J77l42o1N28k42n35M91L27m08k1L64
4190B21k30j27M14j95n36L83N37n04j20M54k17l94M22J21q44K80N14j73k36P24
$$ plain form
4210 494 132 -114 323 290 -269 -143 346 -80 -310 139 56 -272 144 393 -244 -143 174 -158 -463 398 169
4231 169 -239 88 464 68 -157 214 -113 -326 -121 -39 -414 -80 471 125 -172 284 166 -60 320 416 -368
4252 -368 -212 499 110 -254 268 151 -171 38 108 -520 -291 201 130 -133 255 171 29 229 425 -182 -372
4273 -372 191 -13 -373 -180 57 -160 60 269 -88 -139 148 98 -448 32 511 -141 -97 197 -35 -124 280
4294 280 3 -384 -137 188 -229 -268 212 284 147 421 382 -263 51 192 -219 -388 107 34 -276 -9 199
4315 199 -283 -35 137 -136 -149 249 203 -298 35 286 -6 96 348 -148 -327 25 -4 -420 -166 57 -136
4336 -136 -34 254 47 40 289 135 -310 -21 206 -63 -6 135 -18 -85 148 -28 -374 -44 192 61 -145
4357 -145 171 138 77 392 293 -193 -42 257 -30 -177 28 -52 -254 -64 98 -185 30 118 -137 -72 178 154
$$ packed form
4210D94l62k46M37l3n59J26M89m26k30M49q3l28M16K49o37J01L17l32l05Q61k29
4231A69m08L27L76l96k25L71l27k13K05Q2l75L34N51l46k97M56j18k26L80R6p84
4252c68J56P11l89l64N22j17l22K09P0o28K29M92p1k63L88q4j42K00J96o07j90
4273c72N63k04l60J93K37k17K20K09l57n1K87n0n46M80M79o52M4K94k32q9M04
4294B80k77l87K47L25m17l9M80P2j37K74l9o45L14J41m11j69M95p3l10K67K08
4315A99m82K48J72k73j3L98m6n01L33K51k92J02K52m96j79L52k9m16K54K23j93
4336a36J02K88k07pK49j54m45K89K27k69N7J41j53o7K33j76l46L30K36j31k06
4357a45L16l3o1L15r9m86J51K99k87j47K05q0k02J90J62k83K15Q8k55O5K50k4
$$ plain form
4379 154 -73 -127 -56 -89 22 107 -164 -265 217 115 -381 -149 91 -60 76 247 -109 -83 365 301 5 -89
4401 -89 59 -143 29 167 -175 -261 -69 15 -105 149 202 -11 -130 88 47 -89 172 93 -210 79 47 -271
4423 -271 -260 -25 -116 -138 271 20 -207 161 446 -9 -142 124 183 -128 -32 92 -329 -89 106 -313 -376 225
4445 225 183 -174 70 117 -133 224 296 -126 -370 204 281 -161 -89 95 -243 -68 233 0 -239 102 139 -307
4467 -307 105 303 -74 -92 303 68 -219 82 154 -360 -108 202 -240 -296 76 -6 -99 103 217 -292 -106 610
4489 610 94 -150 106 187 -302 165 206 -382 -285 289 43 -321 172 151 -171 60 412 75 -182 254 -64
4510 -64 -286 28 236 -327 -58 238 -252 -266 144 -20 -207 125 376 -344 -102 292 77 -183 288 114 -403
4531 -403 -14 92 -341 -265 144 22 -210 77 232 36 197 154 -167 -116 496 284 -267 -38 113 -214 -107
$$ packed form
4379A54k27n4P1l3J11Q5k71j01M82j02m96K32K40j51J36J71l56K6M48o4k96r4
4401h9J48k02J72J38l42q6J92Q4j20K54N3k13j19K18m1j36K61p9l03K89l2l18
4423b71J1K35r1k2M09k51k27L68K85m55j33K66N9l11R6J24m21K40J95m19o3O01
4445B25m2l57K44M7k50L57P2m22k44N74P7m42P2J84l38J75L01k33k39L41L7m46
4467c07M12J98l77j8L95k35k87L01P2n14K52L10m42n6L72q2r3K02J14n09J86P16
4489F10n16k44K56Q1m89M67M1n88R7N74k46l64M93k1l22K31L52l37k57M36l18
4510f4k22L14K08n63K69K96m90j4M10j64j87L32K51p20K42L94k15k60M71j74n17
4531d03L89J06m33P6M09j22k32K87J55j96J61m3l21N1O12k12n51K29J51l27J07
$$ plain form
4552 -107 279 -150 -269 306 235 -273 -31 137 -82 125 293 39 -258 150 60 -242 27 108 -264 -422 153
4573 153 78 -200 108 63 -111 185 337 -1 -181 162 113 -140 53 88 -262 -119 106 -89 -281 130 64 -227
4595 -227 60 164 -83 88 175 -1 -219 151 92 -253 -103 150 -94 -77 -99 -101 -154 197 282 -101 -148 126 -22
4618 -22 24 150 -43 -123 -36 15 -158 -159 110 -142 -75 196 -66 -158 105 139 -132 107 257 -71 -26 161 125 -139
4642 -139 -88 46 -140 -109 104 -25 -104 165 113 -57 146 97 -16 82 7 -77 -67 187 93 -271 -103 -8 -153 52
4666 52 12 -107 -94 245 202 -11 168 117 36 -62 209 -169 -297 103 112 -173 -74 66 -94 22 170 -59 -101 162
4690 162 219 -58 133 99 -91 -114 141 -82 -247 60 -131 -247 25 42 -193 -107 154 188 -178 41 116 -219
4712 -219 -137 195 -122 -194 180 100 -249 -130 48 -232 13 273 -111 -87 281 130 -74 138 245 -150 -172 33
$$ packed form
4552a07L86m29j19N75p1n08K42J68k19K07J68k54k97M08r0l02K69Q1l72j58N75
4573A53p5k78L08m5j74K96J52l38j80L43m9k53J93L5l50J43K25j95j92M11o6k91
4595b27K87J04k47J71Q7j76k18L70n9l45J50K53k44J7k2kn3L51Q5l83m7K74j48
4618b2M6J26j93q0Q7N1j73jK69k52O7K71k62r2K63L4k71K39J50l28M5J87l6k64
4642a39N1J34j86L1K13j29p9K69n2j70K03m9j13R8p5q4J0K54r4l64J68R5j45K05
4666E2m0j19J3L39m3k13J79n1q1r8K71l78j28M00Rk85R9J40j60J16J48k29m2K63
4690A62N7k77J91l4j90k3K55k23j65L07j91j16K72J7k35Q6K61L4l66K19P5l35
4712b19Q2L32l17p2L74q0l49J19J78k80K45K60l84K4L68j51k04K12J07l95k2K05
$$ plain form
4734 33 -209 -330 83 145 -170 79 264 -149 -50 234 44 -188 71 188 -237 -142 181 -15 -183 201 -97
4755 -97 -429 -36 33 -331 -115 311 -26 -208 398 123 -215 -117 149 -137 -230 221 -227 -187 225 -35 -189 -13
4777 -13 342 -5 -248 315 102 -155 227 171 -229 65 243 -76 -373 -9 -40 -377 0 158 -403 -41 500
4798 500 87 -279 145 167 -183 60 66 -176 -180 291 86 -158 69 13 -211 -36 212 -186 -192 297 208 -98 248
4821 248 223 -146 -196 178 -169 -375 82 131 -200 1 215 -169 -21 376 -15 -269 24 50 -138 79 42 -170
4843 -170 -130 210 -4 -383 -148 -104 -270 -2 109 -189 31 322 141 -150 -126 -39 -169 -3 157 -283 -194 181
4865 181 66 -128 47 95 -91 76 149 -179 -176 39 174 -37 84 64 -124 -100 74 23 -157 -122 13 -114 35
4888 35 178 -107 -46 154 18 -140 50 -16 -175 74 36 -201 -219 83 39 -132 79 63 -199 -65 69 -28 -37
$$ packed form
4734C3k42j21M13O2l15K49J85m13R9K84j90k32K59J17m25R5L23j96j68L84k98
4755i7l32L93O9l64K16M26l37j82O06k75l38R8K66k86r3M51m48M0M12k60j54J76
4777a3L55l47k43N63k13k57L82n6m00K94J78l19k97L64l1l37L77J58n61L62N41
4798E00m13l66M24K2l50K43Ok42mM71k05k44K27n6k24J75K48l98oM89q9l06L46
4821B48k5l69n0L74l47k06M57M9l31K01K14l84J48L97l91k54K93K6j88K17l7k12
4843a70M0L40k14l79K35M4j66K68J11k98K20K91j81k91K4Q7j30J66J60m40Q9L75
4865A81j15j94J75M8j86J67P3l28LK15J35k11J21k0j88K4J74n1j80L5J35j27J49
4888C5J43k85O1K00j36j58J90o6j59K49l8k37j8L02m4j71K11j6k62J34J34r7r
$$ plain form
4911 -37 251 125 -70 -102 -92 -175 -61 39 -200 13 75 -42 -82 65 205 -92 38 23 -44 -68 212 -32 -123
4934 -123 -24 259 -160 -173 -5 -68 -154 0 61 -162 198 87 141 66 161 0 -70 97 -53 -224 0 40 -36 -57
4958 -57 167 -66 -197 124 218 -117 198 187 -74 -16 177 -19 -118 85 -103 -122 -175 22 -160 -111 129 59 -86
4981 -86 178 236 -157 94 372 0 -103 156 6 -228 28 118 -73 -12 200 -66 -99 146 60 -122 59 237
5003 237 13 -10 170 2 -56 71 -20 -285 -23 39 -133 -145 313 212 -100 217 70 -59 173 292 -52 -214
5025 -214 171 164 -125 -59 43 -231 -54 292 -43 -133 55 21 -26 117 183 -90 -2 165 -117 -277 111 21 -331
5048 -331 -31 146 -173 -152 71 -36 -130 174 179 -170 -23 230 -44 -84 126 -8 -231 59 140 -323 11 192
5070 192 44 -11 235 227 -13 164 210 -153 39 181 -108 -271 92 99 -257 -3 22 -222 -32 168 -29 -58 127
$$ packed form
4911c7K88j26j95l2J0q3J14J00k39K13O2j17m0J47J40k97J30j5o7k4K80k44r1
4934a23R9K83m19j3J68o3q6J54O1k23L60j11N4p5R5j61p0J67j50j71K24M0p6k1
4958e7K24k33j31L21R4l35L15j1k61N8J93j96r9K03j88j9n3J97j82M9K40p0j45
4981h6K64N8l93K51K78l72j03K59j50k34K56R0j91O1K12k66l3K45q6j82J81J78
5003B37k24k3J80j68n8J27r1k65K62O2j72j2M58j01l12L17j47j29K32J19l44j62
5025b14L85pk89O6J02k74J77L46l35r0J88l4m7J43O6k73Q8J67k82j60L88r0l52
5048c31L00J77l19K1K23j07r4L04Nl49J47K53k74m0K10j34k23K90Q1m63L34J81
5070A92j48n5K46qk40J77M6l63J92J42k89j63L63Pl56K54K5k44J90K00j97k9J85
$$ [...]
16383E6
##END NTUPLES=NMR FID
##END=
