##TITLE=abcd
##JCAMPDX= 6.0         $$ Bruker NMR JCAMP-DX V2.0
##DATA TYPE= NMR FID
##DATA CLASS= NTUPLES
##ORIGIN= UXNMR, Bruker Analytische Messtechnik GmbH
##OWNER= root
$$ XWIN-NMR		Version 3.5
$$ Thu Jul 24 11:34:34 2025 Russian Standard Time (UT+4h)  servis@DPX200
##.OBSERVE FREQUENCY= 200.131235884673
##.OBSERVE NUCLEUS= ^1H
##.DELAY= (6, 6)
##.ACQUISITION MODE= SIMULTANEOUS
##.ACQUISITION SCHEME= undefined
##.AVERAGES= 32
##.DIGITISER RES= 18
##SPECTROMETER/DATA SYSTEM= spect
##.PULSE SEQUENCE= zg
##.SOLVENT NAME= D2O
##.SHIFT REFERENCE= (INTERNAL, D2O, 0, 16.5164)
##AUDIT TRAIL= $$ (NUMBER, WHEN, WHO, WHERE, WHAT)
$$ ##TITLE= Audit trail, XWIN-NMR		Version 3.5
$$ ##JCAMPDX= 5.01
$$ ##ORIGIN= Bruker BioSpin GmbH
$$ ##OWNER= servis
$$ F:\spectra/data/av/nmr/H1/1/audita.txt
$$ ##AUDIT TRAIL=  $$ (NUMBER, WHEN, WHO, WHERE, WHAT)
(   1,<2025-07-24 11:30:24.78 +0400>,<servis>,<DPX200>,
      <created by zg, POWCHK disabled, PULCHK disabled
       configuration hash MD5:
       00 E9 B6 7A A2 85 ED C7 34 08 36 98 17 FE 4E 26
       data hash MD5: 32K
       12 CB 83 B4 40 49 03 DB D3 3F B0 06 AC 27 13 7B>)
$$ ##END=
$$ 
$$ hash MD5
$$ 4F A7 E3 9A 36 9B 1A 9A 3D 2C FB FF 17 62 F6 E8
##$RELAX= 
##$RELAX= 
##$RELAX= 
##$RELAX= 
##$RELAX= 
##$RELAX= 
##$RELAX= 
##$RELAX= 
$$ Bruker specific parameters
$$ --------------------------
##$DU= <F:\spectra>
##$EXPNO= 1
##$NAME= <H1>
##$PROCNO= 1
##$TYPE= <nmr>
##$USER= <av>
##$AMP= (0..31)
100 100 100 100 100 100 100 100 100 100 100 100 100 100 100 100 100 100 
100 100 100 100 100 100 100 100 100 100 100 100 100 100 
##$AQSEQ= 0
##$AQ_mod= 1
##$AUNM= <au_zg>
##$AUTOPOS= <>
##$BF1= 200.13
##$BF2= 200.13
##$BF3= 200.13
##$BF4= 200.13
##$BF5= 500.13
##$BF6= 500.13
##$BF7= 500.13
##$BF8= 500.13
##$BYTORDA= 1
##$CFDGTYP= 0
##$CFRGTYP= 5
##$CHEMSTR= <none>
##$CNST= (0..31)
1 1 145 1 1 1 1 1 1 1 1 1 1 1 1 1 1 1 1 1 1 1 1 1 1 1 1 1 1 1 1 1 
##$CPDPRG= <>
##$CPDPRG1= <>
##$CPDPRG2= <>
##$CPDPRG3= <>
##$CPDPRG4= <mlev>
##$CPDPRG5= <mlev>
##$CPDPRG6= <mlev>
##$CPDPRG7= <mlev>
##$CPDPRG8= <mlev>
##$CPDPRGB= <>
##$CPDPRGT= <>
##$D= (0..31)
0 2 0 0 0 0 0 0 0 0.06 0 0 0 0 0 0 0.0002 0 0 0 0 0 0 0 0 0 0 0 0 0 0 
0 
##$DATE= 1753342224
##$DBL= (0..7)
120 120 120 120 120 120 120 120 
##$DBP= (0..7)
150 150 150 150 150 150 150 150 
##$DBP07= 0
##$DBPNAM0= <>
##$DBPNAM1= <>
##$DBPNAM2= <>
##$DBPNAM3= <>
##$DBPNAM4= <>
##$DBPNAM5= <>
##$DBPNAM6= <>
##$DBPNAM7= <>
##$DBPOAL= (0..7)
0.5 0.5 0.5 0.5 0.5 0.5 0.5 0.5 
##$DBPOFFS= (0..7)
0 0 0 0 0 0 0 0 
##$DE= 6
##$DECBNUC= <off>
##$DECIM= 32
##$DECNUC= <off>
##$DECSTAT= 4
##$DIGMOD= 1
##$DIGTYP= 9
##$DL= (0..7)
0 120 120 120 120 120 120 120 
##$DP= (0..7)
150 150 150 150 150 150 150 150 
##$DP07= 0
##$DPNAME0= <>
##$DPNAME1= <>
##$DPNAME2= <>
##$DPNAME3= <>
##$DPNAME4= <>
##$DPNAME5= <>
##$DPNAME6= <>
##$DPNAME7= <>
##$DPOAL= (0..7)
0.5 0.5 0.5 0.5 0.5 0.5 0.5 0.5 
##$DPOFFS= (0..7)
0 0 0 0 0 0 0 0 
##$DQDMODE= 0
##$DR= 18
##$DS= 0
##$DSLIST= <SSSSSSSSSSSSSSS>
##$DSPFIRM= 0
$$ [...]
##$SUBNAM0= <"">
##$SUBNAM1= <"">
##$SUBNAM2= <"">
##$SUBNAM3= <"">
##$SUBNAM4= <"">
##$SUBNAM5= <"">
##$SUBNAM6= <"">
##$SUBNAM7= <"">
##$SUBNAM8= <"">
##$SUBNAM9= <"">
##$SW= 20.6817932712277
##$SWIBOX= (0..15)
0 0 3 0 0 0 0 0 0 0 0 0 0 0 0 0 
##$SW_h= 4139.07284768212
##$TD= 32768
##$TD0= 1
##$TE= 0
##$TE2= 300
##$TE3= 300
##$TEG= 300
##$TL= (0..7)
0 120 120 120 120 120 120 120 
##$TP= (0..7)
150 150 150 150 150 150 150 150 
##$TP07= 0
##$TPNAME0= <>
##$TPNAME1= <>
##$TPNAME2= <>
##$TPNAME3= <>
##$TPNAME4= <>
##$TPNAME5= <>
##$TPNAME6= <>
##$TPNAME7= <>
##$TPOAL= (0..7)
0.5 0.5 0.5 0.5 0.5 0.5 0.5 0.5 
##$TPOFFS= (0..7)
0 0 0 0 0 0 0 0 
##$TUNHIN= 0
##$TUNHOUT= 0
##$TUNXOUT= 0
##$USERA1= <user>
##$USERA2= <user>
##$USERA3= <user>
##$USERA4= <user>
##$USERA5= <user>
##$V9= 5
##$VALIST= <valist>
##$VCLIST= <CCCCCCCCCCCCCCC>
##$VD= 0
##$VDLIST= <DDDDDDDDDDDDDDD>
##$VPLIST= <PPPPPPPPPPPPPPP>
##$VTLIST= <TTTTTTTTTTTTTTT>
##$WBST= 1024
##$WBSW= 30
##$XGAIN= (0..3)
0 0 0 0 
##$XL= 0
##$YL= 0
##$YMAX_a= 435832
##$YMIN_a= -360648
##$ZGOPTNS= <>
##$ZL1= 120
##$ZL2= 120
##$ZL3= 120
##$ZL4= 120
##$ABSF1= 10
##$ABSF2= 0
##$ABSG= 5
##$ABSL= 3
##$ALPHA= 0
##$AQORDER= 0
##$ASSFAC= 0
##$ASSFACI= 0
##$ASSFACX= 0
##$ASSWID= 0
##$AUNMP= <proc_1d>
##$AZFE= 0.1
##$AZFW= 0.1
##$BCFW= 1
##$BC_mod= 2
##$BYTORDP= 0
##$COROFFS= 0
##$CY= 19
##$DATMOD= 1
##$DC= 2
##$DFILT= <>
##$DTYPP= 0
##$F1P= 11.0000007629395
##$F2P= -0.999999237060547
##$FCOR= 0.5
##$FTSIZE= 0
##$FT_mod= 4
##$GAMMA= 1
##$GB= 1
##$INTBC= 1
##$INTSCL= 1
##$ISEN= 128
##$LB= 0.05
##$LEV0= 0
##$LPBIN= 0
##$MAXI= 10000
##$MC2= 0
##$MEAN= 0
##$ME_mod= 0
##$MI= 0
##$NCOEF= 0
##$NC_proc= 0
##$NLEV= 6
##$NOISF1= 0
##$NOISF2= 0
##$NSP= 1
##$NTH_PI= 0
##$NZP= 0
##$OFFSET= 16.51637
##$PC= 1
##$PHC0= -199.5608
##$PHC1= 4.101552
##$PH_mod= 0
##$PKNL= yes
##$PPARMOD= 0
##$PSCAL= 4
##$PSIGN= 0
##$REVERSE= no
##$SF= 200.13
##$SI= 16384
##$SIGF1= 0
##$SIGF2= 0
##$SINO= 400
##$SIOLD= 16384
##$SREGLST= <1H.CDCl3>
##$SSB= 0
##$STSI= 0
##$STSR= 0
##$SW_p= 4139.07284768211
##$SYMM= 0
##$S_DEV= 0
##$TDeff= 0
##$TDoff= 0
##$TI= <>
##$TILT= no
##$TM1= 0
##$TM2= 0
##$TOPLEV= 0
##$USERP1= <user>
##$USERP2= <user>
##$USERP3= <user>
##$USERP4= <user>
##$USERP5= <user>
##$WDW= 1
##$XDIM= 8192
##$YMAX_p= 0
##$YMIN_p= 0
$$ End of Bruker specific parameters
$$ ---------------------------------
##NTUPLES= NMR FID
##VAR_NAME=  TIME,          FID/REAL,        FID/IMAG
##SYMBOL=    X,             R,               I
##VAR_TYPE=  INDEPENDENT,   DEPENDENT,       DEPENDENT
##VAR_FORM=  AFFN,          ASDF,            ASDF
##VAR_DIM=   16384,         16384,           16384
##UNITS=     SECONDS,       ARBITRARY UNITS, ARBITRARY UNITS
##FACTOR=    0.0002416,     1,               1
##FIRST=     0,             0,               0
##LAST=      3.9581328,     0,               0
##MIN=       0,             -360648,         0
##MAX=       3.9581328,     435832,          0
$$ Real data points
##PAGE= N=1
##DATA TABLE= (X++(R..R)), XYDATA
$$ [...]
8836f46J14J93K55K63K69J94K5r2j96k65k81k35k09p4P1J90K39K96K29K29R3l9
8858F23j56k58k73k73k09j02J0J29K37K69K82K12J34J4j13k05k51l01k56j21k0
8879f28Q6J59L11K88K41J31L4m3j87k49k90k66j64o0P0J32K61K52K97J85J00o3
8901E97j45k35k48l03k14r4J2J41K24K44K91K22J68j0j33k10k72k44k65j42k8
8922f44J29K03K33K87K52J45M2o1j95k44l02k40j64j01O1J70K59K52L03J54Q5
8943F24l1j13k62k73k71k06q5RJ18K36K62K80K13J12pp8j96k79k98k20j34j3O7
8966e45K03K50K98K60J15K7o7j68k26k67k46j94o4Q2J49K17K75K63J86J02q0j43
8988D27k32k48k61k04j31M2J47K11K58K48K39J21Jr7k28k53k87k19j27l2R1K14
$$ plain form
8836 -646 -532 -339 -84 179 448 642 667 575 379 114 -167 -402 -611 -685 -614 -424 -185 111 340 569 662 623
8858 623 467 209 -64 -337 -546 -648 -638 -509 -272 -3 279 491 625 639 526 321 70 -231 -487 -608 -628
8879 -628 -542 -383 -72 216 457 588 622 579 392 143 -147 -413 -577 -637 -567 -435 -174 78 375 560 660 597
8901 597 452 217 -31 -334 -548 -642 -630 -489 -265 -21 270 492 660 650 517 307 35 -209 -474 -616 -644
8922 -644 -515 -312 -79 208 460 605 647 586 391 147 -155 -395 -559 -660 -599 -429 -170 82 385 539 624
8943 624 593 480 218 -55 -326 -532 -617 -608 -490 -254 8 288 501 613 606 528 332 53 -245 -465 -599 -612 -545
8966 -545 -342 -92 206 466 581 608 541 373 147 -120 -366 -560 -624 -542 -393 -176 99 362 548 650 570 427
8988 427 195 -53 -314 -518 -649 -607 -460 -249 9 257 496 617 618 521 293 40 -247 -466 -593 -625 -534 -320
9010c20K50K48K34J72N0p1j86k56k84k45j45o9L9J82K46K95K39J39J02j2j37k56
9032B15k50k97j79j05M2R3K22K67K72K07R6Nj03j93k51k87k51j00oJ02J75K51
9054g5K45K55J42M8r1j76k22k64k43j95l6O9J52K40K52K23K31P1n5j55k06k55
9076d5k42j91j22j9J58K37K35K39J92J47K2j29j87k82k47k11j36k5M6K00K97K70
9098B07K11J55jk9j62k81k93k11j28n7M1J46K35K79K45J88M8k5j08k29k99k40
9120c08k03o6L6R4J80K85K75J89J02%j10j81k50k66k37j26rR8J93K28K71K29J55
9143E79J6q8j83k13k41k49j58p4Q7J52K20K74J92J99J02n2j49k25k35k31j79j36
9165e92K1J47K14K48K63J58J17K6r3k37k62k69j83j25j3P7J94K33K67K41J09K3
$$ plain form
9010 -320 -70 178 412 584 634 563 377 121 -163 -408 -553 -622 -583 -401 -155 140 379 518 620 608 471 215
9032 215 -35 -332 -511 -616 -574 -481 -259 8 280 487 583 588 485 292 41 -246 -497 -597 -603 -501 -326 -75
9054 -75 170 425 567 615 524 348 126 -138 -381 -576 -612 -543 -391 -151 101 324 555 626 571 416 210 -45
9076 -45 -287 -478 -600 -619 -461 -224 11 250 442 589 611 482 295 13 -234 -445 -581 -606 -560 -360 -63 207
9098 207 418 573 572 543 381 100 -193 -404 -532 -589 -548 -402 -167 112 357 545 593 568 460 231 -68 -308
9120 -308 -511 -577 -541 -447 -267 18 293 482 584 584 474 293 43 -223 -460 -586 -595 -497 -304 -76 195 424 579
9143 579 595 507 324 111 -130 -379 -537 -611 -524 -372 -152 122 314 513 615 563 414 189 -46 -277 -456 -592
9165 -592 -571 -424 -210 38 301 459 576 602 509 272 10 -259 -442 -567 -580 -503 -309 -76 191 432 541 564
9187E64m0j71k41k87k23j21m7L2J54K19K89K23J60M6j0j43j96k77k28k11p4M8
9209e34J05K12K15K76K27R7m9j08j81k06k86k15j45J4J01K01K23K35K30J32N6
9230F00r2j70k46k20k39j67r3O8J92K38K37K02J91P9k1j46k51k21k24j86r8j8
9252e85J20K53K56K27J93R1K2r5k17k72k47j77j10j0P2J73K55K52K12J13M0n8
9274E08j61k44k71k28j15n8O5J30K19K76K13J74N7m4j38j90k51k50j88o8K5J33
9296d06J66K53K39K36J03k8r5k14k33k19k25j30k2J38J81K18K34J99J53K4p6j88
9318C08k12k23k23j73m9P0J29K74K08K23J33J08j8j53k43k69j95j54q9JJ23K01
9340b23K59K40J87O9J4q7j79k76k45j94r5j1Q1J62K46K40K27J35mn6j27k46k39
$$ plain form
9187 564 524 353 112 -175 -398 -519 -566 -534 -380 -161 128 351 511 557 547 404 208 -69 -297 -508 -582 -534
9209 -534 -429 -217 -2 274 501 598 549 441 260 54 -232 -447 -592 -578 -477 -276 -53 182 412 544 600
9230 600 508 338 92 -128 -367 -534 -627 -559 -367 -129 108 310 501 580 559 413 162 -59 -283 -469 -567 -585
9252 -585 -465 -212 44 271 464 555 577 482 265 -7 -254 -431 -541 -551 -479 -306 -51 201 413 526 566 508
9274 508 347 103 -168 -396 -511 -569 -504 -374 -155 121 334 508 565 521 383 193 -58 -308 -496 -564 -539 -406
9296 -406 -240 13 252 488 591 563 468 254 21 -198 -423 -553 -575 -437 -256 -38 196 395 548 572 496 308
9318 308 96 -127 -350 -523 -572 -502 -373 -99 109 332 465 573 555 402 159 -110 -305 -459 -548 -547 -424 -223
9340 -223 36 276 463 532 546 459 280 4 -241 -435 -530 -541 -460 -298 -52 188 415 550 546 490 363 117 -122
9363a22k33j70k4P9J11K17K38K63J40P7l9j73j74k59k11k34q7M5J56J87K47K02
9385B36K12J19j0j26k01k01k44k07j02m7R7J84K59K04J84J44N8p9j51k73k24j82
9407c50j34o9M4J60K29K31K28J36N8j6j11k18k68k13j56q3lJ11K22K49K27J84
9429D58O7Nr0j82k53k67j60j07nJ00J44K11K61K15J41kp2j38k04k64k35j35l8
9452e50Q9J40K16K05K10J87P0p8j19k09k11k16j97r6N3J30J88K10K10K11J18k3
9474E38j18j96k41k18j75j16l0Q4K25J96K04K06J37N5p8j81k20k16k04j12n5M3
9496d72J31K32K46K11J25O0l3j15k05k66k11j42o5JR7K08K34K47J57O8l1q4j32
9519B61k37k59j78j14K5P8J39K24K12K47J24J9j00j35k24k36j78j55m4P3J33K00
$$ plain form
9363 -122 -355 -525 -549 -470 -359 -142 96 359 499 576 537 364 190 -69 -280 -514 -601 -556 -400 -213 34 236
9385 236 448 567 557 431 230 29 -215 -422 -524 -571 -474 -290 -31 173 357 501 559 480 329 56 -168 -350
9407 -350 -484 -553 -509 -349 -120 111 339 475 533 517 406 188 -80 -293 -449 -532 -535 -424 -202 47 274 458
9429 458 525 530 440 258 5 -262 -422 -529 -534 -434 -290 -79 182 397 538 536 464 326 122 -142 -377 -512 -550
9452 -550 -461 -321 -105 100 310 497 567 489 370 161 -50 -266 -463 -559 -506 -376 -188 22 232 443 561 538
9474 538 420 224 -17 -235 -410 -526 -556 -472 -247 -51 153 359 496 551 473 292 72 -144 -348 -460 -515 -472
9496 -472 -341 -109 137 348 473 533 500 385 180 -86 -297 -439 -504 -503 -406 -198 36 283 440 508 477 393 261
9519 261 24 -235 -413 -527 -502 -424 -285 -61 151 398 522 541 441 306 82 -154 -332 -487 -531 -458 -325 -125
9541a25K13K10J84N5n0j30k06k15j92j87p0kJ41K23J95J95J98R5Nj20j90k29k20
9564b22j67j19l4Q0J83K35K39J57J17N0n4j70k38k19k02j28l4L6J32K30K43J92
9586C07J40K6pj09j94k49k17j48n8K7Q5J81K57K17K01P1k8j19j44j94k58j81j07
9609e01QR8J26K05K38K11J20rq2j40j95k19k00j63j6N8J41K01K18J88J65N6m1
9632D67j35j97k08k04j51r9J6J46K14K08J92J52Q9Rj04j76k37j93j73r2k8P8J69
9655b57K19K42J64J03M9p5j65k10k25k01j35JK5J35J93K37K13J24L9l4j13j69
9677A60k47k05j71j3J6Q3K00K03K13J89N2J2j28j21k34k02j70j20j4J04J66J95
9699c2K17J64J23L6r2j48j90k30j51j61o5O7J39K11J98J92J57N6l0j47j87k01
$$ plain form
9541 -125 88 298 482 537 487 357 151 -64 -256 -443 -513 -515 -374 -151 44 239 437 532 537 417 227 -2 -222
9564 -222 -389 -508 -542 -462 -279 -44 195 352 469 519 465 295 57 -162 -364 -492 -526 -490 -358 -128 115 307
9586 307 447 473 466 357 163 -86 -303 -451 -509 -482 -397 -216 41 258 459 530 502 383 239 45 -213 -394 -501
9609 -501 -493 -395 -269 -64 174 385 505 496 414 274 79 -140 -340 -503 -519 -461 -320 -119 99 287 452 508 467
9632 467 332 135 -73 -277 -428 -527 -511 -365 -151 57 249 401 490 499 395 219 -18 -211 -384 -476 -504 -426 -257
9655 -257 -38 204 368 471 520 445 280 70 -155 -356 -491 -490 -465 -330 -137 100 313 437 476 442 329 160
9677 160 -87 -292 -463 -476 -460 -377 -177 26 239 428 480 492 364 243 9 -193 -363 -483 -497 -393 -227 -32
9699 -32 185 349 472 508 416 268 78 -152 -303 -464 -529 -462 -323 -112 86 278 435 491 461 314 127 -74
9721g4j83j57r8O4Q5J79K21J96J33R1J0q0j86k12k04j87n2l1P6J93J72K34J93
9744C83O8J6n9j10k36j70k15j34k3N1J42J64K24K03J44M2o7j19j71j91k36j38
9766d32n9M6Q7J91J67K15J75R2l4q0j61k12j83j82j28K0Q9J67J72K29J80J16J3
9789D88j04j08k35j70j75j56j8M8J47J92K07J64J34Q7p4j13j63k55j62j41o6J
9811d72J14J82J92K17J34R7qr4j64j94k18j34r1j5P4J33K06K04J79R3K1o5j37
9834B54j73k06j94j11k6L5J29J93K10K03J07M8l7j28j74j94k01j40o1jJ50J42
9856a75K13J86J55M1K2j00j60j90j86j60j03j5P8J76J43K19J76J08K0q2j27j84
9878E5j98j73r9m2N5J35J62K27J71J15L5j2j26j67k23j58j57n6M7N4J92J92J97
$$ plain form
9721 -74 -257 -414 -512 -448 -363 -184 37 233 366 457 467 387 201 -11 -215 -402 -454 -485 -409 -216 -44 190 383
9744 383 451 467 408 298 62 -108 -323 -457 -480 -429 -287 -123 101 304 448 490 423 304 133 -58 -294 -432
9766 -432 -491 -445 -358 -167 0 215 390 482 448 368 207 -5 -188 -370 -498 -478 -389 -222 -50 179 359 475 488
9789 488 384 276 41 -129 -304 -460 -478 -430 -283 -91 116 280 414 501 427 314 151 -104 -266 -407 -473 -472
9811 -472 -358 -176 16 233 367 464 456 362 198 4 -214 -348 -439 -454 -380 -247 -41 163 342 435 456 391 254
9834 254 81 -125 -319 -430 -456 -421 -292 -99 111 314 421 469 432 304 130 -64 -265 -405 -466 -467 -317 -175
9856 -175 38 224 379 420 442 342 182 -8 -194 -354 -457 -472 -394 -218 -75 144 320 428 448 366 239 55
9878 55 -143 -316 -415 -457 -402 -267 -105 122 293 408 443 431 305 138 -85 -243 -400 -456 -409 -355 -163 29 226
9901B26J37R2j7r6j55j86k06j71o1%N6J46K05J87J79R5Ln7j66j23k20j93j00m8
9925d73O6J26J85J68K00J45L2m8j11j78j88j74j21p3M5J09J74J42J88J52P4k9
9947D11p0j58k20j63j56q1J1N4J72J77J75J47J16J6r0j05k10j98j16j28l1M9J42
9970b56J64J97J79J04L1k5j11j60k06j71j29o4M4J08J48J67J96J77K5k7p2j53
9992A66j75j85j52p5LQ8J40J44J89J46R9K8r9j17j51j92j81r7j1N1J23J67J67
10015G6K03P3P2n3j24j48j67j54j26p7M0J05J62J71J83J07P7l8o0j54k15j35j50
10038c32p6PO5J50J79J81J18P7L3p5j27k00j54j36j08l2Q0Q0J99J80J37J11L6
10061C93j1j11k03j67j55j56J4J1P8J97J72J44J47N6k6j15j36j49j80j36o9NQ1
$$ plain form
9901 226 363 455 438 342 187 1 -205 -376 -437 -437 -381 -235 -30 157 336 431 434 377 211 88 -132 -325 -425 -473
9925 -473 -407 -281 -96 72 272 417 449 401 290 112 -76 -250 -371 -444 -399 -290 -116 26 214 366 440 411
9947 411 341 183 -37 -200 -356 -437 -426 -372 -200 -23 152 299 415 431 341 236 26 -172 -288 -416 -447 -398 -256
9970 -256 -92 105 284 388 419 394 283 123 -83 -254 -383 -447 -403 -295 -147 20 216 393 418 391 319 166
9992 166 -9 -194 -346 -421 -418 -330 -190 -46 143 289 388 416 317 200 49 -143 -324 -421 -432 -381 -258 -91 76
10015 76 279 352 424 371 247 99 -68 -222 -348 -425 -385 -280 -118 53 236 343 420 382 322 168 -47 -182 -332
10038 -332 -408 -401 -336 -186 -7 174 292 369 402 327 200 0 -154 -290 -398 -430 -350 -270 -71 109 246 357 393
10061 393 382 271 68 -99 -254 -410 -396 -385 -307 -110 62 206 353 409 383 268 132 -17 -197 -333 -402 -397 -316
10084c16J36J69J59J67P6Oo4j34j73j63j40r9m2N6J48J41J94J06J13N5m7j16j45
10107H7j64j55j09n8J5R4J56J93J63R8O7j2q2j41j83j66j03o3j6Q6J29J62J57
10130A55J60N9Ln1j20j55j82j22j03j3K7J04J62J95J48Q3K5l4j05j52j73j67p1
10153c27n7L4J00J25J64J87J21QOr8j25j64j40j30p5QQ6J33J37J55J39J04oo4
10177C21j24j61j72j34p2k2L0J32J46J63J53J03J5l5r9j54j77j08j54k6K5Q0J64
10200a06J65J58J01K6Po3j47j52j96q0q4K0P5J14J68J73J13P4j7m2j14j45j79
10223a31j30p1k5P4J03J14J82J31J12K8q4n6j63j45j53j14l9J6J11J40J48J66
10245B14R1N3j9p8j45j35j41j16r8K7P1J29J52J38J34O6Oo6r4j81j34j13q9l1
$$ plain form
10084 -316 -180 -11 148 315 391 397 333 199 26 -137 -277 -376 -418 -362 -214 -73 121 227 340 395 348 232 87
10107 87 -77 -232 -341 -399 -384 -290 -134 59 222 320 387 375 293 152 -31 -197 -300 -363 -379 -293 -164 -2 155
10130 155 315 374 377 326 206 51 -131 -253 -356 -369 -342 -238 -76 119 267 350 375 341 236 84 -89 -256 -327
10153 -327 -384 -350 -250 -125 39 226 347 355 361 263 138 -26 -166 -296 -371 -363 -277 -144 -7 148 287 391 385 321
10177 321 197 36 -136 -270 -342 -364 -334 -202 -56 107 260 363 378 343 244 90 -87 -195 -349 -375 -350 -270 -106
10200 -106 59 217 318 344 351 288 141 -11 -207 -287 -371 -351 -276 -162 6 179 292 366 349 307 193 48 -131
10223 -131 -261 -332 -357 -283 -180 -66 116 247 359 387 303 247 84 -61 -214 -328 -367 -351 -240 -100 48 214
10245 214 305 358 339 261 116 -19 -160 -276 -374 -347 -276 -147 5 143 277 343 349 283 189 8 -126 -239 -328 -359
10269c59N3J21J74J25J35R4K0m3r0j54j38j57r3k7QR2J50J45J39J19M7j4r3j23
10293A31j75j07j30o8J2Q9J15J26J64J18O9qo2j19j40j55j32n5rN5J06J08J50
10316H3J39J09M0m5j29j26j41j35r3m4J9J10J29J37J67Q1M9l8q4j24j52j43j04
10339b95l9j3N7J62J36J25J36M0J6o0j10j43j50j10n7j4L9R8J39J57J38N3K2l2
10363B95q9j39j48j59o2j0J3R1J28J51J34P6M6k1p4j16j47j55j08k7RP0J18J25
10387AJ79R3N1Lq4r6j54j40j13q6JP9P7J67J31J21P4L7p0p2j46j30j10j01l5L2
10413b91Q6J36J32J29R7N2k1r6j34j45j37p6n2OQ7J19J46J42R4N8J4p4j46j20
10437Fj36j09o5pL6J04J50J16J53M8K2m9q7j21j47j41n4n0N4O9J48J37J26P3M2
$$ plain form
10269 -359 -306 -185 -11 114 249 343 363 320 230 76 -62 -219 -312 -339 -331 -239 -89 56 195 314 361 347 254 131
10293 131 -44 -151 -281 -349 -337 -248 -133 -7 157 275 344 336 274 155 15 -140 -272 -327 -336 -281 -175 -67 83
10316 83 222 331 371 326 197 71 -70 -205 -298 -342 -323 -213 -84 53 220 301 350 312 228 104 -48 -191 -295
10339 -295 -334 -347 -290 -128 8 133 269 309 325 265 155 12 -138 -248 -305 -319 -280 -182 -43 114 252 305 327 295
10363 295 206 67 -81 -240 -302 -312 -299 -208 -80 71 205 281 327 306 232 116 -31 -186 -294 -321 -312 -242 -124 1
10387 1 180 273 324 327 243 147 -7 -147 -260 -346 -345 -266 -189 -22 109 230 304 341 271 199 53 -77 -187 -288 -323 -291
10413 -291 -205 -69 63 192 289 341 320 224 90 -55 -192 -268 -320 -314 -227 -108 38 180 274 332 346 272 126 6
10437 6 -130 -239 -304 -311 -275 -171 -21 95 248 296 318 269 182 61 -86 -227 -281 -331 -277 -208 -60 77 203 276 318
10462C18k5o8j14j29j51j03l3L2O8R3J20J36R9P2k4n4j13j50j00j21m7j9O3Q4
10486a66J49J13J13O7K7n1q3j26j34j30n9n5O0R7J03J48J08P9N6k6r2j20j27j26
10510a75q6k3nO7J60Q9J56R3RL0o4r8j62j35j02m1j9O5Q8J39J29J18N2Mj9p7j26
10537F7j53j42p1KL3Q0R1J68J02R2L5n3o2j01j18j36r9l1J8J00Q3J21J07J27M3
10562C03k0n2j36j09j01j35m7J8N7Q1J53J06R7P2%m6j04j24j34n9q7m2K8R0J24
10587f7J63P7P5L4l0p2j13j45j06q1j4lQ3R2J64J18P9K7j2n2q9j42j32j01oj9
10613b72M0J02J27J55Q2M9Om0j03j15j27j18q9J3M2P1J12J10J33Q8J9l7q5j04
10637E9j14j39n6n0K9P5Q3J42J13O9Q8k7n5p7j40j18q8m8j1M7J07J21J04Q5Q3
$$ plain form
10462 318 293 225 111 -18 -169 -272 -305 -273 -205 -112 8 144 243 315 291 237 124 -26 -126 -247 -294 -313 -250 -166
10486 -166 -17 96 209 276 303 252 169 43 -91 -221 -280 -335 -275 -178 -75 73 181 260 316 290 198 78 -49 -175
10510 -175 -261 -284 -289 -222 -62 27 183 276 285 315 251 153 -9 -144 -246 -287 -306 -241 -153 -14 115 233 285 289 270 193 67
10537 67 -86 -228 -299 -297 -264 -184 -93 75 177 269 304 251 189 88 -30 -166 -265 -296 -278 -178 -95 26 133 260 303
10562 303 283 231 95 -14 -115 -250 -297 -279 -222 -141 12 118 215 287 287 241 137 13 -121 -180 -267 -309 -281 -191 -67
10587 -67 96 173 248 282 252 180 67 -78 -184 -265 -279 -282 -199 -107 57 175 254 281 269 217 128 -14 -146 -247 -253 -272
10613 -272 -232 -130 -3 152 234 283 289 249 146 31 -96 -214 -303 -290 -248 -177 -65 45 178 266 285 248 163 59
10637 59 -55 -194 -250 -300 -271 -196 -113 29 142 211 299 272 217 140 0 -118 -206 -254 -265 -218 -111 10 114 199 282
10662B82Kk0j07j34j19j05n2k5K4R2J11J08J05Q0K3rp9j18j40j05p4l0NQ4J01
10687a00J36J19J02J3no5q2j24j36r4m9K6M2P5R2J54J28M1po6o2j02j16j17j04
10712c01J6M7J07Q9R8J46N1K0oj17j28q0j11r0n8M7Q0J10J33Q2R0L0Ro0j25j09
10738c0j05q9l9l9Q7J07J19J04P8P2Pl9r2j24j21r5n0k1J2J22R1J20J10O7K0j7
10764B55p5j18j13j17q9k1M1M3J06J17J14Q0M6l1o3p2j42r3j00m7L0N4N4J38J08
10789A05J01O2J2o6j10j16r5o2q7oM9J01J00Q2J10O6M2m1r8j14j15q5q3l1L6Q9
10815a54R1J22J05P2N3l3m8j29j29j03q1m5J4M9J02J25J20Q5L8j2lq7j57j17j19
10840b41qj7M6O6J26J39J04K7L3m0n6j00j28j23q3J1JQ6N5J41J07Q7L9j3q9p6
$$ plain form
10662 282 284 264 157 23 -96 -201 -253 -278 -254 -162 -51 57 162 242 265 256 177 59 -81 -186 -260 -290 -285 -201 -100
10687 -100 36 155 257 270 265 200 118 -6 -142 -236 -285 -259 -217 -142 -50 104 232 273 266 200 138 36 -80 -197 -301
10712 -301 -285 -238 -131 -42 56 202 253 273 267 150 22 -58 -169 -259 -317 -270 -190 -80 53 135 225 255 264 204 79 -30
10738 -30 -135 -224 -263 -302 -215 -108 11 115 193 265 272 233 141 17 -104 -199 -249 -270 -258 -136 -45 75 185 252 272 255
10764 255 180 62 -51 -168 -257 -278 -237 -194 -88 29 143 223 269 238 175 103 -39 -132 -232 -279 -249 -195 -141 -3 105
10789 105 206 268 280 214 104 -12 -107 -169 -256 -262 -213 -112 -12 70 180 246 288 247 149 35 -80 -165 -248 -279 -243 -154
10815 -154 -63 59 164 236 289 256 208 79 -50 -153 -234 -279 -265 -216 -114 11 131 216 254 242 239 152 -5 -122 -241
10840 -241 -249 -266 -220 -154 -28 111 215 242 275 235 179 79 -49 -172 -255 -244 -243 -157 -102 39 146 233 272 259 170 94
10866I4j14j22q7q3L4Q1R4R3J00J13Q0j9q3p4j19j07q7m6m9P2Q5J14J19R4O0L4
10892B77n3p6j14j00j06n3l5PP6J43Q7R0R9L0j9p9p4j32j11o6l4k2N4Q8J30J29
10918A36P9L8Oo2p7j25j44o3o3LN0N1J32J26J29N7qn1p8q6j06j36p0k4M7R1Q2
10945f6J30J04O0N5m0q3j08r7r9p9m2KO1J27P5J19R9M4J5o8q7j37j10q2o0k7L8
10972b56R3J26J12R8N9PJq6j26j28q1l8m6J8P0J23J34P3Q5L2l2n9r8j12j09q6
10998b26k0NK9J15J09J09J02J8rl5q0j08j18q4n7j4N4Q5J04J02J21O5K3o9r1j02
11024B8j03j09p7pK0J01J01J07J03P5L9l3q2j01p2j32o8p5K0Q4J11J07J03P2L9
11049B51j2k2j23j08j26p6j6m0N1O9J23J29Q9M9nlq7j13j14j13n0j3MP2J13J28
$$ plain form
10866 94 -20 -142 -229 -312 -278 -197 -103 -10 90 203 283 264 181 107 -12 -119 -206 -252 -301 -229 -144 -30 89 183 243 277
10892 277 224 148 34 -66 -172 -225 -260 -253 -177 -34 53 143 242 272 253 174 100 -32 -143 -209 -243 -265 -211 -123 7 136
10918 136 215 253 259 197 120 -5 -149 -212 -275 -272 -222 -171 -39 87 216 273 265 214 136 50 -56 -192 -262 -286 -239 -148 -66
10945 -66 64 168 228 283 243 160 52 -45 -144 -223 -265 -263 -202 -75 0 119 218 262 277 209 122 -15 -125 -207 -267 -294 -256
10972 -256 -163 -37 75 173 232 239 240 154 28 -100 -181 -219 -265 -247 -177 -54 80 153 238 270 238 179 81 -31 -140 -226
10998 -226 -246 -241 -212 -97 12 121 223 241 232 197 117 9 -109 -193 -250 -264 -210 -125 -21 81 202 267 290 221 130 28
11024 28 -75 -184 -261 -268 -248 -147 -46 61 164 239 278 245 163 62 -10 -142 -210 -285 -265 -181 -70 37 140 212 251
11049 251 239 217 94 -14 -140 -216 -232 -272 -221 -152 -29 100 189 238 233 230 143 30 -84 -197 -247 -260 -256 -184 -71 57
11075E7Q3R4J6l0n5p6j23j45n4j7J2O4Q1J37Q3J08L9j2n8r6r4j03r9m9kN1P7Q8
11103b3J11R0P1J9m7r1j07q0j08q2k7K2Q9R7J45P1P4N2m1p0j28q0j18n0n5kJ00
11130a68Q0J10J12Q3M5k2l7q0j31j11p5m2l8N5J01J08J20R0M8L5p8p1j02j08r3
11155a69r3K5oQ8Q9J05J30O6Nk9m4j09r6j35o7l7L3N8P6J18J24R9M7l4n5r0r2
11182Gj05r9n5j2O7P6R9J07J02O2L3o9q9p6j23j05q0r%J04J08J20P9Q9rJ3o7j10
11210E8j25o1q8l7j7O2J00J29J01Q1M3j7m4j03r4j24p3n7K3J9R3J28J07P9P9k6
11236B36k1n7j25j13r2m5k7J8O5J07J19J14P1J0n5l7j04j18j21p3l6K7O7J09P9
11261bJ26O4O3mm7j05q4j18q2m9k9M8Q2J07J47Q7M9J3o2n6j19j05p9q7k7M3Q4
$$ plain form
11075 57 140 234 250 220 165 89 -34 -179 -233 -250 -238 -174 -93 44 127 235 274 262 204 108 14 -89 -188 -237 -239 -188 -111 -23
11103 -23 88 178 249 268 221 130 23 -57 -165 -247 -274 -252 -163 -66 79 150 224 276 235 165 37 -43 -161 -211 -266 -268 -168
11130 -168 -88 22 134 217 262 240 203 123 -8 -119 -194 -236 -274 -219 -118 -10 110 200 248 283 205 134 32 -76 -169
11155 -169 -262 -237 -243 -155 -66 39 169 235 240 211 167 58 -38 -173 -240 -277 -244 -186 -110 8 132 231 278 244 189 99 7
11182 7 -98 -197 -252 -264 -197 -121 -22 85 187 249 282 213 124 48 -75 -180 -260 -269 -269 -165 -57 63 142 231 222 235 168 58
11210 58 -67 -128 -216 -253 -270 -208 -108 21 122 203 246 229 185 82 -12 -136 -209 -266 -243 -224 -131 -3 104 183 262 236
11236 236 215 158 33 -80 -172 -217 -244 -226 -161 -54 65 179 250 260 205 168 64 -54 -175 -248 -284 -257 -190 -81 -2
11261 -2 124 188 251 247 200 95 11 -107 -189 -238 -267 -219 -137 -30 117 204 253 266 204 148 29 -76 -155 -242 -269 -226 -142
11288a42R9J18P6O4M4k0o2j06j12r8q2m3J2P7P5J24R0J06J5j0n2o9j02j12r3l4
11314b37j5N7P4J14J06R0L6J3l0m0j33j14r6p2qN3N2J15J09R3Q8J2l0o3r7j20
11340d3q5j12j0mQ4J04J02J02P1L6kn4q0j38r7q4o0K6M2P8J15R1J14K8J2o4l8
11367A34j12j18p9n8njR0J18J04Q3P4N4m6m3j12j18j10n1n1K4N4O8J15J23Q6K9
11393B52k9l0o6j18j07j03o2J6M3N8J38J15Q8M3j1mr6q4j33q4n2k3M9O0R4P5J01
11420A30P6N3n1m0j03j30p7n5l2J5M5Q5J36P7Q9J9Qp1p3j14j04q2m5J2L6Q9Q6
11447b1R0J04N3j1l1q4q1j06j01m0l1K4R3Q5J09R2P0L9m0m0j01j11r5p2n2L4K4
11474b00J17R6J16O5M5j0m8r2r6q7r2n7J0M9O5Q1J13R8N4J2n9n3j25o1j09q3j9
$$ plain form
11288 -142 -43 75 151 215 259 239 177 71 -41 -139 -221 -264 -252 -175 -100 24 114 220 235 225 173 104 2 -110 -203 -237
11314 -237 -252 -195 -121 -7 99 189 225 238 208 168 35 -79 -175 -247 -255 -202 -150 -35 74 167 255 267 237 174 77 -43
11340 -43 -128 -240 -250 -254 -170 -66 36 138 209 245 243 189 109 -29 -126 -210 -270 -244 -202 -124 -9 82 196 224 236 172 134
11367 134 22 -96 -175 -233 -238 -239 -149 -31 73 156 230 284 238 195 83 -35 -145 -196 -247 -223 -169 -101 14 137 223 252
11393 252 223 193 127 9 -98 -201 -263 -247 -204 -146 -8 107 195 238 227 223 127 43 -90 -174 -226 -249 -200 -140 -46 29 130
11420 130 206 259 208 168 65 -65 -142 -197 -229 -214 -169 -84 52 129 218 237 245 174 101 -13 -117 -199 -244 -232 -196 -107 -21
11447 -21 69 173 226 215 184 100 19 -87 -188 -228 -259 -235 -142 -57 52 144 214 253 213 173 72 -39 -134 -206 -258 -224 -200
11474 -200 -83 13 129 194 239 229 181 89 -7 -94 -186 -243 -233 -184 -119 -38 75 173 227 239 180 127 2 -59 -168 -251 -270
11501b70M0N5J37O3J16O4M3l3o4j00j12p8n6m7K0N7R3Q0J29L6L0J9m3q6r3j24
11527a24n8l4kK3R1P6J14O8L3N2m5p7q1j18r8o0PQN8R5R4J08N0N8k2o8j10q8j03
11556a53n0l8KN1J21R3Q7O2L5J6j9r8j22j08n3l1k3M2J03M9J36P9M3Lk4q7p2j16
11584g2j17l7j2K6O4R6P6J09N5L0j8n7p5j22p9p1l6QN6Q0J00R2Q5L5j2m1p9n9
11612B5j30p9n3M5L7M3J01R1O8N6K5m7o3r8n2j20n8NkQ9O2J08P2Q3Lk6n4p1j00
11641d0r5o4l8J4N2P1J13J09M3P2k7m0q0j12q9n2m9%M5O5J07P1R4O1j0m3n4q6
11669C8j16p5m4l2M1N3Q4J21N9N9J9j3l7j04j03r0o0j8J4M2O4Q0J38M4M4j8j8
11696A72q1j01j04o8k7j0N9O5P1R8Q9M3J2l4o0r1p8j03l2l1K3N2J06P6R4N1K9
$$ plain form
11501 -270 -230 -175 -38 25 141 205 248 215 151 51 -61 -139 -195 -242 -222 -165 -72 8 137 173 203 222 179 93 0 -124
11527 -124 -182 -216 -218 -195 -104 -28 86 154 187 239 194 117 36 -82 -180 -240 -233 -225 -167 -72 22 130 180 238 216 148 38 -50 -153
11556 -153 -203 -241 -239 -188 -67 26 113 175 210 226 207 109 -13 -121 -174 -205 -228 -186 -83 -34 102 181 224 227 203 116 44 -72
11584 -72 -189 -226 -238 -212 -148 -52 24 133 188 218 200 143 68 -54 -133 -204 -240 -232 -176 -96 4 96 181 216 204 163 84 25
11612 25 -105 -184 -237 -192 -155 -112 -11 80 148 204 229 182 119 21 -31 -151 -209 -204 -206 -117 -55 53 125 208 211 185 131 60 -40
11641 -40 -135 -199 -237 -223 -171 -100 13 122 165 237 210 170 90 -22 -111 -163 -212 -212 -167 -102 5 76 170 231 221 178 124 38
11669 38 -78 -153 -197 -229 -188 -135 -51 70 129 188 207 194 157 53 -50 -140 -200 -218 -204 -162 -98 -18 120 164 208 190 172
11696 172 91 -10 -114 -182 -209 -219 -160 -95 -24 74 163 206 218 184 124 33 -45 -148 -180 -211 -188 -136 -30 46 140 191 220
11723B20l1m2r1p7q8n6m3JM6Q7P7Q3Q6K0M5r4p8n3j30m2p7PN0Q0Q3P3P7N3J9k5
11753A80o3q5j02o6o5kL0M5J02P5R0M2K1K1n9j07q9j07l8k1LM7O5Q9J03O0M1r
11781B01l3p1r1j12p6l2kM8N5R7Q2Q1M1J2m4n4p2o6j25k6j3L0K4P4J09N4R4L9
11809B24j9o3o0j02r4l3n7K8M2P1Q2R6O8M1k6l6p0p9j00o3o3MK2R6P9P9O7K8K7
11838A89m9k2p6j07p8m2k5K3O8Q8Q3N2N2K6rm7o7p9r2o0l3K5N3O3R1P0M8M4j9
11867A70l3l9q0r8p7n3PM1O5Q2P9O6M2K8n1n9o7p8p1p0k2J6O5Q6Q6P5O9mnn5p7
11898C8o9p4o7j8J1K2J04J03Q6K6M8pm9n4o7j21n7k3j7O0K0J18N1O1L6J4k1n6
11926I8o8q2p8n1p%N9P1Q5Q2M3L0l5l7o8q4r4k5j9%L2P9P7P7N9L8jm1n5p3q8n5
$$ plain form
11723 220 189 147 56 -21 -109 -165 -208 -207 -161 -74 3 86 172 192 237 143 65 12 -118 -160 -237 -230 -180 -100 -17 56 133 186 205 180
11753 180 117 32 -70 -136 -201 -203 -173 -128 -26 49 139 181 202 223 164 57 -32 -139 -177 -198 -195 -148 -83 6 109 169 210 201
11781 201 168 97 6 -106 -182 -214 -216 -168 -113 -16 66 147 188 200 156 102 30 -36 -161 -187 -200 -170 -146 -72 37 91 185 224
11809 224 205 142 82 -20 -114 -147 -204 -176 -134 -63 19 115 183 224 198 162 92 13 -87 -150 -213 -209 -187 -91 -12 67 134 162 189
11838 189 140 118 42 -65 -143 -185 -210 -187 -119 -31 52 104 156 182 173 126 59 -20 -112 -172 -205 -180 -127 -64 27 97 145 189 170
11867 170 137 98 18 -80 -157 -210 -203 -162 -97 -15 64 130 172 200 149 90 23 -55 -126 -196 -218 -202 -137 -51 35 110 179 175 170 115 38
11898 38 -31 -105 -172 -190 -179 -157 -53 50 136 162 210 203 154 100 33 -88 -145 -168 -185 -125 -105 13 64 125 161 175 154 98
11926 98 30 -52 -130 -181 -188 -188 -129 -58 27 109 152 182 147 110 42 -42 -136 -161 -180 -180 -148 -69 8 85 144 182 181 140 85 12 -76 -131
11958a31n8%O0N1P3P9O0N4nk3k8j22n0p6n1l6M6N3Q0O8P5L6L6k5m9p7m4r1o6j2
11988a73qP1L0R5P6P7J7m5J6o8o6j08n6l6J0J7O9P5R7M7M4pkn9o6q1j04Ln0K5
12018a60N0N9O6J06L1J1lk3r0o1r0o0l1J3L0J07N3O2O2K8K1l2p7p1o6q6j5j4M2
12047a38L6N4J06N6M3L3l3n5p7n7n8o1j4PM5O5R2O7L7L7po6m8r6q3k0l3mJ1R1
12077g0O1Q2P1kJ1k9o6o6n8n1n8MJ4P0O8O3Q9K8J4l8l5o4q4p5l6jqP0Q8L7N8L5
12109A22N9j7n9m3r1n0q3k6K5N6M4M4R4N8K3j1qo2p0p7n6n9J3J8L1J21N6N5L7
12138A44L1n0j7p7q4p0k0l6J6N7O2P8O6M4kJ8k9q1o8j00k6j9qL4L7Q3Q1M8K4L5
12168A71l8o8p0o4p3l4jQJ00K6R0P7L6Kj5o9m9o0n1q6j6L7L7N6P9O9M9L6k6m7
$$ plain form
11958 -131 -189 -189 -129 -78 -5 74 134 188 183 160 132 10 -40 -116 -167 -203 -157 -104 -24 44 119 155 191 166 117 40 -4 -95 -161 -173
11988 -173 -181 -110 -80 15 91 168 185 140 156 88 22 -86 -142 -178 -168 -151 -82 -7 90 137 181 174 172 113 47 -34 -138 -135 -185 -160
12018 -160 -110 -51 15 121 152 163 160 137 47 -14 -104 -164 -195 -182 -152 -45 8 70 132 160 181 149 72 1 -65 -151 -166 -180 -138
12047 -138 -102 -48 58 114 157 190 157 102 25 -32 -90 -151 -165 -158 -113 -48 44 111 148 185 178 112 64 -32 -115 -135 -168 -172 -161 -70
12077 -70 -9 73 144 142 153 124 58 -8 -66 -117 -175 -171 -157 -87 -19 44 133 161 175 137 102 38 -46 -121 -157 -158 -166 -96 -8 29 87 122
12109 122 181 164 105 62 -29 -79 -162 -188 -163 -107 -63 -19 75 133 156 145 137 75 5 -72 -128 -187 -174 -156 -125 -4 52 107 144
12138 144 175 125 108 31 -53 -123 -143 -179 -163 -106 -44 34 100 144 142 160 131 50 -18 -118 -144 -163 -171 -137 -100 -17 64 112 136 171
12168 171 133 65 -5 -69 -142 -176 -177 -169 -69 -43 47 124 160 162 147 78 29 -31 -82 -168 -184 -147 -110 -54 25 94 143 179 153 106
12198A06m8p5p7n1k6NL0N0Q8O7M0L9j0j2o0q1n0p5k5k7L1N4R1O6K2Q1J9k6o3o3
12228B0o2n7m4j9jL1Q9Q1O0M2L3l3m8m4p7o4m8k8%M1M3N3J09O7J7J1n8l8r1n6
12258g1n9j5j4K6M4N9N6O6P2j4j8m9n1n8o8p2k3PM4R1K8R9L7M5Lo5m8n7q2l7k5
12289a49kK1M6R0P8M5J4K5n6m6o7o5n6ln4M0M6N0Q5M5M4J9k0m9m7r0n8m6j6K1
12319a55M2N4O9R6L5L0k8m7m6n7p2m3m9J9K4M6P3R6M2K0Qk0m6o4o6p1l5m4N2O2
12349g5N6Q0K8L6M4k4n3o6o5l6n8m7J0O8N3O2M8O0L3on7n1p1o6k9j6k0J2O7P3
12379a0P8N3K5mnp8n2o7n2k2qK0L4Q2O9N8K0L4m1k5n0q2p0m5l3L1K2N6O0N0P7
12410A25J9k0k1q3o1m6o1k2J6K8N0M3P9O8K6Nk7o7qp7p5k4k1K7N0M3P1L3P6J7
$$ plain form
12198 106 58 -17 -94 -145 -171 -166 -136 -86 2 69 109 148 138 126 66 -15 -65 -140 -165 -192 -161 -107 -16 50 72 153 172 146 83 20
12228 20 -42 -99 -143 -162 -163 -132 -43 38 98 140 173 140 92 48 -29 -93 -141 -169 -169 -128 -85 -32 77 144 161 172 114 76 -15 -71
12258 -71 -130 -145 -159 -133 -89 -30 26 92 164 150 132 83 32 -26 -94 -166 -189 -182 -138 -47 -19 80 117 162 165 100 52 -5 -87 -124 -149
12289 -149 -151 -130 -84 6 84 129 143 168 112 66 -1 -66 -122 -125 -179 -139 -93 -43 42 87 131 150 130 81 34 -56 -114 -160 -176 -155
12319 -155 -113 -59 10 106 141 171 143 96 50 -7 -79 -122 -171 -152 -128 -82 -9 87 129 149 157 137 91 27 -39 -110 -145 -189 -137 -75
12349 -75 -19 61 89 125 169 145 92 26 -39 -75 -133 -180 -170 -102 -49 13 61 121 154 148 91 40 -31 -97 -126 -142 -162 -150 -83 -10
12379 -10 68 121 146 142 137 59 7 -60 -112 -134 -142 -122 -88 -6 63 121 141 175 134 109 59 -23 -93 -138 -171 -140 -118 -62 -2 48 125
12410 125 144 124 103 20 -41 -87 -148 -170 -154 -126 -76 -33 46 114 140 145 118 51 43 -34 -109 -133 -154 -127 -77 -34 37 70 146 163
12440A63l6n9j7o9o9m9j5J6M3O1O3N0L5L9nm2m6p8n3n7k8j0L0L5R7M6O8L0Kl6
12470A09n9l6p0n1n5J2L5PQ2P0O8K2NJ8n6q1l7q0k9j2jN2M3O2M9P5J1j4l3l5o9
12501Br0k9k3j4M2L7O0O0L1M2J9m0m1o1l5q6l7j5M5M8M1P8N9L9kOn9l7n9o9o8
12532a56nJ4N1N3M2P0N7L3k2l6m5m4r7k7m0j5M2N1O5M5M8L2PLn8q3n2o3jk5J1
12563a45M2N6J00M4L6j9Pk5o0o4o0n5j6LM9N9N2M2O7L1nj0q1m4o0n9k4l4N1O2
12593f0N3O7M5L8pk5k6p2m8p4m7k1J0N7R1K3O2L6J6kj2o8q4o1l7j0QL7M9Q6M4
12624F8M4J7%j3p7m8r0j5j4oK2L8Q1N3N6J3LJ0p7l5q9n5lk1RM0K8Q0L7M3K8k6
12656A01j0n5o7o9m9k1nO1M9Q5K7O0K2Pk3p1k8p7m8l6%J5N0O0N8M8L7K3j6n9o1
$$ plain form
12440 163 127 68 51 -18 -87 -136 -151 -135 -92 -31 32 82 117 156 151 109 63 -15 -68 -125 -153 -163 -133 -98 -1 45 113 143 145 109
12470 109 50 14 -56 -107 -162 -150 -115 -108 -26 44 112 134 139 157 101 20 -17 -97 -126 -138 -139 -87 -44 18 67 142 153 139 106 71 2
12501 2 -88 -117 -140 -154 -112 -75 -15 45 76 118 137 97 56 -5 -40 -126 -163 -178 -133 -85 -44 34 93 132 130 136 77 40 -19 -88 -156
12532 -156 -161 -147 -96 -43 -1 69 126 159 137 101 56 12 -85 -112 -152 -167 -125 -74 -9 36 84 116 123 126 68 -15 -67 -130 -131 -156 -145
12563 -145 -103 -47 53 97 133 114 121 96 36 -28 -88 -143 -159 -156 -107 -48 4 46 113 144 139 129 48 4 -56 -115 -139 -173 -122 -60
12593 -60 -7 60 105 143 136 111 85 13 -35 -109 -156 -177 -167 -110 -19 4 66 102 118 116 104 36 -48 -109 -146 -156 -148 -111 -62 24 68
12624 68 112 129 129 116 39 -9 -99 -114 -128 -134 -112 -74 7 60 116 129 132 142 65 30 -59 -114 -117 -138 -129 -89 -61 19 56 99 127 101
12656 101 91 36 -31 -100 -149 -170 -175 -114 -65 20 47 107 129 136 113 42 14 -63 -111 -147 -147 -132 -82 -22 36 84 121 144 128 69 8
12687Hn7l2m0k0k3P7K6P8O0K2K9j1j8n9o7p7mm1J9RK4Q9L4R7J6l5j4n1o5o0m4
12718a30l1K3K0N2M0N7O4O5j2k8m4m2o8o1m9lJ0L7O6L9N9O2Jk2j7n8m7r0k1k2
12748a50lM4J9P5N2M7N1J1l8n3p8k9m6m1k7L0Q0M9O5N3J7%j5m1n1o2n2l4l1K6
12778a32M4L9R3M4M4npj6n2o1m6m9m8J2QN5P8N8M1MMj6m0m1q4l4m6MK2O4K5P1
12810C3N0K2J7l4j1n5l4o9m0l3L8K7P1K6N9L0M7k3k4m3o4n8m4l5K3J9L3P2N1M7
12840I8J2Ll1k0q3n2l2j8k5J6J2J18K7O6j1M7m2l4m1n5m4l2j2J3QN7O1N5L6K1
12870A18J7m1m5n3n4m1j0kQN4L0O9K1N2rk4k1n8l9r1j0j7L1L5M8N9N8J3K3j0l8
12901G3o0m2m5n1oLL5M8P4K1N9LJ5j8p6l0o3m2k5K3pO2O4M5M4OMj9k9m8n6m2m7
$$ plain form
12687 8 -49 -81 -121 -141 -164 -87 -61 17 77 99 128 117 99 40 -27 -104 -108 -149 -130 -121 -97 -8 26 123 139 104 90 39 -26 -86 -130
12718 -130 -161 -138 -118 -66 -26 31 95 160 148 120 76 34 -34 -95 -144 -147 -137 -100 -34 5 64 126 127 105 88 30 -17 -107 -128 -150
12748 -150 -153 -109 -90 -15 37 84 135 146 108 55 -23 -52 -98 -139 -166 -136 -56 -7 58 111 128 128 113 72 21 -41 -93 -127 -158 -132
12778 -132 -88 -49 44 88 132 127 120 104 52 -9 -55 -104 -152 -140 -132 -77 1 59 100 104 108 92 52 11 -73 -107 -153 -149 -127 -63 -38 33
12810 33 83 105 122 88 77 22 -12 -81 -121 -154 -116 -89 -18 8 67 97 144 121 97 54 -10 -68 -112 -147 -124 -105 -72 0 51 98
12840 98 110 113 82 62 -21 -73 -105 -123 -148 -132 -120 -2 25 91 80 127 85 51 10 -45 -89 -121 -133 -120 -112 -55 6 61 97 118
12870 118 135 94 49 -4 -58 -99 -109 -111 -103 -49 -19 50 71 123 114 90 69 11 -28 -119 -129 -146 -115 -80 -32 27 85 98 121 111 73
12901 73 13 -29 -74 -125 -131 -128 -93 -45 29 50 109 112 127 109 33 3 -60 -102 -127 -104 -111 -49 15 60 104 110 114 95 66 18 -38 -80 -127
12934a27KJ0J2P7O0K7L9J7k9j3o8m4p6j4k7L3K6L1N2Q2L4k7J1ok4o9m2n4l1J5
12964a23L4PO1M6M6K5J4j5k9m3n7p1j8J1%K4O9L3M5M9J4l4k4o5l5k5n9j2oN1J3
12995g4M8M9N6L7Lo1l5m1m2l9l9K3J3M6M4N2L4L7Jqm2o6k2m9n3J7M0j3L3P0M4
13026F3J7J8%k7m9n0n7l7j6L4oM8L2P0M0K6l5k2j4n6k2n2l8j6N7K6N5L4N2L0j
13057A04pk7n8l2n2o7K8%O0J0O6K3L6M7j4m6m9n0n0j0l7nM8L7M3K0N0K2j9J8l8
13088E1n8o0l0k0qK0J2P2L5K8L4L0j5j7n3p2k7l3KJ7J2L7P2L2M7jj2j5k5n7l6
13119c8n7KKj3M7L1P1J5J4L2m3pp2j2p1j7J9J1J6N6M1J3O0Oj2l2m7m0j8l6m0k
13151a21O3K9M8N8ML8j0o3Mo9k3k1m1j0J7M9O9PO3nRj1m5m3m2m5k2J9j7L4M5L2
$$ plain form
12934 -127 -125 -115 -103 -26 34 61 100 117 88 75 7 -37 -113 -127 -154 -121 -95 -64 -12 70 104 77 88 82 58 -11 -53 -107 -138 -123
12964 -123 -89 -82 -21 25 71 96 110 95 66 23 -34 -105 -123 -112 -112 -88 -19 14 59 108 122 88 64 -1 -36 -61 -120 -132 -138 -87 -74
12995 -74 -26 23 79 116 119 58 23 -18 -60 -99 -138 -115 -102 -56 -12 40 74 111 112 104 62 -4 -26 -75 -128 -111 -71 -84 -51 19 63
13026 63 80 98 98 71 22 -28 -85 -122 -138 -104 -110 -62 -30 40 80 106 71 49 35 -21 -43 -95 -133 -149 -92 -66 -11 23 75 105 104
13057 104 97 70 12 -20 -72 -139 -111 -111 -51 -41 25 48 84 131 117 71 22 -28 -78 -88 -125 -130 -82 -45 -2 18 68 90 71 89 51
13088 51 -7 -67 -97 -117 -125 -105 -93 -21 14 42 76 106 91 74 21 -51 -78 -111 -109 -92 -80 -43 29 61 108 107 95 80 55 -2 -38
13119 -38 -95 -93 -91 -104 -57 -26 45 60 74 106 63 56 -16 -28 -99 -116 -97 -86 -70 -14 27 40 100 106 94 62 15 -25 -43 -79 -119 -121
13151 -121 -58 -29 19 77 81 119 109 46 50 -19 -42 -63 -104 -114 -97 -48 21 28 91 86 95 84 39 -4 -46 -91 -113 -94 -111 -77 -32 0
13183@L9K7J2ql8ro7l7%m0L2J3K4M8N6L4J4j4j5m5k2n1l1m4L1RK2M9N1K3M5kj3
13216I3m6k5n2j2l8m6K6N3K2M3K6L3LJ6m3k6n2m5Kn1K4KK4Q2J8K6J5Rj1l5k8o2
13248e5ok6pJ2L7N3K9K9L2j8kpn1l9m0l0RNJ2L5N6K8K8j8J7l9j2l6o5k1k0J2L0
13281f8K5J5M0L7K2kj7J1m3m4m9m2K1M1j5M2P2OM2pnm9m6J0m6l2k7K6K9N1J8K9
13313D5J3L5j4k2m3m7k2k7k9mK9K6P0JN5oklk5n0k3k6Ll3kL3M1M6M2LJ3J0j5n7
13347A5m5l6%k4j3L4L5K8M6L0rJ1j5m7ro0k7KmK4KL6O0L0K7j1k1k0k1m8l8k8j1
13380a07J2J5O4K5L9J4J1ok3m2j5j3l8j9QJ8L4L9L5J1qM3lo4k7l8k4Ml9J7M8L0
13412ARM1J5J5k0j4k8o5km2MJ9KRQ3NJ8K0j1j2j4n9m7lj6K3KJ4O0L4J1K1J7j5
$$ plain form
13183 0 39 66 78 70 32 23 -44 -81 -81 -121 -89 -76 -52 -4 52 86 100 86 71 26 4 -47 -78 -122 -91 -82 -60 -11 40 63 108 106 93
13216 93 47 22 -30 -42 -80 -126 -100 -47 -25 18 44 77 80 96 53 27 -25 -70 -68 -119 -95 -93 -69 13 31 57 72 81 70 35 7 -55
13248 -55 -61 -87 -94 -82 -45 8 37 66 98 80 78 71 20 -19 -59 -89 -80 -75 -63 -28 28 56 84 66 83 44 32 -4 -69 -90 -110 -98 -68
13281 -68 -43 -28 12 49 71 69 52 63 20 -24 -73 -115 -94 -53 -68 -26 46 52 94 87 82 33 -13 -3 -49 -81 -108 -82 -53 -2 16 45
13313 45 58 93 79 57 14 -33 -55 -82 -111 -115 -86 -60 10 11 66 60 58 55 30 -20 -43 -69 -66 -99 -101 -68 -27 19 61 64 77 87 72 15
13347 15 -30 -66 -66 -90 -103 -69 -34 -6 40 70 61 72 57 10 1 -59 -86 -84 -88 -64 -62 -26 34 64 91 80 59 39 18 -30 -68 -96 -107
13380 -107 -95 -80 -16 9 48 62 73 67 44 2 -13 -26 -64 -83 -75 -57 -23 16 51 62 54 97 94 30 3 -35 -59 -55 -94 -77 -29 1
13412 1 10 51 66 81 61 47 19 -46 -48 -90 -86 -67 -65 -56 27 32 50 70 59 47 33 -26 -73 -76 -92 -69 -67 -53 7 41 52 73 90 75
13446G5l1l0m2l2j2JJ6L4J3J3O0K0j7j5j8j8k7l9l2LPLJ9L3N5J6J2jk5j2n8pl6
13479g2j9lNO2LM2N1LJ1l5rn9l4j4RJ2l6L7L5N4J0K0J5Oj7o1n7oj1k9K2j5M3K4
13513a3M1M9k9jJ0k7m2p6moK3JK4K7L6L9J0j0j8lm4km5k4J3KON2OM5M8poj8l3
13548B4k1k4k7pk6L8L8J0K4L6J7j9j6l8m3Rm6jol1P2J5M9QRJ2Jj3l5m8j3k3j1
13581h6K7QL6K7L5QK3k7j8Ro1l9Oj9J6j4M2L8J8M5k2%J1m8ml6m1l4L4J2PM0K0
13614A3K4J6MJpl5l4n3jl7L6J7K9M4J3K3Qj2j1m3kk8k8%j3J6M7L9PL3Nj1Mm0q
13649A6n0oknk6J0N3K8J4J2J9j6pl6k0l1l1K4Mj1K0N8K5lOj2K7l7k0m1k9Pj0J4
13683e6J7M0J7M4J5l2Ql3j4k4k5l9K4J3KL9K3M1k5M5k8l7k3j5k8l5J0J9J5NN5
$$ plain form
13446 75 44 14 -28 -60 -72 -71 -55 -21 -8 5 65 85 68 53 35 17 -10 -49 -81 -78 -71 -68 -49 -16 39 55 67 66 41 29 -29 -36 -72
13479 -72 -91 -94 -89 -27 -24 18 69 72 83 48 39 -20 -54 -68 -59 -47 -83 -46 -11 43 53 73 88 94 77 16 -41 -47 -58 -87 -65 -80 -37 -13
13513 -13 28 77 48 47 57 30 -12 -88 -92 -98 -75 -74 -50 -23 13 52 62 52 34 31 -13 -15 -60 -84 -71 -69 -63 -11 -5 40 88 81 75 57 24
13548 24 3 -21 -48 -55 -81 -43 -5 5 29 65 82 63 47 9 -34 -25 -71 -72 -78 -109 -37 -22 27 35 44 56 57 44 9 -39 -52 -75 -86
13581 -86 -59 -51 -15 12 47 55 78 51 33 42 -19 -58 -52 -71 -55 -69 -27 11 29 74 52 52 63 15 11 -25 -66 -100 -66 -54 -47 -7 13
13614 13 37 53 57 58 51 16 -18 -71 -72 -109 -73 -56 -27 17 30 53 61 49 38 -5 -7 -35 -63 -63 -76 -60 -13 26 33 66 71 60 64 24 16
13649 16 -34 -40 -42 -47 -73 -63 -10 18 32 44 63 47 40 4 -16 -47 -78 -54 -50 -61 -41 17 42 39 45 33 60 23 3 -38 -67 -60 -70 -56
13683 -56 -39 1 18 62 77 45 53 20 6 -18 -43 -82 -58 -45 -43 -4 19 60 35 80 52 15 -8 -23 -51 -86 -76 -57 -42 -37 18
13714A8lKL0kJ2m5m7k6Qlj1J8K2M5J5qL8jj0j7l5m4Ll2J4PQL9K9PK3k1J4Jk5l5
13750a2l8pJ6Kj4L3K4J8J6J0Pk0k8%m7k6JJ7k7L2J8L9L7lK4m0k0Qk3o8LNj2L6
13784c9K1M2qM0k2K6j8l6k4k5j0KJ2jK9J5OL4J1J4k2m1k9j4qj8j2JL4J0N3LkM3
13818F7l1j4j6o0k0K0MK1oQN5J5RMKj4k3k3k3l0kjJ1J4J2M2L6qj4k7K4m6Pn6l1
13853i4K3K9nPL4K5K8Mj3m0j2m2lj6j2K7J2K9K0LJ7L4Jk4k1m6Olk4okN0L6LK3
13888D8J7j5j6k3nm3j8lpMK8JL4L3j2OJ2m2%j4k5rJ5k6J4J9J2L9L1k8Jkml8k8
13923d4Rl7K0J6j2M8K7QPK2j7j6l2l6J2l0J0LRJ8L7LK3j6j4J0n4Rom6j3K6J0M
13957d2M8J3K2NPj9l1k3j0jk3j5J5K5L8kK9JJ8J2l7nm5j6J6j9j4K6qN6K3mJ6k2
$$ plain form
13714 18 15 17 47 45 57 12 -35 -61 -53 -56 -67 -49 -27 18 33 25 63 62 52 35 0 -44 -41 -73 -59 -52 -44 -5 24 31 54 33 47 48 23 -12
13750 -12 -50 -57 -41 -39 -53 -20 4 22 38 48 55 35 7 7 -40 -66 -65 -48 -75 -43 -25 14 51 48 72 32 12 20 -3 -71 -68 -63 -75 -39
13784 -39 -18 24 16 56 34 60 42 6 -18 -43 -53 -51 -39 -40 -11 4 10 44 55 69 47 6 -23 -37 -45 -63 -75 -74 -40 -30 23 26 24 67
13818 67 36 22 6 -54 -74 -54 -50 -29 -35 -27 28 43 52 56 58 44 21 -2 -25 -55 -57 -58 -47 -33 -21 21 57 49 35 8 32 -14 -7 -63 -94
13853 -94 -71 -42 -47 -40 -6 19 47 51 38 -2 -14 -56 -59 -75 -87 -60 -48 -19 1 4 21 55 56 32 11 -35 -29 -32 -56 -62 -64 -14 22 25 48
13888 48 65 50 34 11 6 -37 -55 -58 -65 -61 -33 -32 2 35 23 29 41 -1 -1 -15 -40 -49 -34 -60 -46 -27 -15 24 55 27 28 26 22 -16 -44
13923 -44 -35 -72 -52 -36 -48 0 27 35 42 64 47 31 -1 -37 -25 -55 -45 -42 -33 -15 22 25 48 32 18 28 -26 -17 -23 -69 -82 -56 -46 -42
13957 -42 6 19 41 46 53 34 3 -20 -30 -31 -54 -69 -54 -29 9 7 36 37 55 67 30 25 -20 -36 -20 -39 -53 -27 -35 21 44 40 56 34
13991C4rmk9j6l6J3rJ0K4J0K3K0qJ7k5Nl5m0Pj2Nj3L2oN5M9j5%j7l6L2l7k5j8
14025e4k0M9QN3OK3k0K9k7l6ml3kk1lJjL2K5J3JROk2rk3qql0Rj3L0K8L3KJ1K0
14062E4k3k5j7l1J9n2K1J0NJ6L4K6J2k1Klj4l4j6j3K0j7J3J8J3K2K9J1n2K7j4
14093B0k5k5Km6PL9j2K1L1MK2J8l9Om0k9K9m0j1J2L3K3QjL6lmJ3l8l7Oj3j6j0
14127e9L5K4K2QQR%k0ml5Mm6J6k0J2mJ0M2RL8k3mrk3j8j7l0L0k2NM6J5J3L2lj5
14163B6Rm3J1k6k3k2KL4kL3K6J8j0j2J2k7jl3l1K2m1L0RM5qkL0MMl9j0j9j9OK
14198d5j3K0RJ7K7jJ3Pj5j1j8j5j5J5k1lK9L1J4QRJ1rJ3m7k2j6J0j6J0%K5K4J7
14232D2nLqrk1ok8k9LlJ3L1NNL1K5l3qJj8k5k0plK4OJ3J5J2M5ok1j1Qk5pl9Oj
$$ plain form
13991 34 25 21 -8 -24 -60 -47 -56 -46 -22 -12 11 31 23 40 15 20 -15 -55 -48 -60 -55 -68 -36 -42 13 62 47 47 30 -6 26 -11 -36 -54
14025 -54 -74 -25 -17 36 42 65 45 74 47 11 7 -26 -28 -49 -52 -51 -52 -20 5 18 19 28 34 12 3 -20 -28 -36 -66 -57 -70 -40 -12 21 23 34 54
14062 54 31 6 -11 -42 -23 -75 -54 -44 -39 -23 11 37 49 28 30 27 13 -21 -37 -50 -30 -47 -34 -16 -3 19 48 59 7 34 20
14093 20 -5 -30 -28 -74 -67 -28 -40 -19 12 16 38 56 17 23 -17 -46 -17 -57 -68 -56 -23 0 8 7 43 40 36 49 11 -26 -20 -33 -49 -59
14127 -59 -24 0 22 30 38 47 47 27 23 -12 -8 -54 -38 -58 -46 -50 -40 2 11 49 26 22 13 -10 -28 -45 -75 -45 -67 -62 -16 -1 12 44 41 26
14163 26 35 -8 3 -23 -46 -68 -66 -32 -34 -1 25 43 33 21 33 6 5 -28 -59 -37 -78 -48 -39 6 -2 -4 26 30 34 -5 -15 -34 -53 -47 -45
14198 -45 -58 -38 -29 -12 15 14 27 34 19 8 -10 -25 -40 -25 -46 -49 -20 11 25 33 42 53 44 57 10 -12 -28 -18 -34 -24 -24 1 25 42
14232 42 37 40 32 23 2 -4 -32 -61 -58 -61 -48 -17 -12 -7 24 49 16 8 9 -9 -34 -54 -61 -64 -40 -34 -21 -6 6 51 45 24 13 21 -4 -11 -50 -44 -45
14271d5J9K9K5jL1qj0qk6j6j1l1L1k3j3K4M5LnJ5qPnk2k0ok3K6j5J0K5L5Kj7L0
14306D4J5k8l0Pl3jJ4l8L6OK6J2J7K3k8K0m5%l4Kk1lJ6LJ4J1L7lolm6J8l5Lk4
14341e4j3J7K4L0J2J6JKlj4k3Jk7MLoJM4J4%PJ7mk8j9j3Jrk6MQRJ3K7JK6qRl1
14380A3qm8olJ1j7J1L6K4MQ%Q%m2j5k7J1mOQJ7K8J0K4Mpk2Jk3j5k1J2rK0NJ5%
14418IJ5J6Ok0j0Jj7l0k1NJ0RRJ0M3pK9j5k7k3J8k0k7k4K4qL3K0J1L5onnk6k0
14453hoj3J3k5K6J1J5J1K0JNJqj9k6m2J6kj1K8J6K2K6j1k1Ompk3nk9j4%j0L1J
14489c5K7N4Kkj9ppk9j2nJ0j2J1K8K5MJ5oj5j0j2j3j1k4j8J2L2J7J8QPPlk3k1
14524gj6j0p%k0J3K6L1nK9j2lj4Rj3k2Kj9j1J8KPK5L6kJ4Ok7rl7lk5OJ7kKM7l
$$ plain form
14271 -45 -26 3 28 27 58 50 40 32 6 -10 -21 -52 -21 -44 -57 -33 12 15 10 25 17 24 19 -3 -23 -29 -52 -26 -41 -31 -6 29 31 14 44
14306 44 59 31 1 8 -25 -26 -12 -50 -14 -8 18 30 47 70 42 62 17 17 -17 -15 -36 -39 -23 -20 -6 5 42 39 33 30 -16 2 -33 -30 -54
14341 -54 -67 -50 -26 4 16 32 33 35 32 18 -5 -4 -31 -27 -24 -30 -29 15 29 29 36 53 49 21 2 -11 -10 -19 -45 -41 -33 -24 -11 16 17 43 35 44 13
14380 13 5 -43 -49 -52 -41 -58 -47 -11 13 17 25 25 33 33 -9 -24 -51 -40 -44 -38 -30 -13 15 25 49 53 46 24 25 2 -13 -34 -22 -31 -11 -6 9 9
14418 9 24 40 46 26 16 17 0 -30 -51 -46 -36 -27 -18 -8 35 28 57 42 15 -8 10 -10 -37 -61 -37 -45 -12 8 19 54 48 43 38 12 -8
14453 -8 -14 -27 -14 -39 -13 -2 13 24 44 45 50 51 43 24 -2 -44 -28 -30 -41 -13 3 25 51 40 19 25 21 14 -9 -14 -43 -57 -57 -67 -36 -35
14489 -35 -8 46 48 46 27 20 13 -16 -28 -33 -23 -35 -24 4 29 33 48 42 27 17 5 -8 -19 -43 -61 -49 -17 0 18 26 33 40 37 14 -7
14524 -7 -23 -33 -40 -40 -60 -47 -21 10 5 34 22 19 5 14 1 -21 -19 -38 -49 -31 -29 -22 3 39 37 51 57 30 21 -16 -19 -44 -38 -21 -23 -21 26 23
14562B3K5q%jl8j9%j4j4J6RpQL2K8K1m9J2j9Jnk1k3KJ1K2QK%mL9j6Jk0k6kj6K5
14600a7k4K5J0K8qL6Nlml8j4qpk7jPL6nK0K1K5oj1%k8j5l8MoL1j5k0M3K2K8k8
14636A8L5j5l1opj5j8oJ1L0K4mJ9LJ6ml7oj0k0Kj1QK2kJ0K4J4J7j4j5k3m5Qk2
14671e0j2K2mL4J2rL2Ok0K1j6j8k6j4j2J5J6K0rK7M1j9jnj9j1j0j5j6nJ8j1M3
14704EJ1K6oKjKk6l2qk0J1jMJ4K2K1J0%Ok4J2l4j4k3j9JK5j1M1J4OJ0K0j6kqj9
14741aj4k1nNJ8J1J2K0K4K6k1jl8j4rmk7LK4MoL6K0J6l1k5koKn3K3m2L5K2oM3
14777A8lJ6K3k2%m8mk3jMJ2rM6lL4JNmj5j1J3m4Kk5K1pK9K6j6L3Ml1J7j9Pn4n
14814c3j2LQnM7j4K8pL2k3J0j7m4k0k2J2%K8pK5J6L4lNk5k1j3Nj4j6J7j3K3L4
$$ plain form
14562 23 48 40 40 39 1 -18 -18 -32 -46 -30 -21 -28 -20 12 40 61 12 24 5 6 1 -20 -43 -41 -30 -8 0 2 2 -2 37 21 22 2 -24 -26 -42 -17
14600 -17 -41 -16 -6 22 14 50 55 52 48 10 -4 -12 -19 -46 -47 -40 -4 -9 11 32 57 51 40 40 12 -3 -41 -37 -43 -12 -27 -47 -4 18 46 18
14636 18 53 38 7 1 -6 -21 -39 -45 -34 -4 20 16 35 38 54 50 13 7 -3 -23 -21 -32 -24 -2 -4 6 30 44 61 47 32 9 -36 -28 -50
14671 -50 -62 -40 -44 -10 2 -7 25 31 11 32 16 -2 -28 -42 -54 -39 -23 -3 -12 15 56 37 36 31 12 1 -9 -24 -40 -45 -27 -38 5
14704 5 16 42 36 38 37 39 13 -19 -27 -47 -36 -37 -33 -19 3 24 34 34 40 16 28 -6 -20 -43 -62 -61 -36 -47 -6 8 14 24 44 28 26 18 -1
14741 -1 -15 -36 -41 -36 -18 -7 5 25 49 75 54 53 15 1 -8 -12 -39 -36 -12 -8 -14 22 42 58 27 2 0 -6 -4 -57 -34 -76 -41 -19 -25 18
14777 18 15 31 54 32 32 -16 -20 -43 -44 -40 -28 -37 9 6 40 41 46 42 27 16 29 -15 -13 -38 -17 -24 5 31 15 48 52 21 38 19 26 -28 -33
14814 -33 -45 -42 -34 -39 8 -6 22 15 47 24 34 17 -27 -47 -69 -57 -57 -29 -36 -11 5 39 36 41 16 -5 -18 -13 -27 -43 -26 -39 -16 18
14848A8J0NK2qj1Jj5k6l0k4L1k8J4M2Kj0M8k3oJ0k4m2J5k7kJ0Rj5O1NJ3Mj2j5
14882BNPl1l1j7L1j4L7K7K2MmNj3kj0k8pj2lk4L6J4L1RLj0L6l5mj1n2j1lJ0N%
14919c8K5J2oL0jlk2oj3j6J4k2K7rL1L1j9L1LOj3j4m6j4K0k3J0qL7qJ5PL0k3Q
14954C3k5Pl2j4k8J6nJ5J7K2NKQj4Pk8Jl3KrnLM1L1j1RKJ9pl3k2jkl0J9J5K1j
14992eM3J3k3J1k2j7J5k4j4l0j7L2J3J9MJ8QNll8%jl8Lj0J0M5j5J3K5pJ6j0J9
15026C8j8k7k6Qj6K4k3J9J7lM7Qlk9Ml6J2k6oJ1J5rK2MJ1J1OJ5j2m4k1oj8mrK2
15062d2OK7K5p%lnj1j8qj5K9Nk5K8K1K2kK3mk0j3mmm7lk5L4L2PK5qKJ7J2k8j1
15099A2k5Nl3%j0J8K5K7JmJ6j9J7l3k1j2Nl7LJ8J2K6L4L4k9RlLm4J1m3QNrK3Q
$$ plain form
14848 18 28 33 55 47 36 37 22 -4 -34 -58 -27 -55 -41 1 3 -7 41 18 12 22 -2 -44 -29 -56 -58 -48 -39 -54 7 12 25 29 17 2
14882 2 7 14 -17 -48 -65 -34 -48 -11 16 38 42 38 43 30 28 18 -10 -17 -29 -32 -56 -20 -6 25 34 37 27 63 28 24 13 -39 -50 -53 -43 -38 -38
14919 -38 -13 -1 -7 23 22 19 -3 -9 -22 -38 -24 -46 -19 -28 3 34 15 46 49 55 42 28 -18 -32 -12 -35 -25 -33 4 -4 11 18 48 25 33
14954 33 8 15 -17 -31 -59 -43 -48 -33 -16 6 11 13 21 7 14 -14 -13 -46 -44 -53 -58 -55 -14 17 6 15 17 36 29 -4 -26 -27 -29 -59 -40 -25 -4 -5
14992 -5 38 51 28 39 17 0 15 -9 -23 -53 -70 -38 -25 -6 -2 16 24 29 26 -12 -12 -13 -51 -48 -58 -48 -3 -18 -5 20 13 29 19 38
15026 38 20 -7 -33 -25 -41 -17 -40 -21 -4 -7 40 48 45 16 20 -16 -4 -30 -36 -25 -10 -19 3 7 18 29 35 50 38 -6 -27 -33 -51 -55 -64 -42
15062 -42 -36 -9 16 9 9 6 1 -10 -28 -36 -51 -22 -17 -42 -14 7 29 27 50 46 26 13 9 5 -42 -45 -70 -36 -4 3 28 20 22 39 51 23 12
15099 12 -13 -8 -41 -41 -51 -33 -8 19 20 16 32 13 30 -3 -24 -36 -31 -68 -65 -47 -35 -9 25 59 30 39 36 39 -5 6 -37 -29 -24 -33 -10 -2
15135bK2oL4j0j8J0k0l8%oJ5l1J5K1LK4K5kJ1k7k4Mj7n2M0KpJ6LQJ4J4LRk6k4
15171a7j2Pj9QJK3K6qL0K5rJl1oMl3rq%OK0J0L5nqj0J4j7m2%k6nL0nl7N7J7mJ0
15210A3K2k3l0K3l2KKlK0j1J6RN3j6rJ2m1ooMl7J9j1kK1MK6qK9J3k2k5oj8rj8
15246d5mJ4mL2K9j7K3mkj0oj8m2PK8k1J3K9j1K6RqNk4Jjj6j0k9J0M4pJ4J2L1N
15282E3nk5jm9RoKqK0j2LK4k2M3nK5k9oj4j5m3K2K6j1JK3KJ2oJ6j9lqk1j8Pj7
15319e5L1K0J4MJK0Qqk3j9Rl8mNJ8NjKK4J6j7Qk6rKk1J2k4kL1JQJ4J0J4oKrm4
15358b7J3j5rj1J1K1M1k8M6j5qNk0Nk8Qkj6K7J4PNJ8oJ5nj3ll3k0%Lnj7L2ORK2
15396B7rj1QJk8pj6QRj2j8M7K4JkoNNj8k7J5j6Pj0J4K9KqJ4kLj6ork3kJ3j8MM2
$$ plain form
15135 -2 20 14 48 38 20 30 10 -28 -28 -34 -19 -50 -35 -14 -11 13 38 36 47 20 -4 0 -17 -69 -29 -27 -34 -18 -15 -7 7 21 24 33 7 -17
15171 -17 -29 -22 -41 -33 -32 -9 17 9 39 64 55 56 25 19 23 -10 -19 -27 -27 -21 -1 9 44 39 31 21 35 18 -24 -24 -50 -55 -25 -30 -67 -10 7 3 13
15210 13 35 12 -18 5 -27 -25 -23 -26 -6 -17 -1 8 61 45 36 48 7 1 -5 -1 -38 -19 -30 -32 -11 -7 19 11 40 53 31 6 0 -18 -27 -45
15246 -45 -49 -35 -39 -7 22 5 28 24 22 12 6 -12 -54 -47 -19 -40 -27 2 -9 17 26 18 23 -1 0 -1 -17 -27 -56 -46 -2 -9 5 17 48 53
15282 53 48 23 22 -27 -18 -24 -22 -30 -10 -22 -19 5 -17 26 21 46 17 11 -3 -18 -61 -39 -13 -24 -23 0 2 14 8 24 5 2 -6 -27 -45 -38 -55
15319 -55 -24 -4 10 14 15 35 43 35 12 -7 2 -36 -40 -35 -17 -12 -13 -11 13 29 12 20 -6 -15 -13 -34 -22 -46 -48 -17 -16 -8 6 16 30 24 26 17 -27
15358 -27 -14 -29 -38 -49 -38 -17 24 -4 42 27 19 24 4 9 -19 -11 -13 -29 -2 12 19 24 42 36 51 46 33 30 -3 -23 -23 -20 -25 -42 -10 -4 5 27
15396 27 18 7 15 16 -12 -19 -35 -27 -18 -30 -48 -1 23 24 22 16 21 26 8 -19 -4 -20 -13 -23 -9 20 22 14 28 26 29 13 7 -2 -25 -27 -14 -32 -28 14
15436A4k6K0J0rnK0m2K1k5k4J3Pj4K7mK4J4Nkk4Opj6qqnLJ2L1J9k1K9Pk3J1k7
15472CPk7lj6jK2J9%K2J1ljpj2nLm1%rjJ7J1J8lK2k8L2pk6mk6%qKK1K9jJ2MjL
15513B8k5j0Pjj3J4j5J6K4j5J4pK2rj7qj0k0J6j8jLj5M7K0pmJ0J2j3n0K1k6j8
15547d8J5qK4j3M1NK9j7Ql0Pm5j0L8k6J9%RnJ4J8K0rk2J2l1j8J6j3qJK4NNJ8j9
15583FJ3JJ9m8mk8lJ1kRJ3jL1pJKJ7l1Rk0j2j7KJ7PRK6kJ5k6K2pkk2k4K1j2J6
15621aj4K8RoJ9k2JLm0J6j9J4k3k0L4kPL1k1JLpj2j5JQj2J5k3L8oJ0L1j8K3k4
15657GJ2oj7pKj3K8J3%j0K4oJQk7nj2k0LnkJ0OPJ1K7j5Jnj5Qk1Pk7k4K2J2J1K2
15696EJ8Mk0J1kj2n1J1KMjL3kJ5OK7k4Q%j8j4k9mJ4J1qK6Mj1rK9%j4l3%rrJK9
$$ plain form
15436 14 -12 8 18 9 4 24 -18 3 -22 -46 -33 -26 -40 -13 -17 7 21 26 24 0 6 -1 -17 -25 -33 -38 -35 -23 8 27 6 35 42 19 30 3
15472 3 10 -17 -20 -36 -37 -15 4 4 26 37 34 33 26 14 9 12 -29 -29 -38 -39 -22 -11 7 4 26 -2 30 23 -3 -7 -33 -33 -41 -39 -18 11 10 22 26 25 28
15513 28 3 -7 0 -1 -14 0 -15 1 25 10 24 17 39 30 13 5 -5 -25 -9 -27 -28 -25 -40 7 27 20 16 26 38 25 -25 -4 -30 -48
15547 -48 -33 -41 -17 -30 11 16 45 28 36 6 13 -32 -42 -4 -30 -11 -11 -2 -7 7 25 45 36 14 26 -5 -23 -7 -20 -28 -27 -3 2 7 25 6
15583 6 19 20 39 -9 -13 -41 -44 -33 -35 -26 -13 -14 17 10 11 13 30 -1 8 -12 -24 -41 -39 -22 -15 -6 20 18 33 7 29 22 20 -2 -26 -5 -17 -1
15621 -1 -15 13 22 16 35 13 14 17 -23 -7 -26 -12 -35 -55 -21 -23 -16 15 -6 -5 -2 -9 -21 -36 -35 -27 -39 -24 -47 -9 -15 -5 26 8 31 7
15657 7 19 13 -4 -11 -9 -22 6 19 19 9 33 27 28 36 9 4 -8 -28 -25 -30 -32 -22 -16 -9 2 29 14 15 10 -5 3 -18 -11 -38 -62 -40 -28 -17 5
15696 5 23 27 7 18 16 4 -47 -36 -34 -30 -31 2 0 15 21 48 24 32 32 14 0 -29 -33 -19 -8 -16 10 14 3 -6 23 23 9 -24 -24 -33 -42 -41 -12
15735a2j6K0pJ2RJ2Ok3lj0j4mj5J6K7j8LL6P%kj9L3j3l4j6KOlRQMK9J7j7j6j6
15772bJ4nrol9K5mKJ3K0LK1qpm7K3kl7J3LljL9J7J1k4NJJ6l2mj5LOnJ6j3L5KK5
15812E0j4j6Kk3J0Pk6J0k1Oj3K6K4k9L0JMl4jk4QMk3K2QNK4Knl1L5Mpk5k2K3j0
15849a9LL6%J5qnK1pk4l4J9j7K5k3mJ1J5MJ6J3Mporj5lj1j7j5J0K2j5K6K0J2j1
15885B2lk7J6j7l6K0ljQj0L3mL6Rk4QQl4j1j3L4j1jrK7J9j4K6j4k2Mk3lj5lpr
15922d4M2n0O1oK5l0NmJj7%j8k8K8JOqL3K6kok2J3k4oj7J1QpM4k7L5PQj9jj0p
15960Amj3MoQLjJ3NJ6j0k0K4k0qj4qK3k6K8pK2lK3J2l9K4rj0k1j2LnK6pK5kJ6
15998C1pJ8Kj3km5K4j4rJ4J2k6J7L3mNjmj3k9nk3J5JjJ3jK6k4K6J3l3qk9J4JN
$$ plain form
15735 -12 -28 -8 -15 -3 6 18 24 1 -2 -12 -26 -30 -45 -29 -2 -20 -17 19 26 26 24 5 38 25 -9 -25 -23 -17 -20 -11 -3 1 30 47 30 14 -2
15772 -2 12 7 -2 -8 -47 -22 -26 -24 -11 9 12 33 25 18 -29 -6 -8 -45 -32 -29 -32 -33 6 23 34 10 15 16 32 0 -4 -19 -16 -10 -15 1 -12 23 25 50
15812 50 36 20 22 -1 9 16 -10 0 -21 -15 -28 -2 22 -7 23 24 28 -6 -7 -31 -23 -19 -42 -20 -12 -7 17 19 14 -17 18 22 15 -10 -32 -9 -19
15849 -19 -16 20 20 35 27 22 43 36 12 -22 -3 -20 5 -18 -22 -11 4 8 24 37 41 34 28 19 4 1 -10 -27 -42 -32 -10 -25 1 21 33 22
15885 22 19 -8 8 -9 -45 -25 -28 -29 -21 -31 2 -2 34 43 19 27 35 1 -10 -23 11 0 -1 -10 17 36 22 48 34 12 16 -7 -10 -25 -28 -35 -44
15922 -44 -2 -52 9 3 28 -2 3 -1 0 -17 -17 -35 -63 -35 -34 -28 -36 -3 23 21 15 -7 6 -18 -24 -41 -30 -22 -29 15 -12 23 30 38 19 18 8 1
15960 1 -3 -16 -12 -18 -10 -7 -8 5 10 26 16 -4 20 0 -8 -22 -30 -7 -33 -5 -12 10 7 30 42 3 27 18 8 -13 -25 -22 -27 -1 -8 17 15 31
15998 31 24 42 44 31 29 -16 8 -6 -15 -1 11 -15 2 35 31 36 35 31 18 -11 -16 -39 -24 -23 -24 -11 -12 14 -10 16 29 -4 -12 -41 -27 -26 -21
16035b1qKL5QJ1k9K8Pjk3rKj3j8J8rOL5j1mK3nrLm2M1l8lPRk4K6J8j1NJ3nk4J8
16074Hl5j7J3J3k1L2Pj3K3j1K0J9j9j1k1j2j2NL9Ok5J2OjL7j0j3j8J2j7k6RQp
16108b0J3mL5LMmJ9m3Qk3%l5J8nJK1J2Pk2J5jL0n2J6j6j8M0l9K2QRJ4Mj0J5Ok1
16145Gnl1J9j3LKK4kRJ9k2PKj3k0Nj5KLpK6l5L1j1L9j5mRnk3p%Lk5J2N2nk4J6
16184HK2nNk2krj7Oj0kK6QmK6J2pj8%kjk9J1m8L5NK7%kJ6kk1J3j6j6Jj9j2JK4
16223a8RNKK4j1J1m0J7J1k0rJ3kk3J3J4%RN2m4K5pmk6k0J1k3MJ1J5rL0j9K2j0
16258A3Nk2opj1Qk1J8J6j7K9j5J2j4KqqlK4k6JoqM1MK2K0j0Mpj8%k3LMj2J5J8
16296A7jJK6l6J2J7l0oj0j3QmoJ2oJ7J4%nL0k7k1J5m6LL1j1qL6l1L5mK7mk8Kj1
$$ plain form
16035 -21 -29 -27 8 16 27 -2 26 33 32 9 0 2 -11 -29 -11 -20 -14 21 10 6 29 24 15 18 -24 17 -21 -24 -17 -8 -32 -6 12 1 6 19 14 -10 8
16074 8 -27 -44 -31 -18 -39 -7 0 -13 10 -1 19 38 19 8 -13 -25 -37 -32 7 13 -12 0 6 5 42 32 19 1 13 -4 -30 -21 -13 -20
16108 -20 -7 -11 24 27 31 27 46 3 11 -12 -12 -47 -29 -34 -33 -12 0 7 -15 0 -1 29 -23 -7 -23 -41 -1 -40 -18 -10 -1 13 17 7 22 28 7
16145 7 2 -29 -10 -23 -20 -18 6 4 13 32 10 17 19 6 -14 -9 -24 -22 -19 -26 0 -35 -4 -15 24 9 5 14 9 -14 -21 -21 -18 -43 -31 21 16 -8 8
16184 8 30 25 30 8 6 -3 -20 -14 -24 -26 0 8 4 30 42 35 17 17 15 14 -15 -4 -52 -17 -12 15 15 13 29 27 6 19 3 -13 -12 -31 -43 -42 -18
16223 -18 -9 -4 -2 22 11 22 -18 -1 10 -10 -19 -6 -8 -31 -18 -4 -4 5 57 13 38 31 27 1 -19 -8 -31 -27 -16 -1 -10 20 1 23 13
16258 13 18 -4 -10 -17 -28 -20 -41 -23 -7 -24 5 -10 2 -12 -10 -18 -26 -29 -5 -31 -30 -36 -44 -3 1 23 43 33 37 30 12 12 -11 -8 -4 -16 -1 17
16296 17 16 17 43 7 19 36 6 0 -10 -23 -15 -19 -25 -13 -19 -2 12 12 7 37 10 -11 4 -42 -39 -8 -19 -27 9 -22 13 9 36 32 4 6 -5
16333eKKk7J1%K8J6QNMnqmRl4j5k7K9JJ9PqnoQj2j2lkrK0k3KJ3RRM3m3PPj2J2
16375A1k0qNj4pJ5L4P
$$ plain form
16333 -5 -3 -1 -28 -17 -17 11 27 35 40 44 39 31 27 36 2 -13 -40 -11 -10 9 16 8 3 -3 5 -7 -19 -22 -24 -33 -13 -36 -34 -21 -12 -3 40 -3 4 11 -1 11
16375 11 -9 -17 -12 -26 -33 -18 16 23
16383B3
$$ Imaginary data points
##PAGE= N=2
##DATA TABLE= (X++(I..I)), XYDATA
0@%%%%%%%%%%%%%%%%%%%%%Jl3O4o4O4o4O4o5R7j28J28j30J62j93K00k31K57k90
39a61L25l57M03m38M85n38N89o48P14p94Q86r70J067j185J304j440J595j768J971
58A040k210K495k835L253l787M497n478O929r305J3859k5732J15624L37482p3473
72C62359k92243j75869J09591J56466m8369k34827j39303Q9367J65369j290j46660
83a55409n2015K00405K93334J06796j67203k41249r6229N8773N0060m9957q1359
94a34053o719N3239K7167j4331L2964J30392J44787K5435j10869j34274o0678
105d6940j5302m3718n9292J5265J07726Q5757m2499j05489J2925J94243K05840
116C08516l676k18698k09890j7555J06575K2765j20735r4699R6767K10535Q7870
$$ plain form
0 0 0 0 0 0 0 0 0 0 0 0 0 0 0 0 0 0 0 0 0 0 0 1 -32 32 -32 32 -32 32 -33 64 -64 64 -66 96 -97 103 -128 129 -161
39 -161 164 -193 210 -228 257 -281 308 -340 374 -420 466 -504 563 -622 682 -758 837 -931 1040
58 1040 -1170 1325 -1510 1743 -2044 2453 -3025 3904 -5401 8458 -17274 98350 435832 362359
72 362359 70116 -105753 3838 160304 111935 -122892 -262195 -172828 -7459 -8749 -155409
83 -155409 -207424 -7019 286315 393111 225908 -15341 -111570 -52797 -2737 -52694 -134053
94 -134053 -140772 -87533 -60366 -74697 -41733 88659 233446 258881 148012 13738 -46940
105 -46940 -62242 -105960 -165252 -149987 -42261 43496 997 -104492 -91567 102676 308516
116 308516 304840 86142 -123748 -141303 -34728 -11963 -132698 -227397 -130630 79905 167775
127A67775j23163j45961O2355K39454J40528j47523l03449j63607Q9711J65636
137a8244K2166j09840m4086J26621J68261K3106j20114p8571Q1047J35465p430
148A78381j87912j99138l7557J11094J10009K0204j4174L6199P2609K6010m2230
159G3495l6885K6715M0996l9638j25763j09073m963O9424N3421J4826L7833R2372
171I2760P3985l4614j13467n7948O6661R2104l7158j73702j44331L0096J53514
182e2100J00578k8643m8968O2151J36131M1310j28069j64494j9963J22823P8008
193I8764j02120j88553o1611J38754J89335N8704p1613m8840O2338Q3401l3543
204A25016j43162j04804L1906R3100Q416j00743q3052N1019J46622J05737k774
$$ plain form
127 167775 44612 -101349 -38994 200460 340988 193465 -109984 -273591 -183880 -18244
137 -18244 3922 -105918 -150004 -23383 144878 167984 47870 -30701 50346 185811 178381
148 178381 -9531 -208669 -246226 -135132 -25123 -4919 -19093 17106 89715 115725 73495
159 73495 36610 63325 104321 64683 -61080 -170153 -175116 -105692 -52271 -37445 388 92760
171 92760 166745 132131 18664 -39284 27377 119481 82323 -91379 -235710 -205614 -52100
182 -52100 48478 19835 -29133 33018 169149 210459 82390 -82104 -102067 20756 98764
193 98764 -3356 -191909 -253520 -114766 74569 133273 61660 12820 75158 158559 125016
204 125016 -18146 -122950 -91044 2056 10472 -90271 -173323 -122304 24318 130055 127281
215A27281m9043j0804J8149k5880q5962p2069P381N2424R958n0785l2226N6502
227e5074J09329O4897j5386l4678N872J5185m9871j11990p5084L6357R3226K9201
239A1984o5861n7456N7816J39552Q3675m4769r4426k4734M6283N692r9277j20451
251a61972q018J14427J03844j5868q4961j1866J09211J20263Q89j09124r1514
262c4689M264L9368k7977r2236m7847O6111J15398M7482m2983m0573M1970Q5797
274A14085K4669p1890r3489l2742J7755l650m7141k8022M9720R4171N1020k2583
286E1903l3404K2963N7050Q590p0850q5895k5464K6623O322m1548k8163N2356
298e9517J05553O1565l0020n8852J084N7618K2574o9808j05168l9608M4741M7437
$$ plain form
215 127281 78238 67434 85583 59703 -26259 -98328 -90947 -38523 -28565 -79350 -111576 -55074
227 -55074 54255 119152 103766 69088 74960 90145 40274 -71716 -146800 -110443 -17217 11984
239 11984 -53877 -111333 -53517 86035 169710 124941 30515 5781 52064 57756 -41521 -161972
251 -161972 -169990 -55563 48281 32413 -52548 -64414 44797 165060 165949 56825 -34689
262 -34689 -30425 8943 -19034 -111270 -159117 -93006 22392 69874 26891 -13682 28288 114085
274 114085 138754 66864 -26625 -59367 -41612 -45262 -92403 -120425 -70705 23466 74486 51903
286 51903 18499 41462 98512 107102 36252 -49643 -75107 -48484 -42162 -83710 -111873 -59517
298 -59517 46036 107601 77581 18729 19813 77431 100005 30197 -74971 -114579 -69838 -22401
310b2401j7373m3785K0674R9798Q8732p771p7494m5200L1150M0536l5068r7549
322f5751o3225K9258P0819K5560k7417o257O3646Q3998J6467o4314o7964n332
334a0512L0326r769o8051n9135J5370O9053M6247p391j1467L8331O5902J9035
346A17939n6131p3930k2357K3425L175m8965n1677J3157P2525N9364K69k2742
358A4052J6937N4878K4300n1066q3830l8717K3080K3923k7110m8519K697P1023
370a8352P4815J3624l3438j2106L5391L0237l4948q3227n5304J3570L9895J834
382b8009l4953p794N6584P7672K7655l2741l4371R759K5811j8966p0510o0590
394i0453L230M6137K5077j7083j1976M0138P0816L4759k9524m8991j2305J8416
$$ plain form
310 -22401 -39774 -83559 -62885 36913 125645 117874 40380 -4820 26330 66866 31798 -65751
322 -65751 -128976 -99718 -28899 -3339 -30756 -37013 26633 110631 127098 62784 -5180 -10512
334 -10512 19814 10045 -58006 -117141 -101771 -32718 13529 6138 -5329 33002 98904 117939
346 117939 61808 -12122 -34479 -11054 -7879 -56844 -108521 -95364 -22839 36525 36794 14052
358 14052 30989 85867 110167 59101 -24729 -63446 -40366 -16443 -43553 -92072 -89375 -18352
370 -18352 56463 70087 36649 24543 59934 90171 55223 -28004 -83308 -69738 -29843 -28009
382 -28009 -62962 -70756 -14172 63500 91155 58414 24043 33802 59613 40647 -29863 -90453
394 -90453 -87223 -41086 -16009 -33092 -45068 -4930 65886 100645 71121 22130 9825 28241
406B8241n566n4553n9369m445M9124M3732m33j5223K2165N9437L8773k4257n8961
419A8665l2381J0021P306l4850n2823j1393M7113N7170J5930j5562L978M2305
431E5479L7578j7113o1342m6988m0J6275j4279m0520j4723M1247O2888K8843j3553
444C3752j1484K3189L1659j0463n7981n5264q999K2284N112k5485j5723L2672
456c6731O2822L8347r970k4713K696K2816l240m9187n8215j7463K5017K2991p942
469c2772j4425K1420N6118M3714m636l3588j6745J0853K206l6436n4166k2820
481h1277K4519L5895Q517j0252J0875M5269M3241n50l8533l1707o26N859k3271
494a2041m6044k4594K3241M4879K2426o280L78L1786L9603L560l9891m3932j2179
$$ plain form
406 28241 22675 -31878 -91247 -95692 -46568 -2836 -3269 -18492 3673 63110 101883 77626 18665
419 18665 -13716 -3695 3611 -31239 -84062 -95455 -48342 8828 24758 9196 13174 55479
431 55479 93057 75944 14602 -32386 -32426 -16151 -30430 -70950 -85673 -44426 18462 47305 33752
444 33752 22268 45457 77116 66653 8672 -46592 -55591 -33307 -28195 -53680 -69403 -36731
456 -36731 26091 64438 54468 29755 32451 55267 52027 2840 -55375 -72838 -47821 -24830 -32772
469 -32772 -47197 -25777 30341 74055 69419 35831 19086 29939 32145 -4291 -58457 -81277
481 -81277 -56758 -20863 -12346 -22598 -11723 33546 76787 76237 37704 5997 5371 11230 -12041
494 -12041 -58085 -82679 -59438 -14559 7867 1587 1965 33751 73354 76914 37023 -6909 -19088
507a9088Q532p764l3351k4524J8293M8587L4754M81q927J4194L0344P564l4706
520C4389m9423k3911O636N891j6048j8447J2670M4485M0260P618j2969r73J7234
533D7412O435k8581m7712k8791M603J4351k041j0570J0874M0252M0488R041j7930
546C7831j2747P818O030k3704m6175l1327O036K4697J0652o233N382L4393M1755
559E4408J2181k3403k7406l779Q023j2185l9412l5144J580L1874K6818L512j099
572d032K0017L5015J7033j9691l5966j9425K263j426k3203k9208l962K8081L4579
585G5J5889J294Q499K0633J1774j6238l4419k4983m041R78j2154j8395l96K6580
599b4904L4108J7866J420L483J3108N987j9468l6879k6498j503Q444m288j4876
$$ plain form
507 -19088 -10556 -18320 -51671 -76195 -57902 -9315 25439 25920 16993 31187 61531 69095 34389
520 34389 -15034 -38945 -32309 -26418 -42466 -60913 -48243 -3758 36502 44120 31151 30178 47412
533 47412 53847 25266 -22446 -51237 -46634 -32283 -34324 -44894 -34020 6232 46720 55761 37831
546 37831 25084 32902 38932 15228 -30947 -62274 -56238 -31541 -20889 -27122 -21740 12653 54408
559 54408 66589 43186 15780 12001 20024 7839 -31573 -66717 -65137 -33263 -6445 -2933 -4032
572 -4032 15985 51000 68033 48342 12376 -7049 -4786 -6212 -29415 -58623 -62585 -34504 75
585 75 15964 17258 25757 46390 58164 41926 7507 -17476 -21517 -20539 -32693 -51088 -51484 -24904
599 -24904 9204 27070 28490 31973 45081 51068 31600 -5279 -31777 -33280 -24836 -29124 -44000
612d4000m08K8227L8819K0052n158q788N123P451j4570l8267l4051m196J8583
625c1183J2361o512o050J8522L8160K7784k279j9795j1848O94o141k6606l2703
638d5596j1629J6477K3769R495j002Q442K4945K4303K994j8028k0259j0753q832
651e674j7567k1456p352J4688K3697J5064N246Q073J7372J5061k808j9679k0227
664D438j0876q118j5695j8181k410K0998K9365J6466P82J598J3631J4664m510
677D2152k6046k7765j1246Q86m639j4344o337J8545L5214K5903J993r791r67R655
691C3213J319k0558l1391j9557O96P711L85k419J0691K7677K7974R320r790j2578
705B2693m307k472j2929k2672j8185k834Q482Q871P035J2602K1311K0198O161
$$ plain form
612 -44000 -44408 -16181 22638 42690 37532 28744 33867 41318 26748 -11519 -45570 -49766 -31183
625 -31183 -18822 -25334 -31384 -12862 25298 53082 50803 31008 19160 19854 13713 -12893 -45596
638 -45596 -57225 -40748 -16979 -7484 -8486 -44 24901 49204 52198 34170 13911 3158 -5674
651 -5674 -23241 -44697 -52049 -37361 -13664 1400 6646 14719 32091 47152 44344 24665 4438
664 4438 -6438 -14556 -30251 -48432 -50842 -29844 -479 15987 16769 18367 31998 46662 42152
677 42152 16106 -11659 -22905 -22019 -26658 -41002 -47339 -28794 6420 32323 34316 24525 23558 33213
691 33213 34532 13974 -17417 -36974 -36278 -28567 -28182 -30601 -19910 7767 35741 45061 35271 22693
705 22693 18386 15914 2985 -19687 -37872 -40706 -32224 -23353 -16318 -3716 17595 37793 43954
718D3954r394j3837r301q022j4269j8264j1058L616J2136R912O583J2303K0994
731B5353J8828J728j6604j9906j0539m319r732j7217j1576O759K0412J7649O706
744G542L942J2393J7125M989j6574k7251j8858m115j89o721q889K992J9045K3358
758H789J3282K425J600O078K602j1572k3762k2171r322J292K797J348N980J5160
772e474J9330J3274L757j173j372m628j3203k0373j7657o946K488N172N648J0197
786a0960J7134J7652Q905j927n888l938n029j3255k0711j7067l261R083J1103
799a8159P168P894J4705J7577R409n416j3718j0922n745p876j4859j5698m467
812d0107J0961J7602J3565P940P958J0882P319m351j5105j6471j0716o068p165
$$ plain form
718 43954 34560 20723 11422 3400 -10869 -29133 -40191 -36575 -24439 -14527 -7944 4359 25353
731 25353 44181 45909 29305 9399 -1140 -5459 -15191 -32408 -43984 -37225 -16813 836 7542
744 7542 11484 23877 41002 45991 29417 2166 -16692 -20807 -20996 -27717 -36606 -33614 -14569 8789
758 8789 22071 24496 26096 32174 34776 23204 -558 -22729 -32051 -30759 -27962 -26614 -20634 -5474
772 -5474 13856 27130 30887 29714 28342 23714 10511 -9862 -27519 -34465 -31977 -26805 -21157 -10960
786 -10960 6174 23826 32731 30804 24916 20978 15949 2694 -18017 -35084 -38345 -29262 -18159
799 -18159 -10991 -3097 11608 29185 38594 33178 19460 8538 2793 -5083 -19942 -35640 -40107
812 -40107 -29146 -11544 2021 9961 17919 28801 36120 31769 16664 193 -10523 -16591 -23756
825b3756q071j871R572J7270J6547J0288O050M331O70p275j4682j6005j0966n718
839b3616l856k368L342J1773J6927J4628Q125L500J247k647j0197j6935j6495
852a6572q887j392J278J153M668J2231J7744J4634N606k111m379n170r269j5650
866f116j6589r250J446P597P426O458R844J4149J3156N189m672r875r975j0175
880a387j1977j2219p154K341J0062J1856J0351R305R503Q020J964o105j1357j2296
894I07j1433j0197q190k537N649J1915J3076J0861Q156O854M046k066r284j3076
908D681j2464r270p157n049R1Q089J4420J5055J0063M814K170M37l961j0252j4674
923c007j3201p604k558L59L254Q359J3924J5377J0357K846k934n207o648r668
$$ plain form
825 -23756 -31827 -33698 -24126 -6856 9691 19979 26029 30360 31030 23755 9073 -6932 -17898 -23616
839 -23616 -27472 -29840 -26498 -14725 2202 16830 24955 28455 29702 27055 16858 -77 -16572
852 -16572 -25459 -26851 -25573 -24420 -19752 -7521 10223 24857 30463 28352 23973 18803 9534 -6116
866 -6116 -22705 -31955 -30509 -22912 -15486 -9028 816 14965 28121 33310 28638 18763 8788 -1387
880 -1387 -13364 -25583 -32737 -30396 -20334 -8478 1873 11178 20681 28701 30665 24560 13203 907
894 907 -10526 -20723 -28913 -31450 -25801 -13886 -810 10051 18207 25061 29107 27041 17757 4681
908 4681 -7783 -17053 -24210 -29259 -29168 -21079 -6659 8396 18459 23273 25443 25880 21919 11667 -3007
923 -3007 -16208 -23812 -26370 -26011 -22757 -14398 -474 14903 25260 28106 25172 19965 13317 3649
937C649j2810j1897o770JN105P794R848J2353J2272Q373J225n480r021r912j0489
952e759j0238q331l575K539P508R900J1229J1364R550M883k140q243j0799j0936
966c048r798q325n566j52O131J0197J1126J0138Q612O807K355m672j0964j3250
980d09j1225p264m632k144K009P859J2252J2723R028N009K031j072n963j1299
994F903j4130j1491n785m88K679N143Q334J1882J2140Q255K540k311n393p928
1008A0350j0948j2379r890m148K280O423Q179R591J0755R694N825j29n414q131
1022A2058r511j0631j0265p237j272N240Q911R793R739R114P490L063l319q477
1036A4696j0165r784q730p689m722J291P960J1330J0979Q356O252M513O33n531
$$ plain form
937 3649 -9161 -21058 -27828 -27827 -22722 -14928 -5080 7273 19545 27918 29143 23663 14642 4730 -5759
952 -5759 -15997 -24328 -27903 -25364 -17856 -7956 3273 14637 24187 29070 26930 18687 7888 -3048
966 -3048 -12846 -21171 -26737 -26889 -20758 -10561 565 10703 19315 26122 28477 23805 12841 -409
980 -409 -11634 -18898 -23530 -25674 -23665 -15806 -3554 9169 18197 23206 25237 24165 18202 6903
994 6903 -7227 -18718 -24503 -24991 -22312 -17169 -8835 3047 15187 23442 25982 23671 18278 10350
1008 10350 -598 -12977 -22867 -27015 -24735 -18312 -10133 -542 10213 19907 25732 25603 20189 12058
1022 12058 2547 -8084 -18349 -25586 -26858 -21618 -12707 -2914 6825 15939 23429 26492 23173 14696
1036 14696 4531 -5253 -13983 -21672 -26394 -25103 -17143 -5813 5166 13522 19774 24287 24920 19389
1050A9389j0647j2116r552o084l938j425L381R193J2744J1473O920L131N89k305
1064B0753o914j1455j2543q790l785o7K376N496R684J2652J0597N270j4l109n082
1079A5069p924j1418j1592p374j095L627N674P031R700J1355R066L192l228o566
1093A5517p232q334j0079r814n567J463O996Q563Q268Q592Q894O821R86n839r278
1108I957r174q104p780p051l175L743R305J0662Q923O922N932L853j500p831j0968
1123C714j0090p058n241m053m52N822J0930J1826Q367M584K858Q88l637r205j2248
1138b995j0049n195k021o85J780O765J1830J2391P515J937j100k320m868r363
1152C622j2330r678l693J461L311M142O989J1102J1498O657k30m818n691o265
$$ plain form
1050 19389 8742 -3374 -12926 -19010 -22948 -24373 -20992 -11799 945 12418 19338 22469 23058 20753
1064 20753 13839 2384 -10159 -18949 -22734 -22801 -20425 -14929 -5245 7407 18004 23274 23260 20151 15069
1079 15069 7145 -4273 -15865 -23239 -24334 -20707 -15033 -8002 1698 13053 22119 25311 22083 15517
1093 15517 8285 -49 -10128 -19942 -25509 -24046 -17050 -8487 -219 8373 17267 24088 25074 19235 9957
1108 9957 783 -7321 -15101 -22152 -25327 -21584 -12279 -1617 7306 14228 20160 24013 22513 14682 3714
1123 3714 -6376 -13434 -18675 -22728 -23180 -17358 -6428 5398 13765 18349 21207 22095 18458 9253 -2995
1138 -2995 -13044 -18239 -20260 -20945 -19165 -12400 -570 11821 19336 21273 20173 17853 12985 3622
1152 3622 -8708 -18386 -22079 -20618 -17307 -13165 -6176 4926 16424 23081 22851 18033 12342 6077
1166F077q842j0562q202k064M094O499O488P402R486R225M749k402p312q079p515
1181i58p955q334n873L30O520Q707P805O966P467O934K452m885r603r796p333
1196g556n966n808l734K341Q682J0931Q564N305M352M120N73o230j1373j1330
1210g129o845l145k263j030L564R413J2191R072L714R51L89j665o659j1619j1509
1225a2570o210r21J397K169M815R433J1746Q358K330k001l035l851p188j1029
1239f557j0290m846J460M506M669N782R034J0517P049L84m966n878n411o985r570
1254a1102q761l279L974P523O892O028P334Q429N583j257p446q664o878n893o901
1269a4418o438j666N724R719Q929N962N098N374L404k747q829j0480p668m713
$$ plain form
1166 6077 -2765 -13327 -21529 -23593 -19499 -13000 -6512 890 10376 19601 24350 21948 14636 6557 -958
1181 -958 -8913 -17247 -23120 -22790 -16270 -7563 242 7208 14675 21609 24061 19176 9573 -223 -7556
1196 -7556 -13522 -19330 -23064 -20723 -12041 -1110 7454 12759 17111 21231 21804 15574 4201 -7129
1210 -7129 -13974 -17119 -19382 -20412 -16848 -7435 4756 13828 17542 18493 18882 17217 10558 -1061 -12570
1225 -12570 -18780 -19701 -18304 -16135 -11320 -1887 9859 18217 20547 18546 15511 11660 4472 -6557
1239 -6557 -16847 -21693 -20233 -15727 -11058 -5276 3758 14275 21324 21708 16742 10864 5453 -1532 -11102
1254 -11102 -19863 -23142 -19168 -11645 -4753 1275 8609 17038 22621 21364 13918 5254 -1624 -7517 -14418
1269 -14418 -20856 -22522 -16798 -7079 1850 7812 12910 18284 21688 18941 10112 -368 -8036 -12749
1283a2749m028l596M91P038J1080R758N234K555K423J046m140r831j1450p469
1297a3638k679j034q16K048P782J2038J0027L892m55j098j114m430r819j1705
1311a1001p247r45K586K623L422P337J1233R636L286l019m943l970m833q268r954
1326a4057o487J10N116N831N449O969R142P600J859m756p218o278n535o884p531
1341a6670m291K063O873P399O246O416P476N694m48p264r352p045m382m940n732
1356a7957k832M090R291R354N712L875M742M287j203q785j2049q554k877j014
1370a3920k250j561L824R991J1276O572J572M23Q33j891p823j2171r745l032J742
1385a6160K276J726M068Q441J0151O466J147k061k820m291p961j0459p918k013
$$ plain form
1283 -12749 -16777 -20373 -19882 -12844 -1764 7994 13228 15783 18206 19252 15112 5281 -6169 -13638
1297 -13638 -16317 -17351 -18167 -16119 -8337 3701 13728 17620 17165 16067 14953 10523 704 -11001
1311 -11001 -18248 -19193 -16607 -13984 -10562 -3225 8008 17644 20930 17911 12968 8998 4165 -4103 -14057
1326 -14057 -20544 -20434 -15318 -9487 -4038 2931 12073 19673 21532 16776 9558 3280 -2255 -9139 -16670
1341 -16670 -20961 -18898 -12025 -4626 1620 8036 15512 21206 20758 13494 4142 -2903 -7285 -12225 -17957
1356 -17957 -20789 -16699 -7408 1946 7658 11533 16275 20562 19359 10574 -1475 -10029 -12906 -13920
1370 -13920 -16170 -17731 -13907 -3916 7360 13932 15504 15927 16760 14869 7046 -5125 -14870 -17902 -16160
1385 -16160 -13884 -12158 -8090 351 10502 16968 18115 16054 13234 8943 982 -9477 -17395 -19408
1399a9408L065M525M243N640Q216Q081L938j201l754l795n014q449j0216o616
1413b0745P94O516O691M468M556P326P744K953m186p571n882l774n477q460o822
1428b1869R51R139J0879O599K383L050N033K937l836r489r391n024k540l551l876
1443a8605O50Q049J2022R229L200j7Q2l19l842q127r099n849k382r46K2L348Q199
1460d385J0642P819K591p91j818l102o221q770p444l079Q9L62N71M109R689J1551
1476A1813O644n80m444l571k707n511r423q403k060M065M986K316K142O941J1048
1491A3256Q072p20q145q504m648k894n472o991l121M126Q213O717L398L469O240
1506A2996O076K61p361j0637q128l810k344k266m04L977P460P372M823L473L517
$$ plain form
1399 -19408 -16343 -11818 -7575 -1935 6281 14362 18300 17099 13345 9550 4536 -3913 -14129 -20745
1413 -20745 -19951 -13435 -6744 -2276 2280 9606 17350 20303 16117 8546 2664 -1110 -6587 -15047 -21869
1428 -21869 -20918 -11779 -900 5699 8082 11132 16165 19102 15266 5777 -3614 -8638 -11178 -14729 -18605
1443 -18605 -17955 -9906 2116 11345 14545 14528 14610 14291 10449 2322 -6777 -12626 -15008 -15954 -15932 -12584 -4385
1460 -4385 6257 14076 16667 15876 14058 10956 4735 -4035 -11479 -14558 -14469 -14107 -13536 -9427 262 11813
1476 11813 18457 17877 13433 9862 7155 1644 -7779 -16182 -18242 -14177 -9191 -6875 -4733 2208 13256
1491 13256 21328 20608 12463 3959 -689 -3583 -9055 -16046 -19167 -15041 -6828 -111 3287 6756 12996
1506 12996 19072 19333 11972 1335 -6793 -10603 -12947 -15213 -15617 -11640 -4180 3192 8015 11488 15005
1521A5005K133k370p576r670p178l707j933o85K458O831Q831O237K207J066K512
1536A4161J793l468r840j1244o088j53J504M09J682O701J0736Q168J097l517k232
1551I709N47j323p863j1937p967L88N833N216K869M059P814Q094K666m038o415
1566G652m062k146m478p965o946p73N839Q006O410M664M841M358Q07m022o513
1581E672n581l928m330n355l461J619O398P630N986M669M654L027j711o944q327
1596A8n127j792k353m549l062L103R088R579M953J279J632K452r11p399j1016
1611d105p428p28K104l01k240J420Q232J1223O800J9k819j710j398n161r425q402
1627a3919k154L333M062J797J809N630Q680O545O48l879m724m211n360p101n959
$$ plain form
1521 15005 17138 14768 7192 -2478 -9656 -13363 -15296 -15981 -13523 -6692 2139 8376 10583 11649 14161
1536 14161 15954 12486 2646 -8598 -14686 -14839 -13335 -12926 -11244 -4543 6193 14361 15458 11941 9709
1551 9709 10256 8933 1070 -10867 -18834 -18446 -12613 -7397 -4528 -469 7345 15439 18105 14067 7652
1566 7652 3590 1444 -3034 -10999 -17945 -18718 -12879 -4873 1537 6201 11042 15400 16207 12185 5672
1581 5672 91 -3837 -8167 -13522 -16983 -15364 -8966 -1336 4650 9319 13973 17000 15289 8345 18
1596 18 -5109 -6901 -9254 -13803 -16865 -13762 -4674 4905 9858 11137 12769 15221 14310 6911 -4105
1611 -4105 -11533 -12261 -10157 -10458 -12698 -11278 -3046 8177 14977 14996 12177 10467 9069 3908 -5517 -13919
1627 -13919 -16073 -12740 -8678 -6881 -5072 558 9238 15783 16431 12552 7828 3617 -1743 -8844 -14803
1642a4803j149L716N135L783L382N357O640L965j370n024n211m282n202o751m976
1657a6790P96O280P194M050K006L791N961L472k965p826p351l613k277m253m542
1672a6067K41P202J0032O263R83Q3K676K931k088q192r451n054o61j73j476M37
1688a2314N861R795P749J935j778j194k3k256o792q638n335m21J852J510K272
1703g777N670Q517O723J323k832l073j972l230o539p545l903J393L738K857K606
1718d044N292Q026O079N6n037n308k839k491n343o940l448K855O395N044K553
1733H50L182N979N598M6o194p930m697j684k622m702k991K847P643P321L457J441
1749G544K779L556j32o031q841o166j746m55j850j336L007P681P962L878L39K38
$$ plain form
1642 -14803 -15952 -12236 -7101 -3318 64 5421 12061 16026 14656 9632 4421 139 -5063 -11814 -16790
1657 -16790 -15994 -9714 -2520 1530 3536 7327 13288 16760 13795 5969 -1382 -4995 -7272 -11525 -16067
1672 -16067 -15826 -8624 1408 7671 8654 8737 11413 14344 12256 4064 -5387 -10441 -11102 -11275 -12751 -12314
1688 -12314 -6453 3342 11091 13026 11248 10054 10031 7775 983 -7655 -12990 -13411 -11559 -10049 -7777
1703 -7777 -2107 6410 13133 14456 11624 8551 6579 3349 -3190 -10735 -14638 -13245 -9507 -6650 -4044
1718 -4044 1248 9274 15353 15409 10372 5064 2225 -266 -5609 -12549 -15997 -13142 -6747 -1703 850
1733 850 4032 10011 15609 15655 9461 1531 -3166 -4850 -7472 -12174 -15165 -12318 -4675 2646 6103 7544
1749 7544 10323 13879 13747 7716 -1125 -7291 -9037 -9492 -11342 -12678 -9671 -1990 5972 9850 10189 10427
1765A0427J192j008n904q831o360j281J368N30J94L227P585P991L650j167k264
1780I349q80j434n378q386o300n89L365L035J431K862O634P579L390k416m677
1795G585l099j897m104o962n704j45M849N251K924K364M854O276K934l166o448
1810E512n129k400k624m897m544K87N776P024M147J683K741M442K275l492p715
1825C086o767k746q76k326l039N03O118Q209N167J000L01J997J418l299p957p800
1841g011l173N49M18q40R43N553Q249N647O87j686n97j14l072p302p597l217J560
1858a1003K673J249J666N006P473N228K8l350k675j278k845o406p008k758K821
1873a1179M738K972J809L951O456M864o77n108m968k180j829m579o087k637L496
$$ plain form
1765 10427 11619 10611 4707 -4124 -10484 -11765 -10397 -9867 -9673 -6446 1139 9130 12780 11613 9349
1780 9349 8469 7035 1657 -6729 -13029 -13618 -10253 -7218 -5787 -2925 3709 11288 14678 12262 7585
1795 7585 4486 2589 -1515 -8477 -14181 -14326 -9477 -4226 -1302 1062 5916 12192 15126 11960 5512
1810 5512 383 -2017 -4641 -9538 -14082 -13795 -8019 -995 3152 4835 7576 12018 14293 10801 3086
1825 3086 -3681 -6427 -7303 -9629 -12668 -12165 -6047 2162 7329 8329 8630 10627 12045 8746 789 -7011
1841 -7011 -10184 -9635 -9217 -10057 -9114 -3561 4688 10335 11022 9336 8739 8625 5553 -1749 -9346 -12563 -11003
1858 -11003 -8330 -7081 -5415 -409 7064 12292 12320 8970 6295 5017 2172 -4234 -11242 -14000 -11179
1873 -11179 -6441 -3469 -1660 2291 8747 13611 12934 7826 2858 678 -1151 -5730 -11817 -14454 -10958
1888a0958O737N050J926K008M343M121n70n971o962l685r40k030l978k241L277
1903i873P510O655K567N38J689K353q69n816p555m578o95n4j590q68L295P390
1919I9O921K678n71l73N31j532n714p590m553J07J782M35K7L228P149O970K320
1936A1914k082k679r66j401n041p311m747P41L986K888Q69K205N834O703K480
1951A3393l113n055l012j415l309n858m539P40N244N119K311J437L759N206K218
1966A3126l361o359m717j857j850l802l383J011N707O395L254R38J894L412J418
1981A1826l723p039n663j837l79j770k185J256N971P207L826J04k13J524P89l499
1997F195p347o436j817J295P29o99J077N378P399M384l76k327q61j96k864o555
$$ plain form
1888 -10958 -4221 829 2755 4763 9106 13227 12657 6686 -276 -3961 -4901 -6931 -10909 -13150 -9873
1903 -9873 -2363 4292 6859 7397 9086 11439 10570 4754 -2801 -7379 -8074 -8128 -9718 -10586 -7291 99
1919 99 7020 9698 9127 8754 9285 7753 2039 -5551 -10104 -9997 -8215 -7780 -7753 -4525 2624 9594 11914
1936 11914 9832 7153 6187 4786 -255 -7566 -12313 -11572 -7586 -4698 -3829 -1624 4210 10913 13393
1951 13393 10280 5225 2213 798 -2511 -8369 -12908 -12168 -6924 -1805 506 1943 5702 10908 13126
1966 13126 9765 3406 -1311 -3168 -5018 -8820 -12203 -11192 -5485 910 4164 5102 6996 10408 11826
1981 11826 8103 1064 -4599 -6436 -6815 -8585 -10770 -9514 -3543 3664 7490 7594 7381 8905 9694 6195
1997 6195 -1152 -7588 -9405 -8110 -7381 -8080 -7003 -1625 5774 10158 9782 7455 6594 6398 3534 -3021
2013c021o433j986K413K997J182J243M303O534M243o99l761k844j189k424n457
2028d899n730j575L412M722K564J242L168N368L780j280n100m492j809j447l946
2043f022m949j410M155O524M097R61J157L497L371j068n813o239k842m19j453
2058f453l240j362L794P241N652J408n71Q04J776q55n153o621l756k08L25r40
2074h159k42L476O799N774J542j380j028M9j473m904o156l311N18J671L20L67
2090f137L565O824N649Q05l111k816o48j065m407o269l357J660L949K092K37K137
2106h92N926O122J210m438n602k502k48k094m881l831J148N254M708J563P10L117
2122E270M746J855l786o769m826j213l34j994k281Q45M658N314K793Q84J494K494
$$ plain form
2013 -3021 -9454 -11440 -9027 -6030 -4848 -3605 698 7232 11475 10776 7015 4171 2982 558 -4899
2028 -4899 -10629 -12204 -8792 -4070 -1506 -264 2904 8272 12052 10772 5672 1180 -629 -2076 -6022
2043 -6022 -10971 -12381 -8226 -1702 2395 3356 4513 8010 11381 10313 4500 -1739 -4581 -5000 -6453
2058 -6453 -9693 -11055 -7261 -20 5632 7040 6469 7273 9049 8194 3041 -3580 -7336 -7544 -7219 -8159
2074 -8159 -8401 -4925 1874 7648 9190 7810 6782 6831 5358 454 -5702 -9013 -8495 -6824 -6504 -6137
2090 -6137 -2572 4252 9901 10706 7595 4779 4131 3066 -1341 -7610 -10967 -9307 -5358 -3266 -3029 -892
2106 -892 5034 11156 12366 7928 2326 -176 -424 -2518 -7399 -11230 -10082 -4828 -120 1443 2153 5270
2122 5270 10016 11871 8085 1316 -3510 -4723 -5057 -7051 -9332 -8487 -3829 1485 4278 5162 6656 9150
2138I150N71l794o425m880j446K0p01o64K065N139N084J982k08N94J965Q2m587
2155C947p388m988j48K107O82p08J576N617O298K240k142k380M56J035k921p357
2171d074o567p92M182M067R06J75L328N809L597j574m480k837j98j004m578n733
2187i773k044L467N700L730J274J531L076K363j103m038l790j807j395l075l533
2202i417p04L581N371L859J688J609K255Q14k779n041l663p74l31k617l472j98
2218i819N066O942L848n0m73J586J489k507o499n672q67K211N11k606j629L722
2234d747P906N994K80l156j839M90p13m706o253k800K039L339Q77q54J581N569
2250C007N986J813k883m021k278j489k980m047k154J457L355K208R18J979M155
$$ plain form
2138 9150 9721 5927 -498 -5378 -6824 -6804 -7505 -8169 -6104 -965 4119 6101 5893 6487 8452 8534 3947
2155 3947 -3441 -8429 -8577 -6470 -5788 -6496 -4920 697 6995 9235 7093 4713 5169 6204 3283 -4074
2171 -4074 -10641 -11433 -7251 -3184 -2278 -2103 1225 7034 10631 9057 4577 1740 1542 538 -4040 -9773
2187 -9773 -11817 -8350 -2650 1080 2354 3885 6961 9324 8221 4183 393 -1414 -2809 -5884 -9417
2202 -9417 -10121 -6540 -1169 2690 4378 5987 8242 9056 6277 1236 -2427 -3201 -3532 -6149 -9621 -9819
2218 -9819 -4753 2189 6037 5987 5514 7100 8589 6082 -417 -6089 -6956 -4745 -4234 -6840 -8469 -4747
2234 -4747 3159 9153 9433 6277 4438 4928 4215 -491 -6744 -9544 -7505 -4166 -3289 -4143 -2562 3007
2250 3007 8993 10806 7923 3902 1624 135 -2845 -6892 -9046 -7589 -4234 -2026 -1108 871 5026
2265E026L969O33l066l852k507k071l274l516p62L287M510K241k9J195M131M096
2281A0011j99m967n534k356j92j535l523j671L472O691M448k10j575J382L895
2296H137J324m457p282m506J66J446o75j524J683N837N967J707k043j727R35J095
2312F083k514o003n194j107J891J785P54J877M379M646J704j634k262p64m49k724
2328D68m879l746k18K296K028J213K405M650M345N53l288l504r37J61k278n092
2344e823l884Q20M352L637R44P30L433M707J384l969n904k924O68J54l203m122
2360i000k65M770N846K594k21O57K744J784k654o107m853p27J291l86k169m91
2376g187L629N689L677L46n37N69L52k483n275m567j049J346P30o11N44L697N167
$$ plain form
2265 5026 8995 9628 6562 2710 203 -1868 -5142 -8658 -9420 -6133 -1623 618 589 1784 5915 10011
2281 10011 9812 4845 -689 -3045 -3237 -4772 -8295 -9966 -6494 197 4645 4435 2860 4242 8137
2296 8137 9461 5004 -2278 -6784 -6618 -5172 -5847 -7371 -5688 149 6116 7823 5780 4053 4988 6083
2312 6083 3569 -2434 -7628 -8735 -6844 -5059 -4305 -2428 1951 6597 8301 6667 4405 3641 3192 468
2328 468 -4411 -8157 -8375 -6079 -4051 -2838 -433 4217 8562 9115 5827 2323 1386 1547 -731 -5823
2344 -5823 -9707 -8887 -4535 -898 46 776 4209 8916 10300 6331 427 -2497 -1829 -1675 -4878 -9000
2360 -9000 -9265 -4495 1351 3945 3724 4381 7125 8909 6255 148 -4705 -5432 -4141 -4527 -6696 -7187
2376 -7187 -3558 2131 5808 6154 5617 6186 6538 4055 -1220 -5787 -6836 -5490 -4760 -5371 -4827 -1130 4037
2393D037K985l34j332j78j66k774n474m479l61K707K050j38K15L507N419L121
2409H805j284l344j668M5j535m764m908q38L744M249J347l66J729M449L547r41
2425H267m428l833r88l48k656l958j311L296N329L110J93L09K486K621o34m368
2441C087m669j962j15j065k379p48L146N359L667M11m13J093J582j066m511m914
2457c497j990N55J48j327l72L206N621L937J27j631l34R39r07m402n296k189J388
2474f024J885O4l21K442N301M311K57k768k194j15m55l406m968k556J600L414
2490c533J773J09J484M149M049M49l272l621j298l67k193l962k416J678M274L061
2506C64O73O73K755L318M11l572m575k214j81j011k760j984J742M802M035J069
$$ plain form
2393 4037 7022 6688 5356 5178 5012 2238 -3236 -7715 -8076 -5369 -3319 -3457 -3242 265 5684 8805
2409 8805 7521 4177 2509 2554 1019 -3745 -8653 -9491 -5747 -1498 -151 -517 1212 5661 9208 8267
2425 8267 3839 6 -982 -1330 -3986 -7944 -9255 -5959 -630 2480 2673 2982 5468 8089 7455 3087
2441 3087 -1582 -3544 -3659 -4724 -7103 -7851 -4705 654 4321 4732 4319 5412 6994 5928 1417 -3497
2457 -3497 -5487 -4932 -4784 -6111 -6483 -3277 2344 6281 6408 4777 4443 5382 4475 73 -5223 -7412 -6024
2474 -6024 -4139 -4075 -4396 -1954 3347 7658 7915 5147 2953 2838 2383 -1023 -5991 -8547 -6947 -3533
2490 -3533 -1760 -1651 -167 3982 8031 8480 5208 1587 289 -78 -2271 -6233 -8649 -6971 -2697 364
2506 364 1037 1710 4465 7783 8194 4622 47 -2167 -2348 -3359 -6119 -8103 -6361 -1559 2476 3545
2522C545k01J241K330K73l502n127k923j2K76j337j406J664M803M622J371r10
2538D707k87J080M1l234n113l258J39J424J12o50J468M504M710J504j549j796
2554C802r8q6k736m845l348L33K560J595J5R64L784M603J652k158l254j384j60
2571A239j747l982l361K82L417L091Q72M25K524L836J785k262m224k748n07p59
2587b119k621k698K14L625L996J772K47J221K589J319k188m562l455r04m2j263
2603d869j739N30L680M371K110o4J06J485Q08k280m753l853q30Q69Or80N72L667
2621a164M740K360o69j289K24N91j868m630m276q99J812J663O3L19K914M557K747
2638G195q05k547j424m4j170l687m059j173K239K964J362M88J996L584K503q20
$$ plain form
2522 3545 3344 4585 6915 7188 3686 -1441 -4364 -4376 -4100 -5437 -6843 -5179 -376 4246 5617 4707
2538 4707 4420 5500 5541 2307 -2806 -6064 -5925 -4501 -4389 -5039 -3571 933 5643 7147 5598 3802
2554 3802 3704 3618 882 -3963 -7311 -6978 -4418 -2823 -2808 -1844 1940 6543 8195 6037 2783 1399 1239
2571 1239 -508 -4490 -7851 -7569 -4152 -1061 -189 236 2760 6596 8381 6119 1895 -853 -1360 -2119
2587 -2119 -4740 -7438 -7224 -3599 397 2169 2416 3637 6226 7545 5357 795 -2660 -3564 -3606 -4869
2603 -4869 -6608 -6078 -2398 1973 4083 4019 4125 5610 6418 4138 -615 -4468 -5298 -4429 -4423 -5403 -4831 -1164
2621 -1164 3576 5936 5267 3978 4202 4793 2925 -1705 -5981 -6880 -5068 -3405 -3342 -3023 -109 4448 7195
2638 7195 6390 3843 2419 2375 1205 -2482 -6541 -7714 -5475 -2511 -1149 -661 1335 4919 7422 6602
2654F602l150k577q31q52k607l156r23K420L663K167P18J248K568J889j082l616
2670B481l331j196l75j565k385o35K751M322K774M36K44J469J535j126l997m078
2686b676j528M24j64j432n61K561M656L415M22r00j2P99q84l671m330j994P71
2703e104J214k6j27K054M231L531N72j634j348k56q92l047l929j927R68K161J156
2720b403L78J748L575L127L93k227k385j002q36k419l342j743J392L039K066P00
2736F1J107K741K753K35k780l377j706n28j348k573j535J472L694L084R80L31
2752B611J477K071J35k875m016k398l86k36j314j054J442L769L572J327k25K82
2768D182J028j76k763m106k705j94O09j56l54J437L644L659J333p62q25Q1l88
$$ plain form
2654 6602 3452 875 44 -808 -3415 -6571 -7494 -5074 -1411 756 1474 2722 5290 7179 6097 2481
2670 2481 -850 -2046 -2421 -3986 -6371 -7006 -4255 67 2841 3277 3521 4990 6525 5399 1402 -2676
2686 -2676 -4204 -3780 -3944 -5376 -5937 -3376 1280 4695 5117 4217 4205 5004 4120 449 -3881 -5875 -5104
2703 -5104 -3890 -3916 -4043 -1989 2242 5773 6345 4711 3363 3107 2215 -832 -4761 -6688 -5720 -3559 -2403
2720 -2403 -2025 -277 3298 6425 6818 4591 2206 1204 368 -2051 -5393 -7136 -5744 -2705 -639 61
2736 61 1168 3909 6662 6897 4117 740 -966 -1494 -2842 -5415 -6950 -5478 -1784 1300 2280 2611
2752 2611 4088 6159 6294 3419 -597 -2995 -3381 -3617 -4931 -5985 -4543 -774 2798 4125 3900 4182
2768 4182 5210 5034 2271 -1835 -4540 -4734 -4125 -4281 -4635 -3198 446 4105 5438 4676 3851 3932 3544
2785C544k572m034k697M7J586R96K27J167L210L588J362j284k026r66m86j919
2801b57l468k719Q9K407K278R01Q24K318K964J344j491k841j981q51j234k507
2817d224k158J96K752L022J585P36J395K064Q69j707l239k526r71p24j597j494
2833f021N80L035L504J826L24N26J269M47j918l604k934q36J33n45r32O13L130
2850a403L924K103j22o86J89K08j668l573l267r63Q84Q37qN45K570L739K421j75
2868E555j655j201m46j325k862k959j015J177J800J014Q54K067L049K005l54k122
2884C582j966j116j263k262k286n97J640K352J499R23J675K464J589q46k785k569
2900C4j239p66j616j916k80K192L103J997O08P23J642J388q78l204l365j548j51
$$ plain form
2785 3544 972 -3062 -5759 -5712 -4126 -3130 -2903 -1736 1474 5062 6424 5140 3114 2148 1662 -257
2801 -257 -3725 -6444 -6355 -3948 -1670 -769 55 2373 5337 6681 5190 2349 368 -483 -1717 -4224
2817 -4224 -6382 -6186 -3434 -412 1173 1909 3304 5368 6237 4530 1291 -1235 -2206 -2930 -4527 -6021
2833 -6021 -5441 -2406 1098 2924 3248 3774 5043 5490 3572 -32 -2966 -3802 -3669 -4214 -5146 -4533 -1403
2850 -1403 2521 4624 4502 3816 4005 4213 2545 -1028 -4295 -5258 -4374 -3537 -3545 -3000 -430 3309 5730 5555
2868 5555 3900 2699 2253 928 -1934 -4893 -5908 -4731 -2931 -1917 -1063 1004 4053 6058 5704 3582
2884 3582 1616 500 -763 -3025 -5311 -5908 -4268 -1916 -417 506 2181 4645 6234 5388 2603 34
2900 34 -1205 -1971 -3587 -5503 -5783 -3591 -488 1509 2117 2840 4482 5870 4992 1788 -1577 -3125 -3276
2917c276m02j062k45K013L457K692O62k53L61O47p30k866l540k027JO62J87L48
2935c371J737L065K655P58o43o52l19j038k508l145j753K28J222R39Q67J840K794
2952B676K229K82j244j346p16j048k338k868j423Q25K055J561R18J399K451K067
2968E480O7k007k359j171o57j517k339j446R95K791K496J171O59J416J583J20
2984E282k110l048j971o05m85j196r98Q97K775K949J621L81M00N71k76k024k977
3001h14k204o38l3k96j01J142K683K835J457J02j96j16p62k221k956j964k53O57
3019c678M03K94J226K708K782J185n49j107o93p70j948k879j998PJ545J408O72
3036a392R29K121K579J218q60k044j555r12j315k122j789k1J930K250J402P77
$$ plain form
2917 -3276 -3678 -4740 -4985 -2972 485 3177 3839 3586 3947 4594 3864 998 -2542 -4569 -4568 -3906 -3719 -3371
2935 -3371 -1634 1431 4086 4844 4201 3549 3230 2192 -316 -3461 -5214 -4986 -3764 -2825 -1958 -118 2676
2952 2676 4905 5187 3943 2597 1881 833 -1505 -4373 -5796 -4971 -2916 -1355 -437 962 3413 5480
2968 5480 5547 3540 1181 10 -647 -2164 -4503 -5949 -4954 -2163 333 1504 2163 3579 5162 5282
2984 5282 3172 124 -1847 -2452 -2937 -4133 -5131 -4234 -1459 1490 3111 3492 3892 4463 4187 2163 -814
3001 -814 -3018 -3656 -3689 -3985 -4086 -2944 -261 2574 4031 4133 3937 3821 3059 838 -2118 -4082 -4335 -3678
3019 -3678 -3275 -2981 -1755 953 3735 4920 4371 3264 2571 1801 -147 -3026 -5024 -5017 -3472 -2064 -1392
3036 -1392 -463 1658 4237 5455 4595 2551 996 84 -1231 -3353 -5142 -5163 -3233 -983 419 1196
3052A196J268J754R73r55k337k185j263r16j300j105K83K044K527J742P63P39
3068C228R82L62j243k485k317j222n43o85n44P04K295K737J717M26N0L67k6j445
3086B358k660k459j040J18J52J8P64K173K890J812J05p94n35l80j238k447k448
3103c611j024N72J112P48Q38J785K523J764j5j356j449q85j140j893k015q26Q63
3120d009J677J405J057J420J902J333k27j732j916j307j032j373j445m36J241
3135c442K085J729J092R85J298Q76n49k057k328j422p18q07q51j27J486K451K017
3152A718R29M24N57M40p40k188k528j577l84mk10K48J466K496K157Q46j34k48
3170C268j90q29j996k490j602j45O32N94O28J397K231K058P35n75j008p93r42
$$ plain form
3052 1196 2464 4218 5191 4236 1899 -286 -1549 -2465 -3765 -4870 -4587 -2543 -16 1726 2489 3228
3068 3228 4210 4572 3329 844 -1473 -2695 -3238 -3923 -4467 -3763 -1468 1269 2986 3412 3462 3829 3803 2358
3086 2358 -302 -2761 -3801 -3683 -3531 -3513 -2749 -576 2314 4126 4231 3437 2902 2522 1284 -1163 -3611
3103 -3611 -4635 -4063 -2951 -2203 -1365 420 2943 4707 4692 3336 1887 1002 -138 -2031 -4046 -4872 -4009
3120 -4009 -2332 -927 130 1550 3452 4785 4558 2826 910 -397 -1429 -2802 -4247 -4683 -3442
3135 -3442 -1357 372 1464 2449 3747 4623 4074 2017 -311 -1733 -2451 -3258 -4109 -4236 -2750 -299 1718
3152 1718 2647 3071 3628 4068 3328 1140 -1388 -2965 -3349 -3353 -3563 -3315 -1849 647 2804 3650 3516 3268
3170 3268 3078 2249 253 -2237 -3839 -3984 -3352 -2758 -2130 -733 1498 3556 4291 3716 2708 1915 973
3187I73j745k163j360J05J162J212R81J274J857J676M95r55j574j287j011j367
3203a727j667j045L96J606J709J232J049J333J259J52j285j997j615r77r15j069
3219c561o31O96J870K026J312P15P66P28j25j516k286j822q21l89m13j66Q43K034
3237g40K229J311L71O6J06l83j533k289j950p38J80L36L79R01J875K142J308R7
3255C668n74n72p28j388k070j778o09N48J050R07J029J612J803J027j74j027j136
3272A588r82j303j680j398l23R44J412J281J123J313J387O46n43j475j481j079
3288e70j032j248j054k3J324J882J501R04Q71Q89L83p97j839j866j081n83n95
3305b934o45J56J430K133J750Q16K61J87j6q78j830j995j183l09Q2Q0M46J347
$$ plain form
3187 973 -772 -2935 -4295 -4190 -3028 -1816 -835 439 2296 3972 4467 3512 1938 651 -360 -1727
3203 -1727 -3394 -4439 -4043 -2437 -728 504 1553 2886 4145 4297 3012 1015 -600 -1577 -2492 -3561
3219 -3561 -4192 -3496 -1626 400 1712 2427 3193 3921 3796 2280 -6 -1828 -2649 -3038 -3451 -3617 -2774 -740
3237 -740 1489 2800 3171 3237 3343 2960 1427 -862 -2812 -3550 -3370 -3034 -2655 -1754 121 2263 3571 3668
3255 3668 3094 2522 1794 406 -1664 -3442 -4051 -3503 -2453 -1546 -517 1095 2898 3925 3751 2724 1588
3272 1588 606 -697 -2377 -3775 -4098 -3154 -1742 -461 662 1975 3362 4008 3465 1990 509 -570
3288 -570 -1602 -2850 -3904 -3927 -2603 -721 780 1684 2555 3444 3827 3030 1191 -675 -1756 -2339 -2934
3305 -2934 -3579 -3423 -1993 140 1890 2706 2967 3154 3138 2260 430 -1565 -2748 -3057 -2975 -2895 -2449 -1102
3323a102K016J744P75j13m70o11j043j710j761j019o9N13O44Q09J355J761J458
3340C177M79n02q94r33j186j586j488p32L85J018R80Q79J209J563J198J92r85
3357B774j402j164j008j184j275n72P17J545J471R18P51R79R37Q3j218j829j505
3374i82q88n94o44k59P21J652J798J133M85L06L17k25j181j819j612q77k71n8
3392b998K93R50J632J665J047K78o9k34o08j293j705j433n83P2L67O19J106J692
3410G98J586P67j63n97n82o88j263j651j296k92O22R32P97R75J422J459P35m90
3428C071j207j080p72r03j222j099k36R25J431J186R13R08R65N23n58j462j505
3445a22r87o26o86o07L7R93J580J406Q91N97M28O0p98j482j561r80m59k84j32
$$ plain form
3323 -1102 914 2658 3433 3320 2850 2239 1196 -514 -2275 -3294 -3363 -2850 -2206 -1397 -42 1719 3177
3340 3177 3656 3154 2260 1327 141 -1445 -2933 -3665 -3280 -2262 -1282 -403 806 2369 3567 3759 2774
3357 2774 1372 208 -800 -1984 -3259 -3831 -3114 -1569 -98 820 1571 2550 3487 3570 2352 523 -982
3374 -982 -1870 -2464 -3108 -3367 -2646 -994 804 1937 2422 2728 3045 2820 1639 -180 -1792 -2669 -2940 -2998
3392 -2998 -2705 -1755 -123 1542 2589 2867 2798 2564 1956 663 -1042 -2475 -3058 -2986 -2619 -2000 -894 798
3410 798 2384 3151 2988 2391 1809 1121 -142 -1793 -3089 -3381 -2759 -1827 -1030 -55 1367 2826 3561 3071
3428 3071 1864 784 12 -891 -2113 -3212 -3448 -2523 -1092 94 1007 1915 2880 3403 2845 1383 -122
3445 -122 -1109 -1735 -2421 -3028 -2991 -1998 -418 988 1879 2476 2904 2964 2166 684 -877 -1857 -2316 -2600 -2732
3464b732L71J184J629J313O26K29O9k37r54j633j590q10o6J97J85M98J205J707
3482A191J295L95l13m83m72q39j484j565q15K21Q22O96N95R77J417J208L12o57
3500B501j042q44q08j134j200o36L58J106J135Q38P91R88Q19J36q72j271j114
3517b49q17q26q15l14O42J320J279Q70N71O38N40j81j124j503j128o13m63m42
3535b615j23Q14J533J506P71K10J59J93k65j155j669j277m31N5Q2J90P06J482
3553A66J558Q02n6l86l17m28j003j499j212l71L76N96N35P46J288J308O92k23
3571B572p61o98n96r48j229j002j38O78R02P48P89J027J086M84n54j096r51o07
3589b94o79r81q45M8J015J282R21N22O66P80L76o36j438j278o32l16m75n44O3
$$ plain form
3464 -2732 -2361 -1177 452 1765 2391 2620 2689 2452 1498 -135 -1725 -2535 -2601 -2404 -2219 -1721 -516 1191
3482 1191 2486 2881 2568 2085 1613 774 -710 -2275 -3090 -2869 -2047 -1351 -756 221 1638 2846 3158 2501
3500 2501 1459 615 -193 -1327 -2527 -3163 -2805 -1699 -564 274 1065 2053 2872 3008 2136 865 -249
3517 -249 -1066 -1892 -2707 -3021 -2379 -1059 220 1090 1661 2299 2839 2658 1534 31 -1097 -1710 -2173 -2615
3535 -2615 -2738 -1924 -391 1115 1886 2096 2255 2448 2183 1028 -641 -1918 -2349 -2294 -2212 -2022 -1316 166
3553 166 1724 2526 2470 2084 1767 1339 336 -1163 -2375 -2746 -2370 -1774 -1239 -493 795 2103 2795 2572
3571 2572 1811 1113 517 -431 -1660 -2662 -2800 -2122 -1220 -472 317 1344 2430 2914 2360 1264 313 -294
3589 -294 -973 -1954 -2799 -2751 -1736 -454 467 989 1655 2435 2811 2175 737 -541 -1173 -1489 -1964 -2508 -2445
3608b445J068J545J122M45J73L01J09o59j415j411p24j07J8q2K98J001J485J113
3626A835L88q1j77k53p76j338j310n66J47L17K45M51J009J409R84J47m78n00l77
3645A076p20j287j275m39M75Q41N46L53Q11J242R77J5q42j000n80m87r10j110
3663b314m71O34J223R93M38L89P61P99L7r66j273r19m21m51o20k88O05J322J202
3682F80N58K21L33L77j62r51j350r20l70k11k97L8P84J363J179M60n6L6J59l52
3702A519j061j394q80p0J67K4R8P54J433J296L58m19m78j54k41q72j398r48LO73
3722a590N20K53N11J132J260M68n48j016o05k81n54r72q70j5Q09R29N83M86P10
3741A210Q72L72o12j149q80m17m21o03n18J24R24J061O55L55N27N80J69q24j286
$$ plain form
3608 -2445 -1377 168 1290 1735 1908 2209 2318 1659 244 -1167 -1891 -1998 -1980 -2062 -1764 -763 722 1835
3626 1835 2223 2142 1965 1712 936 -402 -1712 -2278 -2131 -1814 -1569 -1118 -109 1300 2284 2431 1953 1453 1076
3645 1076 356 -931 -2206 -2645 -2170 -1329 -783 -430 381 1623 2600 2615 1773 773 193 -294 -1204 -2314
3663 -2314 -2785 -2151 -928 65 503 892 1653 2452 2489 1523 250 -669 -1090 -1541 -2161 -2449 -1844 -522 680
3682 680 1238 1459 1792 2169 2007 1056 -294 -1214 -1584 -1795 -2092 -2054 -1270 93 1272 1732 1676 1712 1871 1519
3702 1519 458 -936 -1816 -1886 -1719 -1695 -1597 -843 590 1886 2244 1825 1347 1193 952 80 -1318 -2266 -2263 -1590
3722 -1590 -1070 -817 -306 826 2086 2554 2006 990 385 104 -450 -1422 -2292 -2307 -1498 -569 14 500 1210
3741 1210 2082 2454 1842 693 -187 -604 -1025 -1628 -2146 -2022 -1098 -37 618 973 1500 2080 2249 1425 139
3760A39r60l26j36l54l87K94J118J223O73K7J35L52J18p87j438j173k78K88J06
3779a366j55K09J023J357P50o6l62j14jn29j322j231l80M85O17K49K40P26J154
3798A284P73p3o42n55k43m58r80j023l24N52Q75N47L29N81Q63N72k16q15p58l58
3818f9l63p51p93j76P37J065O85K55L66O48M61l70j055r94l90o7l95o24j66P86
3838a210J293Q88J72pK71L28k75j076j226n34J37J17k81j31O31J305J042K28l25
3857A347j87O7k12r73j198o07J77M70J74J2M87J113R97K15m48n27j97l02p58j014
3877a364n75L03P04M58J47L86Q78Q28J70o61p63l94k27n33q69m84L88R36P31K13
3897B72J94N68P26J23p83j009n85j19k27o14m24L99J097R89K95q1J80M95J35p49
$$ plain form
3760 139 -821 -1147 -1283 -1637 -2024 -1730 -612 611 1284 1311 1446 1798 1916 1129 -309 -1482 -1760 -1472 -1366
3779 -1366 -1521 -1312 -289 1068 1818 1752 1390 1276 1275 746 -576 -1807 -2187 -1702 -1085 -836 -596 130 1284
3798 1284 2057 1984 1342 787 544 86 -894 -1917 -2241 -1689 -814 -267 62 643 1506 2078 1862 1047 289 -69
3818 -69 -432 -1183 -1976 -2152 -1415 -350 335 590 956 1604 2065 1695 640 -354 -744 -811 -1206 -1830 -1996 -1210
3838 -1210 83 971 1143 1136 1407 1735 1460 384 -842 -1376 -1239 -1122 -1403 -1534 -903 402 1444 1672 1347
3857 1347 1160 1227 1015 42 -1156 -1763 -1586 -1116 -942 -930 -443 670 1667 1882 1434 907 710 408 -350 -1364
3877 -1364 -1939 -1636 -932 -474 -327 59 937 1765 1935 1274 511 117 -110 -643 -1512 -1996 -1608 -672 59 272
3897 272 466 1034 1760 1883 1100 91 -494 -613 -840 -1454 -1878 -1479 -382 607 902 821 1001 1496 1631 882
3917H82j187p33m3R6k37l24K92J095J148M33k52j99J47N6o02j102q44o0L37J66
3937i31j12K65R15J078M81k91n13k10p1m58r35p62o4N02M59J45J88P53R27M63
3957A829l87p48m33j76l31p51o63K5O99O84K47Q7N04Q02M45m52r74p12j39o1m90
3978i95n98K3Q33R57M17p9J04N51M52l55j093r83k48J54l9l72m7P14J085O43j01
3999A023k14J12K94k21r64j035l81K22K74pQ3N89R35N97m5l91j85Q9k18q30r27
4020a200l20K99M53J94J44N39Q74N47j86o53l91K4j21o70q60l54M83P57L93M4
4040dK82P65O02j88q67p64j05J18l03p26m87M45R96P23J02l6L41M77m1q05r97
4061d72l88J62R1l41l43K65R06Q42K87j24J5J93j23o97r26m29J31K25n0j56K77
$$ plain form
3917 882 -305 -1038 -1081 -985 -1222 -1546 -1254 -159 989 1422 1170 971 1118 1174 572 -530 -1374 -1434 -1097 -931
3937 -931 -1043 -778 137 1215 1696 1405 892 682 611 153 -782 -1544 -1608 -1106 -647 -502 -314 439 1366 1829
3957 1829 1442 694 261 85 -246 -997 -1660 -1635 -936 -252 -5 82 586 1388 1833 1381 407 -305 -444 -505 -995
3978 -995 -1593 -1570 -737 220 637 558 662 1213 1665 1310 217 -766 -1014 -860 -899 -1271 -1318 -604 481 1124 1023
3999 1023 809 921 1215 994 30 -1005 -1386 -1164 -890 -897 -814 -225 710 1307 1262 871 686 775 557 -273 -1200
4020 -1200 -1520 -1221 -768 -574 -430 109 983 1530 1344 691 300 324 203 -467 -1327 -1681 -1198 -441 -48 -4
4040 -4 278 1043 1645 1457 590 -174 -279 -161 -464 -1190 -1677 -1232 -236 487 589 553 894 1371 1330 525 -472
4061 -472 -860 -698 -607 -948 -1291 -1026 -120 722 1009 885 900 1093 970 273 -653 -1082 -951 -726 -776 -932 -655
4082f55Q42P69K13k00j90O5j62o90r54m14K97M97J48j59J90P99Q38J90m80n04
4102D40q0on14q86n71K98Q47N16n7o3M73P73L50m90q18m34J9j58n60n29J34Q29
4124d87Q22J98j48J40M71L09l98q07n97j36l0k69l00J87P70Q30K59j39k7K36J53
4145A037m12q32n75q3J55j09k04J76Q53Q93K72l15l33O4J77l45q49p27k3M25K74
4166d81j40K0O61R30M64l64o64k55J22j15o07p36j90M74O25J65J9L03P36M67k43
4187A191p66n53r2Ql49n33j42M42O97L59L2J84M65L65k73p96o34j62Q1j56l96
$$ plain form
4082 -655 187 956 1169 969 779 844 682 -8 -962 -1376 -1079 -582 -434 -593 -403 396 1234 1424 944 440
4102 440 360 354 -160 -1046 -1617 -1319 -472 44 -13 -76 397 1170 1520 1030 212 -222 -203 -361 -921 -1450 -1316 -487
4124 -487 335 533 385 525 996 1305 907 100 -497 -633 -663 -932 -1232 -1045 -275 555 814 675 648 884 1037
4145 1037 625 -207 -782 -865 -710 -819 -1023 -847 6 899 1171 856 523 587 764 419 -430 -1157 -1180 -755 -481
4166 -481 -621 -601 60 990 1454 1090 426 171 293 178 -429 -1165 -1355 -881 -256 -91 -72 231 967 1434 1191
4187 1191 425 -128 -220 -212 -561 -1094 -1236 -794 -97 262 294 478 943 1308 1035 239 -395 -557 -476 -632 -1028
$$ [...]
16383A7
##END NTUPLES=NMR FID
##END=
