##TITLE=abcd
##JCAMPDX= 6.0         $$ Bruker NMR JCAMP-DX V2.0
##DATA TYPE= NMR FID
##DATA CLASS= NTUPLES
##ORIGIN= UXNMR, Bruker Analytische Messtechnik GmbH
##OWNER= root
$$ XWIN-NMR		Version 3.5
$$ Mon Jun 30 18:25:00 2025 Russian Standard Time (UT+4h)  servis@DPX200
##.OBSERVE FREQUENCY= 200.131235884673
##.OBSERVE NUCLEUS= ^1H
##.DELAY= (6, 6)
##.ACQUISITION MODE= SIMULTANEOUS
##.ACQUISITION SCHEME= undefined
##.AVERAGES= 32
##.DIGITISER RES= 18
##SPECTROMETER/DATA SYSTEM= spect
##.PULSE SEQUENCE= zg
##.SOLVENT NAME= CDCl3
##.SHIFT REFERENCE= (INTERNAL, CDCl3, 0, 16.5164)
##AUDIT TRAIL= $$ (NUMBER, WHEN, WHO, WHERE, WHAT)
$$ ##TITLE= Audit trail, XWIN-NMR		Version 3.5
$$ ##JCAMPDX= 5.01
$$ ##ORIGIN= Bruker BioSpin GmbH
$$ ##OWNER= servis
$$ F:\spectra/data/av/nmr/H1/1/audita.txt
$$ ##AUDIT TRAIL=  $$ (NUMBER, WHEN, WHO, WHERE, WHAT)
(   1,<2025-06-30 18:24:22.14 +0400>,<servis>,<DPX200>,
      <created by zg, POWCHK disabled, PULCHK disabled
       configuration hash MD5:
       00 E9 B6 7A A2 85 ED C7 34 08 36 98 17 FE 4E 26
       data hash MD5: 32K
       6C 63 E9 AD B4 A0 F5 A4 9B 30 4F 17 B0 FE E0 2B>)
$$ ##END=
$$ 
$$ hash MD5
$$ 2D FE 8B F9 97 B0 C5 BB 27 05 96 38 31 AA DA 39
##$RELAX= 
##$RELAX= 
##$RELAX= 
##$RELAX= 
##$RELAX= 
##$RELAX= 
##$RELAX= 
##$RELAX= 
$$ Bruker specific parameters
$$ --------------------------
##$DU= <F:\spectra>
##$EXPNO= 1
##$NAME= <H1>
##$PROCNO= 1
##$TYPE= <nmr>
##$USER= <av>
##$AMP= (0..31)
100 100 100 100 100 100 100 100 100 100 100 100 100 100 100 100 100 100 
100 100 100 100 100 100 100 100 100 100 100 100 100 100 
##$AQSEQ= 0
##$AQ_mod= 1
##$AUNM= <au_zg>
##$AUTOPOS= <>
##$BF1= 200.13
##$BF2= 200.13
##$BF3= 200.13
##$BF4= 200.13
##$BF5= 500.13
##$BF6= 500.13
##$BF7= 500.13
##$BF8= 500.13
##$BYTORDA= 1
##$CFDGTYP= 0
##$CFRGTYP= 5
##$CHEMSTR= <none>
##$CNST= (0..31)
1 1 145 1 1 1 1 1 1 1 1 1 1 1 1 1 1 1 1 1 1 1 1 1 1 1 1 1 1 1 1 1 
##$CPDPRG= <>
##$CPDPRG1= <>
##$CPDPRG2= <>
##$CPDPRG3= <>
##$CPDPRG4= <mlev>
##$CPDPRG5= <mlev>
##$CPDPRG6= <mlev>
##$CPDPRG7= <mlev>
##$CPDPRG8= <mlev>
##$CPDPRGB= <>
##$CPDPRGT= <>
##$D= (0..31)
0 2 0 0 0 0 0 0 0 0.06 0 0 0 0 0 0 0.0002 0 0 0 0 0 0 0 0 0 0 0 0 0 0 
0 
##$DATE= 1751293461
##$DBL= (0..7)
120 120 120 120 120 120 120 120 
##$DBP= (0..7)
150 150 150 150 150 150 150 150 
##$DBP07= 0
##$DBPNAM0= <>
##$DBPNAM1= <>
##$DBPNAM2= <>
##$DBPNAM3= <>
##$DBPNAM4= <>
##$DBPNAM5= <>
##$DBPNAM6= <>
##$DBPNAM7= <>
##$DBPOAL= (0..7)
0.5 0.5 0.5 0.5 0.5 0.5 0.5 0.5 
##$DBPOFFS= (0..7)
0 0 0 0 0 0 0 0 
##$DE= 6
##$DECBNUC= <off>
##$DECIM= 32
##$DECNUC= <off>
##$DECSTAT= 4
##$DIGMOD= 1
##$DIGTYP= 9
##$DL= (0..7)
0 120 120 120 120 120 120 120 
##$DP= (0..7)
150 150 150 150 150 150 150 150 
##$DP07= 0
##$DPNAME0= <>
##$DPNAME1= <>
##$DPNAME2= <>
##$DPNAME3= <>
##$DPNAME4= <>
##$DPNAME5= <>
##$DPNAME6= <>
##$DPNAME7= <>
##$DPOAL= (0..7)
0.5 0.5 0.5 0.5 0.5 0.5 0.5 0.5 
##$DPOFFS= (0..7)
0 0 0 0 0 0 0 0 
##$DQDMODE= 0
##$DR= 18
##$DS= 0
##$DSLIST= <SSSSSSSSSSSSSSS>
##$DSPFIRM= 0
$$ [...]
##$SUBNAM0= <"">
##$SUBNAM1= <"">
##$SUBNAM2= <"">
##$SUBNAM3= <"">
##$SUBNAM4= <"">
##$SUBNAM5= <"">
##$SUBNAM6= <"">
##$SUBNAM7= <"">
##$SUBNAM8= <"">
##$SUBNAM9= <"">
##$SW= 20.6817932712277
##$SWIBOX= (0..15)
0 0 3 0 0 0 0 0 0 0 0 0 0 0 0 0 
##$SW_h= 4139.07284768212
##$TD= 32768
##$TD0= 1
##$TE= 0
##$TE2= 300
##$TE3= 300
##$TEG= 300
##$TL= (0..7)
0 120 120 120 120 120 120 120 
##$TP= (0..7)
150 150 150 150 150 150 150 150 
##$TP07= 0
##$TPNAME0= <>
##$TPNAME1= <>
##$TPNAME2= <>
##$TPNAME3= <>
##$TPNAME4= <>
##$TPNAME5= <>
##$TPNAME6= <>
##$TPNAME7= <>
##$TPOAL= (0..7)
0.5 0.5 0.5 0.5 0.5 0.5 0.5 0.5 
##$TPOFFS= (0..7)
0 0 0 0 0 0 0 0 
##$TUNHIN= 0
##$TUNHOUT= 0
##$TUNXOUT= 0
##$USERA1= <user>
##$USERA2= <user>
##$USERA3= <user>
##$USERA4= <user>
##$USERA5= <user>
##$V9= 5
##$VALIST= <valist>
##$VCLIST= <CCCCCCCCCCCCCCC>
##$VD= 0
##$VDLIST= <DDDDDDDDDDDDDDD>
##$VPLIST= <PPPPPPPPPPPPPPP>
##$VTLIST= <TTTTTTTTTTTTTTT>
##$WBST= 1024
##$WBSW= 30
##$XGAIN= (0..3)
0 0 0 0 
##$XL= 0
##$YL= 0
##$YMAX_a= 278905
##$YMIN_a= -221516
##$ZGOPTNS= <>
##$ZL1= 120
##$ZL2= 120
##$ZL3= 120
##$ZL4= 120
##$ABSF1= 10
##$ABSF2= 0
##$ABSG= 5
##$ABSL= 3
##$ALPHA= 0
##$AQORDER= 0
##$ASSFAC= 0
##$ASSFACI= 0
##$ASSFACX= 0
##$ASSWID= 0
##$AUNMP= <proc_1d>
##$AZFE= 0.1
##$AZFW= 0.1
##$BCFW= 1
##$BC_mod= 2
##$BYTORDP= 0
##$COROFFS= 0
##$CY= 19
##$DATMOD= 1
##$DC= 2
##$DFILT= <>
##$DTYPP= 0
##$F1P= 11.0000007629395
##$F2P= -0.999999237060547
##$FCOR= 0.5
##$FTSIZE= 0
##$FT_mod= 4
##$GAMMA= 1
##$GB= 1
##$INTBC= 1
##$INTSCL= 1
##$ISEN= 128
##$LB= 0.05
##$LEV0= 0
##$LPBIN= 0
##$MAXI= 10000
##$MC2= 0
##$MEAN= 0
##$ME_mod= 0
##$MI= 0
##$NCOEF= 0
##$NC_proc= 0
##$NLEV= 6
##$NOISF1= 0
##$NOISF2= 0
##$NSP= 1
##$NTH_PI= 0
##$NZP= 0
##$OFFSET= 16.51637
##$PC= 1
##$PHC0= -271.4733
##$PHC1= 1.101538
##$PH_mod= 0
##$PKNL= yes
##$PPARMOD= 0
##$PSCAL= 4
##$PSIGN= 0
##$REVERSE= no
##$SF= 200.13
##$SI= 16384
##$SIGF1= 0
##$SIGF2= 0
##$SINO= 400
##$SIOLD= 16384
##$SREGLST= <1H.CDCl3>
##$SSB= 0
##$STSI= 0
##$STSR= 0
##$SW_p= 4139.07284768211
##$SYMM= 0
##$S_DEV= 0
##$TDeff= 0
##$TDoff= 0
##$TI= <>
##$TILT= no
##$TM1= 0
##$TM2= 0
##$TOPLEV= 0
##$USERP1= <user>
##$USERP2= <user>
##$USERP3= <user>
##$USERP4= <user>
##$USERP5= <user>
##$WDW= 1
##$XDIM= 8192
##$YMAX_p= 0
##$YMIN_p= 0
$$ End of Bruker specific parameters
$$ ---------------------------------
##NTUPLES= NMR FID
##VAR_NAME=  TIME,          FID/REAL,        FID/IMAG
##SYMBOL=    X,             R,               I
##VAR_TYPE=  INDEPENDENT,   DEPENDENT,       DEPENDENT
##VAR_FORM=  AFFN,          ASDF,            ASDF
##VAR_DIM=   16384,         16384,           16384
##UNITS=     SECONDS,       ARBITRARY UNITS, ARBITRARY UNITS
##FACTOR=    0.0002416,     1,               1
##FIRST=     0,             0,               0
##LAST=      3.9581328,     0,               0
##MIN=       0,             -221516,         0
##MAX=       3.9581328,     278905,          0
$$ Real data points
##PAGE= N=1
##DATA TABLE= (X++(R..R)), XYDATA
0@%%%%%%%%%%%%%%%%%%%%%%%%%%%%%%%%%%%%%%%%%%%%JjjMoQj2J6k1K7l1L3l7
57b0M4n5P3r8J31j83K69m08O54j136K293o075L9038K44378k3367k65122j61295
74a70879O3085J45367N0804n0972n0077L90r779m2513N083Q6397O7365l3924q6654
87b6307m4727L1599P2725M0111l5665o9890l2700K1330M5962L5106l924l7268
99c648k3281J0380J6550J0378J7167P233k8789m0140m867L3829L2212o618l8125
112a7719j6785K8848K6566j4391j6848K0900K4098j9521m2676j0086L7132L7816
124C7334j5981n2231j4017M4604L5529j9168l1888N921K8188L264l2020k3754
136c4219K3245M3020j746m8180k6822K9700M4122P889k9148k9575K57K2952J2558
$$ y = [0, 0, 0, 0, 0, 0, 0, 0, 0, 0, 0, 0, 0, 0, 0, 0, 0, 0, 0, 0, 0, 0, 0, 0, 0, 0, 0, 0, 0, 0, 0, 0, 0, 0, 0, 0, 0, 0, 0, 0, 0, 0, 0, 0, 0, 1, 0, -1, 3, -3, 5, -7, 9, -12, 15, -16, 17, -20, 24, -31, 42, -56, 75, -108, 161, -247, 407, -729, 1564, -4511, 34527, 278905, 255538, -9584, -170879, -107794, 37573, 88377, 37405, -12672, -12282, -22061, -64574, -59491, 26906, 94271, 60347, -26307, -71034, -39435, 33290, 73401, 37736, -32154, -64854, -43524, 2438, 37544, 33620, -3648, -26929, -16549, 1, 10379, 27546, 34779, 5990, -34150, -39017, -5188, 27024, 20406, -17719, -34504, -5656, 20910, 6519, -10329, 10571, 34669, 15148, -27528, -37614, -482, 37334, 21353, -30878, -44895, -291, 35238, 16070, -15818, -9897, 18291, 21555, -10465, -34219, -10974, 32046, 30300, -17880, -44702, -15002, 29120, 37009, 7861, -21714, -21457, 1495, 14053]
149A4053r372r892J507N69n242J25R954J2689L684j3058j9690j436K0416J5597
163A9904q794k1510j0936Q840J7337N025r025m216O971J901q550j105J2436P830
177A6108j1633j9377k930J7375J3956j0262j7189L563J8322M823j3829q619J0120
190D28J3968l845j8284q028J2787J3776m627j2913j066R845L826p070n414O751
204A34J0528k614j5066q236R930J6239L892j2416j4178k63J3054J0745k265j0079
218e95o510J63L872L758K305K006j601p460o349N164J4076O621r232j5599m522
233a3903J1506J3048j257j1883o182L546M326R11J686L427j30o826o938L088J2612
248G031O120j0064j2989k93J0207P563k028p223l880K814L825m96n82K739K93
$$ y = [14053, 4681, -5211, -3704, -3135, -8377, -8252, 1702, 14391, 18075, 5017, -14673, -16109, 4307, 19904, 11110, -10400, -21336, -12496, 4841, 9866, 841, -3375, 3596, 5497, -3053, -4158, 8278, 16108, 4475, -14902, -17832, -457, 13499, 3237, -13952, -10389, 7933, 12756, -1073, -9692, 428, 14396, 10551, -7733, -15761, -2974, 10802, 6175, -6738, -7804, 2041, 5867, -1203, -6617, 134, 10662, 8048, -7018, -15254, -5324, 10915, 14807, 2391, -11787, -12050, 1004, 11749, 9484, -595, -7105, -6942, -3070, 688, 2993, 4999, 3398, -4062, -10411, -5247, 8829, 15450, 6218, -9381, -13903, -2397, 10651, 9394, -2489, -8671, -5125, -799, 112, 1798, 5225, 5095, -1731, -8669, -5581, 7031, 13151, 3087, -9902, -10195, 12, 7575, 5547, -1676, -5556, -2742, 1083, 587, 5, 2744, 3037]
263C037m563l044K523M978L025k662p109k640N979N660k090n406j673K181K970
278A166O17l075r14L983J902m066k566L361K971r41k912k459Q14L561Q09m340
294b089j459L683J995k094j437Q40J671J958r61m140n94M504J506l762k617J351
310a645J662Q61o07k372M21L518P5l419J18L640N14k537j523QJ629K134j401m166
328c090J96L621N04j748j38N01j58Q93N26j229M70J671j473k620J166K370l13
345A149j335j278j174J708L223q57l310L08K312J02m16L79m61m12N39o83j053
362a259J614J467k377j713J103J540K92J25r30j450J256K154q04j457N31K98o60
379b70K87K06o80K71N96j338q68K104J056j469q92Q34M21M80O29j157j199J189
$$ y = [3037, -1526, -4570, -2047, 2931, 5956, 3294, -3815, -6455, -476, 5184, 3094, -2312, -3985, -1804, 1166, 1783, -1292, -2206, 1777, 3679, -387, -2953, 408, 3379, 2438, -474, -2933, -2119, 1442, 2251, -2089, -3548, 135, 2130, 36, -1401, -561, 1110, 3068, 2107, -2033, -2627, 1877, 3383, -379, -2996, -1645, 17, 878, 271, -2101, -1680, 1838, 1913, -1506, -1388, 2252, 2766, 229, -1294, -1286, 343, 2477, 1076, -3090, -2894, 727, 1231, -517, -655, -154, -312, 581, 1107, -122, 348, 2019, 546, -2074, -908, 1462, 1149, -186, -1464, -2638, -930, 2293, 1436, -1874, -1566, 746, 848, 432, 811, 350, -62, 477, -206, -1259, 355, 1822, -555, -2268, -1165, 375, 667, 792, -138, -1588, -332, 1822, 1018, -439, 92, 390, -270, 17, 223, -457, -186, 410, -928, -1796, 308, 1364, -105, -997, -163, 258, 738, 1367, 210, -989, 200]
397B00P19r92l03O09o28o09P57K74m91P72K83j239k07J466N52m65k75p21o19J171
417B54R30j287o71P56p2r71L99J061J24j39n52r51Q16J768M3j564m88M99l60L2
437c73P64J19p98n19m10J70J474J021q90r49J04o7K31J045O25r24j374n86K31
456a106J382J206r39j794k44P89Q37Q13O26q87j447m47Q53J222R43q29j792o26
474a440Q82M84K80Q23k81j509j532P44K374K060j145l031j007J919K267j93j101
491E94q25n67o45J07J328J456j74k096j294J194K036P36l39p43j214j345K25K247
509F81K072j102l469j817K497L118K75k151j025M67J31k92M78J620M97j833k477
526b330M79K511J188n35j054j068j229J96K248J963m57l064k325J749L880Q41
$$ y = [200, 919, -73, -376, 233, -395, -1004, -247, 27, -464, 308, 591, -648, -855, 611, 1163, 698, 423, -298, -917, 254, 1184, -103, -774, -18, -90, -1061, -662, 399, 523, 384, -168, -1119, -303, 1465, 1508, -56, -544, -45, -405, -373, 391, 510, -288, -807, -1217, -1047, 427, 1448, 558, -391, -287, -354, -123, 922, 1547, 623, -751, -1337, -1106, 276, 1482, 543, -1251, -1495, -706, 131, 944, 1570, 683, -764, -1211, -358, 864, 1807, 978, -814, -1440, -558, -74, 206, 1029, 748, -761, -2293, -1549, 825, 2885, 1740, -1291, -2298, -379, 1888, 1695, 594, -231, -798, -1443, -1336, -8, 1448, 1274, -822, -2116, -922, 1114, 1850, 1511, 768, -446, -1791, -1566, 681, 2753, 1651, -1818, -3635, -1138, 1980, 2255, 104, -921, -454, -323, -615, -137, 1483, 1980, 147, -2330, -1851, 660, 1848, 1313, 259, -809, -2038, -1842, 406, 2369, 1912, -1152, -3477, -1728, 2152, 2993]
542B993k552j334R82N21j163o25J557J487r94l315j776K791M113K54k158j855
558a074l96Q46J902J442j006k671j825J01K402K341n95k051o1N97p02k08K131
575A173J807j286l592k290J992M738J932l351l803J5K247J671Q27l33k259j858
591b370R8J464K290O68j507k165L67J266J18O41J877l09l717k974J335L988K594
608C664k209n142q52M563L733r34j968m59o06k93j19J54P58O17j409k495N85K815
626D03J636L72m12k321k484J084L494J270j814l314j824K129L955O33k641p81
642f15R28n76j013R16J747N03j665k802j018L308L306l79k337r93m12j8K128J887
660B895j152l358k307P74L335K684j587k845O82J929mr22J424J014j701l094j628
$$ y = [2993, 441, -893, 89, 610, -553, -1178, 379, 1866, 872, -2443, -4219, -1428, 2685, 2939, 781, -1074, -1470, -624, 1278, 2720, 1714, -957, -2782, -2681, -279, 2062, 1467, -584, -645, -48, -750, -958, 1173, 2980, 1694, -1898, -4188, -2196, 2542, 4474, 1123, -2680, -2665, -418, 1253, 2080, 1747, -512, -2370, -2272, -808, 1482, 2150, 643, -1522, -1155, 111, 229, 870, 2747, 2438, -1279, -4253, -2918, 1070, 3664, 1455, -3687, -4539, 24, 3757, 2823, 855, 396, -210, -503, -622, -468, 290, 907, -502, -2997, -2412, 403, 2039, 2411, 1999, -322, -2806, -1722, 1772, 3042, 1228, -2086, -3910, -1781, 2174, 2807, 166, -615, 313, -263, -1276, -360, 1387, 1890, 225, -2577, -3595, -287, 3019, 2640, 303, -690, -1102, -1120, 1008, 2895, 1743, -1615, -3922, -3148, 187, 2871, 1284, -1561, -879, 1050, 1046, 124, 1548, 2562, 861, -2233, -3861]
677c861J758L777J071l229k775J496K734J324L9q40k060j175P37J212O57l49j285
694g69q90J142R13j39J88J422o42k420q79J510J707N38j721j989M17K589P31j090
712F18m46N27o02r21J09M71L00j40p65n64R93J106j77L54O50k60j559p64J188
731A18Q84m19j585j436O02K301O38r59k8Q37j80q76J20P24M39p25j745r99J661
750f28J550j42j042o7J19k26P79P62J4j107j116p6J306J112q48j090L28P63l48
769D3l76O72O86n97j627n55J245J626l62j448j47J227L68n85J36N70j53j182r44
788a403P04R66N3j338k08J222N92k96j56N83L52o38q66k21Q59L41r52o02L76N96
808c6k23j6M91L84k54o41n4N64P43o00p13j22M95j52j87O43j78k79m20P1N52O58
$$ y = [-3861, -2103, 1674, 2745, -484, -3259, -1763, 971, 2295, 2334, 1494, -566, -1741, -1004, 208, 865, 516, -769, -1659, -517, 396, 257, 445, 1867, 1225, -1195, -2074, -564, 1143, 1681, -40, -2029, -1612, 977, 1708, 618, 172, 699, 97, -824, -715, -244, 56, -84, -849, -1413, -420, 686, 509, 863, 1513, 1253, -306, -1070, 118, 1002, 583, -1002, -2438, -1836, 465, 1103, 144, 116, 953, 773, -103, 17, 741, 1180, 455, -1290, -2289, -628, 922, 780, -262, -329, -210, -436, 343, 1105, 1119, 12, -1104, -1180, 126, 1238, 390, -700, -372, 391, 43, -333, 339, 1025, 428, -1199, -1754, -509, 1117, 755, -693, -840, 387, 755, 170, 306, 876, 723, -459, -1403, -699, 267, 320, -1018, -1226, -4, 588, 292, 136, 719, 1071, 433, -433, -654, 205, 546, -406, -1008, -632, -36, -259, -275, 216, 600, 346, -295, -349, 215, 958, 358, -355, -477, 18, -134, -321, 322, 144, -135, -555, -484, 68, 726]
830G26k58j031j17Q38L81l26p7K32l27j53n8J79J31J29o04o80O59P90k93l15K74
851A00M7J8L06J46l82j88m8n33J68O84q7j014K18M11O7J76L63k45j95K03Q2k68
873B9L67M7p76j98N91J90m97L3O9l62L22N37l75k6M44l15l80O32M49o76m47N00
895A58k42l00N07q2n22J73L98l27J16M67o6m74M08J40k93L0L04m59l22N84k32
916c4l67J88K26l22L2L72N9k74L88J22n96L43M91n89k62K75r3m62M30J81m73m1
938d06N20j01k37N99lm46J96K67l96p2N76l88n22P0L38l48K39L07l77k15N40%
960A41l01N76L14p91k09N77l3j91J7j11n72L79L19k39J08J94j58l83L32N01k88
981A82j3L47m97n29N75L12l99j56j2m96L18N88om36R6K57n43L52O44q3l24n4k61
$$ y = [726, 468, -563, -680, 158, 539, 213, 136, 368, 41, -112, -170, 9, 140, 269, -335, -1015, -356, 434, 141, -174, 100, 147, 165, 471, 617, 235, 47, -1, -534, -366, 318, 231, -783, -565, -154, -87, 89, 452, 207, 12, 215, 297, 29, 396, 443, -333, -531, 60, 250, -247, -214, -145, -507, -185, 352, -23, -49, 395, 80, -300, 332, 781, 105, -342, 158, -84, -384, 123, 41, -481, -308, 90, -237, -121, 346, 280, -194, 214, 354, 61, 91, 395, -64, -386, 198, -34, -401, -213, 13, -309, -277, 95, 154, -120, 268, 390, -206, 137, 628, 39, -223, 52, -41, -503, -73, 108, -365, -406, 114, 13, -224, 375, 372, -74, 122, 389, -7, -79, 497, 109, -413, -343, -5, -353, -114, 193, -184, -399, 141, 141, -160, 416, 730, -61, -270, 307, 274, 83, 100, -11, -583, -204, 115, -124, -16, 178, 20, -363, -31, 470, 182, 169, 516, 19, -510, 65, 377, -22, -178, -190, -686, -368, 220, 214, -222, -126, 131, -412, -60, 584, 501, 177, 123, -138]
1004a38j80M34K78o15l70L36N3p5M59J03m26J05N8k68J77P13K2p92l40J11L87
1025C2L99k82o64k2N81Q3j95J83L83k48l49n0Q9L10M29l96o25j88L43K68L26K8
1047D35n85n27K81M81K47k0k85j46J9K52qJ42K04l52o29j2J70M66J02k30q7l50
1069d32J02N14K92K60m41q04p1P68N70l10q32m37N03M93r5l18K44N03k02n17l60
1090e70O60P96p9j032p88L45J042K03m41l83j98J73M29J01k44n6r1kj36O8J56
1111d7L90J95k54o81l0P75K93l62q40m68M80P33K56l44l76L48J51j20L93n9j20
1132C13k85l65p4J09L91p8l48L59j12k95K47R90J56p44r65J01Q66O20p11j228
1152a053J17J060L80o18j30M06K73j47n44l22M54P13k61q28j09M67M76L57j12
$$ y = [-138, -318, 116, 394, -221, -591, -255, -202, -277, 182, 285, -141, -36, 22, -246, -69, 644, 666, -126, -466, -355, 32, 431, 149, -515, -537, 44, 127, -68, 115, 498, 250, -99, -149, -60, 250, 679, 283, -342, -530, -187, 81, 407, 435, -150, -677, -396, 85, 332, 312, 27, -119, -100, 152, 144, 286, 490, 138, -491, -503, -333, 133, 235, 5, -82, -432, -330, 184, 476, 736, 295, -509, -580, 188, 758, 448, -384, -821, -318, 175, 80, -238, 6, 509, 307, -210, -570, 90, 886, 807, -225, -1013, -668, 374, 577, 136, -247, -445, -272, 157, 258, 14, -42, -133, -135, -271, -203, -47, 343, 538, 284, -397, -427, 348, 641, 279, -561, -1029, -549, 184, 440, 96, -280, 68, 219, 99, 492, 433, 313, 28, -337, -411, -302, 89, 11, -337, 22, -90, -385, -138, 852, 1008, 264, -701, -600, 266, 886, 175, -1053, -936, 124, 504, -114, -244, 162, 435, 288, -256, -578, -124, 589, 328, -500, -609, -142, 334, 691, 579]
1171E79q31j57K44N60j53k54o04MN50N19n85j65R72M85r28o68K03P04J81n88r71
1192i03p9J061Q1n39J09P72l08l97K73M56Q5n15p66R7O60L21r08j80R18N11r52
1213b03m54Q24O83k46q81q15N66J036M5q85j09N97Q7m21L38J27k53l42K2J23L
1234a58P0j09K35L17m02n79Q45J058p07j060j47Q03L90o19o91J04Q54K25q85j20
1254e76J069O24j033o49N03N71L8o65n41L59N83l08n67M92R07m23p63P3O64J55
1274E13m19n41p3N72L36m85q9L67K16o05L5K72M6j87p4j66R7K9J39O9M02n2o25
1297b23j2O60J80r40k27L48K52o7m92QO21M54o02o43N55R06j84p98l40O38L65
1318D59m47n21QO56K49n80l98O60P11o44m84J25K78K46k47m09K41L42j95j98N9
$$ y = [579, -252, -409, -165, 395, 242, -12, -616, -612, -62, 457, -128, -293, 679, 1164, 236, -432, -229, 475, 656, 68, -903, -982, 79, 160, -379, -270, 502, 194, -203, 70, 526, 611, 96, -670, -573, 87, 408, -500, -680, 238, 749, -203, -657, 167, 850, 604, -277, -1092, -526, 510, 555, -330, -439, 158, 245, -176, 162, 289, 36, -306, -284, -161, -158, -88, -197, 38, 355, -47, -626, 219, 1277, 570, -490, -637, 166, 556, -63, -754, -650, 204, 429, -456, -576, 493, 1117, 84, -565, -62, 509, 547, -118, -659, -300, 283, -25, -592, -100, 807, 384, -379, -306, 358, 513, 94, -447, -520, 52, 388, -97, -186, 181, 397, -208, -173, 99, 145, -42, -116, -282, -185, -156, -17, 52, 454, 402, -223, -235, 425, 605, -335, -562, -214, 38, -29, -521, -513, 108, 562, -40, -683, -128, 778, 594, -204, -544, 94, 459, 12, -509, -501, 155, 404, -176, -574, 86, 797, 153, -331, -206, 72, 318, 71, -338, -97, 245, 50, -148, -89]
1339h9L28k65m7n9jJ35l4J3J05N9k12pL56P5k82l62J92K69k73k40p5L35K45k36
1363g0m16L97O15q3o94N1M09K55k52o55J02O50j4n99l07N48O10m30m23O6M86J95
1385D41j94n19J59M42j71k60j13K69Q3j88q0N9rJ98j34N9o3p4J94N9J9j03j83
1408a09K84J45m35k00L35J60j33j93j36K00L34J00n36R6M61m0l39k20L41oOk28
1430a13l19M17K54j88n03L31L62j81j74J02j18L57Q7k67j55J06K25k80j28J45
1450d0j32J85J20j28l52L65K07j84l62L30J70j70J03r8j83P0K83l47k89L46O4
1471d2K8l1P9j51K91J60l29j96L85K24m03k00K34j75P4J42k95j61L95J50k97o
1493a24K63M7q4L7o6j32K14J01n18J60K74j74l05J84O5j5l5K38j12k13L44Q1l19
$$ y = [-89, 239, -26, -73, -132, -133, 2, -32, -19, 86, 145, -67, -74, 282, 357, 75, -287, -95, 174, -99, -339, -414, -79, 166, -70, -486, -89, 526, 443, -251, -200, 209, 464, 212, -443, -341, 309, 295, -304, -611, -63, 547, 117, -306, -240, 246, 441, 247, -272, -113, 329, 158, -102, -215, 54, 137, -51, -131, -72, -81, 117, -17, 42, -21, -95, 99, 158, 177, 74, -109, 175, 320, -115, -315, 20, 180, 47, -146, -282, -82, 252, 352, -184, -88, 373, 333, -6, -226, 115, 109, 115, -113, -432, -15, 239, 51, -452, -121, 241, 60, -114, -12, -130, 227, 314, 47, -108, -2, 223, -57, -185, -40, -172, 13, 133, 5, -347, 18, 225, 41, -321, 9, 179, 9, 112, 14, -169, -99, 184, -163, -452, -106, -42, -14, -45, 34, -117, 174, 334, 5, -191, 194, 418, 15, -185, 49, -126, -52, 90, -205, -366, 29, 179, -118, -124, 139, 186, 102, 139, 73, -59, 155, 256, -262, -102, 172, -2, -307, -123, -58, -73, -108, 130, 18, -195, 149, 230, -89]
1516h9J68J24k45p2K25j54j13J60J01l97J13K60j56O2R8M3r9J57N1j80p7J86j47
1539A9k66J70r2q7L14j7l14R2M00n2k65J99j28J5J43k6j79p7J47m2k61K14K20
1562A27j57j05K30j65j6K00O4j24N7J53l19r6K15o4k81K28Rj72J24K08j6j66O4
1585bP6j03K05N8k91p1Q6l8j72K31j8j46J80n8m6K0K80r3k84N6K23q1O0L4j42
1610c6l3J78j10m6p6J48j63j09K27kJ3J70j28j2N5j13J13J00O0k88r5q1K83j06
1634e1j17j52J31K43m5j4O1K39j37k45Q3J21o8k03M7mJ1m6J3J48K79j34l60l4
1658b34M53J37l06j67R1J20R0k87o7L21J35l40q3JK12m4o8Rnr1O5M8L03j53k58
1683a18j07L93J86l81m32N6M47N8l53o0L20K82j09l68J53M77p8k87k09j13J05
$$ y = [-89, 79, 203, -42, -114, 111, -43, -156, 4, 105, -292, -179, 81, -75, -13, 85, 128, 29, 186, 237, 57, -20, 166, 19, -247, -77, -169, -256, 58, 41, -273, -181, 219, 167, -98, 101, -27, -12, 131, 105, -74, -151, -4, -46, -307, -93, 127, -30, -135, 95, -70, -86, 114, 178, 54, 111, 264, -55, -151, 64, 0, -281, -53, -44, -216, -92, 116, 100, -66, -2, 74, -29, 176, 234, -57, -128, -42, -80, -252, -21, -39, -185, -5, -63, -109, -89, 191, 98, -186, -130, 93, 12, 72, 106, -36, -69, 109, -1, -47, -123, 25, -138, -247, -20, -22, -9, 161, 33, 21, 76, -37, 76, 176, 236, -52, -147, -228, 55, -51, -168, -320, -189, 54, 9, -5, 56, 295, 158, -87, -4, 117, 49, -154, -107, -111, -100, -146, -133, 15, 294, 160, -200, -234, 219, 356, 50, -117, -26, 94, 184, -103, -170, 151, 286, -54, -137, -136, 76, 32, -36, -27, -32, -123, -58, -10, 293, 140, -118, -225, 168, 354, -27, -459, -403, 44, 102, -251, -311, 9, 291, 182, -186, -33, 444, 366, 79, -130, -243, -138]
1704a38n0RrJ75R2k84K12L82L9l51m14L87J84k17k91R5K14J75k22l37K99M32j98
1727A84l23p2K13L4r3K0l6N8n5Q9j6L42j57m06K38J18n5l73j23L58J06j94j51
1750b94m2O26K41l53l62K86K62j73m86l4K06N8k1l86L38N42J9m60R7K70k27j75
1772f8J3Rl6j37j02Q7N39j09m14R8L89J44m42k28J31J16p6r5l7J53K87k27k40
1795b45L22L01l25k85K53J11l13j42J47J93rp9j91M16M72k44n81J40L49On32j76
1817d12K57J84q5k73J56L81L67m19k73K30K56k18m34l2J49j5O6k25L32J29P2l04
1839a11J56J25j82k02K35K1n3k25j5L39P4L8k78l6K77L0k94p2L95k61n0Pp3K33
1863G8k5j68P4L54j22j55k67K17J65l64j08M5K20N1k0j04J84L41j60l10O5K57
$$ y = [-138, -188, -179, -188, -13, 79, -205, 7, 389, 428, 77, -337, 50, 234, 17, -274, -179, 35, 210, -12, -349, -50, 382, 184, -139, -211, 2, 36, -57, -37, -73, -15, -70, 19, 3, 345, 188, -218, 20, 138, 83, -290, -413, -55, 51, -143, -294, -336, 290, 531, 178, -184, 102, 364, 191, -295, -329, -123, -65, -86, -472, -134, 408, 427, -33, 64, 334, 107, -68, -55, -46, -82, -219, -321, -234, 305, 196, -218, -120, 269, 413, -29, -257, -126, -10, -86, -181, -218, -65, 222, -5, -245, 77, 378, 53, -232, 21, 132, -181, -323, -176, 17, 8, -71, -262, 154, 626, 382, -199, -59, 290, 296, -236, -412, -155, 29, -56, -329, -173, 208, 575, 156, -117, 113, 369, 151, -283, -315, -166, -181, -115, -340, -8, 121, 193, -111, 45, 170, -12, -214, 21, 42, -11, -236, -251, 88, 162, 200, -78, -114, 163, 193, -101, -173, 222, -39, -89, -82, -155, 78, 53, -115, -41, 313, 191, 36, -231, -14, 151, -213, -321, -276, -56, -5, -25, -129, 55, 396, 236, -74, -9, 248]
1885B48j94k14l5M7J7N8k9j40L52J50j77%o4K5l7k5L2q3Q2Mk3N7m6J37j48R1p
1912G8j05%K5j4K1j30P2J40P3pk22O7J19Q9l03k8J09n4j05L4N4Q6J27j02j77K35
1938H2J21j12l6k05J42K5L2l29K02K20j82k2j1J83N1m5k57K37j0k9l3j49J00Q8
1962F3n6M3m1mMJ15p0k18O3J00o3RR3j42O1J9j6j13J33M7rpj08r4K84l1j48o7
1990a53J83K09j21p0j1O7Qj45o9L1j7J69j95J46j66K07l1j50J34JP3o6k6J5Q9
2015A12q3j96Q6J82j79J26j18l4LJ41K6j53J70L3q4J2K7j02K8n5P9k50J63N6J22
2040A12j55j21L14j33R6j0j71K0J67j35N1q8J14r9J02j14r1J17J80p5k05N6J62
2063I4j8qj07N5l1l4J17j29N0qj22LJ67j39J11k4L9j46Q9K53j92N0k4n2l5J02
$$ y = [248, 54, -160, -195, -148, -131, -73, -102, -242, 110, 260, 83, 83, 19, 44, 7, -18, 14, -69, 13, 17, -6, 51, 5, 142, -6, 85, 78, -27, -27, -2, -16, 5, -125, -53, 87, 160, 153, -69, -2, 117, 206, -97, -125, -16, -70, -175, -141, -87, -1, 126, 24, -153, 82, 203, 91, 55, -150, -8, 17, 49, -280, -78, 142, -40, -62, -73, 110, 161, 116, -141, 96, 86, 57, 24, -125, -25, 63, 7, 50, 9, 5, 9, 124, 54, -164, -101, -1, -64, -55, 38, -104, -43, -24, -40, -153, -20, 27, 18, 11, -97, -191, 93, 62, -86, -153, 30, 239, 118, 48, 37, 104, 112, -33, -102, -71, -88, 81, -114, 32, -134, 73, 42, -108, 26, 27, 100, 34, 8, 23, 112, 29, -167, -81, 101, -78, 48, -70, -104, -101, 40, 66, -87, 83, 116, 32, 44, 71, -31, -3, -58, 21, -229, -66, -10, 112, -43, -164, 150, 17, 113, 103, -68, -48, 119, -16, 35, -53, 61, -38, 64, -50, -141, -24, 156, 81, -124, -68, 94, 76, 68, -39, 16, -15, -49, 68, -61, -11, -19, -141, -138, 29, -110, 1, -23, 16, -130, -41, 212, 20, 70, 46, -6, -41, 61]
2089F1N6k20K30l1k38L1R3R7j62L9R4M0m3J09k11k8L16o7k92k4Q6M0Np6L8j15
2115a72K77J3o2M0j20Q8r9J06p0j46J70J2p5j53K35J1r9l5PP9nO6On1R7kj50J58
2143A26j08j1R4n1j52M5J24N1j21J06q7N7j36K4Q5Q1M2j85j57J88R5j14r6l9l
2168a42K03mk8m9K1J19j90M4OJ68m9j08j3M1J4m7qq8N2J37j17J54p1M7q4oN0R9
2196A51o7j6r3%m1J27nj16J4mj6L1J15j15P5r3P1K7O2p4O2j13j08m8K11L2r2j35
2224a58k2K15J87k30j17J85N2o7m0o9J06O2m2j10J7M4j6l1j20J50j12J44r0jK27
2249A64j62m2J51j77J49j33j11M1J57Lk03M1J73J18k20K8L9N4L8k03oJ20l8j20
2273a39N7J34j52O4J4J09j55J44j44L5J40l9j41j6J60J2j50p5N5J18J39j73j10
$$ y = [61, 117, -103, 127, 96, -142, -111, -18, 79, -83, -44, 50, 90, 47, 156, -55, -83, 233, 166, -126, -150, -64, -24, -19, -95, -57, -172, 105, 118, 56, 96, -24, 64, -35, 71, 1, -145, 25, 37, -38, -191, 44, 55, -44, -79, -72, 7, 2, 68, 74, 23, 120, 118, -32, 126, 18, 7, 101, 50, -102, -57, 67, 118, -3, 103, 16, 73, -63, -39, 46, 127, 169, -16, -173, 15, 110, -4, -100, -139, -142, 61, 57, 29, -20, 1, 120, -70, -26, -20, 148, 99, -9, -22, 19, 33, -14, -22, -110, -58, 79, -38, 116, 45, 92, 8, 2, 52, 151, 84, 68, -25, -25, -66, 61, 56, -60, -46, -50, -66, -35, 80, -35, 40, -53, 18, 45, 107, 33, 95, -18, -126, -174, 37, 69, -23, -158, -180, 35, 222, -8, -125, 60, 112, 45, 5, -64, 42, 104, 62, -48, -31, 13, -3, -34, -154, -4, -116, 28, -62, -63, 164, 2, -40, 111, -66, 83, -50, -161, -120, 37, 40, -163, -122, 51, 169, -51, -23, 16, 70, 108, -95, -101, 19, -19, -139, -82, 52, -100, -36, -22, 87, -68, 76, -68, -33, 107, 68, -73, -89, 71, 83, -67, -142, -87, 31, 170, -3, -113]
2296a13M6J84j48o4J31q3J13m5n2j6J91p0m7J9Po9j35M4N3K8r8qO6J26j8j3q7
2323e8K34P6k22p2L4k2M9l9j32L7K68j1k40M8J52J09j43n3k3K3n1j5K94j79m3
2348B1Qp3Q5o0l2r7J54Jj32J4Q9J30m0K9j58L8J99j16k09J95K2l1k61P3J24l4
2374f1L5Q0J3J23j9j54K8K75j60k92m9Q7J69j28qp4K56K29k80k44J68J89j72j11
2398a00K0N5P5o1j44L9K29r3r8LK60k5l56K3K05p5l3M9M8N0m3j59J16Q0J67k22
2424A0j10kJ33j41j36J87J01L0pl3J94K6k02n7J02kk25jm4K64l6p3Mj2L18k1l42
2451g5K9J83Rj57k20K24r2O3Q7r2N3J87j25m6j9J37j01p8l1J07j31N4o1J61N4
2476A20p4l5r7J46Q0l04M0K14N3k95L3J79L8J20l56J65J19j5k06n5J50Q3k21j6
$$ y = [-113, -67, 117, -31, -95, 36, -47, 66, 21, -31, -47, 144, 74, 27, 46, 53, -16, -151, -107, -54, -26, -124, -132, -66, 60, 42, 29, -58, 176, 252, 30, -42, -8, -30, 19, -20, -152, -115, 153, 142, -98, -50, 102, 211, 68, 15, -8, 15, -36, -51, 243, 64, 21, 29, -44, 41, -19, -51, -148, 6, 7, -125, -111, -22, 108, 68, 97, -61, -23, 176, 60, -149, 46, 68, 37, -224, -151, -27, -61, -26, 54, 67, 190, 171, 17, 45, 320, 160, -132, -181, -94, 75, -53, -61, -135, 121, 350, 70, -174, -6, 183, 11, -100, -80, -25, 50, -11, -155, -116, 113, 20, -78, -75, 185, 160, -196, -173, 32, -43, -76, -27, 21, 71, 28, -131, -15, 65, 232, 10, -100, -102, 31, -110, -246, -59, 42, 72, 65, 32, 226, 252, 50, -7, 95, 93, -132, -133, -177, 87, 51, -22, -18, -30, 288, 267, -75, -46, 137, 146, -11, -231, -7, -99, -36, 51, -41, 12, 199, 74, 28, 9, 146, 45, -33, -64, 43, -88, -34, -95, 66, 120, 46, 11, -86, 60, 140, -164, -124, 90, 143, -152, -119, 60, 98, 218, -138, 27, 146, 131, -75, -130, 20, 103, -118, -134]
2500a34M4P5K5j44K24o2J89k08r9l4J40O9j28l7J0N5K1n4J03J0L9j47q2K10Jl8
2526D8q9M6J17o1l4j35K20m4j13J3J12n7r1R1J5l7L1j72J26J12J4j56k7O7O8j07
2552d3j51K03M3m2o9mO8J79j54q8N0J97j91j15J12j0L4j41nJ43M3J5j23r2K01
2577F0k2n3P4j71J22K7K1j96J26Q8q6P2j37J75j00m3J18l9p0j27J82K4k4K1p5
2602c3L1M9q9j02J30K8J4j56J38o5Q2p8J4R1o0Q9j83J74o7j03J59j02jk5J3J16
2628F4j49J40N9o3j00N8L4r4JL5oP5O8r6l9jN1n8n4J2j0r8J67L0RPnj0k5r2J15
2659B5k6r5K26j42j4K4j07o1J65K6m4L7pL9R8n8r9p7J29j14l7K28o7l8M9l8Pj77
2687a48J91j07M5l3J03p1M5K1j91J35o5Q8r8K8L8l0N0J0Q0j50M5J08m9q0M5oQ0
$$ y = [-134, -90, -15, 10, -134, 90, 28, 217, 9, -90, -124, 16, 85, -43, -80, -70, -15, 6, -48, 55, 65, 104, -43, -125, 85, 86, 48, -41, 5, 122, 61, 27, -108, 112, 68, -45, -32, 80, 23, -68, 23, 38, 1, 32, -140, -14, 98, 112, -44, -71, -4, 64, -43, -194, 9, 52, 10, -59, -63, 5, 184, 30, -58, -8, 189, -2, -117, -5, -15, 19, -122, -127, 16, 59, 74, -49, -141, 60, 38, -15, 59, -112, 10, 37, 58, -138, -12, 76, -10, 62, -75, 100, 0, -43, 75, 36, -34, -161, 21, 45, 21, 42, -33, -2, 47, -42, -144, -14, 14, 28, -128, 10, -55, 27, -51, -37, 54, -6, 83, -100, 74, 7, -96, 63, -39, -40, -65, -52, 64, -85, 55, 114, 51, -49, 9, 43, -51, -50, -15, -21, 54, 122, 26, -13, -14, 37, -21, -75, -63, -73, -171, -4, 26, 35, 42, 37, 27, 2, -90, 25, -1, -96, 130, -12, -26, -2, -109, -170, -5, 21, -23, 14, 7, 46, 144, 86, -13, -90, 39, -75, -112, 116, 49, 11, 60, 22, 29, -148, 43, -64, -19, -52, 51, -20, 25, 46, -145, -10, -75, 13, -85, -57, -19, -49, 1, 11, 91, -59, -14, 94, 45, -35, 10, 4, 84]
2714H4j5p1j3Q0q7j1LP6j1q6N1L7m9Rn8J25j35J32q8J02k9K2p4L0o9p4O9J11J0
2743G1j44J70l9o9N0Kj39J23p3Mk8M1J3o7R7K7p2N3o7K3j02K61p5K7j57m4J53
2770C9k0o8O2j11mJ40Kp4P0j0RM7J7Mj56LJ73r8m6o9N3R8j03J23r7m3J2QJ03o9
2800ep3N8N9K9m8Nl3M1O1j25q5J4Oo3K20qq7P2nkk6kk6L9r4J96j58j0M9n2m2R2
2832cj7l3J33k4r3J3J85j75P2r6j4N6q0m4J99p5j9k5j02J38J05p0o7L4P1j02M1
2859HR4q1%j24K66k06J31k4j78J31L3r1L2M3OJ49o1j47Q5R3j94m7M4R0N8j16j71
2886a77J07K5K8o4J29q3J45n3k23Q6M2m6j06J44J15l7j71K8J11J07Q3j40o2J46
2910A34J5k59pQ6P5j5r5N8J03j22N0p9K5J47j66M5M3r6M7Ql5J07J67p9k99J46
$$ y = [84, 69, -2, -15, 65, -22, -33, -30, 46, 35, -51, 0, 37, -12, -3, -61, 64, -71, 61, -27, 75, 46, 68, -6, 24, -45, -119, -50, 61, 71, -73, 97, 58, -11, 39, 41, -98, 25, -48, -44, -72, -31, -18, -85, 12, 39, -33, 20, -47, -24, -126, 135, 60, 87, -70, -114, 39, 19, -49, 13, -98, -102, 38, 40, -34, 36, 26, 35, 82, 99, 103, -53, -50, 123, 25, -21, -90, -37, 61, -42, 81, -16, -59, -47, -39, 64, -5, -78, -20, 39, 68, 20, 25, -8, 33, 94, -31, -116, -102, -96, -159, 61, 53, -34, 38, 33, 31, 5, 3, -23, 16, -78, 118, -40, -50, -1, -53, -95, -3, -20, -53, 80, 56, -37, -24, 161, -14, 58, -38, -52, 4, -76, -120, 79, 4, -15, -40, -142, -4, 101, 31, -36, -2, 69, -33, 8, 102, 21, 21, -103, 163, -43, 88, 64, -114, 17, 50, -41, -9, 34, 40, 189, 128, -19, 66, 159, -35, -82, -38, 52, 110, -6, -177, -70, -45, -17, -81, 48, -35, 110, 57, -166, -80, -38, -84, -190, -46, 69, 32, -139, -111, 0, 107, 190, 50, -12, 134, 149, -110, -117, -31, 44, 29, -66, -8, 95, -27, 23, -56, -31, 116, -50, -5, 38, -58, -11, -3, -38, 69, 236, 157, -142, 4]
2936DJ65n0l44J39J27L3k91J9K16N4o1k0m1K07Q0l63P0M5J08j90o9K30%J6j14
2961c0K4J85k1j25k25K56J62k68r8R7N1M1j00l4K27M0o1k19J22N6j07j00J37J29
2985A39j64L0o9N7Q5n8j73J86L1j9j30%P3J06p9k63L43k4Q7j57l1J11J28k78r2
3010a61K28J52k82l8J41oO4k9r1m2K82j26j63J20q0J07o6r7J03l0m0L8J9LJ36
3035A42l43K50K2j23L8k2J12r0K4j54L5J75j35o1K5J47Q4j50q4K6J06J6L6n8J31
3060A49Oj01j41m7L10o4j97m5L2O9J3J5kk5J48j29J0O3M4J7j74nJ47r6j39J47
3086Ej47R8J38r9LJ2q7J1jJ10j1KLm5Q6j34K8N3M5j11P0j14K10j48mO0n1J20p2
3115C0l7K4K8K2k9n2k1J8j70J27J1k9Q7n0P1J0L4p4q4R6P7l4j22M0q8k5P4P6j4
$$ y = [4, 169, 119, -225, -86, 41, 74, -217, -198, 18, 72, 11, -9, -50, 157, 237, -126, -56, -11, 97, -93, -162, 68, 68, 84, -30, -6, 179, 158, 33, -192, 64, 226, -42, -140, -43, 8, 49, -51, -85, 142, 182, 121, -98, 24, 80, -27, -127, 10, 139, -25, 5, -64, -7, 78, 20, -153, 33, 64, 45, -85, -85, -12, 94, 15, -248, 95, 71, 158, 1, -30, 81, 209, -69, -161, 67, 219, -63, -101, 40, 34, 98, 69, -22, -64, 218, 92, -71, 49, -31, 76, 10, -87, 16, -14, -54, -16, 3, 6, 142, -201, 49, 71, -52, -14, -36, 76, -14, 10, -144, -109, 66, -69, -130, -105, 42, 126, -24, -108, -82, 24, 40, 76, 18, 149, 155, 54, -87, -134, 176, 112, -85, -130, -98, -29, -16, -1, -3, -28, 120, -9, 1, 64, 108, 125, -49, -54, 93, -3, -142, 5, -142, -44, 94, -5, -2, 10, -77, -66, -67, 43, 32, 34, 37, -8, 78, -56, -28, 25, 70, -41, 29, -85, 125, -23, -27, 33, -18, 102, 30, -7, 17, 45, 67, 38, -14, -35, -17, -187, -60, -49, -78, 9, -41, 30, 40, 74, 0, -84, 12, 89, 55, -67, -27, -115, -140, -66, 10, -4]
3144dJ7R7j55m8J68p4Q6p7N3rm6n3POl5m0Q2J2N0m4j3J10j8j01J00m7Pm9Qk1K
3175b9J50o4k20J56Q1m9p9qk8OJ83p9m0O4LR4k42L4J19p2k3o3R1L4jj02J80k9
3203F7J1j71J93M3j40o0J94j33M4n6M0j26K33j83J10l7J34j54rN6j15O7j2m2R6
3228E0k15J32o3n5K6J17j80P2O3Q5L8j66J41jM5m0n3m1K48k22J9J55k43O9q8j0
3254a17J01O6J53k31P3j7p7J47p6k7M9q9J68j20J5n2l9Q9j57jN5R9L5o5L2KR6
3281A12j73L3q9J13k8J37q0m1l9J85p2o3Q5m8k4Q6j17Q8j01J52j23j04J75J01
3305A65k07J13j9k58K59j15L5jP4om1r2J90l5LL0j71Q1Kn7N5lq6J10p7M9r2J94
3333A00o0m1p2q5J98p9M4k5L0ol1l0R0j64Q9Q1R4o0j5l0J6q4n0J87Jj53J79j48
$$ y = [-4, 13, 110, -45, -93, 75, 1, 87, 10, 63, 54, 8, -45, -38, -32, -67, -107, -25, -13, 37, -7, -20, 90, 72, -29, 71, 24, 31, -18, -10, -31, -29, 121, 57, -163, -7, 74, 25, -54, -62, -90, -84, 99, 20, -20, 44, 47, 141, -101, -67, 52, -20, -43, -106, -15, 19, 18, -84, 96, 67, 78, -93, 100, 143, 3, -57, 137, 4, 48, -8, 32, -94, 139, -44, 66, 29, 163, 9, 0, 56, -59, 8, -4, -46, 50, -165, -33, -96, -151, -125, -8, -188, -116, -53, 32, 70, -96, 45, 44, 89, 49, -4, -45, 203, -19, 0, 155, -88, -19, -107, -117, -16, 50, 203, -28, 45, 28, -49, 98, 22, -5, 44, -45, 123, 3, 18, -34, -73, 16, -141, -142, -87, 12, 47, -18, 14, 16, 112, -61, -28, -117, -4, -32, 105, 25, -16, -55, 130, 58, -5, 80, 32, 8, 94, -23, 65, -36, 116, -7, -111, 64, 165, -42, 71, 52, -206, 53, -62, -27, -28, 46, 40, -1, -93, 97, 62, 65, 95, -76, 5, 7, -50, 5, 2, -84, 26, -51, -2, -94, 100, 40, -1, -73, -158, 40, -39, 5, -20, 10, 4, -27, -57, 33, -131, -42, 39, 133, 73, 58, 28, 44, -40, -90, 97, 98, -55, 124, -24]
3361b4k6O2K1j38O7N9k7M9k1Mo4P5K7j77J97J9m7j50P9j30P8O0o2J65K8j4j21
3388a1j8k5K10j22o7N4j11O9L6O9n9q4M0J05K4j50P4R2p7M3Kr2R0j23K8j9L1P1
3416H0n8r7K61k95J03O9q8N2Rj45r7J71O5K3q3j00R4mN0n5j09J79j3l0P4K1m6
3443C1jn6K9Ql6M4p0J28o2p3K1L5q3J0R4j0l5J85j35l4L6M8j63n8J98l9l4k0O6
3472B4p0J30kj44M6J5oj54J52m4P5o4j7L6R5j02Q4j36K40r8j04k9Q5O9j60J21
3498D2l6K6J21l4o7Q3Q2j79kR4l9p7j11R9j7j1J3o1M5R5J6p5K7jr0L3m3O3L4p0
3528d0N6K1RN5k19l7K58n4l8K9j67J48p1OJ02k0P1j04o4K7RJ80k06K6M1l9j2K3
3556a0J24p1O6m8j25R6K9j58J23p3r2J54j41J72kJ1P4r0L5J9n7j34J43o4q9M0
$$ y = [-24, -50, 12, 33, -105, -38, 21, -6, 43, 22, 26, -38, 37, 64, -113, 84, 103, 56, -94, -15, -145, -67, -7, -69, 96, 124, 110, -11, -29, -54, 156, 34, -33, 21, -90, -21, 15, 84, 25, -59, -19, 86, 110, -40, 34, 126, 49, 92, 94, 2, 92, -31, -3, -22, 9, 80, 22, -75, 186, -109, -6, 63, -25, 27, 36, -109, -206, -35, 30, 53, -30, -130, -36, -40, 10, -45, -154, 25, 12, -18, 56, 77, 31, 30, -26, 3, 11, -25, 19, -51, 77, 15, -58, -37, -2, -85, -75, 19, 9, -26, 159, 24, -10, 26, 74, -89, -147, 51, 12, -22, -42, 24, -46, 84, 82, -62, -16, -1, -7, -161, -9, -53, 22, -42, -59, -23, 72, -30, 54, -82, 158, 60, -44, -73, 12, 81, -79, 42, 6, 32, 153, 119, 52, 135, 217, 38, 36, 130, 91, 14, -97, 2, -15, -26, -13, -74, -29, 66, 82, 7, 34, 33, -57, -24, -67, -4, 30, -40, 16, 37, 46, 101, -118, -155, 103, 49, 11, 40, -127, 21, -50, -44, 58, 38, 109, 5, -59, -32, -23, 157, -49, -23, 18, -21, -33, -10, 114, 43, 109, 61, -64, 32, 61, -97, 26, -47, -139, 15, -126, 46, 44, 55, 129, 39, 74, 93, 36, -98, 45, -19, -108, -68]
3582f8K1L1J05o1j2J2K54j97o6mM1j04pj2J28n6o4N6n7k8J11J5o9R3q7J51j70
3609d4J10K0n9q7J55q5k1P6j75M9J38p3j76K7K09q6OQ2j77K11m3m7k5R4j04j50
3635a75K41j23J5J2Q4p8NK12j55j31J15L7kj89Q4J23q7n5N2Jl4K01j51o2J11q0
3661b9Q8P0j22J05j90j14K63j26jRJ16n6M7j17n6K81m1j33MP5k5p0n3K3J04J05
3687A57j01om6L6n6P5r4N5N7k03j1J93j9P7m7j15mQ8q3l0L8N6jo7OM6J41k65K34
3716A11k07J94j8j48M2J46j56j5R8j7j49J21n1R2l1O3r8J5J16L5j26k2N0J05j37
3741A3r7J76q0lO2j64m8J31k5nK7L5q3Q7N9o0k8rr8J88q4p2P0lj01Q2O5m8J19
3770A06j14K8j33Q4J50j77K2J67o8m3OR8j35p7O8Q8o5N9j67J10J8n0j5M0K1n9
$$ y = [-68, -47, -16, 89, 28, 16, 28, 282, 85, 19, 15, 56, -48, -55, -67, 61, 5, -59, -3, -60, -88, 23, 38, -31, 62, -25, 126, -44, 66, 86, 27, -60, 95, 10, -11, 65, -110, -61, 77, 4, -172, -145, 64, -22, -16, 66, -111, 100, 57, 10, -15, 79, -25, -175, 66, -57, -42, -30, 54, -24, -19, 193, 38, -93, 22, 59, 57, -132, -48, 75, -12, -67, -15, -14, -48, 153, 2, -60, 51, -29, 59, 129, 7, 112, -78, -192, 71, -55, -56, -47, 69, 13, 60, -57, -113, 168, 127, -6, -2, 73, 48, -22, -75, -52, 52, 157, 56, 50, 4, 40, -16, 59, -35, 20, 77, -126, -137, 56, 37, 114, 67, -48, -52, 36, -47, -77, -39, 17, 16, -51, -45, 1, 142, -123, 111, -96, 98, 80, -68, -26, 120, -36, -51, 47, 30, -119, 2, -49, 43, 12, 75, -23, -8, 108, 143, 17, -5, 45, 150, 13, -84, 92, 12, 9, 71, -93, -141, -10, -35, -40, -13, 22, -61, 26, 85, 25, -3, -12, -110, 78, -6, -78, -8, -11, -112, -30, 35, -13, 106, -8, 20, -113, -29, 121, -56, -34, 133, 65, 22, 28, 126, -9, -86, -18, 70, 5, 64, -103, 7, 25, -25, -40, 0, 21, -38]
3796c8O4K6n1j07J30K4l3q1J16N4m4j04J01j25O5J01j82j0L2J86j23K2j05R3J4
3821B5j07Q9RJ7K9Kq2m0Q5L6O9m1j19L3Qk0QN9p7l5O2m4o7Q4l4Q8j35J61o2r8
3851i7J58K5j5k4p8l6J15n7J7J5j5P2j38O6N2J8j48N0KK5P6j51J34j52L1OoQ0
3879B5j01J49j35J04j38J6K33n0r5O4K3o4o9M4j28J11J7J42j88M0o6J2J50J9j01
3904A4p6l3R0Q2q1R2K8Oj38K5O1j28J30j7j10J78r9M9j17M3j8J48j38M9m0%L9
3931C9j39J34n9l4J27nj9j5K6l3Q6o0k8L0pj02O3o2J14m5j86K36p3N3o5k5J17
3958F8O2K2j57N7l9q7J17n8Rj20l9Q0O6k8p2K16k56J99M1j80R8m0n3M1l0K01j68
3985e0m7P3J13q1p2J14pj7m8l2O2J3Q4k5j42J66j30K6N1M2j00J30n8j23J02K3
$$ y = [-38, 26, 52, 1, -106, 24, 48, 15, -66, 50, 104, 60, -44, 57, -68, -3, 98, -84, -94, -62, 124, 1, 23, -82, 11, 25, -82, 7, 16, 33, 62, 64, -18, -58, 27, 63, 132, 91, -28, 5, 13, -7, 1, 60, -17, -52, 10, -34, -101, -17, -51, 37, -98, 63, 1, -97, 61, 86, 71, 47, -31, -67, 48, -9, 8, 23, 8, 80, -58, 8, 60, 78, -70, -20, -18, 7, 83, -68, 66, -86, -55, -49, -55, 25, -76, 73, -62, 42, -96, -80, 153, 103, 8, 72, 95, 31, -38, 6, -122, -11, 6, 148, -40, 0, -66, -54, 96, 115, 14, -62, -95, -5, 77, -4, 88, 116, 122, -16, 9, 70, -58, 72, 55, -55, 123, 24, 73, -44, -1, -19, 129, -9, 40, 0, 0, 39, -100, 34, -25, -59, 68, 63, 44, 29, 55, 22, 108, 48, 20, 50, 43, -59, 4, -58, 56, 11, -175, 61, -12, 41, -24, -49, 68, 130, 152, -5, 52, 13, -74, 43, -15, -6, -126, -165, -85, -19, -47, -119, 97, -159, 40, 81, -99, -1, -41, -94, -53, -83, 118, -50, -97, -24, 89, 8, -64, 50, 43, 26, -22, -54, 8, 21, 105, 80, -62, 104, -26, 0, 51, 93, -7, 123, 65, -58, 44, 67]
4011F7j05J21k6j8p4O7P5j47R6l0j91QK59j62O8o8J26j33N4N5J6j4j11O2P7m1
4037C1k9r6M3M1l7k7R7n1j6J61K2j90R2J25k32O0j25P6N6K9k2o0L8N5m9O5L8k10
4065a15J23j5o5rJ42o0J5L2O2j25m2M1J00j5p7L3oJ03k05N9Q2J7r3j98K74P7j25
4092A0k4m3J94j75l7J30n4N2Nk8j08J25m0j08J69l7o4J39j84R5R7n7or6J46j4
4118H7m1k65J51J18o9j30J73N6l7m3k3N4j9j09Q4R2pp1j0r0J44o5M8N1j19K7J20
4145A07k10N5J65n3q3j39R6Q2r5O7J23l2j10n9oJ65M8j17j44K51n0r3k2K2J17
4170H5M7j36L1N2K9j00j5Q5J3l1j15K8J12j65J65N4o1m2r9R3m1M2k3p3M1J26J8
4197A20j5j0k8kM0p6q6j11J38N2l9L3J14j28q5Q5o5L9P7n6k6J41j48o3J08N4j3
$$ y = [67, -38, 83, 57, 39, -35, 32, 107, -40, 56, 26, -165, -157, 102, -60, 8, -60, 66, -67, -13, 42, 58, 44, -67, -5, 72, 31, 2, -94, -51, -10, -47, -74, 23, -28, -44, 117, 139, -51, 41, 166, -66, -6, -131, -55, 1, 30, 8, -52, -14, 41, -8, 57, 95, -115, 8, -7, -72, -81, 61, 1, 16, 48, 110, -15, -57, -16, 84, 69, -8, 25, 19, 122, -83, -24, 58, 75, -18, -216, 58, 135, 10, -14, -57, 137, -38, -75, 55, 1, 53, 58, 30, -78, 47, 7, -101, 68, 31, -33, 106, -78, 17, 114, 57, 51, -45, 101, 87, 46, -219, -68, 50, -19, -149, 24, 80, 43, 0, -23, 31, 12, -97, -13, 79, 72, 1, -9, -99, 45, -20, 28, 79, -40, -13, 107, -103, -48, 117, 64, -19, -158, -62, 20, -75, -8, 115, 83, -27, -86, -92, 73, 121, 4, -140, 111, 61, -32, -54, -32, 85, 132, -4, 27, 79, 108, 8, -7, 78, 91, 60, -55, -27, 85, -80, 85, 139, 78, 36, -63, 30, -11, 31, 8, -65, -24, 102, 120, 105, 95, 67, 65, 105, 29, -57, -168, -30, 22, -17, 16, 130, 2, -83, 2, -63, -24, 53, -3, -29, 112, -36, -99, 9, 63, 50]
4224E0j11O1j01J68J7j52J02K4q1Mp0J53j04Q2L7j46J80p3K2J1k27P4L2o0P7J08
4250G7j3j83P6J28n6r2Pj8L5j0l5R9m7Pkj9J50k8L6k04K33l5k09Q4k5J01m9m7
4278c9n6P7L7o1m0M8O3K4j63P1K24k14l7R2m7lk9m9j2kJ45m1J2L9pk9o9J9M4O7
4308F4j58Q1k2P3q9l9J37n5n8rJ26j10M7j1L5m7J56j49J43j47j6J8J13n3K0q1
4334c1rNJ03Qj60K9L9J4J4j1j21O1M1J00j95J33J09q9j81J09J14j20KJ63j72J35
4360I0j9j21J83k96K54On9l9q7J01O0j88Q6K6L7k1l7K9l2M3J5n4n4J26o8MRL6
4388C0o3N6l1j11J42l1j70J13J32r6Q1J4j07n5K45j31O1o4m3jq9K36j68OP5J33
4414A64j83L2m6J30j10J17o9j02Q4n0p3J34r1J25j06m8J02o4Q5J1k4No3m1Q8j37
$$ y = [50, -61, 0, -101, 67, 84, -68, 34, 58, -23, -19, -89, 64, -40, 42, 79, -67, 113, 40, 62, 73, -154, -80, -48, -108, -31, 77, 64, -119, -43, 85, 29, -63, -56, -74, -39, -49, -84, 15, -32, -25, -27, -46, 104, 76, 112, -92, 141, 106, -103, -19, -44, 57, 8, -39, -95, -18, 19, -42, -82, -34, 29, 53, -110, -39, 185, -29, -66, 26, -21, -24, -53, -102, -114, -116, 29, -12, 0, 39, 32, 3, -66, -47, -3, 64, -94, -13, -35, 38, -51, -90, 47, -8, -66, -75, 51, -59, -12, -23, 12, -35, 121, -28, 115, -32, -48, -30, 83, 30, 50, -31, -40, -35, 68, 76, -84, -55, -16, -2, 12, 1, -120, -59, -18, 82, -113, 20, 129, 40, -141, -32, 82, -38, -36, 127, -45, 90, 71, -50, 133, -163, 91, 97, 38, -1, -88, 13, 73, -115, -29, -3, 34, 13, -24, 5, -27, 16, 31, -23, -77, 49, -19, -15, -6, 30, -33, 23, -8, -119, 23, -8, -178, -65, 67, -29, 52, 66, -41, -96, 149, 18, 79, 15, -28, -29, -118, 118, -50, -44, 31, 164, -19, 13, -33, 97, -13, 104, 35, -67, 17, -33, -106, 28, -63, 62, -44, -92, 10, -54, 31, 42, 18, 23, -40, -81, 7, -130]
4440a30J5J76r2PM1o6Pm4N2O3kR3j44J27k2n2n2K5O4o6L8J9M2q7M7o3jl0P0q9
4470e4R5Qo5mR5kl6RK6j05j0m5J29J7n1O4r4J56r6N6j31M8k1L2j49J44lk5J3k6
4500b5M9p9M8R0j48J36l2n5nM6Pq6J67j69J29n2m5Q4j0p4Q1j81J02J1k6L3l8p1
4528a13K4P5N8q7L0l2k5K5j3RR2j03K7M6L9Lm1M7Jn2Lj10J28P4o4p7R4r1P3j7
4558B3o1nR0k3%P2o8J7p2J3l9N4R0n2O5j19Q4L8k53K20j39n2J70o7Q6l0m9K8L
4587B4q1J34k11N5K39j67m3J24k6o5Q7j50J65K6j67N1nJ50k90J12O7j6q1L8q3
4612a13R6O6M3r3j47J26J23j15n2O2J23k49J8J06j8J4m6L9j1K29k58kM0P8k06
4637a47O1J52OK1r6J11Ko1jl5K0nj0r6Q8J02j57P5L2J22l7j68J7J3j30K15k80
$$ y = [-130, -115, 61, -31, -24, 17, -49, -42, -86, -34, 29, 27, 120, -24, 103, 81, 29, -23, 2, 66, 0, 38, 57, 99, 12, 59, -4, -5, -35, 35, -54, 41, 49, -16, -20, 75, 73, 37, 46, 72, -33, -43, -88, 41, 58, 7, 71, -23, 133, 37, 93, -38, 10, -11, 21, -128, 16, 13, -12, 1, -25, 24, -55, -7, 83, -65, 71, 39, -16, -21, 25, 32, -54, 113, -56, 73, 21, -24, 60, 50, -24, 57, -124, -22, -11, -37, -4, -42, -113, -89, -14, 44, -43, -13, -45, -70, -45, -58, -49, 43, -60, -33, 13, 52, 55, 14, 61, 62, 10, 13, -97, 31, 105, 41, -36, 58, -33, 40, 23, -38, -43, 47, 24, 24, 96, 28, 45, -27, -14, -53, 1, 91, 39, 104, -15, 69, 107, -146, 74, -65, -117, 53, -14, 72, 42, -7, 21, 24, -57, 77, -134, -79, 160, -7, -50, 74, 48, -17, 70, -80, 85, 111, -56, -5, -10, 140, -150, -38, 29, 13, -68, -30, -113, -17, 49, 92, -1, -148, -22, 101, -14, -66, -4, 119, -130, -112, -6, -24, -10, -56, -17, -28, 201, -57, -59, -19, 59, -147, -86, 66, 72, 93, -3, 108, 110, 49, 48, 13, 33, 28, 18, -78, 10, 112, -45, 30, 62, 184, 147, -21, -4, 9, -121, 94, -186]
4664a86R9R3L1J7j07J1O1P4j56K9k3K7l8r1J28O7m6P7L7q2Km3k0P6o0p9M6J54
4692I8k64L50k23j0N6M2l7K8n5J0K4ln8O9r7q8J57Q3M4k21J60j55K16j11K2j31
4718i4KO6l8l9O9k7R4N5j2r3P0n2j9j7K02j66n5k2J26o2L8Q9r1J3j20Q3J2L7R5
4747A44j25k0N5k3N5r6jM5J04k32n0K42n7j17J05k1L5l3M0r2J35k01N0K5L0m8
4773e1J30r9Pn6k3J9n5K61p4n7l8R0o5j07J27J4r5n4Q9L0j3q8N4J04m5J4j33J33
4801A9j09M9J2r0Q4P5k0l8J23j64qqJ65q5M7k1j41M2K3k4J12q5qR0K3j16J07n7
4829cn1n0M5QP3m9m9M5K4L6J13j96L7O8j1P8j27l3l7J82j28j04J69P0j09M6n8
4856a1J14L5j55j4Q2j2o7j3L0Kp4O3M4O0j84J01J6j09pK59j38O7q4K8K2mj04n
$$ y = [-186, -87, 6, 37, 54, -53, -42, 19, 93, -63, -34, -57, -30, -68, -159, -31, 36, -10, 67, 104, 22, 24, -19, -39, 37, -23, -102, -56, 98, -166, 184, -39, -49, 7, 49, 12, 40, -15, -5, 19, 16, -42, 27, -70, -158, -1, 82, 126, -95, 65, -90, 126, 15, 37, -94, -92, -26, -64, -103, -34, -61, 33, 88, 76, -17, 53, 1, -18, -35, 167, 1, -54, -76, 50, -12, 26, 115, 24, 37, -83, 0, 12, 49, 144, 19, -1, 54, 31, 86, -10, -11, 34, 138, -94, -144, 98, 41, -76, 29, 8, 43, 10, 50, -42, 93, -108, -58, -33, -3, -51, 79, -20, -13, -69, -92, -73, -128, 133, 59, 2, -36, 54, -11, -118, 9, 23, -72, -126, -37, -7, -20, -108, -54, 50, 5, 19, -114, 19, -90, -41, -29, -119, -35, 40, 20, -18, 105, -59, -67, -75, 90, 5, 52, 31, -110, -68, -45, -69, 43, -42, -50, 40, 63, -53, 54, -3, -54, -104, -59, -51, 22, -27, -76, -31, -7, 29, 142, -54, -17, 51, 40, 118, -9, -42, -79, 103, -25, -129, 40, 110, 1, 47, -11, 103, 138, -17, -31, 51, 39, -28, -41, -11, -9, -83, -20, 24, 84, -100, 1, 17, -92, -99, 160, 22, 89, 5, 33, 55, 51, -53, -58]
4884e8M6rPN2j49P6j6O2J10j23l3j7P4J43p6o9J04j0p0j13N9J0P4j07P3M7j06
4911a9mj38P5J82o0r0M3Q2j66M7N6j21J81q0R3n0l2M1j51J03m3O2P3j21J9J5N9
4938E6l3p1kmJ44j89J26Q7m1j00J12j05M2n5L6QJ08j29L8J9j27J29j10O7Q4q3
4964GJ9q8Q1j2M3m7l6N7rjkj1M8j87J18R6p7J8q5j7M2J91j22l4MnL5r9O3J4J05
4995A09j87J12k9l8M9l0mN9j0j29J51Po7k6O7k7n7O1N5q8n6M2L0J46r6l3j20J01
5023hO9q4P2p3P2o1J0P7r8r9R1m5M5k3O7JO2k1L4p9p1J82q0nm0n5O9j64P7J32
5053E4Ql3pl9K9m0Q8j2q8m8K08q3j07p3m2N9J86p5k8L7LJ2l5J2j0J25k0J4k0K0
5083I5qj52J9J93j19L0j22M5J06n1L4k3j8K9r0L8ok2k3n9J42K8p8q2R7L9p3J52
$$ y = [-58, -12, -21, -14, 38, -111, -35, -51, 11, 121, -2, -35, -52, 22, 165, 89, 20, 124, 114, 44, -69, -10, 0, 74, -33, 40, 87, -19, -23, -161, -86, 96, 36, -54, -11, 71, -95, -48, 8, -113, 68, -12, 81, 31, -1, 40, -111, -8, -51, 11, 84, -37, -18, -3, 56, 23, -48, -50, -54, 90, -99, 27, 114, 73, -27, 85, -20, 22, -33, 3, 11, 119, -10, 28, 47, -80, 49, -61, 6, 90, 7, 26, -62, 19, 7, 50, 3, -33, 24, 15, 14, 12, 1, 49, -138, -20, 76, -1, 17, -68, -85, -43, 148, 26, -8, -4, -9, 26, -73, -10, 4, 109, -78, 34, 5, -33, 16, -14, -18, 41, 31, -98, 53, 60, -7, -33, 34, 7, -50, 11, 66, -22, -78, -36, -6, 140, 44, 11, -109, -8, 61, -23, 49, -24, 48, -13, -3, 74, -24, -123, -32, -77, -32, -55, 12, 13, 75, 54, 88, 9, -62, 120, 40, 35, -5, -60, 9, -155, -78, 54, 62, 29, 22, -17, 12, -28, 60, 48, -40, -88, 120, 37, -70, -143, -185, -126, 60, -15, -43, -6, -3, 9, -26, -14, -24, 101, 81, 95, 75, 95, 87, -65, -46, 147, 28, 58, -64, -19, 87, 36, 70, 47, 29, 58, -32, 6, 0, -22, -45, -104, 38, 66, -12, -94, 3, 42, -31, 121]
5111A21j21k2K03k68K10o9r9J64m9l6N5j16kM0K2p9N2m5m6J5J20k2J0K1r3Q5P1
5138A22m5j17N1P3j16N3L5l6P0m8pn9L3J6K0j4K1j45J22l4j15M4J18P2j06K2r7
5165f7N2N6j65k2J10L1P8l4n4m8j3J9p5J47m5P8Rr1P0n5J8j9RLk7J33j03n9K8
5194c6M9NN1n9m8P7P6j00j03J73m6j3k7q7O9O4L5j23M0O6n4q1K0k1K0N0K1m3r6
5223a21J56P4q0j37L6J06MJ7p9m0Q8J1l0M1o3J51o9j24J50p9J4p4J07j30jJ22
5249E0m7m5P5j19N9J1r1J14r3m6J22RN1ql0j6J33q7j3n6P6j5L8r8n6M4M6n6K10
5278A62j50qN2p8L4M4O3p5j31J78j54o2J29k3lm6rJ00K2k3J6Ok1l2l5q8J90j00
5306d2MQ3j46K02q9j9LL6M7p0N8r8NO4k2q0O4q1J81j91R5n4O6N2j0Nj01NQ8L5
$$ y = [121, 0, -22, 181, -87, 123, 54, -45, 119, 70, 34, 89, -27, -29, 11, 33, -46, 6, -39, -85, -70, 50, 28, 38, 59, -34, 51, 122, 77, -40, 11, 84, -32, 21, 56, 20, 90, 42, 35, -24, 9, 25, 45, 31, 52, -93, 29, -5, -120, -76, 42, 114, 8, 30, -67, -15, 41, -124, -146, -36, -5, 73, 39, -15, -63, -76, -57, -132, 15, -30, 48, 57, -34, 36, -19, -1, -20, -11, -8, -35, 98, -5, -64, -36, 13, 18, 69, 10, -38, 39, 115, 15, -88, 85, 39, 26, -1, -88, -19, 45, 80, -43, -3, 63, 9, -72, -52, -73, -53, -3, 18, -25, -121, 35, 109, 29, -108, -72, 34, 38, 55, -24, -64, 24, 35, 5, 46, -17, 134, 65, -59, 91, 12, 26, -48, 59, -71, -72, 50, 3, -42, 33, -86, -27, -16, -107, 7, -86, -132, -10, -1, 50, 42, 12, -4, 129, 42, 29, -27, 49, 34, 72, -26, -82, -38, 8, -48, 162, 12, 4, 56, -22, 12, 56, 119, 44, -87, 91, -63, -125, 4, -19, -22, -68, -77, 23, 45, 22, 38, 44, 23, -9, -44, -132, 58, -42, -38, 45, -101, 101, 12, -7, -4, 32, 79, 9, 67, -31, -26, 38, 16, -64, 0, -81, 100, -91, 4, -50, 16, 68, 58, 63, -38, -33, 55, 90]
5336I0n8P5j31J71j49Mqj42J95K8j95J05n6J15qn2Q3j01J05p6JMJ4Qj6n1l4J20
5364D1j04J08k7n7J50r9j19J10L2L7j19P2j1L1j1MJ9o7K2j31K54j67P6j10J47
5389H1m8l0nn9J28j3m3q4J26Mj24L6k0R5l3j43j7J51k7J6M6o0L7K5jj21L1J39
5417H7o1o1O3J3o7o4J39l9mK0l5k5Q8pr0m9J30j5m7n1Q6m1m6J83j67J3o1R8J03
5446I3j43l8N1j01J71R3k33M8n0K23j53M6L7j53N5R3j16M8l3J26q3l1M0J8qn5
5472e5J14j3J01j49k8K41j68rq1o0Q1lM0m2J34p9l6l2q2M3J26J3q9M7j8K3m4M0
5500A5k8m4Q7N2j58J32M0P7k29L5k0j9q4K23q5Lk9L0J05Mo9j07P4J9j5O9j25O0
5528A3l5o1J5P4o8NM6K8j7k4j29J02J30l7j00K3J32k02L0M1N5j90J14P5k6k3R5
$$ y = [90, 32, 107, -24, 147, -2, 2, -6, -148, 47, 75, -120, -15, -71, 44, 36, -16, 67, -34, 71, -5, -4, 0, 14, 22, 6, -45, -79, 41, -63, 45, 18, -39, 111, 12, -107, 3, 35, 72, -47, 25, 14, 45, 34, 38, 57, -10, 12, -119, 135, -32, 44, -66, 81, 33, 3, -2, -61, 67, 54, 11, -73, 53, 57, -67, -31, -51, 44, 11, -132, -149, 2, -25, -9, 37, -23, 14, 39, 38, -83, -52, 87, 26, -35, 28, 41, -26, -90, 49, 10, 6, 26, -9, -34, 54, 47, -43, -92, 38, 23, -24, -75, 11, -30, -76, 107, -60, -47, -108, -10, 93, -50, -88, -37, -138, 33, 126, -107, -59, -109, 114, -39, 7, 44, -109, -54, 39, -77, -29, -62, 64, -19, -50, -10, 8, 0, -55, 59, 46, 147, -2, -30, 211, 43, 34, -47, -107, -26, -29, 11, -31, 103, 24, -12, -44, -126, -83, 43, 56, -33, 14, -4, 19, -25, 15, -13, -57, 30, 82, -76, 56, 96, 173, -56, -21, -41, -60, -144, 79, -6, -3, -32, -2, 103, 107, 38, -69, 5, 24, 9, 78, -47, 13, -22, -83, -68, 6, -62, -57, -11, 17, 0, -24, -153, -51, 79, 42, -58, -35, 97, -105, -75, -34, 21, -169, -55, 20, -6, -29, 66]
5555F6j01Q5O1l6p2m4k9QL2P0k8j03O1J61j76N5q0J10j6P5m1j24J27j40O5l6o6
5582a16J15o1k3K6J07p2Q0j0k9pj8m7P4N4l5p6P0Jr3R0q3J1P8M5m8j36M7M7J9
5611A0jl8J6J41j60p4P7L5k3p0J03j37P9J9J6N7j0q7J25q7P8n0o0J39j74O2kK2
5639Fqk5m2M4J12n1o4n8M7p8J08k4m1P4p9L6R2j88Q9Q8Jj0o1N1j6j7j03J28m6
5668c5n2J54q8J4ol8J84m4o4Q1j43M4j51RJ98m6m0R5j32L5L3j05R3kM5q8J24j02
5696b7k0K5k9J33j18LJ15L8r9%Nj7n1K14j64j6l5J9J5L9j00M8k7j6O3k6J68j64
5724b4j1Q3l5N4j4L0J5l4j03r5J56k0N1R8j60M4K2n8j04J53j49M4J05L9r1l0N3
5751A9ok3K4J1PN1j2j01n4k9J17K7J6P7p0Jm3O7j69J36n8p2K01k0j85J71j52k7
$$ y = [66, -35, 50, 111, 75, 3, -41, -70, -62, -30, 40, 12, -91, -30, 131, -45, 10, -70, 40, 24, 99, 58, -66, 61, -79, -14, -50, -116, -1, -62, -85, -59, 48, -24, 56, 46, 17, 10, -8, -55, 19, 73, 38, -38, 32, 33, -60, 30, -53, -42, 36, 81, 33, -103, -56, -9, 10, 9, -29, -13, 128, -32, -106, -29, 6, -17, -87, 16, -121, -42, -23, -7, 50, 40, -47, 78, -9, 69, 19, -41, 98, -76, -14, -16, 6, -2, -27, -69, -25, 87, 36, -28, -86, -39, -117, -9, -33, -74, 0, -79, -43, 49, -139, -50, 38, 39, 29, -32, 19, 3, -14, -117, 11, -35, -87, 67, -21, -7, -13, -51, 133, 89, 25, 106, -37, 7, -144, -135, 63, 17, -23, 72, -60, -25, 8, -97, -4, -6, 39, -49, 75, -27, -47, -22, -51, 82, -36, -33, 82, 120, 21, 21, 26, 9, -42, 172, 8, -8, -43, -24, -9, 30, -70, -22, -49, -65, -2, -28, 140, -24, -35, 48, 13, 67, 53, 83, 98, 64, -39, -134, 22, 2, 53, 151, -9, 35, 57, -1, -105, 48, -101, -57, 48, 87, -4, -34, 19, 13, -10, 14, 25, 32, 83, 71, -30, -84, -113, 4, 31, 47, 124, 54, 55, 12, 79, -90, 46, -12, -84, 117, 97, -88, 83, -69, -96]
5779i6J12Mj26K08q4q6K8J6O3q6j07J02n2J38k1o8R6q9J15j79J58j26N9M3J1p
5805B6J2q1N3p3Q7jN6r1P2l5N5Q8j36q2K6m2J38j13RM8Q8j27n4kNK16k14J55q7
5834dK8o6J34j40l7M9J32nm3o2M0n2%l9J4jO5J5k7N4q2ql2k7K7Q5rj5N4j4rk8
5866cL5P4j87j2J06O9n1Pj41K3P7L9K6j27O6PR6Rj25l7J22o4j5L6n8K0o1J42r2
5895a9M8m0k5J2K2k3m9L8LO6J3k4q9R8R6j36m9P6J7J7L5k4m6Jr3J40o4kk8n9R4
5926Fp3N3k4P4oQo5J9J3qK6O0j03O0r3N9o8N6kl3P8k6K3Mn4l2lk6R6j09J48p9
5958b1J68j17j07J56o4Ll1N4J9k5MN8ro0Nj31J29k9N6q4m0J20p6O1j34NQ9k2j32
5987a55J17Q3K6p7J5n1l4K03o0j36Q1m4Q6r0O1o0%J23N9q5m2R1k6k2j1Nj29O1
$$ y = [-96, 16, 20, -106, 102, 18, -68, -40, -24, 39, -47, -154, -52, -104, 34, 13, -55, 41, -48, 67, -112, 46, -80, -21, 22, 33, 26, 38, -43, 10, -63, 24, 23, 79, -12, 60, 25, 80, 168, 32, -50, -24, -66, 72, -41, -32, 16, 104, -23, -77, -79, -74, 142, -72, 83, -4, 24, -42, 92, -48, -85, -36, 96, 91, 48, -14, 26, -26, -26, -65, -51, -52, 13, 28, 1, 55, -27, -35, -67, -94, -67, 18, 9, -6, 48, 34, 25, -3, 32, 106, -81, -93, 13, 82, 31, 38, -103, -80, -3, 36, 62, -65, 1, 8, 104, 113, -12, -49, 73, 9, -6, 30, -28, -8, -69, 73, -19, 29, -11, -36, -24, -2, -25, -74, -36, -33, 33, 46, 22, -67, 31, 127, -9, -58, 18, 35, 52, 87, 63, 17, 18, -75, 65, 1, -1, -29, -88, 6, -67, -14, -38, 36, 30, 38, -27, -8, 5, -3, 23, 83, -20, 40, -53, 6, -62, -6, -8, -41, 37, 11, 34, 38, -16, -48, -51, -77, 19, -90, 58, -21, 147, 30, -77, 79, 15, 18, -13, 41, 60, 35, 39, 97, 88, 28, 33, -98, 31, 2, 58, -26, -66, 54, -22, 39, -95, -90, -1, -23, -155, -38, 45, 71, -6, 9, -42, -76, 127, 67, -69, 12, -32, 54, -36, 25, -35, -35, 88, 147, 62, 20, 111, 85, 63, 52, 57, -72, -11]
6015a1J01j47J54r4p4J4N6q0PJ05Q3j41J3p4J21q4j1M7j14K00k6p5K2Pj32J65
6041C2j30J11n7J82j60oJ10m1J15k11K4m1J11l8p5O0L2p7R3m3K9Mj40J23J15j01
6067B1K0j39M3J05k4o2J73k24j2N2N6k1J26j63J3J6o5O4M4J45m9q7n0k4J14l1
6093D1k6p1n9O6R0q9J32j13P0lm6J07k5n5m8j13J09J05n3N2l4M2l8q3o8O4j8j8
6121h2P9k7O3p4N0j8oJ%p3rJ03r2M2J50j34j3rm7R3n3R5r2J02j01M8m5M4P5k6
6151D4Ml5J8n2J45m3l9k6Q6k23qQ2k6R6j16Q9n5l0J96k01P6R6p7M0Or8N1L6j6
6180B0l1J99j20j14J99j83N2q9j9O4qR4Nj00p6J64klj31Q6r2P0R5j14N0P2j67
6207g9M2p7N8Q0k2j52K44j06j3M7Rk1K4l1PJm2R5j39M4l8N6J0l6k0K19k32J56
$$ y = [-11, 90, -57, 97, 3, -71, -57, -1, -81, -74, 31, 114, -27, -14, -88, 33, -51, -62, -15, -129, 71, 45, -30, -8, -1, -133, 32, -98, 13, -44, 138, -22, -28, 82, 41, 156, -55, -31, -72, 39, 1, -74, -14, 18, -59, 34, -9, 20, 24, -116, 7, 122, 21, 41, -98, -55, 50, 26, -36, 137, -87, -99, -47, 9, -12, 114, -49, -36, -20, -85, -21, 23, 168, 119, 32, -18, -42, 72, 41, 15, -56, -115, -49, 41, -48, 84, -29, 41, 38, -8, 99, 74, 19, -29, -142, -33, 72, 19, 71, 37, 79, 41, -42, -110, -46, -64, -82, -3, -30, 33, -41, 9, -9, -15, -14, -14, -87, -96, 7, -85, -43, 107, -27, -40, -49, -96, -3, -56, 39, -53, 49, -52, -4, -49, -5, 70, 44, 48, 13, 31, -21, 124, 81, 42, 16, 102, -121, -129, -47, -73, 23, -93, -4, -59, -89, 107, -94, -18, 78, 1, 41, 47, -51, 0, 36, 20, -11, 188, 68, -46, 153, -30, 22, -67, -86, -22, -30, 64, 69, -31, -107, 57, 55, 52, -79, 7, -85, -15, 80, -34, 16, 88, -79, -37, -114, -56, 24, 2, -150, 94, -12, -25, 22, 31, 10, 34, 3, 10, 11, -31, 64, -75, -31, -69, -13, -3, -39, -59, 160, -72, 84]
6235H4j70r7O0R8j13J72K5j55Q4j1P6n5k7m6M8N1n1P3j28J59j27M0R9p1k6L2M
6262B8P2o7l1qL4j04N1J6j1L8KLJn4p4N3N0j86J24J89j35J0Q0j84R9J38j18O9
6290H5p3n5K7J37q0j4p6p3J77l0k2J2M6or6L8M1M0p6o4Q0N3j64P1L5m8q5J30L7
6319D7%q5p4J10n9O2q0R7r9L5k2N4R9j33Ln1P0m4M2J74j38m9O1K3n9M0k4J03q8
6348A5r7J2P2J2J24j74Q9m6j5K3M7j0k1o2l5J31j3j13lJ01j39J24j03l9J22n2
6374e0P6p5N3R2m8j11O4J30n7k8p1l9J15j10JR3n3P8r9J98k85J1J05M4J3L6q9
6401fJ2n4m7J69j06K8Q7q2J3q7J39j64J00Q2j06J67j68J3kK0K6l5J71k17J23o6
6427A0K0rJ0M9o1o0n6J04P3K6n4l6k3R4q7Q6l7o7O3L4q5N8O4q6M2j31R2p2J02
$$ y = [84, -86, -183, -123, -25, -138, 34, 59, -96, -12, -23, 53, -2, -29, -75, -27, 24, -27, 46, -82, 77, -50, -10, 89, 18, -8, 24, 28, 100, 33, 2, -6, 28, -76, -25, -9, -20, 18, 20, 23, 24, -30, -104, -51, -1, -187, -63, 126, -9, 1, 81, -103, -4, 134, 16, 85, 12, -43, -16, 121, 41, 27, -49, -122, 55, 25, 3, 15, 61, 55, -41, -3, 38, 78, 2, -62, 18, 71, -93, -22, 13, -35, -120, 10, 47, 47, -38, -112, -2, -61, 1, -79, 18, -81, -46, -68, -14, 85, -48, -45, -96, -26, -70, -28, 146, 8, -41, 20, 43, -16, 24, 0, 103, 15, -82, -70, 2, 14, 138, -36, 53, 7, -8, 15, 62, 52, 31, -31, -66, 65, 52, -61, -64, 37, -102, 22, -81, -120, 2, -50, 26, -49, 4, 96, 48, -63, 1, 131, 74, 46, -25, -64, 51, -59, -58, 35, -18, 60, -39, 159, -126, -115, -10, 34, 47, 83, -6, 6, -48, -95, 74, -32, -4, 83, 1, 14, -73, 66, -98, 2, 84, -22, 145, -23, -10, -12, 8, 34, -1, 170, -47, 76, 10, 30, 21, 31, 80, 19, -41, -97, 7, 80, 106, 52, 16, -7, 87, 0, 86, 49, -18, 45, 79, -6, 52, 116, 30, 72, -59, 33, -39, 63]
6456F3l8J8n2M2nO3j16l0Q6j36L6J00r3O8N3p1k9J14r5J04q9pJk2J25r9o9J97
6484A19L3j04qm8Q7j6j75K07q3m8K17j20m3n4Mj7Q3j5R0j29M5J00j40O4j2j1l0
6511dQ4k0Pq2K5l3Nl8K2l4M7M7o5O9O7M5j62Q6n8r2R4o9M0r1J13j1Q9l4j60K07
6541I4k69J70Q8k6j08N6o7M4K2L7Pj46K01j82J38q5L8o3K4j4m9J07Ol8l0J34j36
6568d7ON3m2N1k8j0JPo0J43%j01R2p5M6K2P8j18l9n7J13p4J1J4J50r8M1j39N1
6597il1J12m1q0J46o8O0j16R5p0j26M6R7j8m9OJ3k9J61k18J19Q1k36J93N7j69
6623g4R3j0roO6q2K9Kq9J08N0k2j6P3j15l9K8Rn9L9k6J50j45J3L5l0r8O1qN3q0
6654i9J46L1j11k0J6K3KO5j01N5M1l3J7Nl3j6j4L5j8j3N6j1q5J4J82o3q7L3M8
$$ y = [63, 25, 43, -9, 33, 28, 91, -25, -55, 31, -105, -69, 31, -62, 6, 59, -12, -41, 73, -22, 82, -7, -14, -13, -35, 90, -9, -78, 119, 152, 48, 40, -8, 79, 63, -112, 95, 12, -36, 181, 61, 18, -36, -32, -49, 34, 19, 109, -20, 25, 125, -15, 49, 37, 26, -4, 80, 60, 67, -15, 10, -23, -18, -56, -34, -68, -21, 26, -39, 30, 97, 142, -20, 66, 8, -84, 10, -59, -19, -110, 3, -8, 81, 47, -113, 94, -175, -5, 83, 57, -51, 5, -62, -18, 4, 41, 48, -98, 103, -79, 59, -26, 12, -51, -27, -41, -90, 17, 23, -15, -45, 89, -47, -41, 12, -30, 21, -7, -17, -16, -9, -69, 74, 74, -27, 65, -10, 36, 58, 136, 18, -21, -78, 35, -39, -28, -14, 136, 38, 79, -60, -9, -40, 72, 31, -49, 97, 29, 89, -27, 68, -2, -128, -82, 15, -3, -52, -46, -33, -62, 99, -119, 0, 81, -155, 38, 95, -74, 19, 9, 0, -6, 60, -22, 7, 9, -80, 28, 78, 56, 40, 113, -2, -41, -13, -4, -63, -24, -50, 100, -45, -32, 3, -27, -125, -64, -72, -19, -99, 47, 78, -33, -53, -37, -14, -12, 53, -48, 7, 48, 15, 32, 37, 4, -12, -26, 9, -9, -22, 34, 23, -62, -48, 134, 71, -16, 17, 65]
6683F5J1j41J07j35N7Q7j09k2L0J2k7l3L9P0k4k5P3L0m5J5M8o5m7l5J9L5nPo5
6712g3O8qQ9j3L7j10O4q2kL6L9j11R1J2r3J18k17J70KN9Jj00%J05J4j47m0Q0J7
6741Fj0m6o8K09k2k15K11l4J2n9l3N1o1J21l4m5rP0r3Q4M3r4J0M4m2l2O7Qk6q9
6771g6K15j15K6j58J60m8n9J40o3l4j32J72p4R7J12j55P2p8j3nMK8l7lR4m4j4
6798A2J02p7m8O8j48K8k2K24j27J07j24K1%M9nl5P8j91N6J6p8Q3J4LQ3j60J7O7
6826A3m3J5n4J5P4K3K5j29J54k2j18P7M6j99J31o1M5m9l3J28n8N4nL6j34j10J67
6853a2j0LJ60k38J6J58n7q7R3l4k1lJ01j6r3j24K59m4j48k4Q6K5l7K3O2l8P1k9
6881D2Kj21O1j7Ql3Kk2K3N7lm9R8k2j09qJ07n2R2j11P6q7J63o4m8L2q6KJ29Rp9
$$ y = [65, 76, -65, 42, -93, -36, 51, -58, -80, -50, -38, -65, -98, -59, 11, -13, -38, 35, 65, 20, 35, 83, 18, -29, -64, -45, -10, -15, -8, -73, -5, -13, 76, 63, 100, -10, 54, -28, -30, 6, 45, -66, 25, 37, -56, 62, -155, 15, 17, 76, 77, -23, -23, 82, 96, -51, -91, -11, 6, -4, -50, -118, 91, 69, -146, 65, 31, 43, -16, -49, 2, -59, 62, 28, -17, -26, 44, -49, 35, 78, -16, -6, 38, -4, -36, 31, 39, 13, -76, 139, 24, 50, -108, 52, 4, -55, 85, 22, -12, -144, 28, -46, 51, 163, 8, 80, 2, -11, -16, -12, 16, -21, -24, 70, 26, 12, 114, 37, -11, 57, -91, -63, -85, 139, 12, 119, -5, 16, 16, 65, 60, 25, 103, -88, -32, -16, -94, -11, 3, 6, 89, -71, -54, 13, -30, -15, -69, -54, 20, 43, 68, -61, 93, 71, -47, 30, 76, -123, 8, -53, -8, -57, -90, 38, -20, 34, 29, 65, -69, -179, -12, -22, -19, 141, -97, -81, 77, 20, -67, 26, -8, -29, -32, 69, 53, -40, -164, 95, 51, -97, -121, -35, -10, -47, -24, 38, 0, 71, 42, 44, -77, -16, -33, -25, -58, -56, -78, -55, 2, -1, -50, 48, 26, -83, -91, 16, -36, 56, -55, 21, -66, 97, 33, -15, 17, -69, -67, 62, 71, -8]
6912hJ32j01o8m3J9j1N6L9p5p0J69R2j45n3J49j55J67j22J5n6J94q7p5M8j32R5
6938b6J8l6n5J42M6m9o5qj34J94o3np4J08k8Q6j19M0K7J2p1J41p9L4nj21O9M1
6966B0Jk1J09j1r7n8P3l8Q3p4l3Q9L3r4J9k1R2p8J39o7n0m4J15j45J9QJ5j19J33
6995bK5M0J6j51K9J17n1J45k23O6N7m8r2L0l4N5J05l1k4J32j43p1J14P1j56l2
7021e6N5Q3j15N4j2J1mj05K9J47Jj08N5L5%l7r8%J63j04R5j71J35O7j52m5Q4n6
7049d9P1J59k95J83j61K57j87n2J05n2M1j23N4Q3j1o0J39r9k8k6k7Q2Q2R3j34
7074D5j38J14j73K56j0m4k8m4J18j34J9KK6K2n4J01q1N8J13r9q8K9j5k2N2k1j11
7101a07J78q6K4J50j39JM9q7Q7M4k28J51Rj6nK6p5N1M6p9M3j43J07K4p6j1J17
$$ y = [-8, 124, 23, -45, -88, -69, -80, -24, 15, -60, -130, 39, 131, -14, -67, 82, -73, 94, -28, -13, -69, 125, 38, -37, 11, -121, -26, -8, -44, -99, 43, 89, 40, -25, -33, -167, 27, -36, -41, -115, -7, -35, 51, -68, -28, -1, 11, -60, 81, 2, 36, 31, -90, -21, 20, 21, 0, 109, 98, 1, -57, 16, -22, 61, -13, -46, 43, 76, -18, 1, -20, 72, -6, 133, 66, 16, -28, 87, -58, -39, -31, -16, -135, -2, 23, 63, 79, -72, -43, 74, 23, 168, -55, 11, 68, 20, -72, -42, -76, -21, 84, 53, 29, 161, 18, -53, 61, 132, -24, -56, -1, 82, -33, 21, 9, 20, 16, -89, -60, 87, 88, -20, 35, 70, 70, 33, -65, -65, 98, -6, 89, -82, 53, 120, -32, -77, 7, -49, 22, 181, -114, 69, -92, 165, -22, -74, 31, -21, 20, -103, -49, 34, 23, -37, 102, 3, -25, -51, -78, 4, 86, 179, 45, -93, 21, -152, 104, 94, 50, 22, -22, 96, -38, -19, -17, 9, 31, -23, 78, -3, 55, 168, 69, -19, 10, -5, -27, 25, 4, -107, 71, -15, 9, 159, 20, 21, 70, -17, 70, 114, -114, 37, 46, 30, 25, 51, -24, 27, 73, -6, 37, -106, 1, 25, -51, -62, 55]
7128E5l6j20N2N7k4J5j11J57o1K1J01L1r7J4o8K8P8q8m9P6N9p1j59P0N0P7J1k7
7156D1M8j45J15n8k9J90j85OP3K6j32R9k0J17k86J34J1N9o3P6j79K9J21N6j26
7181b2j00J07n5R4J8L5j4m3r5P3Q8r5o6J47j8J0j21J35l2o2K2q9J29j55J57j08
7207f0J13L1j19n7J73m6J9q2K7Ln7J17mq4Q9j02nl0j8M7Q2p5J76k07J4J06o1J4
7235DK1Jj55J39R7k32J52Jj15K3J80q4k2OoN7n2k3P4j4j5M1K5p3l7j01K73k10
7263d5N3p4mJ31j29Q6L1kn2m2J7J8k5N4j21L3K4m3Q1O3o3K4l2N6r4n0R2o7J34
7292E4k7p5Q3l8p2l7J84O1j38j02J01Q9q8k9N8J4l7p6R2R8j33l2J5K6o6M0k6r
7320g0jJ41j2j77O3O6rM9L9k10J91p6k6R5J4j35R6mk9p5J39j21O4r0M5QO2j3J7
$$ y = [55, 19, -101, -49, 8, -16, -1, -112, 45, -16, 5, 106, 137, 40, 54, -14, 14, 92, 4, -45, 31, 90, 19, -140, -70, -20, 57, 68, 41, 89, -56, 59, 1, -28, 162, -23, -17, 56, 82, -50, 49, 29, 146, -140, -6, 5, 64, 1, 77, -102, -73, 48, 104, -22, -122, -15, -70, 24, 42, 77, 63, 20, -75, -2, 86, -9, -75, 72, 54, 64, -57, 78, 46, -16, 6, -83, 46, -109, 48, -60, 53, 84, -35, -92, 81, 35, 54, -28, -1, 2, -55, 62, 58, -26, 63, -39, -44, -74, -92, -45, 37, -38, 138, -69, -55, 51, -10, 4, 25, 26, -129, 10, 107, -125, 27, 28, -87, -64, 116, 32, 10, 16, 10, 67, 15, -8, 66, 52, 37, 78, 103, 30, -7, -108, 165, -45, 8, -66, -70, 61, -68, 18, 49, 47, -5, -47, -30, -12, -37, 17, -104, -71, -47, -90, -9, 54, -9, 15, -17, 39, -55, -105, -13, -80, 54, 27, -48, 35, -3, -75, -112, 72, 133, -5, -107, -6, 83, -5, -34, 24, 38, 1, -75, 17, 115, -18, -50, -35, -9, -75, -35, -61, -70, -71, 70, 58, -119, -56, 10, 1, 50, 89, -121, 70, -6, -32, 63, 77, -58, 38, 34, 5, -70, 69, -52, 12, -78, -33, -25, 37, 24, 41]
7349D1k2L1n0L7j16L6L5J26j35J13p3N5r1PN4J9q1m3J45j85L5J49Q9l45J54J51
7375A36j70j8J08K8p3o7O3j7R4m3o4O5N0j07m9R0rK3k5r3R4j0J8k7j08J14j18
7402a15J11kRpJ05O3j56k4R1pn3J13j74J25o3K9o0L0M1k7K4K2j01O7n2M4j2L9
7430F0j32L0MJ65j14k3QJ70j56k8jJ75j69j13J40j01J77j41O5P8o6m0J44k31K8
7455g1o9J23J28m1n1J5L9j25oK5J36r2J1p9rj7J60j25K7J05o3L8j38J39q4q8J66
7482E4j06R0L3n6j8jj7M1L4l6p8J65k06j1l9J15O1R2j51K6q9p8K98j71O3N8M3
7509A16j08O2qj10J35r9j7J12q7q3J51lp2J06j69J81k9k1j71J30j1J36j49N8k9
7534B1n0J00o1N4l3K3q0J09K1n6j58rK9l8J87q6n5J41n1j0K2q7m7P1%P3k8R5k11
$$ y = [41, 19, 50, 0, 37, -79, -43, -8, 118, -17, 96, 23, 78, -13, -6, 48, 67, -14, -57, 88, -97, -62, 87, 176, -169, -15, 136, -34, -52, 56, 84, 11, -56, 7, -10, 84, 41, -23, 42, 92, -15, -64, 26, 17, 40, 15, -78, 16, 6, 24, -3, -111, 3, -115, -4, -6, 3, -4, 101, 164, 8, -16, 75, 68, 15, 128, -46, 79, 16, 45, -15, 15, 56, 29, 53, 75, -26, 41, -11, 33, 21, 60, -72, -42, -38, 127, 13, -10, -2, 168, 12, -16, -17, 158, -11, -124, 16, -85, 92, -49, 16, 94, 28, -12, 132, -99, -71, -140, -17, 111, 70, 19, 34, 73, -52, -58, -33, 103, 11, 22, -57, -66, -83, 77, -48, -21, 84, 21, 59, -79, 60, -24, -112, 54, -52, 38, 71, 15, -3, -4, -21, 20, 54, 18, -60, 105, -101, -112, -151, -36, 25, 117, -34, -8, -97, -175, 123, -48, 15, 73, 116, 8, 70, 62, -48, 87, -12, -29, 83, -4, -87, 64, 61, -11, 95, -74, 107, 78, 57, -114, 16, 5, 141, -8, 50, 21, -29, 71, 10, 64, 31, 54, -26, 83, 104, 48, -110, -119, -90, -128, 59, -27, -82, 59, 8, -2, 20, -67, -114, -43, -43, 30, 2, 97, -114]
7563a14J24K8K8j8j61J27o6j3J34p4j08R4k0J27j94O5n9J55j02R9j8n0m8J28M5
7588A09q0l0j3r8J09lJ25j11o5Q4p9R1j0m8J1l9J1M6j58J52n3J95n8j15J04J9
7614I6j05j01J43J20k68oK6P2R7j20J00j70J03NP8n6n6N5j68J84j7L9P6p4r0M6
7640IN9ro0P1o9j9J27j12q4K9K0J43j35N0N6k5j17k5J13j16R8m3J03O7k32p3K12
7667C8j14M4qQ7j8j05L2%N0O7k3k0p7kR2o8m5m5N4P4N1p8L6k2L0j2o3J37j02l8
7697d8j4J03j32Q3l3P9m9p4L4J37o3l9J03l1r5j6KM0q2J04j3Q1j0j28J58j10L0
7724A7n1L3L0M2p8o9O0p1O4j6O0J7P6r2Pj71R9N1J0pj02P7J6o2O3j6L4j5r5N1
7754c8M7J72k39J22j41N2L0n4P0mm6L8LJ06j74Q2k9L2j29J58p4M2p3k6J97j41
$$ y = [-114, 10, 38, 66, 48, -113, 14, -52, -65, 69, -5, -113, -19, -39, 88, -106, -41, -100, 55, -47, 52, 34, -16, -64, 64, 109, 29, -1, -14, -112, -3, -6, 119, 8, -57, 27, -52, 39, 29, -19, -8, -47, -36, 10, -148, 4, -49, 146, 88, -27, 77, 96, -9, -110, 33, 153, -115, -121, -95, -23, 74, -46, 54, -116, -13, -8, 70, 14, -42, 13, -155, 29, 12, 51, 127, 53, -37, 9, 68, 59, -1, 70, 1, -18, 109, -3, -87, -58, -38, 105, -30, 20, 76, 51, -66, -91, 22, -94, 4, -39, 64, 131, -101, -174, 38, -76, -32, -40, 47, 29, -76, -44, -44, 6, 73, 50, 30, -47, -49, 43, -25, -70, -115, -61, 13, 64, -14, 22, 0, 30, 18, -45, 92, -10, -48, -62, 41, -91, -8, -41, 38, -11, -85, -51, 86, 23, -16, 87, 56, -39, -55, -53, -13, -95, 9, -4, 77, 67, -61, 97, -13, 17, -34, -1, 29, 71, -7, -76, -16, -87, -23, -39, 21, 38, 114, 22, 29, -142, -43, 8, 18, 11, -91, -14, 2, -60, 3, -13, 21, 6, -89, -38, 9, 181, -58, 64, -77, -25, 5, -49, 21, 17, -29, 9, 12, 118, -56, 26, -3, 29, -100, 58, -16, 26, -47, -73, 124, -17]
7780a7P2qj19K6K2j9olM5R4j96J49J11j73pL7j43L7Q5N8k6rK5O4j71J39m5j43
7808a21J85pM0l0m4R6j52M3k4R6j19R0o1j4Kl7J31q6N9k0o9R7o1j45J00jP2k2
7836bp3M8j6JQ8n3J53j36m1P7m6J16p4j31N7J27j31p7R9K2k1mp6k8K02j71J15
7863B5m0k7O8lP4q0J9j29J41l3k5l9R6r5J49Q1j75j18K02j20n0O0J44r7j31J63
7889F0j16P2k4l0M9LJ10j21P1j43L3l5J32j16P6J06j01N0j86J05Qo0K1qM6j3l1
7916d2J3k4R2j10J37j51J59j53J4n5P2K4J23r8K3Kq7K17k4j94OR8l2K5m6J06j06
7943a1q1J40j5Ln2J16j24j5O4o4O5m8K4J4mM7L0n6j11P4j10O6L2JJ55k48J68j7
7971D3j12N9J1P9M2j21o4Q8o9M2K5j84P1J06l7J29l5r3J8n9P9n3J56j49M7j77
$$ y = [-17, 55, 47, -72, -46, -24, -43, -49, -52, -7, 87, -109, 40, 151, -22, -29, 8, -135, -98, -13, 45, 19, 10, 35, 99, -72, 67, 22, -121, 64, 57, 97, 67, 23, 119, -33, 10, -14, 82, -37, 53, -8, -22, -20, -57, 74, -12, 47, 27, -42, 55, -6, -151, -51, -52, 20, -2, -75, -27, -43, -42, 46, -7, 146, 10, -31, 46, 0, 116, 42, -89, -32, 95, -36, -113, -14, 8, -13, -17, -93, -121, 81, -90, 25, -15, -42, 26, 23, 97, 17, 36, -93, 48, 15, -10, -49, 47, -48, 101, 182, 7, -111, 91, -29, -79, -19, 125, 28, -103, 60, -56, 16, -8, -38, 11, 14, 124, 3, 74, -69, -36, -71, 61, -55, 21, 127, 26, 76, -110, -5, 3, -57, -36, -44, 2, -11, -42, -29, -53, 39, -71, 66, -85, 74, -79, -65, -120, -48, -24, 99, 1, 24, 26, -61, 156, 132, -62, -56, 42, 10, 35, -11, 95, -11, -92, 48, 33, 36, -16, 100, -24, -39, 25, -39, 26, -22, 2, 16, 12, 59, 89, 33, -78, -4, -114, -48, -16, -15, 140, -108, 60, 43, -69, -10, 1, 80, 122, 1, -63, 25, -44, -2, 23, -161, -90, 16, -21, 108, 73, -20, -2, -61, 18, -35, 121, -28, 19, -158]
7997a58J58m3QPR2K3k5j33J8P1M4J4j43NQ3j67N3J17N3r8J13j04J1M8r4lQ3p9
8025d6R2o7jR3kn0q0K46j63P0j79m4J30j22J28K4j29J75l4l4N7j39jR1K2j28J87
8052I6o4o9L6n3N3m7J16j33j3P1L6J28j00j41J63j56J52p8j30J78j9Q4j31J14
8076I3o6k2O5m1K8j7n5Q4j09j49R0J1J30l1M1j46L8N4p4P1r0j3O9NO5O8j16L1
8104A4O2r7M8j50P3K9k2J25j02O4p1J9M7j4o9J0m9K5J25n1m2m6O8R5r7J30j18
8131FOO2m3o2Q8j3m7mr1N9O0M8j00j9M0L5PK3j62J33o4n3J88o4lk3K0L9j05n4
8161i3QR0l9K8m6L3lR2pp4O2m5J04J0j35J01q4O6j56L4L3p9J07k15J48l9N7M9
8189GM1k4k6L9L7o6mJ2p1N0L2lL2l0j9o3Oo8J77o6nN8j8n0J24j25J8Q5j37P7m2
$$ y = [-158, 0, -43, -35, -28, 64, 87, 62, -71, -53, 18, 62, 76, -67, -62, 21, -146, -93, 24, 77, -21, 92, -12, -1, 47, -47, -50, 33, -46, 46, -21, -22, 71, 69, 19, -61, 185, 22, 92, -87, -131, -1, -123, 5, 29, -100, 75, 41, 7, 64, -75, -76, 15, 37, -91, 96, 32, -37, -1, -54, -1, -48, 68, -65, -78, -7, 29, 157, 57, -84, 79, -77, 75, -3, -133, 45, 26, 110, -21, 93, 27, 5, 70, 29, 57, 40, -15, 69, -40, -189, -99, -88, 42, 11, 52, -94, -56, -2, -76, -5, -95, -108, -39, -34, 31, 99, -17, 14, 76, -21, 27, -123, -50, -21, -43, 82, -20, 44, -27, -8, 39, 25, -44, -34, -83, -58, 67, 16, -26, -72, -4, 91, -6, 124, 6, 12, 74, 31, -31, 57, 44, -3, -7, -98, -39, 21, 69, -31, -50, -10, 25, 32, 55, -107, 26, -38, -91, 97, 33, 30, 7, 27, 66, -39, -93, -85, 5, -34, -6, -52, -19, -22, 70, 63, -11, 51, 6, 110, 120, -15, 86, 2, 68, -88, -54, -21, -100, 7, -208, -60, -99, -42, 7, 48, 24, -2, 37, 74, 8, 4, 16, -55, -5, 27, 24, 56, 26, 7, -56, -50, -118, 59, -7, -12, 46, 28, -22, 102, -23, -5, 80, -57, 20, -22]
8220b2P5O4j38R0q5P4n9J02k9r1Nm5M9l1n4J20p3J85j01p0J15j33K1P5j21J25
8246D8q8N4j6M8k8j83O9J03Jq1R9po2J45j69O5J9m5m4n5J02o0L8J65j39J25o6
8273C8n2o0rqQ2rP2mj50Q2mK7R3q6L5ll6pJ3j20J07q2M0N6k1M7l6J6l6J0k5J3
8305a7Ppo1p3J25J21j14K0k7L3q7J93j49L2P9j38N9L5K2j1o3Q7j01j7k3L0l9J6
8333f8L5J4o3M8l7P9r2J17j3k07J52R5m9j27R9j2J9N6q8o6Q3m4N5jJ2K7K0L1j26
8362e1P3P4p1n8j8o9Q4J07j36J07q5RQ1j16Q8j71J61MmJl4O3q1q4J00m6Q8O7r2
8391iM1J02p7j53J07R2o4k4PN7j5o3j00mJ78n6M5q0O8n4K1m7r7P3L8j2M6l7o9
8420h6J26n8N2l7M0l8Rl4l4O5o0Lp2J48L4o5k7N7j4M1j5q9M1N8L8q3K8rj21J45
$$ y = [-22, 53, 117, -21, 69, -16, 58, -1, 101, 72, -19, -14, -59, -10, -41, -95, 25, -48, 137, 36, -34, 81, -52, -31, 44, -77, 48, -40, 14, -2, 46, 18, -165, -96, 7, 8, -73, 26, 19, -43, 102, -67, -2, 17, -28, -72, -127, -25, -85, -47, 118, -21, 104, 38, -14, -74, -83, -91, -9, -18, 54, 50, -100, -18, -22, 5, 98, 12, 47, 44, 8, 1, 14, -106, 1, -81, -41, 15, -6, 41, 5, 21, -15, -5, -30, -17, -10, -17, -78, -151, -26, 95, -19, 1, -26, 7, -80, 113, -36, -4, 75, -63, -4, 31, 53, 42, -21, 66, -35, -52, -75, -45, -84, -68, -33, -19, -82, -34, -71, 8, -84, 33, 20, -187, -35, 60, 11, -116, -17, -29, -10, 46, -42, -108, -25, -69, -14, -15, -3, 24, 44, 75, -51, 22, 96, 25, -33, -51, -120, -36, 71, -65, 42, -43, -34, 47, -69, 19, -152, 9, 13, 9, 10, -24, 39, -42, -126, -26, -72, 16, 83, -9, 32, 134, 57, -96, 11, 103, 39, 15, 22, 79, 64, 1, -99, -103, 75, 19, 64, -16, 52, -2, 19, -28, -125, -52, -14, -26, 20, -17, -86, 40, -18, 34, -3, 37, -1, 8, -26, -60, 5, -55, -52, -124, 24, 58, -7, -34, 23, 9, 50, 35, -54, -13, 45, 83, 0, 28, 19, -102, 43]
8450D3p5J4J3K7K0M0j12o1J7p0J30M0j00P0j7l0O7M4j39R0R4j67M8j7pP2p9N6
8478A1O0M1o5l9M0j05K2J00r7k0j2P8k4pn9J38j33J60Nj39N8o1L0J2J8j23J92
8505H1J5r5O6j11N6O9rn3J47j81Nk5m9J38o0j04J23K0q3M0o3M3L7k8K6K8l3n3
8533e3K8R6k10K16J4j3o1J0l3n8KL1R6j00j2k2J10k3q4m4L7J56j01O8k3P0k16
8560a19J07kJ06j53O9m9O0N0j0l2j18J13j03K8jO5k1qq3O0K9l3l9J39j02J21j51
8587g7L8L5K2j19R0l8n0J52l9l4L2m4q2J92o4m5O8m9R3mj60Q3M0m1J6j8%k9L2
8616@k8N8r0ok7J31po4j4O9J4k3J5k7M1L4j88P7J29r1O1j41J93j62K5n3M2Q5o5
8645a2m8J54j08Q5j35O8p9J84lk04L0oJ27j05QL2M1l6Rn4M6n6P9l5O2L0r0J7n0
$$ y = [43, -32, -18, -5, 22, 42, 82, -30, -91, -74, -144, -14, 26, -74, -4, -21, -51, 16, 60, -79, 11, 105, -62, -14, -31, -38, 34, -45, 11, 71, 112, 47, 8, 48, -57, -35, 65, -32, -52, -64, 14, -10, -17, -76, 62, -71, 89, 94, -45, 13, -48, -18, -6, 12, -111, 81, 96, 1, 67, -44, 12, 81, 72, 19, 166, -15, -10, -35, -84, 54, -6, -110, 13, 33, -50, -10, -73, -30, 7, -21, 5, 33, 0, -53, -25, 71, -139, 77, 91, 78, 17, 27, -6, -64, -62, -31, 65, -35, -47, -69, 41, 18, -66, -110, -73, 83, -18, 50, 27, 97, -119, -12, -14, 92, -61, 8, -41, 19, 69, 59, 27, -91, 22, -81, -53, -54, 11, -10, -18, -101, -41, -12, -45, -84, 55, -47, 74, -77, -39, -4, 18, -101, -11, -49, -99, 53, 14, -20, 12, -32, -114, 78, 14, -31, 37, -12, 81, 77, -83, 0, 40, -1, 15, -3, -3, -32, 0, -28, 30, -60, -66, -93, 38, 31, -33, -47, 22, 36, 13, 28, 1, 42, 76, -112, -35, 94, 3, 64, -77, 116, -46, -21, -74, -32, 53, -12, -60, 94, -14, 71, -64, 4, -75, 109, 106, -98, -68, -74, 53, -52, -44, -12, 29, -7, 2, -52, -6, -62, 17, -18, 44, 74, -16, 1, -49]
8674d9L7L5m4Q0j77J56l4%J4j8N8O5j08M5o1O4N7k45J33p1M5Q2nL7j22m1N6n7
8702f8Q9n9L1p0k1Q2J6O3n0r2J21k7L4j04P3ll4Q6m4Q6m1r8N3L4j66J34o6lj05
8731a49R3J07j8q7J0O5J9j29J26M8j50l9J54j22J6K0qkJ4K6R8qk01RJ78j16M3
8758c%l2R5p8R9p8K8mq8J29%l3K9j5j04qP9pk6k1k4N7J70j65j4JPj4J6R3j50Q6
8790B5P8p5l3j11Q0p2P1K7P9k8q0O4l2O1k6o3J31q7L6k1K7L3k04N5J26Q0j30K0
8818C1o2l2q7K24q5N9j14J03L1j35J0j9J36Ok16M0N5K0K5m1k7qJ40k1O4j43O5
8845A9o2j34J64N2l5p2R4o2J72j08j04o6J29J7M6qj00J9Q4O5o8q8R1j01M0J01
8871H5o3m0k3Km8J38j44J7m6J76j8L7q2Q3n0q1R3qj0q9J43j84P6ON5o4q0R7J5
$$ y = [-49, -12, 23, -21, 59, -118, 38, 4, 4, 18, 0, 58, 123, 15, 60, -1, 63, 120, -125, 8, -63, -18, 64, 59, 96, -26, -67, -11, -68, 21, -38, -7, -77, -98, -16, 0, 63, 13, -79, 42, 15, 49, -55, 18, 15, -19, 67, 23, 109, 68, -30, 23, 57, -109, 25, -41, -44, -149, -56, 51, 33, -54, -44, 21, 40, -89, 37, 85, -65, -104, 50, -72, -56, -36, -44, -46, -32, -6, 92, 84, -117, -108, 70, -46, -3, -3, -35, 60, -18, 81, 3, 31, 27, -61, 68, 68, 35, 64, 49, -55, -63, 16, 9, -17, -38, -62, -5, 165, 0, -14, -13, -6, -20, -4, 89, -61, 25, 103, 28, -5, -116, -36, -108, -37, -10, 69, 41, -39, 25, -7, 54, 28, -35, 96, 9, 45, 24, 51, 84, -120, -65, 61, 141, 11, 31, -31, -63, -150, 74, -11, 48, -66, 37, 68, -67, -57, -76, 60, 66, -150, -110, -55, -35, -10, -51, -78, -86, 54, 33, 97, -46, 19, -43, -177, -13, 39, 4, -68, 26, -36, 136, 28, -76, -142, -13, 4, 50, 42, -58, -39, 45, 110, 42, -46, 45, -56, -16, 85, 22, -18, -41, -39, -87, 51, -93, -76, -122, 54, 36, 73, -9, 74, 24, -57, 36, 28, 18, -71, 72, -112, -36, -30, 25, -39, -119, -22, -7]
8900gm9K3J19q2J68j95J6L5m3J22j3J2M5j48p7J14q2O2j6P9j48K3L8p2J37j20
8926e9l2Q3J6K9j47P5J5P2j54N4J08j34J11p4p7J09N1n4m3J37p1j06N4M9q4Q1
8952IJqRn4J38j35K4Q1n2m8J5k4jK1R9j79J04j30J07Qj6J54j18lo9R6j61P1J44
8981H3l9m5m0pm9K5kK5J05n5k0k2M1Q0l8m5j21R5K44j54J6Qj55O7m9k0Q6M0j54
9010a00J77n7J0Pr6qJ69k00J13o6J10j29J69j27r3O1Q2R9j24J3M0%n7L0m7M%R2
9038G2k4L6j14K1O3j02J6L8j05m0K21j51N9P3j02KJ2j4Q9m9QN2j49N1L2j07K9
9065h3J51n8o2Nk3R0M0r3jQQ1o0L6p7J37j12k2K5J65p5P7j64m4K3K%P9K5r9J09
9095H0n3o7Q9m3r9O2N4J8r7J70j58K6k8Q9NN9j09J78j17K6r9k9M6o1L0Q5r0R8
$$ y = [-7, -56, -33, 86, 4, 172, -23, -7, 28, -15, 107, 94, 106, 151, 3, -74, 40, -42, 20, 4, 83, -65, -42, -4, -76, 61, -59, -91, -8, 8, 37, -110, -35, -20, 52, -102, -48, 60, -74, 37, -37, -114, -5, 46, -8, -51, 86, 15, -91, -37, 12, -72, 9, 10, 2, 11, -43, 95, -40, -16, 65, 13, -35, -20, -44, -45, -24, 75, -104, 0, -130, -23, -15, -31, 123, 5, 2, -67, 29, -132, -61, 83, 44, -1, -41, -48, -97, -72, -74, -49, 56, 1, -19, -41, 0, 80, 42, -3, -124, -29, 215, 61, 77, 85, -70, -3, -52, -72, 14, 54, -100, 77, 20, 30, 37, -59, -67, 102, -98, 15, -51, 59, -70, 99, -28, -121, -60, 22, 121, -3, 10, 50, 50, -7, 23, -24, -20, -20, 72, 48, 84, -30, -9, 54, -48, -32, 6, -99, -139, 82, -69, -10, 63, -39, -37, -25, -39, 50, 1, 9, 61, -88, -37, -5, -112, -83, 68, 10, -52, -47, -70, 20, 60, -33, -34, -26, 55, -5, 31, -46, 91, -21, -43, -18, 147, 72, 149, -15, -59, -36, -34, -34, 45, 70, -29, 80, 27, -40, 49, 6, -93, -31, 23, 41, -56, 114, -44, -18, -46, 43, 48, 107, -2, 176, 59, 85, -14, -43, 3, -58, -28, 57, -33, 65]
9123F5K6q4n0nQ1k09K12p8m3o4K61j41m0k0J13j4r8P6%L0m2L6k8O4r0J22q4nK8
9152A9j2k1k7R4o7%j30Q3J13p8j37K00j25J51O9j59q9J47j02M3k5P9M3n7J06j20
9178bj0m1L4N7l4j2J6r5R8R4m9j10j5O2r8N1l5O3P6p5R0P2j76OR1j88K03j28k8
9207h3O6n7J91j26l0L0n5L6K2L7k1q1J36j28R3q8O8j10J44k2L0k44J37N6k7p2
9233i8K48q1j25O2o1K4l8N5m8Q0p9J83j28J6j24P2N6L0m4q1M7j6J16%J1n4N3j19
9261d3K05j54OM0p4N5L5j58Km2P5Q0M0r3p9L4O2N5k7qO4n2j16m2m9O0M2J4J48
9290H0j40J9J05n6j21J26n0q3K31n4j02O6l7O9j19j5M5o5J33l1j0P6j01J1J0m3
9316e6oM8J29k6m7m2MJ2j1p9J18o7j8L7Q0q4J9o4Q1k5p2P4J9J10j40L2n1K1nL7
$$ y = [65, 91, 7, -43, -48, 33, -176, 36, -42, -85, -149, 112, -29, -69, -89, 24, 10, -88, -12, -12, 18, -24, 12, -16, 48, -42, 80, -4, -9, 19, 7, -14, -41, 53, -14, -14, -144, -61, 52, -26, -163, 37, -88, 63, 132, -27, -116, 31, -71, -28, -53, 26, 69, 12, 118, -2, -12, -53, -19, 38, 4, -8, 8, -87, 11, 105, 56, -54, -69, -7, -105, -54, -89, -26, 50, -25, 65, 137, -39, -33, 58, -130, 73, -55, -83, -17, -74, 117, -9, -39, -9, -64, -28, -6, 31, 10, -71, 65, -63, 30, -58, 10, -100, 44, 22, 52, -192, -55, 1, -26, -98, 150, 69, -56, 6, -55, -31, -69, -14, -62, 18, -61, 122, -6, 10, -114, -42, 14, 44, 0, -81, -34, -50, 66, 66, 77, 23, 76, -43, 162, 8, 14, 54, -20, 35, 70, -88, -86, -128, -53, 27, 67, -26, -105, -71, -9, 46, 19, 11, 75, 23, -93, -135, -184, -124, -82, -68, 80, -60, -41, 64, 8, -113, 13, -37, -120, 111, 57, -45, 21, -16, 53, -66, -81, -36, -101, 32, 1, -9, 67, -34, -23, -13, -56, -62, -14, 115, 89, 42, 0, 4, 16, 5, -74, 44, -23, -41, -4, 76, -8, 11, -53, 28, 3, -69, 5, 24, 134, -6, 26, -25, -4, -9, 28]
9346B8m7m8J52n5q4ON5K9j29O0J13j31J00j0l4rK5L0Jm4Pl6k4rJ2J01j09O0o6
9375e6J0J24Mk4j38J15p8J96j27l9m6Q2j0p5O1O0Pm0Q1q9J4m8M2k5lk1J68j21
9403B4M4p5l0l2R7lq0J65k8j29rN9p2m3OO5nK00j29j26J09K1n8J01q6J1j3J21
9431A05r9J5K0n0J17j95J50j19n0P2K0m4L1J38j91J00r2J14J2r7L1L7L1q5Q3j54
9457a00J21L4l9lj38Q2Q9Qj24R7rj22J00P7j41O7N5j15P6nL3N2n4j5l5m6J51k53
9485a57J27O4m3r0J72k5r8l9q6J65J01k2j53Q7J38j39l4N9l5m8OkJ14j00o0J46
9511D8q1j5L3l0N8l2R7j68L5J8O5k9J8L1L5r1l9O8J18k02J51o7q3R9o0k3M8L9
9539D1j01J10o9j7R3p6L2m5lK8N3n4oJ1L3M4mn4j43J81Ol1o8L2MJ8R7r0Q7j66
$$ y = [28, -19, -67, 85, 30, -54, -48, 7, 36, -93, -33, 80, -51, 49, 39, 5, -4, 21, 51, 52, 8, 15, -21, -45, -54, -42, 59, -50, 10, -56, -46, 78, 82, 58, -80, 35, -43, 153, 26, -13, -59, 23, 13, -62, -1, 59, 66, 26, 107, 18, 32, -16, 26, 1, -2, -23, 145, 24, 68, -7, -37, -69, 28, 25, -55, 110, 82, -47, -56, 3, -69, -112, -106, -41, -46, 154, 25, -101, 8, 29, -29, 72, -14, -3, -16, 105, 6, 21, 41, -9, 108, -87, 63, -56, -106, -34, -14, -58, -27, 111, -80, 20, -72, 42, 54, -43, -12, 25, 56, -29, 54, -100, 21, 55, 16, 13, -125, -43, 46, 54, -70, 27, 18, -104, -4, 73, -68, -1, 54, -61, 15, 10, 43, 95, 41, 26, -9, -55, 96, -157, -30, 34, -9, -99, 73, 48, -50, -89, -175, -10, 91, 69, -84, 3, 141, 2, -32, 27, -8, -56, -50, -52, 62, -38, -98, 48, -33, -48, -15, -45, 13, -19, 78, -90, -55, -37, 28, -1, 17, 48, 83, -8, -47, 21, 139, -63, 88, 21, -62, 37, -23, -46, 2, 41, -60, 50, -19, -36, 57, -19, 13, -32, -35, -7, 46, -8, -14, -3, 30, 74, 70, 16, -127, 54, 60, 29, -39, -7, -3, 15, 112, 22, 109, -57]
9569e7J04o3oJ3N7j15N5O9j32J25j04J15j11J43p8m9m9KJ25N3n5K8l0j49J72n8
9595Ep4oJ24j33J26J1p0m2k9Q3J01j40L0j5j1N4QJ09r6Np1k2J08j35P1N4Ro8J9
9624Ej15J48m7oO4O7m8j43J41j70K80m6m5j39l0R4P8j86P3j4M9K7j18N1L9lRR
9652B4n7P6rk4j5j47P2k1J30q3J8M7k4L8NJ37k65J87Qo9NrK4k3n9rkJ57j02k8
9682a8J52p4n7p3K01j95P9J4pO5o6n5m5N4R6j8k6L1q1n0J0Q0k0k6Q4l6qj6J0J46
9712A51j11L0j03L3J6Qj6K2k7Q5l3p4j8Q1l5m6P6J13l8q4K5l1k1J2OK9m8M0M8
9741I0o9p8Q4Jr2L6J79j36J2m8M0qm6Nn2P3m6J71j38N4J8o5J18m7j4k7J8L1k9
9770C5r6J55j08o7K43k44k8J08L9q1Mj24J59Qj07J22j14J28J4j24R6ol5J43j88
$$ y = [-57, 47, -16, -22, -9, 48, -67, -12, 57, -75, 50, -54, 61, -50, 93, 15, -34, -83, -81, 44, 97, 42, 70, 40, -109, 63, 5, -69, -75, 49, -84, 42, 53, -17, -59, -88, -5, 96, -44, -14, -29, -40, 14, 22, 131, 35, 40, -31, -53, 55, -80, -9, 45, 54, -14, 5, -110, 38, -9, -15, 49, 116, 68, -75, 66, -104, 176, 130, 85, -54, -84, 10, 88, -98, -25, -39, 10, 37, -81, -30, 9, 6, 15, 24, -33, 43, 34, 10, -5, -152, -80, -101, 29, -54, -36, 11, -13, 25, 30, 167, -98, 89, 97, 28, 33, 24, 48, 25, -34, -43, -45, 112, 10, -18, 134, 60, 3, -70, 131, -64, 15, 29, 22, 87, 21, -34, -79, -25, 71, 53, 27, 58, -23, -73, -63, 17, -3, -29, 55, 19, 11, -5, 5, 151, 40, 70, -33, 0, 16, 24, 8, 30, 3, 88, 55, -19, -37, 44, 9, -37, 39, 152, 114, 30, 55, 24, 3, 15, 21, 50, 2, 42, 90, 21, -57, 27, 28, -64, -28, 151, 15, 27, -21, 19, 11, -35, -30, -82, -9, -55, 116, -22, 32, 50, -15, 103, 56, 42, 15, 33, 64, 35, -61, 94, -14, -81, 162, -82, -110, -2, 37, -44, -40, -164, -5, 3, -104, 18, -96, 32, 46, -78, 18, 12, -23, 120, -68]
9795f8N0L4pp3J04N6Oj54L9Po2L6k9R7J7p4qK2n0M2K9O0M2j32O3o5M8N9K9j42
9825b4m8P7M9J1Qn8rp0O1K7Kq0jJ00J9r6P5q4J13p4l4pQ8m2K7m2Q3l0m3j6q1P6
9857b3N7j43K06j33J9m2Q4L3n8Q2n2l0K5O6j19Km8K7J9J18j58M1lJ21j32J04j24
9884f1J86j55N3R1k6j92J49p0M9l9o3J10k4L5J2m2o8J21pj7q1Kl0O3O8q2K5l2
9912b5J52l9k5j13j4L3J68k49Q6n6L0J53k22R6M3q7J17m6L1j4L4L9q0o7Nn4J56
9939E2j53J70L7o1j04Q3o1K4ojM5l5N1M1j9j88J08Q3j09ON3L9l2J28n9k3M8k4
9967I3m5j4j15J67j6m6o7R5p6P1l6q0J06J6l5K6o0P9q4m4J72j61J76o2l4n2l4
9994f0K6L4J8Q2n0K2l6o7J05o3Qo4k1J56o1M8po8N5p1L1J16j60n0P9n1L4p7O1
$$ y = [-68, -18, 16, 9, -64, 40, 96, 102, -52, -13, -6, -68, -32, -61, 36, 53, -21, -29, -7, -57, -15, 14, 74, 116, -16, 47, -18, 30, 89, 118, -24, -72, 5, 54, 65, 73, 15, 6, -64, -3, 24, 26, -54, -55, 45, 64, -32, 43, -41, 72, -2, -36, -43, 45, 3, 30, -12, 71, 41, -2, -18, -99, -23, 34, -109, 97, -36, -17, -59, 25, 58, 0, 82, 30, 0, 25, 91, -28, -26, -74, -47, -28, 90, -68, -27, -30, 91, -41, 63, -61, 125, -30, 23, 114, 88, -104, 45, -25, 24, -15, -78, 32, 8, 43, 55, 13, -55, 66, 59, 42, -39, -37, -67, -4, 64, -18, 7, -25, 127, 88, 63, -50, -64, -31, 137, -112, -26, -82, -52, 101, -121, -25, 18, -69, 48, 2, 33, 19, 53, 92, 12, -55, -50, -104, 52, -101, 69, 106, 45, -59, 24, -37, -13, -19, -20, 25, -10, 41, 82, 63, -125, -17, 66, -43, -37, 16, 55, 23, 151, 92, 69, 117, 93, 48, 34, -81, 86, 70, 24, -43, 52, -24, 47, 11, -69, 37, 53, 18, 44, -16, 63, -21, -65, 107, -54, 122, 60, 26, -26, -60, -34, 0, 18, 100, 50, 72, 36, -31, 74, 11, 19, -45, -66, 90, 29, 77, 70, 2, 57, -14, 17, 133, -27, -77, 2, -49, -15, -92, -31]
10023c1PQ1j34O3J15j06O3J8j56J54p7j1l3J29rr8j6m1L7n7N2J17p6Rj50J54K6
10050C0n7N0n4K4po3L8l8l2J56J6j79J23k9k9J05r3K3PM5q2R2j0J3j16l6J57p4
10078b0J56j10Ro7J29j76J14l4o6M7n1J07n2K8O7j76Q1J4L1k3q6Q2q1J56q7J34
10104A26j26m6k3J38O1k55M7J61q5R2j52J38j25J53j26J4L0j02J20j54R2l3N0
10127eK4m9N1rJ7k6J24j36M5K8K2j29K2l7O2o3L3r0J84L8k82K16m3P9j79J42j35
10154i6P3l2R1oJ5m0O7n9r9O6n0J99m0p2O8o7L6qPp1J76o8o3Mj20K05m4p2N3N3
10184A06j45P0k2J21j61L5P1j45M6k0k9J08J1j07L8k1m8M9J2k3K4n7J61n5lP0
10210H6l7k08J89k6L4m0mnK8k7K3k9O1j03L8J44j43L4j7J3RKn1O0n1j5P7Lq3M0
$$ y = [-31, -24, 57, -77, -14, 101, -5, 58, 76, -80, 74, -3, -14, -47, 82, 73, -25, -41, -82, -45, -102, -50, 67, -9, 0, -150, 4, 30, -27, 23, -31, -7, -14, -77, -39, -77, -109, 47, 63, -116, 7, -22, -51, 54, -39, -16, -9, 36, -46, 46, 36, 49, -67, -103, 54, -20, 136, 26, 35, -32, 97, -79, 35, 1, -65, -18, -69, 38, -14, 14, 81, -95, -14, 0, 31, 8, -78, 4, -77, 79, -8, 126, 0, -46, -69, 69, 130, -125, -78, 83, -2, 90, -62, 76, -49, 104, -22, -8, 22, -80, 40, -114, -22, -55, -5, 19, -30, 21, 12, 29, 3, 127, -9, 36, 64, 86, -43, -21, -58, 4, -59, -26, -116, 68, 106, -176, 40, -3, 76, -103, 39, -96, -23, -55, 36, 30, 45, 5, 72, 13, -86, -20, -70, 129, 89, 17, 85, 18, 54, 46, 53, -18, 158, 90, 27, 31, -89, 116, 72, 0, 53, 106, -39, 31, 9, 130, -31, 4, 75, -70, -24, -44, -73, 35, 46, -61, -23, -44, -92, -43, -31, -54, -30, -87, 74, 19, 16, 86, 49, -159, 30, 4, 38, -2, -6, -11, 17, -10, 13, -16, 45, -58, -20, 124, -19, 15, -2, 11, 20, 22, -29, 31, -20, -35, 42, 45, -38, 2]
10240BO6l4p9N6O1o0o6M8M9n5N6P0p0Jo3J01j5o7K5n5L6M3q4J2L2r0J04L3j86
10269a29K01j7p6P2r0O0l3o3K6N3pK0j4L7Mj41K9M7OK4J0L6j16Q0n7Q0Kj03JK9
10299b9n0J5M3n7mK01j40K3O8j53Q7L3j04J73r4Oj6o5J98j41j6mJ6O4P2j28N3
10326E1mK2j26J31j08J08J07j84J24j42k0O2J9j60P3K8Q4o4on8P9J52j68j34J19
10351a5J9q6k9J99j14jn5J75l5j02P8q2R8R1j17J1k2Qn9K4llp9o1J71j1K4P2j43
10380d7J2J22j31P4m8m9Q2p4M5q8K09j58P6J4l9O1j83R8kJ75j49NN0n1P4O6p8
10407F6m9r6J78j52M7O8k9J6L5r3m3J56k73J27R2k8M8q1P9r5n9P8J02p6n8P7M
10434D1p2j0L7n8m3J44m6p9J22j03k9J75r4k0M8j15K11j76J50j93J70j2j65J17
$$ y = [2, 68, 34, -45, 11, 72, 12, -54, -6, 43, -12, 44, 114, 44, 45, -18, 83, 68, 1, 26, -29, 7, 50, -34, -22, 10, -80, 24, 57, -129, 72, 55, -21, 51, -39, 21, -12, -75, -49, 4, -3, 17, 3, 40, 44, -97, -68, -21, -15, 9, 19, 55, -61, 19, -38, 42, 44, -59, -58, -29, -79, -64, -21, -78, -82, 119, -21, 2, 70, -83, 4, 37, -67, 106, 12, 18, 2, -63, 135, -6, -22, -26, -10, 54, 126, -2, 51, 47, 69, -57, 74, -34, 74, 181, -3, 121, -21, -41, 21, 40, -120, -47, -19, 65, 1, -5, -63, 16, 168, 0, -134, -15, 4, -82, -111, 88, -26, -27, -82, 93, 58, -44, 34, -48, 50, 141, 24, 35, 13, 21, -38, -14, -17, -20, -99, -160, 11, 0, 24, 96, -47, -35, 87, -44, 30, -18, -67, 15, -59, -14, -102, 107, -51, 25, 39, 0, 61, -122, -24, -26, 149, 0, 5, 55, 4, 78, 144, 66, 17, -79, 99, -53, -6, 62, 33, 49, 84, -9, -52, 104, -169, -42, 50, 22, 70, -11, 68, -27, -86, -8, 94, 18, -40, 37, 41, -31, -41, -4, -62, -105, 39, -7, -86, 36, -67, -96, 79, -15, -35, 13, -102, 109, -67, 83, -110, 60, 48, -117, 0]
10458@m7J11n6Lj30Q6n0J66j10j14J50J9Kl4Rm2J61j53P4k1J6j06R6l5N3j7KJ08
10486A41j24R3j39MM9n3M3M8m5L9o0O5r4J3p1J53Oj22J2J47j46Q0L8p3m1N6K0
10513C9L4mj67J01J9m6N2j5R8qj55RJ55r8l3P3k7q9J47r4M1n1M6p8R3q0M6l3m0
10542f5N5j4N0km8PP8j00P4J6j7m8R4j78Q2J35k05K0L8NK3Km4K4K2j1j1o3K9K
10572e0O2R4o0n3l3N5N3o8r4K04j59o5J72M7j10k7m8MN3k8O4M8j31P5J17jj26
10599eJ08l9r6L2P6n2m2r4J99K6j47p5N1l1K7J13K3k4o7p1M8K4n5J91j1j4r6j9
10627b0L1j01N5J44j88P7n2K4P2k5k8qL5Q7r5j10J94r5j0k1O7p7O7N8j89Q3N1
10654B6L8q9L5J07j09j46O7J03Qj8o7OJ09m5k8K0J05r5l8N9j71J29j5q2P9j5K5
$$ y = [0, -47, 64, 8, 11, -119, -33, -83, 83, -27, -141, 9, 28, 30, -4, 5, -37, 124, -29, 45, 24, 40, -66, 30, -5, 48, 31, 33, 141, 17, 110, -29, -25, 24, -29, 14, 62, 17, 56, -4, 61, -33, -20, -91, 62, 68, -54, -42, 105, -41, 39, 77, 4, -37, 19, 39, 73, 69, -98, 3, 22, -24, 28, 13, 111, 103, -52, -43, 112, 14, -19, 54, 27, -62, 85, -9, 32, -19, 27, -51, 42, -38, 8, -25, -65, -10, -24, 26, 24, -24, -17, 61, -39, 35, 51, 34, -14, 80, -98, -16, 119, -86, -66, -28, -23, 0, 2, -42, -18, 4, -7, -18, -81, -52, -50, 12, 106, 46, -7, -40, 15, 68, 0, -94, 110, -49, -114, 58, 105, -5, -32, -80, -76, -23, -51, 13, 61, -70, 5, 122, 121, -5, 103, 64, -32, 0, 76, 24, -18, -112, 87, 113, -34, -109, -58, -89, -62, 51, 74, 50, -17, -88, -40, -16, -71, 120, 109, 95, -1, -20, 11, -90, -35, 109, -79, -2, -54, -30, 42, 17, -11, -19, 16, 103, 8, -102, 92, -3, -13, -34, 33, -44, 23, 81, -108, -25, 26, 64, -25, 10, 117, 8, -138, -71, 32, 40, 22, -45, -39, 70, 25, -3, 17, 122, 27, -11, 48, -123, 6, -9, -91, -12, -27, -2]
10681bqj06j0K19r0L8J2k33K19Q4j71J4L7l5J32j46J60j28j07J92j01O6L5j40
10705f9J60j25k5J08j10L7kO1j54N0P7M3l9J58r7n6N8l4L4p8nL3j65J61Jn4K7
10732eLnN6R1r9j56J29n3j6J15l5K3j05j7P1J55j89J24N3n8q3l1N6L3j07K22r6
10759G6K5j22M2m8M4J5nR3j42K0LL1j06Q3l8RR4j01J66k06m6J07Ln9J37j14Q2
10786D3o2nq0J77j11n8J42o4o7J17q4O4r8J20MN7p3l5J2k0n2N6j15K18j78J44
10812E2k3K7o5J20n2j5p6n4j4R5j70K04r8N4J5j1m7J31o6j5J04l7q7m9J18j39
10838i8N2k1J51n0LL0j40K21j37q1M4Q3k9qk3p9J69j27J17lj62J08l2n4L9P1n
10865C9on8J6K8J7m4L9L0L4j4j21O9j0Okk3m6j6L4K5K7o1J4L6P6q4J3m3J01nn4
$$ y = [-2, -10, -116, -126, 93, 3, 41, 53, -180, 39, 123, -48, -34, 3, -32, 100, -46, 114, -14, -121, 71, -30, 36, 71, -69, 91, -34, -59, 49, -61, -24, -26, 35, -119, -69, 8, 51, 12, 170, 73, 17, 75, 41, 75, -3, -8, 25, -140, 21, 22, -32, -5, -2, -7, 49, 140, 41, -115, 14, -39, -55, 60, 25, 48, -57, -74, -3, 152, -37, 87, 140, 82, -1, -32, 24, 57, -50, 172, 76, 101, -21, 21, -27, 17, 32, 27, 120, -22, -2, 1, 32, -74, 9, -29, -20, 74, -27, 139, -67, -113, -6, -3, -62, 75, -39, 43, -19, -24, -104, 73, -38, -96, 46, -18, -85, 32, -52, 12, -86, 34, 38, 95, 22, -13, -1, -21, -73, -17, -132, 86, -92, 52, 29, 56, -9, 111, 59, 44, -32, -86, -100, -5, -175, 29, -69, -15, 0, -11, -58, 73, 7, -8, 96, 59, -28, -77, 41, -98, -46, -67, 84, 34, 37, 67, -73, 148, 11, -70, -26, 57, 28, 20, -3, -82, 87, -40, 77, 74, -88, 20, -12, -66, -27, 44, 39, 33, -25, -9, 19, 36, -8, 31, 61, 95, 81, -40, 29, 19, 25, 23, 0, -46, -62, -28, -3, 24, -37, -23, 13, 89, 5, 18, -25, 76, 71, 17]
10896A7Q7l8j5O0j25L1J06j89O6J1mm1k8J28j24OJ15j22m1j6R3o9R4j0O6k3M1
10923G6j77N6Q4k8M4n6P8j76J91j36j1R1M8o0k39K86o8K1m4Q3%j4p2K1J42k03
10949f3K3O5r7J2J50j7k8l0Qn5K9n8P3n9P7n0O8j76J47Q6r0m3JJ8p0K5J00j32
10977h6kJ59r0l8J16p8Q9j00J14j36Q8o2K0k4P1k21J47J68j98J92q6k12J30J81
11001A42j07M1r6J3M0m5R2k3rp7J0l6N7k3p2R8J02k13N5K2LK1j7M5J57j44m1M
11029ak2M7m2K1J5KO1p6o9J2K3J08j13J47j20j00J70p8l0Q6j9lj03L6M7o4J58
11056I3p8M8j47J09k0L9J2n7J8K5n1m8J57j35J59j18j90J80K2J3j02K4%P8l0j7
11082a6R9j25J0N3LR8j35P8m3qO7r9R1j06J68k29L7P6Q2j03n5J75j69LO0K9j33
$$ y = [17, 104, 66, 51, 111, -14, 17, 123, -66, 0, 11, 7, -34, -62, 66, -58, -52, 63, -59, -100, -116, -23, -92, 2, -8, 58, 35, 76, -101, -45, 39, 11, 55, -1, 77, -99, 92, -44, -55, 36, 84, 24, -215, 71, 3, 24, -20, 63, 63, 49, -23, -2, 140, -63, -40, 25, -72, -60, 90, 73, 45, 15, 23, -32, -3, -61, 12, -47, 30, -20, 48, -128, 19, 105, 15, -28, -27, -9, -79, -54, 46, -86, -88, 71, -19, -57, 59, -19, 70, -30, 84, -52, 36, -26, -6, -30, 41, -180, -33, 135, -63, 129, 43, -169, -39, 142, 35, 76, -20, -7, 33, -12, 80, 57, 48, -29, -19, -55, 2, -21, -93, 5, 107, -106, -51, -29, -26, -5, -22, 23, 180, 36, -5, -1, -23, 24, -18, 3, 18, 20, 81, 5, -64, -52, -29, 79, -34, 113, -7, -107, 63, -15, -45, 41, 22, 19, -84, -48, -1, -65, 93, 15, 63, -84, 25, 5, 44, 56, -1, 17, 42, -9, -57, 100, -35, 124, 6, -184, -4, 18, 31, -71, -47, -47, 31, 1, -16, 83, -42, -32, 21, 24, 122, -13, 65, 22, 14, 81, -18, 73, -33, 135, -94, -57, 19, 101, -2, -57, 118, -51, -48, 12, 41, -92]
11109i2J80r5j01J03m2QJ38j45r2O6J04L4o1J7O4o5P6j24J11q5J8k2K5JqKn1m8
11137h4O8pJ37j60O4m1pl9J2j3l8J72n6J69k02P8q8J60j8j80Q7nq7J1O9Nj25J04
11165a4l5M5Q6r4l9j2P8j17J50l2p2J54j61N7L0P3L3j5j15n2%J55r2q8jJ71k02
11192a09J14P3M4j81J94j19n5qJ14q8K3K0o9R7m5l1K1J2j8L3j2j18J62j18P6n5
11218d3l7J18J51j90q4J62l1r2R5j7j61J48j10J05n7J04j82J65o7J7np8J56j00
11242c3ML0qNK8J3k1j8N5j37P7k4Kl4k5J11p2L9j46K56k01K6N0R2j5r5j0m4j5
11271a10N7J72k86K06p3m9NQ8o3K5p8J51m5R4j04k1q3R9j38J08j2M8j0mJ4Q0n2
11298A9r3R0j22P4N0l1J08n5j21Lj2J29n3K2%j32k9J20r3P1O5J09k01P1m9p5J41
$$ y = [-92, 88, -7, -108, -5, -47, -39, 99, -46, -138, -72, 32, 66, 5, 22, 86, 21, 97, -27, 84, -1, 17, -5, 20, 21, 13, 15, -36, -84, -16, -23, 114, -46, 18, -23, -30, -69, -57, -70, -108, 64, 8, 177, -25, 53, -35, 125, 107, -73, 14, 9, -78, -67, 2, 7, -118, -14, -49, -4, 82, -12, -51, -63, 15, -102, 48, 16, -56, 98, -63, -6, 24, 97, 130, 115, 0, -52, -52, 103, 11, -77, -78, 93, -109, 5, 78, 122, -59, 135, 16, -39, -47, 67, -21, 2, 22, -47, 50, 5, -26, -5, 7, -11, 22, 10, -108, 54, -64, 12, -43, -80, 38, 189, -1, -85, 77, 46, -46, 49, 32, -129, 19, -91, 14, -43, 61, -121, 44, -23, -6, -11, -89, 67, -33, -29, 1, -7, -2, 26, 39, 18, 0, 55, -82, -5, -29, -27, -61, -86, 25, -47, -8, -154, 102, -99, -73, -23, 69, 54, -41, -51, -95, -110, -53, 119, -167, 39, -34, -83, -78, 10, -53, -28, -106, 45, 0, 94, -10, -31, -114, -15, -153, -45, -57, -9, -19, -23, -9, 71, 19, -74, 16, -106, -32, 18, -13, 95, 40, -81, -78, -90, 39, -14, 8, 8, -124, -153, -33, -126, -55, 10, 119, -82, -11, -60, -135, 6]
11325FJ09j39J03j15M1P3j60R2N2J0j45J23r3O3k9P6m1j52L1K52q7r1p1J13n9
11350c8Q4k23K21J4j13R7j5j1q6o9J88j04J8K1Q1Q2o0Oj00lKm7j8j8J24n0M2k
11378B3P9l4k5n3O3on7O1j29J9L1M4nNq9O2j02l5J72l9l5n0J19j07J30q3KLM0
11407DK6j1J41k22N0P3r3J02q2l8oJ05m8L6L4k1K0j53J1rK9O1j01N9n6k3j1K39
11435A16q2M2m6M4j26N6j05Q9q3N9O0k06J33Q4m1q6Q1Np3Q0M0k41J65p2M1n4R5
11462b5J6l6j1K2L5Pl9K9m6J60j59J03q7K6JL5j23R1R3j25J11n3q3J10q6j2jM1
11490fJ1j19J08M1o6O1P9j95K00r6m2k7R8n6K5o2R7m7j23J65j43Q9P2r8j13J17
11516c0%L7j4n7Q9lR0r3J8q5R6RJ0r9P3j14K2O0j1K8j13R3K1j38LJ42q3M1Q8j72
$$ y = [6, 115, -24, 79, -36, 5, 78, -82, 10, 62, 72, -73, 50, -43, 20, -9, 67, 26, -126, -95, 157, 70, -21, -92, 21, -38, 46, -177, 44, 58, -55, 42, 27, 16, -70, -139, 49, -55, -37, -16, 65, 147, 87, 93, -7, -10, -8, -55, -73, -91, 33, -17, 25, 23, 102, 68, 43, -10, 53, 47, -10, 51, -78, -59, -28, 16, 11, 16, -73, -11, -113, -148, 24, -15, -50, -100, 19, -88, 42, -41, -39, -36, 4, 30, 19, 160, -62, -12, 61, -32, 70, -12, -50, -56, 49, 1, 37, 71, 50, 70, -83, -72, -81, -52, 9, -92, -33, -89, -112, -123, 116, 34, 76, 30, 74, -52, 4, -101, -12, -95, -36, 24, -182, -49, 35, -6, -92, -11, -6, -79, 1, 41, -200, -35, -107, -66, -120, -25, -9, -45, -56, -34, 1, 8, -31, -2, -48, 112, -47, 56, -31, -5, -4, 31, -92, -1, 92, -33, 78, 25, -58, 52, -34, -46, -47, -6, 5, -114, -6, 35, -31, 30, 109, -86, 114, 18, -24, -51, 47, -9, 16, -46, 51, 4, -119, 46, -97, -8, 64, -34, -147, -30, -30, 7, -7, -64, 25, 22, 112, 19, 37, -48, 48, 57, 67, -32, 41, -73, -51, 9, -2, 26, -87, 6, 27, -111, -108, 34, -49, -8, 80, -92]
11546i2R9kM3M7k67J60L4m2q5K2K8K7L8J9j06R7m1n8N8Nl4L1J10n6M9j01q4k7
11574a28J32O2l9j58Q9P9j71R4J70j84nL6P0j78m5K00j33J72j07R3m0P9m6n0R7
11599H9k41J97j18M3kk4K0n3J12%j44J01J07j09Rk2mQ8k8N4j1j1On6p7M3J05k41
11627a67K24j09o4R9n9J54n9k1J9r8O7K1k0j21J44Q0p8j62J58j4O2p7N7j12R0
11652A4P2j35J2j1J4q1J09J3n3J4R0l6J2p0Q9m1l7k1RK7l1Q1n0p0K4P5rL9O6k24
11682a09J06lN0J07j55O6K1j85Q6j72J92R9j08M3j37M9L3O9o0O7M8k1j19m6J01
11707B2M1k5j1P1lMk02Q7M4r6J94k13J50p9N2m4J5J9j05Rp5J02R2O3j21rL6J3
11735C1l5J9Qj6n7N8n3n9M4J35k6p1m9L8k9mM8M6krk2L8j43L0P8p9R5l8j2q6J51
$$ y = [-92, 7, 5, 48, 95, -172, -12, 22, -20, -105, -83, -55, -28, 10, 29, -77, 20, -21, -79, -21, -16, -50, -19, 91, 35, 84, -17, -101, -128, 4, 66, 27, -131, -42, 37, -134, -40, 130, -54, -59, -23, 47, -131, -176, 24, -109, 63, -44, 49, 9, 88, 42, -8, 89, -152, 45, -73, -30, -32, -56, -36, -89, 23, 23, -121, -20, 87, -22, -13, -35, -39, 49, 21, 75, 64, 53, 59, 3, -74, -31, 74, -167, 57, -52, -116, -17, -76, 78, 19, -2, 17, -81, -14, 7, -13, -134, 10, 90, 12, -150, 8, -6, 56, -21, 36, -76, 14, 86, -49, -37, -48, -34, -115, -6, 7, -46, -32, 58, 22, 34, -36, 53, 12, -25, -46, -37, -10, -41, 40, -10, -80, -56, 19, 10, 49, 115, -109, -3, -6, 44, 151, -4, 62, 83, -102, -16, -188, 4, 103, -5, 38, -99, -50, -17, 52, -8, 59, 107, 86, -33, -79, 22, 63, 38, 27, 98, 95, 99, -103, -16, 28, -68, 126, -87, 63, -16, 36, -8, 7, 26, -79, -70, -145, -43, 49, 112, -9, -18, 18, 31, -4, 15, 23, 7, -50, 8, -45, -104, -60, 75, 49, -22, -71, -33, -62, -66, -18, 28, 26, 17, -5, 33, -110, -80, -2, -81, 14, -24, -36, -122, 29]
11766B9j9p5R6r2J4O0q6K3k5m0o0J85K8q7M7j6O9j9m7l3M8L3JMk0KP3m9p1j20
11796a47J46m1j1n8M8J26K5j13%J19q1j7k9N5L0m7J21p3j44R9J12q6L8o1J8m2
11822a3K6J7j32Q6k9QM1P7j17Np5J71r7n8P1N0r2q1PJ9P7mJ09j23J41p5L9Rn4
11851CPj10K06j59mJ6N9R3k66J54p2M0r1K13j6r2O0M3J2j2j18rQ7o7p4R5q2J56
11879G2K9j28q6J02rq8K3P3P2j21N7K7n2l8K2L4P1r0Q6n4P3j72K2M7J8n4Q5L1
11907E2m0k9j3R1J7j81J30J3j0k5L4oO2l6k08J53K5J6K3j49J12n6N4r9J7O9j1
11934Ej19O5N6N7N7j38J3m8Q6k7O9j21J2O3N4o7l3K4k3P8n6l4j8K5l8R3Q7k03
11962h1J05l5R9j0o9P1j29L5R3j17J44o9r8RQl9J07j16J12JO4m4j03l5k4J09m2
$$ y = [29, 10, -65, 31, -61, -47, 13, -73, -50, -75, -115, -175, 10, 38, -49, -2, -18, 51, 32, -15, -48, 0, 33, 34, 38, 18, 20, 93, 44, -27, -147, -1, -42, -53, -111, -63, 63, 88, -25, -25, 94, 13, -4, -33, 22, 52, 5, 126, 53, -91, 8, 120, 34, 72, 11, 29, -13, 13, 30, -102, -16, -45, -37, 4, 81, -36, -31, -106, 65, -32, -90, -19, 31, -61, -142, -135, -116, -39, -43, 66, -57, 84, 9, 48, 57, 3, 10, -100, 106, -53, -57, -41, 18, 111, -155, -1, -73, -33, -124, 89, 73, -19, 41, 84, 96, 84, -34, -43, 44, -23, -97, -2, -84, 72, 101, -27, -113, -11, -20, -108, -85, -12, 60, -61, -4, 23, -29, -67, -45, -11, 60, -30, 56, 2, 75, -97, -75, -28, -10, -64, 21, 52, 12, -17, -30, 61, 78, -103, 27, 40, 30, 5, 39, 33, 95, 59, -149, 4, 29, 45, 68, -81, 31, -25, 29, -70, -53, 16, 5, -114, -49, 7, 64, 121, -17, -4, -52, 34, 7, 76, -45, -33, 30, 84, 17, -16, 8, -15, 63, 7, -27, -45, -20, -58, 35, 122, -81, 24, -11, 88, 78, 9, 80, -49, -14, 79, -38, 106, 37, -61, -52, -44, -83, 24, -92, 20, 21, 85, 41, -62, -97, -121, -12, -54]
11989e4q8K09j84R8J7P3nj12J8l1J0J74j18l8O5Q8j06j5K0L9p0J3l2j5J3P1j8
12016B2j25J48r8Q7j07J4J43j57j7R0k6q1J52j11J2O8nj19K3R7r6J47j44LL3l7
12042h4J25m7p7P8Q7p2R2l5j29O9R2j31l8N5K3J02j23m0J02j50J63p3M7n5J6m6
12068d9N7m1l9R6p0MP5l6m3O5m7L8k1l5L4M6j43R6q4J10R3m0p8k11K68r5n2J92
12096I0j76J16l7Km3m3Q2K7j1o8K5J29k1p4L8K0j28J42j44P2k7k0O7j69J65j33
12122a19J23Pj23J04K8LL3j02qj00K02Nj25o0J08j1O4n6M5L6j69N2L3J05m6k4
12148En3k0J56n5N0j91J96j04K0j9P6p0oo3N4k0L2K1j06J09K6o6O6n4N0m5k40
12175b51K59R2j37l4P0l9O1J04k13J40M2j11O0n3J4N7JL5q2j06R9N8j0l1J7j68
$$ y = [-54, -142, 67, -117, -19, -2, 71, 66, -46, -28, -59, -49, 125, 7, -31, 34, 122, 16, 1, 21, 60, -10, 3, -29, -44, -31, 40, 22, -103, 45, -53, 34, -73, -59, 84, -73, -90, 0, -26, -107, 45, -66, -54, 14, 9, -110, -87, 10, -86, 61, -83, -80, -47, -84, 41, -6, -83, -5, 82, 10, 102, 67, -62, 7, 99, -32, -70, -15, 8, 110, -13, -53, 49, -101, 62, -11, 36, -19, -3, -49, 8, -33, -72, 24, -46, -42, 33, -3, -46, 19, -28, 10, -11, -46, -12, 34, -109, -13, -97, 13, 106, 66, -12, -223, 45, -50, -102, 90, -86, 30, -7, -5, -48, -91, -9, 18, 7, -61, -36, 93, 72, -2, 36, 56, -72, 70, -74, -2, -29, -49, 18, -151, 14, -119, 4, 11, -112, -8, 20, 23, 56, -46, -54, -154, 48, 53, -72, -132, -24, -35, 29, -27, 18, 54, -115, -63, -30, 75, 29, 5, -48, -68, 88, 33, 83, -108, 88, -16, 4, -15, 61, -9, -15, -78, -24, -44, -12, 9, -97, 12, 38, -28, 38, -16, 34, -11, -251, 8, 100, -37, -71, -1, -40, 21, 125, -88, 52, 94, -17, 43, -10, 4, 61, 62, 97, 15, -91, 8, 66, 56, 25, 42, -126]
12201a26J01j50K01%j52P0J51l6L5n5j31j5J79p9Ok3k4%Q2J7J7K9j04P3j8J11
12227A59j95J30j59J6j8N4P8j00P5j29M3m6K1J39M7r6k7q4R7RJ39j14Q8j29n1
12252e3R2j04j9j1M6n2J47j03k0M4J05j09K7q3M0J07j33Q3p6L4l9M2q1J09K6O
12278B5o9L2om3J01q5R8q5J23j69M6N2j10J94K9j50O9k8j2k4J12j0j05n7J57n4
12304C1j2n4N3p0J01p5p3K0J05p3MlJ21o4m1j09m3J91n4K7q7J10J9m8n3J3JJ34
12332G1j98J71j04O3O6l7j15J77j53N9q9J47j3J28k16k9M3p3J32k6m5L1K3o2M3
12357fP9J3j18Pl9J37o2K1o1l7J78p5j17J43o5mq8Q2k7J07k5o0J5J3L9O9j98J78
12385I9n5O3j05P1jj91O0J01n6L0R1j13J0J5pM9K3p0M9o4N0j23J23K0j03QKJ10
$$ y = [-126, -25, -175, 26, 26, -126, -56, 95, 59, 94, 39, -92, -107, 72, -7, -1, -24, -48, -48, 34, 51, 68, 97, -7, 66, 48, 159, -36, 94, -65, -49, -67, -13, 65, -35, 40, -89, -46, -92, -71, 68, 115, 19, -8, -92, 5, 14, 153, 39, 127, -2, -53, 39, -65, -84, -95, -49, -101, 46, -57, -77, -33, 72, -37, -10, -93, -53, 54, -79, 4, -72, -38, -77, -35, -116, -7, 19, 25, -44, -12, -18, -61, 40, -45, 53, -32, 91, -78, -32, 20, -90, 104, 133, -17, 52, 24, 12, -12, 100, 90, -15, -72, 85, 31, 19, -35, 18, -52, 49, -26, -99, -79, 26, -47, -43, -46, 75, 11, -30, -139, -182, 9, -45, -18, -105, 5, 24, -24, -77, -64, -63, 71, -127, 44, -60, 3, 69, 32, -83, 94, -59, 0, -89, 58, 45, 173, -43, -72, -29, -102, 30, 4, -41, -10, 13, -49, -6, 73, 86, -32, -25, -64, 73, 11, 32, -29, -66, 112, 37, -80, 63, -2, -6, -94, -12, -39, 68, 43, -17, -2, 11, 50, 119, -79, 99, 44, 107, 2, 73, 72, -119, -59, 42, -14, 16, 107, -6, 4, 19, 12, 61, 84, 14, 63, -1, 49, -74, 49, 69, -34, -26, -24, 86]
12413H6o7k9M6q3J44nr9j12J04k6L9m6J19n8p8K9J8j8l4K03j33j9n0M1M6j2lM0
12441D3NPo5n3L7M1l9M2k4LJ1n0J03j03O8N4k02O1l6J22n0n9K9J1M4k5l7J14p1
12470a9K9n0P5n2J36r1J2k5j46J06J43j32j2P4o0q6J04l3J24o3n1M5l3j58K99
12495A36l6j77P8K4k0p5k2O0J06l5m0om6L6J3Qp4J19l2L8n8m8K7P6j19J90K4j46
12523Ak9M7k4K4L8j02O8n4j9Q4j5%j23L6J2J64j94J06m1O8l5p1N3M5RP5m0j24
12551d1J24r5O1Qj15j5J16J04j97q0J08m8n9J25p4J19p8P5nl9o7J21j44J38j7
12576B5m6L3j1j9O1j15Q3j55J03M4K2j09R7l4L9Kk1O4OJ6j02M3R2q7K1p9JJ09
12604H3l4m1r4R2Rn3J4j1N4j00P1O0k7j1j9Pj63J78%K3j37M2P2O9j26N5Q9j6j90
$$ y = [86, 19, -10, 36, -47, 97, 92, -7, -119, -15, -41, -2, -48, 71, 13, -65, -36, -18, -36, -70, 133, 0, -19, -69, -28, 18, 6, 3, 43, 48, 55, -10, -63, -26, 15, -24, 18, -6, -3, 8, -42, 61, -42, 26, 80, -122, -61, -97, 25, -25, -84, -55, -44, 0, -25, -62, 52, -19, 10, -40, 35, -17, 119, 28, 40, 15, -131, -25, 118, -14, -26, 48, -12, -98, 6, -27, 97, 34, -17, 28, -5, -163, 136, 100, -77, 1, 25, 5, -70, -92, -32, 74, 39, -1, -7, -53, -17, -4, 4, -70, 49, 17, 55, -3, -51, -24, 52, -67, 123, 147, 1, -28, 19, -5, 19, 57, -45, 23, -31, -50, 34, 19, 19, -104, -68, -56, 108, -86, 20, -21, 47, 12, -59, -6, 39, 48, 123, 83, -41, 83, -12, 49, 57, -58, -73, 43, 147, -50, -130, -22, -70, -129, -4, -78, 41, -37, 38, 33, -6, -73, 48, -96, 42, 25, -21, 12, 1, -18, 43, -72, 11, -144, -41, 3, 25, -84, 13, -21, 18, 20, -1, 63, 69, 85, -17, 26, 118, 31, 52, -27, -26, 83, 49, 8, -86, 6, 15, -38, -24, -35, 19, -81, -10, 50, 23, 12, -7, 0, -163, 15, 15, 38, -99, -57, 15, 84, -42, 13, 102, 86, -104]
12633a04J30N%NnL4m3P1jl1r9Pl0O1j0jQ8j43j15K11m9R9r1k8M0m4m5J5R5l6N7
12664D3q8N8l1N5J6p9P5l0o4k3k8K11j46o9R0q9Q7NL9l1K3k5l4Q2q5N8jL9j08
12693e0J17j4j43R1lo1O4j7J1J53o0j69r0K09j1n2N1j29J95q1n0QJ82j69O5l3
12719A4n3j8J76j58Q5j8Nr2j3Q8R7k11Q5J28j29L0%j28J03k6L8m5J13j30K3K7
12745iL5j1j8K1k3M9o5KL9L2r2m3J53o9j6j54N6L9l0J51j22J40O3k63N7Q8k3J7
12773DJM7p5N5qq0P7K2j30Q6pJ29j04o7J8l9J07n8RkL6l2m7RN7k9k6J78l8r8n
12804a0Ro6P2o0Q5l5j8P2l5n5N5k6Q3j59R3o8J30p5j2r6M5M3l2Q4r6J75p0j3O8
12833H8j21L6p3jn9K01r9J31j40J1L2Q6j05J6j2o8O8n4J5J51j26k3M6L6kj6k2
$$ y = [-104, 26, 31, 31, 36, 31, 65, 22, 93, 92, 61, -38, -31, -61, 0, -10, -11, 77, -66, -181, 30, -19, 80, -11, -39, 1, -43, -88, -73, 22, -14, 43, -45, 13, -18, 37, 53, -26, 49, 19, -45, -68, -96, 115, -31, -100, -10, -99, -12, -7, 32, 1, 24, -1, -35, 47, -38, 20, 19, 58, -50, 67, 53, -90, 1, -2, -63, 1, -16, -5, 148, 88, -81, -171, 38, 27, -25, 26, -103, 92, 11, -39, -31, 151, -18, 47, 14, -39, -57, 119, -39, 46, 28, 33, -59, -72, 16, 113, -98, -13, 115, -14, 16, 16, -112, -9, -35, 3, -42, 71, -59, -36, -9, 26, 15, -3, 18, -5, 44, -21, -19, 20, 52, -40, -83, 70, 1, -15, -169, -113, -74, -104, 47, -75, 65, 128, -135, -78, 10, -13, 4, 5, 52, -23, 32, 24, -56, 21, 43, -87, -1, -8, 121, 17, -50, -32, -71, 36, -22, -13, -15, 21, -11, -58, -49, 8, -21, -47, 131, 93, -5, -10, -1, -67, 5, -55, 30, -5, -23, 49, 14, -41, 14, -12, 71, -88, 5, -63, 67, -8, -20, -116, -71, -28, -60, 24, -72, 103, 33, 20, 88, -33, 3, -70, -71, -130, 71, -28, 103, -37, -26, 6, 92, -13, 3, -9, -77, -9, -63, -48, 103, -23, -46, 0, 36, 34, 18, -4]
12860dq7J31N5j63oo2O9l5Q1jP5K0q4j26J67J4O0n2q5N7J8j02P4j1L5P7j5k1k9
12889E0K3j58P9P3n5l9On3l9R8J01l4j27N4R0n6j31M5LK28j18p8J58j78J6P6j5
12916A9mk2M2n9J1K2o7J76p5M3n3l6J6m0k0J54k1m0n3L6K5J5l8p2j0J09q2Jo1
12945h4Q9L3O8j13j29R9P0m1j9J8l2l6Q5RM6j52J79l0lq8K9J7r4J43j9K0k3m9
12973gj6P0L3K6k0J5j66L3J14r6J25j16J94k35Q6Pj41J5Q1j1R5j73J3R1j48K52
12999A21l4j08O8l0m3j20J21m9R1n7J03j6o1L2j7k1L5m5R8p8m4OL1n2j1J09n2
13026b3n8J07r1M1LQ6j74Q1l5Q5K8l5k6K4o6j1J4m5J25J4j64J36Nj64K13j39R6
13053B7q4J05o5o4J50m9K9p9m9J17o5M3l4j17R3J07k0mm2j5j4p3N5l7J10k6pJ5
$$ y = [-4, -91, 40, 95, -68, -74, -136, -67, -102, -21, -22, 53, 73, -11, -137, 30, 44, 104, 52, -33, 24, 42, -60, 14, 3, 38, 115, 100, 79, 50, 73, -85, -6, 67, 12, -27, -21, -74, -113, -15, 86, 52, -75, -21, 69, 13, -118, -73, -70, 158, 40, -38, 120, -58, -42, 34, 19, 15, -7, 35, -24, -13, 9, -58, 118, 43, 86, 33, -3, 13, -27, -47, 107, 86, 46, -7, 29, 54, 69, 31, -41, -51, 58, -24, -23, -84, 5, 38, 106, -7, -136, -37, 33, -8, -27, -9, -41, -77, 8, 17, 63, -89, 90, 60, 57, -31, -2, 15, -79, 64, 45, 65, 42, -7, -23, 47, 80, 106, 86, 101, -65, -32, 82, -14, 111, -5, 189, -46, 40, 47, -94, -79, 2, -9, 86, -87, -74, 17, -131, 121, 87, -21, 47, 17, -26, -146, -25, -74, 17, -40, 63, 47, -14, 18, 1, -20, 15, -30, 68, -10, -54, -48, -17, -69, -80, 29, -23, -81, 26, -65, -24, -21, 65, -109, -28, -63, 22, 50, 15, -11, 13, -53, -64, -50, -95, 30, 44, -120, 16, 21, -143, 70, -69, 27, -57, 48, -17, -81, 69, 20, 49, -30, -79, 38, -27, 16, -18, -135, -42, 65, 45, 41, -1, -16, -30, -103, -48, -85, 25, -1, -8, 7]
13081Gn0P9p0L8j61J34Rr4J55n8L5q6P9OL2j27N3q9J9Q5j1k2K3R4l4Jo9R5j14
13110d1Q5p4P5j33P7q0J19m3o3N4NoJ37j42Q8n8k4O2M6m2j15J7P1k8L5OK8p0K0
13139FJ10j2j74nO7k1L0j34K00j86M3J24J2j39N5K6ol3J3L8j31M8O3jJ46j23%
13166A6J3j9K7LK4M2p9j1n2N1pp1L2m1M3R4m2j02N9n7J07J3mkj26J43qr7J3O9
13196C1p2Q0pk6N5p1O1Q5j28p1Q9K5m1j27Q7jJ09j0k4q6k1K16k83J00M6n2O4n2
13224b4K7o3q1K43j55J43j9o6RO4n8q3m1J36M2j62J21n9jL0p9N2k9P1j8j9N6j21
13252h4J05J2J4m1N4j46R8r5O0K2lr2J24K4o5q2O7P9n4r6R3PR6n0j13J85j7p9
13280B3r6lK7Q5j01J50j03N1n5K8n8n8J36Q2r7O4j41J0kRL7j05J42l4L9q0L2k3
$$ y = [7, -43, 36, -34, 4, -157, -23, -14, -108, 47, -11, 24, -62, 17, 23, 55, -72, -19, -108, -89, -4, -15, -37, -14, 80, 46, 47, -22, 73, -41, 44, -30, 45, -88, -11, -91, 28, -15, -78, -24, -19, -25, 112, -30, 58, 0, -24, 38, 84, 42, -73, -56, 15, -13, 22, 28, 56, -14, 6, 116, 104, -70, -75, -8, -29, 1, -133, 67, -119, -76, 48, 60, -79, -24, 2, -4, -37, -24, 14, -117, -69, -6, -7, 139, 16, 16, 29, 10, 37, 40, 64, 106, 27, 16, -36, 15, 8, -63, -31, -72, -29, 65, 23, -79, -20, -77, 30, 43, 39, 37, -89, 54, 46, -51, -38, 31, -41, 39, 32, 6, 61, -10, 51, 136, 8, -63, 26, 51, 10, -117, -30, -31, 78, 68, 44, -42, -63, 153, -130, -30, 16, -36, 28, -24, 3, -60, -141, 102, -53, 90, 71, 5, 14, 78, 20, -63, -104, 32, 74, -88, 33, -26, -27, 3, -76, -24, -53, 18, 0, -19, 37, -84, 21, 33, 47, 6, 60, -86, 12, -83, -23, -1, -4, -96, 28, 52, -13, -95, -28, 51, -3, -99, -6, 1, 97, 47, -66, 119, 102, 23, -73, -76, -49, 36, -65, 85, -18, 33, -22, 6, -52, -110, 26, 108, 11, 75, -66, -56, -58, -49, -12, -117, 25, -9, 30, -50, -18, -41]
13308d1J16r6K8N5o6J6j9Kj7N1n1K4n9k5K00j12J05j15J6Q7m7QQ4j52j8N3Nl8
13336fr9J06M3p5n5J91p7L6J4l5qK4R2q7L6o7j51Q8l3P3jJ36k78J30K1J6K8k5
13364C7n9KJ1J5n2j2J30o8j29N8N7n3MJ34J3k81O4J5N4n4N9j26J93m9m9J10J00
13391A24r5ML5j6L4q5l7M1J1K3m8K5M1n2Q5j49M4p5O7J39p3m0Q6j59M0N6j54J99
13419G1r7J01j46N8l3N0O1k5j77PK00n0p6QJ01j11J61j0n7O0l0q2q2K17j23M7
13445D3L4j14O4K8q9J9rQR0j87J83j75J99k3j11J06j7n6j7J31q6N2j03m1J18J6
13471F3o3J8j47Q2l8J62j8L1p1K0j13K20j05M0j23R7o4j1PM6l6k9J19j20NK7j0
13498a1O0L7j33J56rj17J70n7r2O7j7j28K6O8L7j53J1K1J23j63O2J43j51oO7J6
$$ y = [-41, 75, -21, 7, 62, -4, 12, -7, -5, -22, 29, -22, 2, -57, -82, 118, 6, 111, -4, 12, 99, 52, 60, 144, -8, -26, 27, 32, -6, -105, 1, 44, -31, -86, 105, 28, 64, 78, 43, 35, 59, 151, 64, 100, 33, -118, -30, -63, 10, 9, 145, -133, -3, 18, 34, 62, 37, -22, -20, -9, 6, -46, -58, 72, 4, -125, -67, -10, -63, -59, 75, 88, -193, -129, -114, -60, -114, -55, -181, 12, -37, -86, 24, 124, 29, 33, 68, 52, 86, 1, -36, 5, 16, 39, -9, 16, 57, 5, 90, -59, -15, -90, -23, 116, 43, 3, 89, -70, -30, 26, -128, 71, -26, 75, -71, -13, -46, 4, 65, 40, -137, -130, 70, 20, -56, -48, 53, -58, 103, 93, 36, 96, 66, -16, -98, 119, -4, 43, 77, -37, 27, 55, -34, -15, -24, -16, 74, -113, 70, -105, 94, 71, -40, 66, 49, -7, -24, 107, 21, 73, -30, -71, 47, 63, 0, 18, -129, -47, -85, 77, 59, 90, 19, 39, -74, 146, 41, 81, -42, 55, -9, -20, -13, 33, -3, -32, 87, -33, -28, -1, -11, 49, 86, -47, 109, 100, -17, 153, 96, 4, 71, 54, -74, -48, 20, 57, -96, -85, -64, 59, -104, -42, 101, -50, -56, 11, 27]
13524B7O2r5M1R6j65m1O7J6J96l45J77J40j98NJ11Kj36N6k8L0o0pM9L0Q7j10J4
13551B1P8j38K2j14L6LJ96j25j2nk4P6n4N5kL1j27N3j2L4p6Q7R3j79J03l0o9L2
13579d7Q6Lo1lk5j36J23LJ3OM1l8O8l8PK7q9K0R6Nqj9J0j07N9mk4rn1J02o3m6
13611i9J08J1k4Kl7Q%J11j29K4L8O6o5K3r8O3mP2j21L5j6K06j11j54M3Q7j3R5
13639A21p5l1o5N7lo6M8M7j23J60j8r8k2kJ36o3j12R7J05m4j42M0J65q1r0P4n0
13666c5L0N4o1J04jk9p9l2oJ4N8M6r8m4N0N3k0J3O2j7k8J6m7L7l7o2M7o7Q2R1
13696I4q4L8q7L9N9l1l6k4L1k2n1J6J51p9n8o9O4N2r4K33k2j22J3P8j05N3o9m5
13724g7L5O5k6n1P4Q6j21J11j17or6R3m5K6%M1L2o2Q5j18J9NK9L0n1J04j19J01
$$ y = [27, 89, -6, 35, 131, -34, -75, -8, 8, 204, -141, 36, 176, -22, -17, 94, 96, -40, 16, -12, 18, -42, -49, 0, 30, 117, 7, 21, 99, -39, -17, -131, -95, -92, 104, -21, -33, -38, -62, 14, -40, 15, 13, 44, -83, -30, -42, -8, -84, 3, 96, -83, 20, -10, -79, -47, 39, 42, -19, -22, -47, -183, -60, -57, -44, -38, 3, -35, 33, -5, 2, 29, -60, -40, 56, 61, 53, 34, 44, -63, -4, -8, -32, -41, -92, 10, -53, -99, 9, 20, -4, -2, -39, -31, -31, 80, -49, -25, 13, 79, 14, 37, -61, 2, -2, 70, -51, -16, -32, 174, 63, -91, -48, 39, 26, 121, 46, 15, -50, 7, 4, -62, -14, 33, -90, 70, 52, -46, -68, -70, 66, 3, -109, -12, 93, 49, -93, -53, 112, 31, -59, 15, -35, -5, 49, -12, 92, 91, 62, -17, -49, -55, -41, 17, 63, -35, -79, -29, 24, 4, 17, 79, 62, 34, 50, 3, 40, 3, -59, -12, -79, 3, 94, 10, 48, -39, 0, 59, 28, -8, -32, -1, -23, -74, -58, 93, 14, -44, -113, -49, 3, -91, 142, 120, -2, 11, 89, -16, 37, -32, -77, -42, 23, -3, -54, 20, 106, -15, 96, -21, -27, -123, -30, -75, -49, -49, -8, 24, -38, 47, -71, -52, -47, -18, 12, -39, 65, -54, 47]
13752D7k3n1Q1m1J7p3j10P4J69j20P6j06Q7m9K3%r1N2N3K2PR6j01j04L1K9M4p3
13780c4J73k03%O4j21K32j28Pnk4L6K8O0j69J0O4oQ4N7j87L7Q3Lrm5l7o2O5N1
13809B4P2j29J26m6K2k3j04J28k16J19Q7j5n5L0KK9q5K9N1kk24K58q3Mm3M0K7
13836B3p9j8J32M5m7m7l9K0j3R1j09Q5n9Rk5l5o5J11K6l4O4n2J2k9K2mj17J56
13864B4P7r5J0l2Q3j9p1OmQ2m6N8q0j2m4O3j03J20mj6j4J20j32K35j83M1o0L5
13892C9j49J28l3j4K5j7J12j76R4pjj09J39m8lJ20l3k7n7JK2Q4j97J78J1o5j00
13919h3lJ58J2j01j3oR0j76R4k2L4m8N2J39j5j28N4K6j05o2J17k0k2o0J0J66j52
13946f4R3m6N1j08M8P0q7J45r0M6M0n0p7M7j36J96r8r6K45q4k11J94L9j67P3J5
$$ y = [47, 24, -27, 54, 13, 30, -43, -153, -79, 90, -30, 46, -60, 27, -22, 1, 1, -90, -38, 15, 37, 44, 140, 39, -65, -34, -5, 39, -34, 139, -64, -64, 0, -121, 111, -17, -10, -15, -39, -3, 25, 85, -84, -74, -10, -16, 68, 125, -62, -25, 58, 61, 52, 7, -30, -92, -27, 24, 96, -33, 93, 47, 69, 46, -58, 70, -146, -27, 60, 45, -10, 20, 22, 51, -34, -5, 46, 44, -180, 78, -5, -1, -44, -4, 23, -56, -74, 58, 103, 56, 9, -30, -10, -23, 68, -41, 44, -15, -6, -31, -66, -131, -20, 6, -28, 36, -16, -4, -33, -11, -15, -132, 24, 101, 6, 16, -16, 67, 48, -23, -17, -21, 61, 15, 73, -7, -19, -63, 0, -103, 17, 13, -3, -17, 103, -29, 206, 23, 64, 4, 39, -110, 18, -15, -29, -4, -21, 91, -85, 9, 2, 1, -108, 31, -17, -20, 100, 67, 40, -17, -16, 6, 90, -107, 71, 82, 17, -83, -86, 72, 84, -17, -30, -36, 54, -122, -28, -50, -16, -64, -12, 127, 112, -16, 38, 64, -41, -103, 14, -6, -28, -88, -78, 88, -64, 29, -17, 34, -74, -26, 44, -43, 102, 12, 58, 98, 48, -29, 18, -118, 78, -20, -116, 129, 45, -166, 28, 67, -100, -27, -12]
13972a2rm5N9L7Nn1OJ36n8j21lJ91o1r6j3Q5n9qQ3j77J03QN0m4J02j69P7N0j55
14001h9l6R4p8L3J23p7L8J6l7J5L7Nm8N5n4j3R3q7ln3L5k1J00q1J25o4j54J92
14029F6K6j04k5J78j47J05p3K7l6o7Q4r7J9P7n1m6J86k65J25j27J09k8M2J88l02
14054a36J24M6rm5m0L8j3P9l7k1J9Jm6J04jl8j18J42j36L3J39j34OK1N3N7j10
14081b2L8l1M2M5m6l9L0J6m0J03n8j0n0j9M2J09o5m4r2M5N2j03N1r5O6J43j10
14108d2J2n1J26j43J18q6J45j10N1j19J66L3p1%o0k3p2J90o8P2k9r0ql3J17j17
14134i2K1k2P5J01j21P1j42LJ38p3J3R3k9j01l0J46m9R7j32ro0J06j09Q1O3r2
14160e3N2MK8%j64K27o6j6O1n3p4Q1n3m3Q2m3K7J01n9N3n4r3O8q7J40j87J56j13
$$ y = [-12, -21, -66, -7, 30, 35, -16, -10, 126, 68, -53, -56, 135, 74, -22, -35, 50, -9, -17, 66, -111, -8, 0, 50, 6, 108, -61, 16, 66, -89, -125, -31, -109, -76, 47, -30, 8, 24, -13, 2, 39, 44, -4, 51, -3, -16, 77, -10, -13, -66, -31, -52, 48, -33, 92, 28, -126, 66, 92, -12, -37, 141, -6, 99, 26, 53, 17, -50, 34, -63, -44, 33, -18, -64, 122, -143, -18, -145, -36, -64, -22, 166, -136, -12, 34, 25, -20, -60, -22, -35, 44, 7, -14, 5, 6, -40, 64, 63, 25, -93, 49, -87, -54, 85, -49, -43, -22, 31, 88, -22, 16, -15, 27, 72, 26, -13, 17, 33, -7, 96, 38, 28, -22, -41, 1, 110, 45, 1, -91, -46, 6, -97, -46, -141, -75, 68, -42, -30, -81, 45, -98, 20, -66, 79, -31, 20, -99, 67, 100, 29, 29, -31, -54, -126, 64, -4, 68, 39, -51, -59, -92, 25, -92, -71, -93, -18, 83, -38, 33, -109, -106, 32, -41, -28, 65, 36, -65, -95, 51, 2, 99, -33, -42, -102, 4, -105, -24, 39, -53, -1, 3, 31, 31, -133, 94, 28, 12, 73, 20, -54, 27, -26, -69, 13, -30, -3, 98, 39, 92, 38, -55, 13, -74, 66, -121, 35, -78]
14188g8l1O6J34r7Kj26P9rM6J31j09M4m9j62K08k1pp7k3N9q8J12M4j37R9j2P6
14215G4m7k5N7j45J59n4K6o9L7j4O8p3j04RJ12M5k6m2J36k28J00q5oJ39j25L8
14241d3jJ01O3j77oQ0Oqp2k2J8P1m5L4m9k8O0K4PJ44k78O2J40o6j00O3J0Mn7K6
$$ y = [-78, -109, -43, 91, -6, -4, -130, -51, -60, -14, 117, 8, 52, 3, -159, 49, 28, 21, -56, -79, -20, -108, 4, 48, -89, 10, -2, 74, 27, 2, 59, -86, 73, 19, 45, -24, 13, -1, 67, -6, -110, -101, 11, 56, 30, -12, 124, -104, -4, -89, -95, 44, -81, -43, -44, 57, 120, -57, -63, 17, 23, 15, -57, -79, -61, 10, -35, -1, -50, -78, -18, 6, 13, 157, -121, -59, 81, 15, -85, -22, -12, -8, -65, -39]
$$ [...]
16383f3
##END NTUPLES=NMR FID
##END=
