##TITLE=abcd
##JCAMPDX= 6.0         $$ Bruker NMR JCAMP-DX V2.0
##DATA TYPE= NMR FID
##DATA CLASS= NTUPLES
##ORIGIN= UXNMR, Bruker Analytische Messtechnik GmbH
##OWNER= root
$$ XWIN-NMR		Version 3.5
$$ Tue Jul  8 17:26:02 2025 Russian Standard Time (UT+4h)  servis@DPX200
##.OBSERVE FREQUENCY= 200.131235884673
##.OBSERVE NUCLEUS= ^1H
##.DELAY= (6, 6)
##.ACQUISITION MODE= SIMULTANEOUS
##.ACQUISITION SCHEME= undefined
##.AVERAGES= 32
##.DIGITISER RES= 18
##SPECTROMETER/DATA SYSTEM= spect
##.PULSE SEQUENCE= zg
##.SOLVENT NAME= CDCl3
##.SHIFT REFERENCE= (INTERNAL, CDCl3, 0, 16.5164)
##AUDIT TRAIL= $$ (NUMBER, WHEN, WHO, WHERE, WHAT)
$$ ##TITLE= Audit trail, XWIN-NMR		Version 3.5
$$ ##JCAMPDX= 5.01
$$ ##ORIGIN= Bruker BioSpin GmbH
$$ ##OWNER= servis
$$ F:\spectra/data/av/nmr/H1/1/audita.txt
$$ ##AUDIT TRAIL=  $$ (NUMBER, WHEN, WHO, WHERE, WHAT)
(   1,<2025-07-08 17:25:36.45 +0400>,<servis>,<DPX200>,
      <created by zg, POWCHK disabled, PULCHK disabled
       configuration hash MD5:
       00 E9 B6 7A A2 85 ED C7 34 08 36 98 17 FE 4E 26
       data hash MD5: 32K
       DB 26 33 0A 4E 6C 2C E8 D0 00 37 A4 FB CE AF C3>)
$$ ##END=
$$ 
$$ hash MD5
$$ FE 21 EA 4A 24 7F 8F 31 3D BE 78 3F DE FB C2 B3
##$RELAX= 
##$RELAX= 
##$RELAX= 
##$RELAX= 
##$RELAX= 
##$RELAX= 
##$RELAX= 
##$RELAX= 
$$ Bruker specific parameters
$$ --------------------------
##$DU= <F:\spectra>
##$EXPNO= 1
##$NAME= <H1>
##$PROCNO= 1
##$TYPE= <nmr>
##$USER= <av>
##$AMP= (0..31)
100 100 100 100 100 100 100 100 100 100 100 100 100 100 100 100 100 100 
100 100 100 100 100 100 100 100 100 100 100 100 100 100 
##$AQSEQ= 0
##$AQ_mod= 1
##$AUNM= <au_zg>
##$AUTOPOS= <>
##$BF1= 200.13
##$BF2= 200.13
##$BF3= 200.13
##$BF4= 200.13
##$BF5= 500.13
##$BF6= 500.13
##$BF7= 500.13
##$BF8= 500.13
##$BYTORDA= 1
##$CFDGTYP= 0
##$CFRGTYP= 5
##$CHEMSTR= <none>
##$CNST= (0..31)
1 1 145 1 1 1 1 1 1 1 1 1 1 1 1 1 1 1 1 1 1 1 1 1 1 1 1 1 1 1 1 1 
##$CPDPRG= <>
##$CPDPRG1= <>
##$CPDPRG2= <>
##$CPDPRG3= <>
##$CPDPRG4= <mlev>
##$CPDPRG5= <mlev>
##$CPDPRG6= <mlev>
##$CPDPRG7= <mlev>
##$CPDPRG8= <mlev>
##$CPDPRGB= <>
##$CPDPRGT= <>
##$D= (0..31)
0 2 0 0 0 0 0 0 0 0.06 0 0 0 0 0 0 0.0002 0 0 0 0 0 0 0 0 0 0 0 0 0 0 
0 
##$DATE= 1751981136
##$DBL= (0..7)
120 120 120 120 120 120 120 120 
##$DBP= (0..7)
150 150 150 150 150 150 150 150 
##$DBP07= 0
##$DBPNAM0= <>
##$DBPNAM1= <>
##$DBPNAM2= <>
##$DBPNAM3= <>
##$DBPNAM4= <>
##$DBPNAM5= <>
##$DBPNAM6= <>
##$DBPNAM7= <>
##$DBPOAL= (0..7)
0.5 0.5 0.5 0.5 0.5 0.5 0.5 0.5 
##$DBPOFFS= (0..7)
0 0 0 0 0 0 0 0 
##$DE= 6
##$DECBNUC= <off>
##$DECIM= 32
##$DECNUC= <off>
##$DECSTAT= 4
##$DIGMOD= 1
##$DIGTYP= 9
##$DL= (0..7)
0 120 120 120 120 120 120 120 
##$DP= (0..7)
150 150 150 150 150 150 150 150 
##$DP07= 0
##$DPNAME0= <>
##$DPNAME1= <>
##$DPNAME2= <>
##$DPNAME3= <>
##$DPNAME4= <>
##$DPNAME5= <>
##$DPNAME6= <>
##$DPNAME7= <>
##$DPOAL= (0..7)
0.5 0.5 0.5 0.5 0.5 0.5 0.5 0.5 
##$DPOFFS= (0..7)
0 0 0 0 0 0 0 0 
##$DQDMODE= 0
##$DR= 18
##$DS= 0
##$DSLIST= <SSSSSSSSSSSSSSS>
##$DSPFIRM= 0
$$ [...]
##$SUBNAM0= <"">
##$SUBNAM1= <"">
##$SUBNAM2= <"">
##$SUBNAM3= <"">
##$SUBNAM4= <"">
##$SUBNAM5= <"">
##$SUBNAM6= <"">
##$SUBNAM7= <"">
##$SUBNAM8= <"">
##$SUBNAM9= <"">
##$SW= 20.6817932712277
##$SWIBOX= (0..15)
0 0 3 0 0 0 0 0 0 0 0 0 0 0 0 0 
##$SW_h= 4139.07284768212
##$TD= 32768
##$TD0= 1
##$TE= 0
##$TE2= 300
##$TE3= 300
##$TEG= 300
##$TL= (0..7)
0 120 120 120 120 120 120 120 
##$TP= (0..7)
150 150 150 150 150 150 150 150 
##$TP07= 0
##$TPNAME0= <>
##$TPNAME1= <>
##$TPNAME2= <>
##$TPNAME3= <>
##$TPNAME4= <>
##$TPNAME5= <>
##$TPNAME6= <>
##$TPNAME7= <>
##$TPOAL= (0..7)
0.5 0.5 0.5 0.5 0.5 0.5 0.5 0.5 
##$TPOFFS= (0..7)
0 0 0 0 0 0 0 0 
##$TUNHIN= 0
##$TUNHOUT= 0
##$TUNXOUT= 0
##$USERA1= <user>
##$USERA2= <user>
##$USERA3= <user>
##$USERA4= <user>
##$USERA5= <user>
##$V9= 5
##$VALIST= <valist>
##$VCLIST= <CCCCCCCCCCCCCCC>
##$VD= 0
##$VDLIST= <DDDDDDDDDDDDDDD>
##$VPLIST= <PPPPPPPPPPPPPPP>
##$VTLIST= <TTTTTTTTTTTTTTT>
##$WBST= 1024
##$WBSW= 30
##$XGAIN= (0..3)
0 0 0 0 
##$XL= 0
##$YL= 0
##$YMAX_a= 1064491
##$YMIN_a= -866421
##$ZGOPTNS= <>
##$ZL1= 120
##$ZL2= 120
##$ZL3= 120
##$ZL4= 120
##$ABSF1= 10
##$ABSF2= 0
##$ABSG= 5
##$ABSL= 3
##$ALPHA= 0
##$AQORDER= 0
##$ASSFAC= 0
##$ASSFACI= 0
##$ASSFACX= 0
##$ASSWID= 0
##$AUNMP= <proc_1d>
##$AZFE= 0.1
##$AZFW= 0.1
##$BCFW= 1
##$BC_mod= 2
##$BYTORDP= 0
##$COROFFS= 0
##$CY= 19
##$DATMOD= 1
##$DC= 2
##$DFILT= <>
##$DTYPP= 0
##$F1P= 11.0000007629395
##$F2P= -0.999999237060547
##$FCOR= 0.5
##$FTSIZE= 0
##$FT_mod= 4
##$GAMMA= 1
##$GB= 1
##$INTBC= 1
##$INTSCL= 1
##$ISEN= 128
##$LB= 0.05
##$LEV0= 0
##$LPBIN= 0
##$MAXI= 10000
##$MC2= 0
##$MEAN= 0
##$ME_mod= 0
##$MI= 0
##$NCOEF= 0
##$NC_proc= 0
##$NLEV= 6
##$NOISF1= 0
##$NOISF2= 0
##$NSP= 1
##$NTH_PI= 0
##$NZP= 0
##$OFFSET= 16.51637
##$PC= 1
##$PHC0= -274.4572
##$PHC1= 1.101538
##$PH_mod= 0
##$PKNL= yes
##$PPARMOD= 0
##$PSCAL= 4
##$PSIGN= 0
##$REVERSE= no
##$SF= 200.13
##$SI= 16384
##$SIGF1= 0
##$SIGF2= 0
##$SINO= 400
##$SIOLD= 16384
##$SREGLST= <1H.CDCl3>
##$SSB= 0
##$STSI= 0
##$STSR= 0
##$SW_p= 4139.07284768211
##$SYMM= 0
##$S_DEV= 0
##$TDeff= 0
##$TDoff= 0
##$TI= <>
##$TILT= no
##$TM1= 0
##$TM2= 0
##$TOPLEV= 0
##$USERP1= <user>
##$USERP2= <user>
##$USERP3= <user>
##$USERP4= <user>
##$USERP5= <user>
##$WDW= 1
##$XDIM= 8192
##$YMAX_p= 0
##$YMIN_p= 0
$$ End of Bruker specific parameters
$$ ---------------------------------
##NTUPLES= NMR FID
##VAR_NAME=  TIME,          FID/REAL,        FID/IMAG
##SYMBOL=    X,             R,               I
##VAR_TYPE=  INDEPENDENT,   DEPENDENT,       DEPENDENT
##VAR_FORM=  AFFN,          ASDF,            ASDF
##VAR_DIM=   16384,         16384,           16384
##UNITS=     SECONDS,       ARBITRARY UNITS, ARBITRARY UNITS
##FACTOR=    0.0002416,     1,               1
##FIRST=     0,             0,               0
##LAST=      3.9581328,     0,               0
##MIN=       0,             -866421,         0
##MAX=       3.9581328,     1064491,         0
$$ Real data points
##PAGE= N=1
##DATA TABLE= (X++(R..R)), XYDATA
$$ [...]
9957B12k69o4K07m6j45j86K22J70k26K87j84j25L05r8r5N2Nj38P9J00j93N3K51
$$ 212 -57 -121 86 40 -105 -291 -69 101 -125 162 -22 -147 158 60 -35 17 22 -116 -37 63 -130 -77 174
9980A74j09j53K3J78O3q1J22j98k55L00K02k25Ko5k12J35J21O7k50n9N41n33L05
$$ 174 65 -88 -65 113 176 95 217 19 -236 64 266 41 43 -22 -234 -99 22 89 -161 -220 321 -212 93
10003I3J08j21j50J06r7j82L00K19k30k39l4J73q5L24N5j61j2Q3k62m0L09j94
$$ 93 201 80 -70 36 -61 -243 57 276 46 -193 -227 -54 -139 185 240 79 67 150 -112 -152 157 -37
10025c7K40K04k72l9l06K91kk37K49k03q6J16J70l98L36J91O8k65j8J2l56K99
$$ -37 203 407 135 96 -210 81 79 -158 91 -112 -198 -82 88 -310 26 217 285 20 2 14 -342 -43
10047d3L34m12qK46q7j44M4J51l69L78k62O6J02Q0qj64K52j40K39k37K22l57J3
$$ -43 291 -121 -129 117 30 -114 -70 81 -288 90 -172 -106 -4 76 68 -96 156 16 255 18 240 -117 -104
10070a04K06q4j64K75k08j40K69J72k41M1K32j87m40M49M2l87K48J87k65j85K75
$$ -104 102 18 -146 129 -79 -219 50 222 -19 22 254 67 -373 76 118 -269 -21 166 -99 -284 -9
10091i%L1j18J15l2L1K42m02J74o0L8l12J40K58k82jL91k40j59M9J12j2K41J68
$$ -9 -9 22 -96 19 -13 18 260 -142 32 -28 10 -302 -162 96 -186 -187 204 -36 -195 -146 -34 -46 195 363
10115C63l22R5M2k25L14k73J24p3J03k16j6j30J66p0j08J02O2J62r2K00Q2l98
$$ 363 41 136 178 -47 267 -6 118 45 148 -68 -84 -214 -48 -118 -226 -124 -62 100 8 208 290 -108
10137a08J19J80o5kk47n8k3J59j60M4J26M1l52L82K24k40o6K08M0m08K51P9J08
$$ -108 11 191 126 124 -123 -181 -204 -45 -205 -161 -35 6 -346 36 260 20 -46 162 202 -206 45 124 232
10160B32k49M5k27l7J79l2q1K40k01j00K38l6L1q0L05k20J78l35m0j1L26Lk4j21
$$ 232 -17 28 -199 -236 -57 -89 -170 70 -131 -231 7 -29 2 -78 227 7 185 -150 -190 -201 125 128 104 -17
10184a7J38n8j0l61K78l1j14L98j17k83M80l20j91m3J89j7l0J24K8LP5K52Q3n06
$$ -17 121 63 53 -308 -30 -61 -175 223 106 -177 303 -17 -208 -251 -62 -79 -109 15 43 46 121 373 456 -50
10208e0K34m7k31J02K34m18J02K35m02K22j06J00R5j49m6J9M57l05j13K60p1n7
$$ -50 184 137 -94 8 242 -176 -74 161 -241 -19 -125 -25 70 -79 -125 -106 351 46 -67 193 122 65
10230F5k99J73o5J03J4o4j2j67J71J54l26N09k76L1P2p9N1k23K41k68k0L04J68
$$ 65 -234 -61 -126 -23 -9 -73 -85 -252 -81 73 -253 256 -20 11 83 4 55 -168 73 -195 -215 89 257
10253B57n48J99K36l72K45K94l21j63L18j75O3r8J32o4J07j01J92Rk28N9k77K51
$$ 257 -291 -92 144 -228 17 311 -10 -173 145 -30 33 -65 67 3 110 9 201 210 -18 41 -236 15
10275A5J00N5m56J21L40l4m8J38k59k21L75k43P2J43k39qJ31l5J97k73J32K01
$$ 15 115 170 -286 -165 175 141 93 231 -28 -249 126 -117 -45 98 -141 -149 -18 -53 144 -129 3 204
10297B04k68J33J82m32lK07N4l09J66L8j08L34k20j09j23K06K64j47J66o8k13
$$ 204 -64 69 251 -181 -184 23 77 -232 -66 -28 -136 198 -22 -131 -254 -48 216 69 235 167 -46
10318d6J35K21l93J23j68J6J8K02l0l5j39mm3J21k2J6J5m9K80j38k16K49r4Q2
$$ -46 89 310 -83 40 -128 -112 -94 108 78 43 -96 -100 -143 -22 -44 -28 -13 -62 218 80 -136 113 19 101
10342A01r7j4j77N8n5p5L11j93N5P3J12j83J03k29J65k8K36j21J15k91K68k29
$$ 101 4 -10 -187 -129 -184 -259 52 -141 -86 -13 99 -84 19 -210 -45 -73 163 42 157 -134 134 -95
10364i5R0j99J08k15M40q8j41O6J38J07j74m2Q0j8k39J58P6M0L3j91k92K24M03
$$ -95 -5 -204 -96 -311 129 41 -100 -34 104 211 37 -5 75 57 -182 -24 52 92 125 -66 -358 -134 269
10387B69m11K08Q3j36k4r7K96k83K65J45n26oL95r6q6K5j20J45J65nj20J96n5
$$ 269 -142 66 149 13 -11 -108 188 -95 170 315 -211 -217 178 82 -4 21 -99 46 211 206 86 282 227
10410B27l16j01J43RJ01r4j9M0j01K33K5l54K84J36m53k3L65Nk52K70Q7l35L20
$$ 227 -89 -190 -47 -38 63 -31 -50 -10 -111 122 147 -207 77 213 -240 -263 102 107 -145 125 212 -123 197
10433A97k14k2j19N89m19k0J26K19l53J29j02J35j01J65j65m13L04o2J67j46J15
$$ 197 -17 -39 -158 431 12 -8 118 337 -16 113 11 146 45 210 45 -368 -64 -126 41 -105 10
10454A0r8J24k6J94l77J14J92lr2J61k77K98j03k22nK17k25l9L62j83j70J60M
$$ 10 -88 36 10 204 -173 -59 133 130 38 199 -78 220 117 -105 -110 107 -118 -157 205 22 -148 12 16
10477A6q6J43k51M49k11J19j63k6j98L63j32N4j06K8k43R4J80M8J5k5j3k7J70
$$ 16 -70 73 -178 271 60 179 16 -10 -208 155 23 77 -29 -1 -244 -150 30 78 93 68 55 28 198
10500A98M9m06Q7L71k59k76J37J38m0p2J14j35O9m1LJ10oK73n03J12L37m35O4
$$ 198 247 -159 -72 299 40 -236 -99 39 -1 -73 41 -94 -25 -66 -63 47 41 314 -189 -77 260 -175 -111
10523a11j01L17k52K30k37j21K32j48L16k54K56P9k95p4L39j00J50k25Jj13J76
$$ -111 -212 105 -147 83 -154 -275 -43 -191 125 -129 127 206 -89 -163 176 76 226 1 2 -111 65
10544F5Rl02J70J48j68J96o7k25P2o1J81j4j3J88l63p7M10k48J05q0o4J87l8K27
$$ 65 74 -228 -58 90 -78 118 51 -174 -102 -163 18 4 -9 179 -184 -261 149 -99 6 -74 -138 49 11 238
10568B38k39M5P9K4j50rP1j99l0N28j75j28J70q8k58r2L14j57o5K92k01j22L67
$$ 238 -1 44 123 147 -3 -12 59 -140 -170 358 183 55 225 137 -121 -213 101 -56 -121 171 -30 -152 215
10591B15r8o0P1J10j89j11RP6Mk56K97j27J52Ml37J04J88j14J73l8N4l2j56K4
$$ 215 117 57 128 238 49 -62 -53 23 27 -229 68 -59 93 97 -240 -136 52 -62 111 73 127 95 -61 -37
10615c7L1r4K5P3j90N0J28k25J34M9j02N2K2K68o6k13K74l46K92M1j94k17L25
$$ -37 -6 -100 -75 -2 -192 -142 -14 -239 -105 -56 -158 -106 -84 184 118 -95 179 -167 125 166 -28 -245 80
10638H0o2j86j42M66j69j03K63pn4M8L9n8j29K80m69rK74m5j44j0K8L2O4r2J19
$$ 80 18 -168 -310 156 -13 -116 147 140 86 134 173 115 -14 266 -203 -212 62 17 -127 -137 -109 -77 -13 -105 14
10663A4J18m7J56m83K20K47l52k8K44o5k56N0J86k12L18O6l69J29K35k23mK5R9
$$ 14 132 85 241 -242 -22 225 -127 -155 89 24 -232 -182 4 -208 110 176 -193 -64 171 -52 -56 -31 68
10686F8j92k2J05J31k71R0K86l93OJ45r5J04P9Q7pq2j23P3j75L53j26j76J42j28
$$ 68 -124 -146 -41 90 -181 -91 195 -198 -192 -47 -142 -38 41 128 121 39 -84 -11 -186 167 41 -135 7 -121
10710a21k12N89l14n6L49q0q3P1r9O0l9R5r5j71K86L9k60o9J03M9n1K5J49k84
$$ -121 -333 256 -58 -114 235 155 72 143 44 104 65 160 65 -106 180 219 -41 -110 -7 42 -9 16 165 -119
10734a19K31K32l10j01K59J13j40p4m6r3j23K98j32M6K3R5l33nJ18n2N3J96j21
$$ -119 112 344 34 -67 192 305 165 91 45 -48 -171 127 -5 41 64 159 -174 -179 -61 -113 -60 136 15
10757A5k07L21n8l25L34r0k1k77L76o7k37K75K6k55pL08l3j84K92n1m73K86Kk16
$$ 15 -192 129 71 -254 80 -10 -31 -308 68 1 -236 39 65 -190 -197 111 78 -106 186 135 -338 -52 -50 -266
10781b66N8J78k13O3M01J25j52r5N7l28K2L87k34J87J6j6j65j98L40m62L0M00
$$ -266 -208 -30 -243 -180 221 346 194 99 156 -172 -150 237 3 190 206 190 25 -173 167 -295 -265 135
10803A35r9q5K26m2j63k25N08k50J48j66N0j12J54j16l00L87q4K3o9M4r7J11K43
$$ 135 36 -49 177 135 -28 -253 255 5 153 -13 37 -75 79 -37 -337 50 -34 -11 -80 -36 -133 -22 221
10826B21j04o4K5J16M7j85rj06r7J52J16k58J22K40k52P6R5j17q7R1K43j30o3
$$ 221 117 53 78 194 241 56 47 -59 -156 -4 112 -146 -24 216 -36 40 135 18 -69 22 265 135 72
10849G2K31l94L09r3j04l39L47o5j05P3r4J24J44N4j01L3L3j55m8p0K08j17p4
$$ 72 303 -91 218 125 21 -318 29 -36 -141 -68 -162 -38 106 160 59 92 125 -30 -78 -148 60 -57 -131
10872a31K5J38J41m20K60j37M5LJ85j71k7L91L8k59J1L8j14mj15n3K33p0o5j30
$$ -131 -106 32 173 -247 13 -124 -79 -76 109 -62 -89 302 340 81 92 130 16 12 -103 -156 77 7 -58 -188
10896a88N07l08r0K02k48J55J85j76l7j8k6J19k85J05O0J00J0J20l91J85J60j81
$$ -188 319 11 -79 123 -125 30 215 39 2 -16 -42 77 -208 -103 -43 57 67 187 -204 -19 141 -40
10918d0N4J28P8k22J21J59l69k7J44M2k3k41M42m50J4K34p4K35k34n8q0K18K66
$$ -40 14 142 220 -2 119 278 -91 -118 26 68 45 -196 246 -204 -190 44 -30 205 -29 -87 -167 51 317
10941C17l06j28K60j90j26K30o6j57L25k9l07J97j06k2J9J87K31k52O3L02n83
$$ 317 11 -117 143 -47 -173 57 -9 -166 159 130 -177 20 -86 -108 -89 98 329 77 140 442 -141
10962a41o4L59O7k31K7N2q0k87L03r9LK0o9K29m3K08k59O0J62L6m77K44o2o8K10
$$ -141 -205 154 221 -10 17 69 -11 -298 5 -94 -91 -71 -140 89 46 254 -5 55 217 253 -224 20 -42 -110 100
10987A00J64l06r9R7K2J93O5p9k75K20j30J09l6P5nk37p1K65k12O9J2J70r4K97
$$ 100 264 -42 -141 -44 -22 171 236 157 -118 102 -28 81 45 120 115 -122 -193 72 -140 -71 -59 111 17 314
11011C14k41O6J50q6l74K32J5o5j4n5j76L3J14J06q4R2K55j55j65R1K29m00K40
$$ 314 73 139 289 203 -171 61 76 11 -3 -58 -234 -201 -87 19 -65 27 282 127 -38 53 282 -118 122
11034A22j76N4j63M44l18k90K84j18K0k6K04J45k0j08J47k89K71m9k67K9K95l20
$$ 122 -54 0 -163 281 -37 -327 -43 -161 -141 -167 37 182 162 54 201 -88 183 134 -133 -104 191 -129
11056a29k1j4J65l67L76j15O3M4J33j73R3j56J42j27J80J67k95J6K9k12J90J98
$$ -129 -150 -164 1 -366 10 -105 -42 2 135 -38 55 -101 41 -86 94 261 -34 -18 11 -201 -11 187
11078A87l41n8N1M82n11R0J45K27k47K47l81J17J92j91jk69K07K10j97J4J74j03
$$ 187 -154 -212 -161 321 -190 -100 45 272 25 272 -109 8 200 9 8 -261 -54 156 -41 -27 147 44
11100D4j58J61JNJ8K26l81O6l4j17p1K49Nm0J07O5k04JK89k52L02M3k80k57K51
$$ 44 -114 47 48 53 71 297 -84 -18 -52 -169 -240 9 14 -26 81 146 -58 -57 232 -20 282 325 45 -212 39
11125C9J1j78J71M4k76M1K12N9j82r1J08k25L13J21o2n8l2R0r6J78k38j42K53
$$ 39 50 -128 43 87 -189 -148 64 123 -59 -150 -42 -267 46 167 105 47 15 105 9 187 -51 -193 60
11148F0k7P9k17J87l9k05kK9J13K08J3m0j96M88m51k01J4L17p6k90L84l07K3J83
$$ 60 33 112 -105 82 43 -162 -164 -135 -22 186 199 159 -37 451 0 -201 -187 130 54 -236 148 -159 -136 47
11172D7Mr9%K58k63K25Rk47N7K19P6k43P3n6j27p5M06l61j01L28j38NJ38jk27
$$ 47 51 -48 -48 210 -53 172 181 -66 -9 210 286 43 116 60 -67 -142 264 -97 -198 130 -8 -3 135 134 -93
11197i3L10o4j2j31Q4k0P9j51j00O2k29L56J52l69J02P3j05K72m7k78R3L8m1q0
$$ -93 217 153 141 10 94 74 153 2 -98 -36 -265 91 243 -126 -24 49 -56 216 169 -109 -16 22 -19 -99
11221i9J91K0l75K37N3k98L03J09Pj50J00J61Mn36M60N9l06m3K21n9l35N12j95
$$ -99 92 112 -263 -26 27 -271 32 141 148 -2 98 259 263 -273 187 246 -60 -103 118 59 -276 236 41
11244D1k65K47J00m92M15J1J51o4j97l2J12j71J41p6j6L6n1J82j69N6j22M29m3
$$ 41 -224 23 123 -369 46 57 208 144 -53 -85 27 -144 -3 -79 -95 -59 -110 72 -97 -41 -163 266 223
11267B23j96L4m4j35K32K04l75K2K0j76mL7J52r4J39n4M4m5jJ90j78P9j07j1k0
$$ 223 27 61 17 -118 114 318 -57 -35 -15 -191 -195 -158 -6 -100 39 -15 29 -16 -17 173 -5 74 -33 -44 -64
11292f4j45L75l05K01j7k8p1MJ60n92N97j57K73j55K26k36N6K48j23m47pJ81j40
$$ -64 -209 166 -139 62 45 17 -54 -50 110 -482 115 -42 231 76 302 66 122 370 247 -200 -207 -26 -166
11315a66K09N1k05j56N47k68J7J26M7k64N2K42j25m5N0rp4j46L68l66L13K4k87
$$ -166 43 94 -111 -267 280 12 29 155 202 -62 -10 232 107 62 112 103 29 -117 251 -115 198 222 -65
11338f5p1L54j33q2o6M03l84MM3k64K74L52l17l83K39R4M8J7K11k54J43nj4O2
$$ -65 -136 218 85 3 -63 340 -44 -40 3 -261 13 365 48 -335 -96 -2 46 63 274 20 163 158 144 206
11362B06j06K89l76J8R2l46J87j37J21n24N30J6j64J68L36j25p5J61l00j95J23
$$ 206 100 389 13 31 123 -223 -36 -173 -52 -576 -46 -30 -194 -26 310 185 110 271 -29 -224 -101
11383a01N50n93QJ03j86J67n5K71k76O0J77j51R3J39p7j70J26j36j39k1J54K18
$$ -101 449 -144 -136 -33 -219 -52 -107 164 -112 -52 125 -26 67 206 129 -41 85 -51 -190 -211 -57 161
11405A61m75L42k38j68L58J62k42j95N93j84j00o2L59o11L26o8j80J90J61k39
$$ 161 -314 28 -210 -378 -20 142 -100 -295 298 114 14 -48 311 -300 26 -42 -222 -32 129 -110
11425a10r1J04J82k22q9K98N2r0J45j47l3L7p2%Q7R9k15P5J74j81p4j00J25K1
$$ -110 -201 -97 85 -137 -226 72 124 34 179 32 -1 36 -36 -36 51 150 -65 10 184 3 -71 -171 -46 -25
11449b5j96M21k37j05J51n1jJ66J59m13P3R2N4j68K00j11j22k8J78m7n2K56k47
$$ -25 -221 200 -37 -142 9 -42 -43 123 282 -131 -58 34 88 -80 120 9 -113 -141 37 -10 -62 194 -53
11472e3JJ34J89m08J39Q1l08L28j54p6K16j61J42j99J61J88l10j04K39K88m45
$$ -53 -52 82 271 -137 2 83 -225 103 -51 -127 89 -72 70 -129 32 220 -90 -194 45 333 -112
11493a12q9K32q1M8J6j22N4L26l52j02J68L7j5j09J30p4K4m7K81l81L80q6k2k71
$$ -112 -201 31 -50 -2 14 -108 -54 272 -80 -182 -14 23 8 -101 29 -45 -21 -68 213 -168 212 126 104 -167
11517a67J92L5k36J28k36J87M6L57k73l2L14m27r5J92j19j6J92p8m2j06K5K33
$$ -167 25 60 -176 -48 -284 -97 -51 306 33 1 315 -112 -207 -15 -134 -150 42 -36 -78 -184 -159 74
11539G4J2KJ67l42K56J0k92K74m2j44p8J54L17n93K76K31n34rK73O3j94K27J35
$$ 74 86 88 255 -87 169 179 -113 161 119 -25 -103 51 368 -225 51 282 -252 -261 12 75 -119 108 243
11562B43j82J60k38J00j15j09K37k75L6L02q6j29N1k9k57J92JJ77Q1j77P8j26
$$ 243 61 221 -17 83 -32 -141 96 -179 -143 159 73 -56 -5 -34 -291 -99 -98 79 160 -17 61 -65
11584f5J41M3l05K84n3k10M0K23k82Q4k6K79k41o5K46k9J0J87l16k38L40n5j41
$$ -65 76 119 -186 98 45 -165 -125 98 -184 -100 -126 153 -88 -153 93 64 74 261 -55 -293 47 -8 -149
11607a49J21k26R5j2O6J11q3kK83j29J22J21m02k88L68k77MJ33K41l85J63J73
$$ -149 -28 -254 -159 -171 -105 6 -77 -79 204 75 197 318 -84 -372 -4 -281 -277 -144 97 -288 -125 48
11629D8l44Q7K15R4j17K13L8q4j59l0r7L62k26J96l02J05J97k30Q5j58K40j51
$$ 48 -296 -209 6 100 -17 196 234 150 -9 -39 -136 226 0 196 -106 -1 196 -34 51 -107 133 -18
11651a8Q6K19k02m6K75k00j09K06l39K63k55J45j19m3M9K65l77K89j66n4J79J59
$$ -18 68 287 85 39 314 114 5 211 -128 135 -120 25 -94 -137 -88 177 -200 89 -77 -131 48 207
11673B07j46J2j16p7k6K60q3k04K83L7l80M4K23l2K9j80M00k26J14J6l18J60J21
$$ 207 61 73 -43 -120 -146 114 31 -173 110 147 -233 -189 34 2 31 -149 251 25 139 155 -163 -3 118
11696A18j57kR2p1K0j48J32p3k1J54j99M6K77q4k43K25r6Qj96P0J26L1k09J30
$$ 118 -39 -41 51 -20 0 -148 -16 -89 -110 44 -155 -109 168 84 -159 66 -30 -22 -218 -148 -22 9 -200 -70
11720g0J13j21K95n0j31j70K16k26K24l9L3l83N23l41Q3M6J41m50R2K97r2p8L90
$$ -70 43 -78 217 167 36 -134 82 -144 80 41 74 -309 214 -127 -44 2 143 -307 -215 82 -10 -88 302
11743C02k05j2J32j16j07J8K44k68Klp0J08L44l37K18l10J14j9j2M8j95J85P9
$$ 302 97 85 217 101 -6 12 256 -12 -10 -13 -83 25 369 32 250 -60 54 35 23 71 -124 61 140
11766A40J32k37o6%n3j69l9K40J20l4m3j29NK32k5N7l9j1k10J4N5P9P4p0j47M0
$$ 140 272 35 -31 -31 -84 -253 -292 -52 68 34 -9 -138 -133 99 74 131 92 81 -129 -115 -60 19 93 23 -124 -84
11792h4J00O0k72k8L60k04k0J45lj07J90K5k27L7K05l63J49J25j95l8K13M1j85
$$ -84 16 76 -196 -224 136 -68 -88 57 54 -53 137 162 -65 -28 177 -186 -37 88 -107 -145 68 109 -76
11815g6k4J94k1j98J62O8Pj34K51l98J32ML7j43K3O9R2j53J88k34M35q8k7J4p
$$ -76 -100 94 73 -125 37 105 112 -22 229 -169 -37 -33 4 -139 -116 -47 45 -108 80 -154 281 193 166 180 173
11840A73k88j16L08m0J76J9k00n0L9m5o7J71J09m0j25j3M08m74n0J91O6k13K34
$$ 173 -115 -231 77 37 213 232 32 -18 21 -24 -91 80 189 149 24 11 419 -55 -105 86 152 -61 173
11863A73j74k59L09Jm8J9J03j25K5l2L61k48j61K29J70n58K93j2l38J14P5P9l2
$$ 173 -1 -260 49 50 2 21 124 -1 24 -8 353 105 -56 173 343 -215 78 66 -272 -158 -83 -4 -36
11886c6J41p1j58J48J97j55j83L65j91k72L20j83O3P0k05K61j70P9j34k83N21
$$ -36 105 34 -124 24 221 66 -117 248 57 -215 105 -78 -15 55 -150 111 -59 20 -114 -397 124
11907A24k2j18Q8L78n99K08J33q3k77J67J10j32O4nj02m6K60Ml01J83M91m69j42
$$ 124 102 -16 72 450 -149 59 192 109 -168 -1 109 -23 41 36 -66 -112 148 152 -149 34 525 56 -86
11930h6L32l32J31J26l19j23L37J53l12R4P3pj74K24r7J5r4K54j43n1K15k8l74
$$ -86 246 -86 45 171 -148 -271 66 219 -93 1 74 67 -107 117 20 35 -59 195 52 1 216 188 -186
11953a86K87j75o6q4K06N8k16K85l21K17n3j54J79N3J35j60q2K24Q4l00o0P1k74
$$ -186 101 -74 -140 -224 -18 40 -176 109 -212 5 -48 -202 -23 30 165 5 -77 147 231 -69 -129 -58 -332
11976c32L17l4K84j11pl1k58L60Q7r9j72J58l65J55L2P7j36J05J76j91J0K27k74
$$ -332 -15 -49 235 124 117 86 -172 188 275 176 4 162 -203 -48 -16 61 -75 30 206 15 25 252 -22
11999b2m8L0M48l19O3k89m4K3K44k14j67L21q6JP3J65j80j08J90o6L1O2N9k52
$$ -22 -70 -40 408 89 152 -137 -181 -158 86 -128 -295 26 -60 -59 14 179 -1 -109 81 15 46 108 167 -85
12023h5K67jj71L5J57j47j56J88k53J05J88L68n54J20K40j95l43R7M42m93J71
$$ -85 182 181 10 45 202 55 -101 87 -166 -61 127 495 -59 61 301 106 -237 -140 302 -191 -20
12044b0K32k95k62L94j29M7N7R0j74R2J49r2P6J11k45j36J01m7k84L35L3L8J0
$$ -20 212 -83 -345 49 -80 -33 24 114 -60 32 181 89 165 276 31 -105 -4 -51 -335 0 33 71 81
12067H1j10p9j70J44L85k41j71K81pj79J43J36k13k4J78m07J32j9K59k96J36K91
$$ 81 -29 -108 -278 -134 251 10 -161 120 113 -66 77 213 0 -24 154 -253 -121 -140 119 -177 -41 250
12089B50l65J15K04k07k30M11j0m71K33J03KO7r4n5l4o2P5j67L02J15j33N8qK48
$$ 250 -115 0 204 -3 -233 178 168 -303 -70 33 35 102 8 -47 -81 -143 -68 -235 67 182 49 107 99 347
12113C47l19M4q8O0m08K50j8N6k1l5o8J75R2J09l01J74J15m66M15j2l7K8n1n8
$$ 347 28 72 -16 44 -364 -114 -132 -76 -97 -132 -200 -25 67 176 -125 49 164 -302 113 101 64 92 41 -17
12137a7k42K04R3k95J48M31k42j26K87l42j4J35Q7j22l2K43j43j94R4n6N9O1o2
$$ -17 -259 -55 38 -257 -109 322 80 -46 241 -101 -115 20 107 -15 -47 196 53 -141 -47 -103 -44 17 -45
12160d5K3N0l19J6L99Q4k93K25J41k10k67O7K95j90q4Q7O6r5o6M2J91k70J51k43
$$ -45 -22 28 -291 -275 124 208 -85 140 281 71 -196 -129 166 -24 -108 -21 45 -50 -116 -74 117 -153 -2 -245
12184b45PO57m86L8k0K23k95K76Q3k99k7K15l3j00Q9j41m0J1J09J76l27K67J10
$$ -245 -238 419 -67 -29 -49 174 -121 155 238 -61 -88 127 94 -6 83 -58 -98 -87 22 198 -129 138 248
12207B48l24J98J38q66O02n9p3Q2N6M2q4J52Ko1Q5J5j46r1J99nm28J98K96k31
$$ 248 -76 122 260 -606 -4 -63 -136 -54 2 44 -40 112 114 53 138 153 7 -84 115 110 -318 -120 176 -55
12231e5j27K02j48j81L2N72r6o9n6J13k9m8k02m9K70j73J40o3N2n0L7j46m4J26
$$ -55 -182 20 -128 -309 -277 295 199 130 74 187 158 110 -92 -141 129 -44 96 33 85 35 72 -74 -118 8
12255Hm3l1J49K9J34m47Q0J31M6l03K80N5j05j0J86l73K1M81m33K45j15K21q5
$$ 8 -35 -66 83 112 246 -201 -121 10 56 -247 33 88 -17 -27 159 -214 -193 288 -145 100 -15 206 121
12278A21j67J88k90j02J50J99q1J86o4l80J75N8R6k19L02j90m1K67n9j41qR6k7
$$ 121 -46 142 -148 -250 -100 99 18 204 140 -240 -65 -7 89 -130 172 -18 -59 208 149 8 0 96 69
12301F9k03J31m6k95K93K18k26k17N24j03l95M62P7k06q0J64k58n8L11k17j0r8
$$ 69 -134 -3 -49 -344 -51 167 -59 -276 248 145 -250 212 289 83 3 167 -91 -149 162 -55 -65 -163
12323a63j7K45l02M3J60N4n7M72l25J59j32j75RJ69r5l33L21K07l94J65J86m32
$$ -163 -180 65 -237 -194 -34 20 -37 435 110 269 137 -38 -29 140 45 -288 33 240 -154 11 197 -235
12345b35L35K1n7l31J07P5J71j30r0J08k69M33j28j07O4J99l18J37P0J37l24J75
$$ -235 100 121 64 -267 -160 -85 86 -44 -134 -26 -295 138 10 -97 -33 166 -152 -15 55 192 -132 43
12367D3J54k77J40J33J14l97K2K35l70K69j52K06j1m4j28J12j5R1l2j44J22j32
$$ 43 197 -80 60 193 307 -90 -68 167 -203 66 -86 120 109 65 -63 49 34 125 93 -51 71 -61
12389f1J31Ml2J10k32n5P9j21K26j69J72Kk47J25k9L00j97p0J31k59K49o8l1k24
$$ -61 70 74 42 152 -80 -135 -56 -177 49 -120 52 54 -193 -68 -97 203 6 -64 67 -192 57 -11 -42 -266
12413b66K00k0JJ34R4j83J3J11J29k18K89k91m1L82k01l04K78J20j74k22K60k8
$$ -266 -66 -86 -85 49 143 -40 -27 84 213 -5 284 -7 -48 334 133 -171 107 227 53 -169 91 63
12435F3j19j93Q3k0K68j0KJ88l22K36l35K10j36J68j51l4J07l09J17K7l8L36o1
$$ 63 -56 -249 -166 -186 82 72 74 262 -60 176 -159 51 -85 83 -68 -102 5 -304 -187 -160 -198 138 77
12458G7O8l17K37n6q8P3J87k60R5J60j93l94M81k05K00J1J24k17k4J07j38LK16
$$ 77 145 -172 65 9 -79 -6 181 -79 16 176 -17 -411 70 -135 65 76 200 -17 -41 66 -72 -69 147
12481A47j54j25J16K60n10j48N08j92j30R6J52k3k4J31r4R8L6l7k32N7K56n93
$$ 147 -7 -132 -16 244 -266 -414 94 -98 -228 -132 20 -3 -27 104 10 108 144 107 -125 -68 188 -405
12503d05L25Ol1j71K71k3J8M8%O5k6K86k51qq7L08k25k50J90j12l1J40l1l6L34
$$ -405 -80 -74 -105 -276 -5 -28 -10 38 38 103 77 363 112 104 17 325 100 -150 40 -72 -103 37 6 -30 304
12528C04k3l29J15j26J94R4k58R3k5K32j76l60OJ00rJ06K19l58j19N59k24k29
$$ 304 281 -48 67 -59 135 229 -29 64 39 271 95 -265 -259 -159 -168 -62 157 -201 -320 239 15 -214
12550b14J50K21P3k75K93m58N9m1K28k1m9J79K5k11j67M01m29K89K92m29K03q3
$$ -214 -64 157 230 -45 248 -210 -151 -192 36 15 -34 145 170 -41 -208 193 -236 53 345 -84 119 36
12572C6o8O3J67k20j42J65J24q0Q2k03j4j52K28MJ9K7K6j20K24j56J58j89k8N9
$$ 36 -32 31 198 -22 -164 1 125 45 127 -76 -90 -242 -14 -10 9 36 62 -58 166 10 168 -21 -49 10
12596A0m24L72J16k85k9M81j83l07J70J0O7J64J13j52k55J82M1l30J15J0j7k6
$$ 10 -414 -42 74 -211 -240 241 58 -249 -79 -69 -2 162 275 123 -132 50 91 -239 -124 -114 -131 -157
12618a57K0K05l70M96m7p2R9j00J49k53J94l4l86K95j0m17L85K21l26O4K01k64
$$ -157 -137 68 -302 194 147 75 174 74 223 -30 164 130 -256 39 29 -388 -3 218 -108 -44 157 -107
12640a07Q0k18M93j71j32J60L7l42qJ90q7M9O5k85K72J20n0k38J69J62kj59R6
$$ -107 -27 -245 248 77 -55 105 142 -200 -208 -18 -105 -56 9 -276 -4 116 66 -172 -3 159 157 -2 94
12663I4j07l7jJ87l32J44R7p2j04L28k54k84M69K5l08L70j2l17J91P2k08J33J63
$$ 94 -13 -50 -51 136 -196 -52 45 -27 -131 197 -57 -341 128 153 -155 215 203 -114 77 149 -59 74 237
12686B37l70J10j66M24l14R5J59p3L3k8k5k65M77l05PJ72M6j53n7J89L49m25k44
$$ 237 -133 -23 -189 235 -79 16 175 102 135 107 82 -183 294 -11 -4 168 214 61 4 193 542 117 -127
12709a27J65K29O3o8j1k82M3j81N93l92J40n13K49L65k66j39J50l2k03K91j14
$$ -127 38 267 330 262 251 -31 12 -169 424 32 172 -341 -92 273 7 -132 18 -14 -217 74 -40
12730d0K14k08K11o8l50L88N7k85M0J28j70L0QK41k38Q5q8k5m2M2J70l1o2L68
$$ -40 174 -34 177 109 -241 147 204 -81 -41 87 -83 -53 -45 196 -42 43 -45 -70 -112 -70 100 69 7 375
12754C75k58j37J02j62J19J23k88K3Lr2J92k26J98O5L5K86k11l05Q6K63q6J21
$$ 375 117 -20 82 -80 39 162 -126 -103 -100 -192 0 -226 -28 37 72 358 147 -158 -72 191 105 226
12776B26j62k09r1K73k44R3K17k8j37n9K56r2j24L72j66Rk28M3j09J50J00k42
$$ 226 64 -145 -236 37 -207 -114 103 75 -62 -121 135 43 -81 291 125 134 -94 -51 -160 -10 90 -152
12798a52j95N24m2k98K14K66l18p7J02R3k82K74l9Ll4j16j26j6L85j84K35k15
$$ -152 -347 177 135 -163 51 317 -1 -78 24 117 -165 109 70 73 39 -77 -203 -219 166 -18 217 2
12820BP4r0j55P3J06j62M67l83j62K4N53n04K42P4l28j05j9L59k50K81L26m92
$$ 2 76 -14 -169 -96 10 -152 315 -68 -230 -206 347 -157 85 159 -169 -274 -293 66 -184 97 423 -69
12842f9nN23k65j20L3r0j77K22P2m16M21j17j87O1P0Q5k51M43j89o3K2K02k19
$$ -69 -74 449 184 64 97 7 -170 52 124 -292 129 12 -175 -114 -44 41 -210 233 44 -19 3 205 -14
12865a4k4L59m05o7L45k53K8l50K86J93j68K46k44J0L2L16q7l50K48K00l28J4
$$ -14 -38 321 -84 -151 194 -59 -31 -381 -95 98 -70 176 -68 -58 -26 290 203 -147 101 301 -27 -13
12887a3k2k20L27J13l34J32L5K69J4j57K9J6l85K34Pl3Kj3K80l87Q8M5j73K05
$$ -13 -35 -255 72 185 -149 -17 18 287 301 144 173 189 -196 38 45 12 14 1 281 -106 -18 27 -146 59
12911E9j76R3M7J3j95r5L57P2m1l2j99m2K50m7j80r1J19J13r7PJ51k23L6K26j66
$$ 59 -117 -24 23 36 -159 -254 103 175 134 102 -97 -139 111 64 -116 -207 -88 25 -72 -65 86 -137 -101 125 -41
12936d1k5J28p3l9L64k28j86J40Nk27J68m6L7L6q6K92l65L27j64M3j34oo2J84
$$ -41 -66 62 -11 -50 314 86 -100 40 45 -182 -14 -60 -23 13 -73 219 -146 181 17 60 -74 -80 -142 42
12960D2M6P7k97J41J87l06K79Q8l13r4K30K9k9q5J1j10J08R1j87o1L2J85k70j15
$$ 42 88 165 -132 9 196 -110 169 257 -56 -150 80 109 80 -5 6 -104 4 95 -92 -153 -121 64 -206 -321
12984c21K55J04r2j43l3L66k56L67l93K86j0m1j89K02p8j26P6K34l57n7N45m41
$$ -321 -66 38 -54 -197 -230 136 -120 247 -146 140 130 89 -100 102 24 -102 -26 208 -149 -206 339 -102
13006a02J2k5L49m05K57K47n50L3M94k59j52P0qj58J53K4j63L7J82j61P5O5J04
$$ -102 -90 -115 234 -171 86 333 -217 -184 310 51 -101 -31 -39 -197 -44 -20 -183 -146 36 -125 -50 15 119
13029A19j24M8K22j88q4j9P9k13K25m5k21J89N5P0j96N7j4j27L67j76J8j37L53
$$ 119 -5 43 265 77 -7 -26 53 -160 65 20 -201 -12 43 113 -83 -26 -40 -167 200 24 42 -95 258
13052B58k67P4l71J71J3P9LJ50k37M47l50q1K71j05J38l40R2J97l82L84j50j43
$$ 258 -9 65 -306 -135 -122 -43 -40 110 -127 320 -30 -111 160 55 193 -147 -55 142 -240 144 -6 -149
13074a49k73K91j34J50J72j61K4N0M39l77P6j55J17j55K88j54j81k6O49n84J85
$$ -149 -422 -131 -265 -115 57 -104 -80 -30 409 32 108 -47 70 -85 203 49 -132 -158 491 -93 92
13095I2K5N1rq8j18k08L52J82l44J88j52q4o2L36n9m94L49K49n45K34J77j62J28
$$ 92 117 168 159 71 -47 -255 97 279 -65 123 -29 -113 -175 161 102 -392 -43 206 -339 -105 72 -90 38
13118C8k03J41JL74l98p8Q6j52J65j35K02J8k36K51j22J33r6o3M11k78J21P0L4
$$ 38 -165 -24 -23 351 -47 -125 -39 -191 -26 -161 41 59 -177 74 -48 85 -11 -74 337 59 180 250 284
13141B84p7r4j99jK04j21J82o2m68J88J45J83l10J46K39j84R1j09N0k4O4j23O1
$$ 284 207 113 -86 -87 117 -4 178 116 -352 -164 -19 164 -146 0 239 55 146 37 87 63 127 4 65
13164F5j58L64l68j89K04R1P4q0K00p2k24p2L43l58J50J41l74M30l24J45k22M61
$$ 65 -93 271 -97 -286 -82 9 83 3 203 131 -93 -165 178 -180 -30 111 -263 167 -157 -12 -234 227
13186B27m1k71K45J13q0k28J65p7J02j14Q4j18M4K04l77j20M82q5j69j6K41k26
$$ 227 186 -85 160 273 193 -35 130 53 155 41 125 7 51 255 -122 -242 240 155 -14 -30 211 -15
13208a5m1N1j22qJ5K61o1R1j23Oj25q8kR1N7j03m3K26q3k4L0RJ91j68r3p2K0J39
$$ -15 -56 -5 -127 -135 -120 141 80 171 48 54 -71 -159 -161 -70 -13 -116 -159 67 -16 -40 -10 -1 190 22 -71 -143 -123 16
13236A6K13l28m3R4J39l15L15r6P9j82J31r4K8J48j04J98j2j75jp7N2r3j68L70
$$ 16 229 -99 -142 -48 91 -224 91 -5 74 -108 23 -71 -43 105 1 199 187 12 11 -66 -14 -107 -275 95
13260I5O8k70R4K06n21K35J19j17o3J41N6K7k86J52l6PQ9n4k04J05mK38j4n4K23
$$ 95 163 -107 -13 193 -328 -93 26 -91 -154 -13 43 70 -216 -64 -100 -93 -4 -58 -262 -157 -161 77 63 9 232
13285B32k59R4Q1q9O6o2j23j18K08l40J59L12n00K02J20j01J84K7P9j46J94j75
$$ 232 -27 67 148 59 125 63 -60 -178 30 -310 -151 161 -339 -137 -17 -118 66 93 172 26 220 45
13307D5j06q4J36j70R2NK5j45L3K20n8n4j5K35k62N0K27J04m12N6Q7j72J57q6
$$ 45 -61 -145 -9 -179 -87 -82 -57 -202 -169 51 -7 -61 -76 159 -103 -53 174 278 -134 -78 9 -163 -6 -92
13331i2o7q2J92lj7j49L67j32l3J18q3J67M3k93R2j47RM6J06Oq1J13p3m2K29j54
$$ -92 -159 -241 -49 -52 -69 -218 149 17 -16 102 19 186 229 -64 28 -119 -110 -64 42 48 -33 80 7 -35 194 40
13357D0J66k12j3q8J47k18L33k81M2K36l10l5K60L3j08j05K92mP3j29K0L0l75
$$ 40 206 -6 -19 -107 40 -178 155 -126 -84 152 -158 -193 67 100 -8 -113 179 175 248 119 139 169 -206
13380b06J66k1k07J50L25l33J21K25l22L30p5k24J03j13J55N2j27K2o3r9P6J44
$$ -206 -40 -61 -268 -118 207 -126 -5 220 -102 228 153 -71 32 -81 74 126 -1 21 -42 -141 -65 79
13402G9k65J18J36j82m8K28M0j62N6P3J56j78j07K8OR0M2l75K83o3l26M01p1O1
$$ 79 -186 -68 68 -114 -162 66 106 -56 0 73 229 51 -56 -28 -22 68 110 -265 18 -45 -371 30 -41 20
13426B0k94J96J95j85J48J8k97L32J16k95J41k15j04K86J4K1k83J43M5p5k70N84
$$ 20 -274 -78 117 -68 80 98 -199 133 249 -46 95 -120 -224 62 76 97 -186 -43 2 -73 -343 241
13448B41k42j84M48n54L5M74L1l56q5J73j07j31R5K87l04O4K96l13N8L28n4l87
$$ 241 -1 -185 263 -291 -256 218 249 -107 -192 -19 -126 -257 -162 125 -179 -115 181 -132 -74 254 200 -187
13470a87J03Q0LJ32O4l95R0J46m5j66K19j24j19oL09j06J67O6n4l37J11L90k10
$$ -187 -84 -4 -1 131 195 -200 -110 36 -9 -175 44 -80 -199 -205 104 -2 165 231 177 -160 -49 341 131
13493A31j73j65M95l80K9R1J70O0k88J73l02K79l9Q0l08R6J90p3R7j83j00K6O8
$$ 131 -42 -207 288 -92 -63 28 198 258 -30 143 -159 120 81 161 -147 -51 139 66 163 -20 -120 -94 -26
13516b6j73J17K73m18Q6L05k85J55J30k79r2J23K58l14L94k60r0K0O4n3j34J36
$$ -26 -199 -82 191 -227 -141 164 -121 34 164 -115 -207 -84 174 -140 254 -6 -96 -76 -12 -65 -199 -63
13538f3L40p24K13N50l19On6K83n46L06K19j20k02L58m32LJ63J81k05J9P3j07
$$ -63 277 -447 -234 316 -3 3 -53 230 -316 -10 209 89 -113 245 -187 -184 -21 160 -45 -26 47 -60
13560f0p9K10J47n39M09j35mK22mj81j24M15l18K31k43K63m17K53J19k84M7L39
$$ -60 -139 71 218 -321 88 -47 -51 171 167 -14 -138 277 -41 190 -53 210 -207 46 165 -119 -72 267
13582B67j07k19OJ11m8j63O2L8j30J44M3P2m0K01q7l90K39r2J0P1J38o9k90K48
$$ 267 160 -59 -53 58 10 -153 -91 -53 -183 -39 4 76 36 237 150 -240 -1 -93 -83 -12 126 57 -233 15
13606A5j43jJ92K48k41J08j17O1j53K11p5k27L2K34k86j6M33n15J94J63j83r2
$$ 15 -128 -129 63 311 70 178 61 122 -31 180 105 -122 -90 144 -142 -158 275 -240 -46 117 -66 -158
13628a58J63j9k33K46J88l30M62k66l45K19J44O9o9j06J37J22k07O5k54L6L3K36
$$ -158 5 -14 -247 -1 187 -143 319 53 -292 -73 71 140 71 -35 102 224 17 82 -172 -136 -103 133
13650A33k10R9p9L0L9O5n6k2J05m2k62J20J96J03k84J16Q1q5K83O2n30L35R3l81
$$ 133 -77 22 -57 -27 12 77 21 -1 104 62 -200 -80 116 219 -65 51 132 47 330 392 -138 197 290 -91
13674i1j87L32k85K11j11L63n19K42J10k12K68k39L29j15j66O7j35J51K27k68
$$ -91 -278 54 -231 -20 -131 232 -287 -45 65 -147 121 -118 211 96 -70 -3 -138 13 240 -28
13694b8n4K90k25q0J47j70N7%L96l50j94J99j44J5J79L09l71O0L5l6k37L6J77
$$ -28 -82 208 -17 -97 50 -120 -63 -63 333 -17 -211 -12 -156 -141 38 347 -24 36 71 35 -202 -166 11
13717A1J9l28L66k03J64J40P4k91J33J18j96KN2J6j58p4L60l72J49p5lQ5J16q9
$$ 11 30 -298 68 -135 29 169 243 -48 85 203 7 9 61 77 -81 -155 205 -167 -18 -93 -96 -11 105 16
13741A6L6j03K63j80j2j86J23q1L64j48k09J38m4L5j53M79n67J08J07J9K48j69
$$ 16 52 -51 212 32 20 -166 -43 -124 240 92 -117 21 -23 12 -141 338 -229 -121 -14 5 253 84
13763H4p2%K06j92l08K36K80j66k99J85L3p6j75K78j%K46k68j31K77K2k35K10
$$ 84 12 12 218 26 -282 -46 234 68 -231 -46 -13 -89 -264 14 13 13 259 -9 -140 137 159 -76 134
13786A34j71K4j3k6J33k14K28j0P0r8j1K5l33nM53k26J81lm12J48J60p9r1R3J79
$$ 134 -37 -13 -26 -52 81 -133 95 85 155 57 46 71 -262 -267 186 -40 141 138 -274 -126 34 -45 -136 -43 136
13811A36j74j0J48q2p2L20j61k17J03J59j91q4K60k53j48jM15k90L17k02q0L31
$$ 136 -38 -48 100 18 -54 266 105 -112 -9 150 -41 -125 135 -118 -266 -267 148 -142 175 -27 -107 224
13833B24j55L4j08K24l59m5J62K71l39j7K4r6J45L3K88l98J16K49j77k11J96m8
$$ 224 69 103 -5 219 -140 -185 -23 248 -91 -108 -84 -180 -35 -2 286 -112 4 253 76 -135 61 13
13855A3j78J15r1k0J59O8J29l73L51ql61K26n8p1J25J38l49L12r3O3l53J48J32
$$ 13 -165 -50 -141 -161 -2 66 195 -178 173 165 -196 30 -28 -99 26 164 -185 127 34 97 -256 -108 24
13878B4p3m6L30m31n6M36Rk89O6L74l26j03J93j04m5J11Q4k06L8R9l27J95J50
$$ 24 -49 -95 235 -196 -252 184 193 -96 -30 344 18 -85 108 4 -41 70 154 -52 -14 85 -242 -47 103
13901A03k25O1l4L79j94O4k9j01J29r0m5k33L45q5j21J91k61n8j8P2J62p5p7L08
$$ 103 -122 -61 -95 284 90 154 125 24 153 63 18 -215 130 45 -76 115 -146 -204 -222 -150 12 -63 -140 168
13925A68j75N9Oj41j78L87m6l04K41mk47J33q6J54l9Q0J4j21K18K21l98o5N31
$$ 168 -7 52 58 -83 -261 126 80 -224 17 13 -234 -101 -187 -33 -72 8 22 -99 119 340 -58 -123 408
13948D08m73n0P2J57j55l00K49J32k51M19j6k12O0J09J3q8m5R9k12Q5K00J2n40
$$ 408 -65 -115 -43 114 -41 -341 -92 40 -211 208 192 -20 40 149 162 74 29 128 -84 1 201 213 -327
13971c27L34R5k41K94m34K50N4p9J37j13J34k00l2L2k44N6L71j45j38J70j15J40
$$ -327 7 102 -139 155 -279 -29 25 -54 83 -30 104 -96 -128 -96 -340 -284 87 -58 -196 -26 -141 -1
13993aj71K38j89K36Pk54R6j47P3P1R7j42J73j57mL24l98m3M53j13k86l6J06n3
$$ -1 -172 66 -123 113 120 -134 -38 -185 -112 -41 56 -86 87 -70 -74 250 -148 -191 262 149 -137 -173 -67 -120
14017a20J96J36o4l02K84j78l0K46l16J65j71K91k88J17L12m25M3O5J36k23J54
$$ -120 76 212 148 -154 130 -48 -78 168 -148 17 -154 137 -151 -34 278 -147 -104 -39 97 -126 28
14038B8K9l10J72J23j20j18P9K41l11J49J57m5j8K02k59p7J62J02j11j95J39P
$$ 28 57 -253 -81 42 -78 -196 -117 124 -187 -38 119 74 56 258 -1 -78 84 186 75 -120 19 26
14060B6j14k1K10j78L8N5j53O1L31l71j34M05l20R7M5J06j58q6L66j27k53k6K17
$$ 26 -88 -109 101 -77 -39 16 -137 -76 255 -116 -250 155 -165 -68 -23 83 -75 -161 205 78 -175 -201 16
14083A6j92M5O5j26J05K48J96m83K22q1K05l7j35m6q7L01k48n6J80n0k99K22J59
$$ 16 -176 -131 -66 -192 -87 161 357 -126 96 15 220 183 48 2 -85 216 -32 -88 92 42 -257 -35 124
14106A24O8k24J51l1j49P6J08k80J93p1Q7j54J09K82m37J04J94j68j57K78k93
$$ 124 192 -32 119 88 -61 15 123 -157 36 -35 52 -102 7 289 -148 -44 150 -18 -175 103 -190
14127a90L28j32K14m12m1J15o0O9J60J00l90P3L26j71q2J08q5j4L98m5m43J22
$$ -190 138 6 220 -192 -233 -118 -178 -109 51 151 -239 -166 160 -11 -93 15 -70 -84 314 269 -174 -52
14149e2j7j04J38j76J04K56j49O0j99J05j62L02j68J00n1j1K38J1j89K51k80j54
$$ -52 -69 -173 -35 -211 -107 149 0 60 -139 -34 -196 106 -62 38 -13 -24 214 225 36 287 7 -147
14171a47p2L32k30r8J51Q1J3j47M37k28J12j40j6J5J32k00k9j55J77K3j34Mn9
$$ -147 -219 113 -117 -215 -64 17 30 -117 320 92 204 64 48 63 195 -5 -34 -189 -12 11 -123 -119 -178
14194a78j26J55J80l1n3n5J61M6q2J87r2J56j82l03P3K02o1j46K10m3ok83M25
$$ -178 -304 -149 31 0 -53 -108 53 99 17 204 112 268 86 -217 -144 58 -3 -149 61 18 12 -271 154
14217A54q4m3J09j15j28o8M39m32J58N3j09j50J34J90k90K18L2k96K78R3k8k94
$$ 154 70 27 136 21 -107 -175 264 -168 -10 43 -66 -216 -82 108 -182 36 68 -228 50 143 115 -179
14239a79O2J51k17L47k89l8P3L49k86j17L7J68K5k02J32L5p3L18m45J44k8j62
$$ -179 -117 34 -183 164 -125 -163 -90 259 -27 -144 -107 61 86 -116 16 51 -22 296 -149 -5 -33 -195
14261a95r5J83R4mk41M30P7l55J59j10K50k38K53j88j7J56k85J08M3R1l20L62
$$ -195 -290 -107 -13 -17 -258 172 249 -106 53 -57 193 -45 208 20 3 159 -126 -18 25 116 -204 158
14283A58l84K11k10K37k9k4K8q0N3J96k50O7l1J64l6j1l5o0L9j18L52l04N8O6
$$ 158 -226 -15 -225 12 -17 -41 -13 -93 -40 156 -94 -27 -58 106 70 59 24 -36 3 -115 237 -67 -9 57
14307E7O1j97o6K54l2J89j3l43n2J48j09K0Q4K34k43j6N1j25J28L4m4k97qJ85
$$ 57 118 -79 -145 109 77 266 253 -90 -142 6 -103 -83 1 235 -8 -24 27 -98 30 64 20 -277 -285 -100
14331a00j4K36N3l30O3J51o8%K5L71m76J3J47J96k58o2N1K60j69j35M4j56q1L5
$$ -100 -114 122 175 -155 -92 59 -9 -9 16 387 -89 -76 71 267 9 -53 -2 258 89 -46 -2 -158 -239 -204
14355b04K2K23Q2L6k35L08k51%J45m4j55K99J40l96K5mJ0j99L00j91n1K75k98
$$ -204 -182 41 123 159 -76 232 -19 -19 126 82 -73 226 366 -30 -5 -9 1 -198 102 -89 -140 135 -163
14378a63J59n0j09J06p6L47j73kj54j1Q0m1m7K56k52M8J71k92o9M46l23p8N00
$$ -163 -4 -54 -163 -57 -133 214 41 39 -115 -126 -46 -87 -134 122 -130 -82 89 -203 -272 174 -149 -227 273
14401B73j27k77K41J73r7q7j06O9k96K08Q3L5j0P5k54N5J99P1l41L46p1k74l2
$$ 273 146 -131 110 283 186 99 -7 62 -234 -26 57 92 82 157 -97 -42 157 228 -113 233 162 -112 -144
14424a44J52J01j22L36m14J66M7M8k75M01m60J36P5J14q7j94K09J12k45L2kJ51
$$ -144 8 109 -13 323 -91 75 122 170 -105 296 -164 -28 47 161 74 -120 89 201 -44 -12 -14 137
14446A37k58J94k7j37K02l6o8j91K52J40l17J98j01n4L5R7J25n14K92l2J91k73
$$ 137 -121 73 46 -91 111 75 7 -184 68 208 -109 89 -12 -66 -31 66 191 -323 -31 -63 128 -145
14468a45M9j6J42j17J04j76M51k17l72J80R8j12L16j92J38k10j33R5J51J86k38
$$ -145 -96 -112 30 -87 17 -159 292 75 -297 -117 -19 -131 185 -7 131 -79 -212 -117 34 220 -18
14489a8J4qK63j42j16K17q2L2k59K11J1j07J23k71m5K5J66j24J44j13J86m3j23
$$ -18 -4 -12 251 109 -7 210 128 160 -99 112 123 16 139 -132 -177 -152 14 -110 34 -79 107 64 -59
14512e9QK77o2j55j12J2J58j11j63K42L1j34J55J80n02J95J36o8P8p5L7J50j49
$$ -59 -51 226 164 9 -103 -91 67 -44 -207 35 66 -68 87 267 -235 -40 96 28 106 31 68 218 69
14535F9j10N0p5K20k48J37l05M23j73qQj35K27J19K5k51j17K50j29K6o1J22K2
$$ 69 -41 9 -66 154 -94 43 -262 161 -12 -20 -12 -147 80 199 224 -27 -144 106 -23 3 -58 64 86
14558H6q5p1rK04O4mk31l0j07L01J79j10k47J38j27K78k27j20l8J56k22K80l51
$$ 86 1 -70 -79 125 189 185 -46 -76 -183 118 297 187 -60 78 -49 229 2 -118 -156 0 -222 58 -293
14581b93L18P8j59K5J56L3k10j09L4O6p7K13j89K16k25J85r5J80o6kj8l4l4J34
$$ -293 25 103 -56 -31 125 158 -52 -161 -127 -61 -138 75 -114 102 -123 62 -33 147 81 79 61 27 -7 127
14605A27Jl19K56j98R9J47k00K35k74nl9R6l2L9j30K31J21M1m34L88j88O7K23
$$ 127 128 -191 65 -133 -34 113 -87 148 -126 -131 -170 -74 -106 -67 -197 34 155 196 -238 150 -38 29 252
14628B52m49J22O1K38l48J96j61J37K92l16K33k14O0m1L1q1k15K03l6J96n19L09
$$ 252 -197 -75 -14 224 -124 72 -89 48 340 24 257 43 103 62 93 12 -203 0 -36 160 -359 -50
14650e0P4k1n4o4p0K32J23j22j13K41l30m5K11P6j79K95m5n4oQ6k29J18%j39o3
$$ -50 24 3 -51 -115 -185 47 170 48 -65 176 -154 -199 12 88 -91 204 159 105 99 185 -44 74 74 -65 -128
14675a28PK36k96J90k01K86j20j66K34J26j15l58M01J41j6k19J40j38Q9k09J86
$$ -128 -121 115 -181 9 -192 94 -26 -192 42 168 53 -305 96 237 221 2 142 4 93 -116 70
14696G0J34j25J11q4L1r8m3J33o8j52jJ88m3l32K05j44K46r9P9J50k1o4M6k01
$$ 70 204 79 190 106 137 39 -4 129 61 -91 -92 96 53 -279 -74 -218 28 -71 8 158 137 73 119 -82
14720h2J20j82J12L9J6k17K56j57L1K01J49q2j31Mj97K90L8K02l85n0l8M5J2j29
$$ -82 38 -144 -32 7 23 -194 62 -95 -64 137 286 204 73 77 -120 170 208 410 25 -25 -63 -18 -6 -135
14744a35O6j07J62r0k7K60j5k32L60k45k04J83j05k1J85P8k67p5O0L04n2j73J63
$$ -135 -69 -176 -14 -104 -131 129 114 -118 242 -3 -207 -24 -129 -150 35 113 -154 -229 -169 135 83 -90 73
14767G3P4j22j42J33J75l46K92j75q9j2K73m12L14J12k15Q0m7J7KJ22j31J15q4
$$ 73 147 25 -117 16 191 -155 137 -38 -127 -139 134 -278 36 148 -67 13 -34 -17 -15 107 -24 91 7
14790GJ63k00p4R5j05q1L22j07l83K67P9r7K33j92L0j06L28q5k18K28j69J56j32
$$ 7 170 -30 -104 -9 -114 -195 127 20 -363 -96 -17 -114 119 -73 -43 -149 179 94 -124 104 -65 91 -41
14813d1M6J61l13J64O0k68K96r6Nj14K31p0j13L31k37n3k36L60k76m0J28K04k75
$$ -41 5 166 -147 17 77 -191 105 9 14 -100 131 61 -52 279 42 -11 -247 113 -163 -203 -75 129 -146
14836a46N8M12m57J01j57J87Q4J5j9k03J23J77J4k09K0M0j27L27l26rN8O1J54
$$ -146 -88 324 -133 -32 -189 -2 82 97 78 -125 -2 175 189 -20 0 40 -87 240 -86 -95 -37 24 178
14859A78m25K51k5r4L72l28M9j94K16L0P0p0J1j22K73k13J34l21K52K15k69P6
$$ 178 -247 4 -21 -115 257 -71 -22 -216 0 30 100 30 41 -81 192 -21 113 -208 44 259 -10 66
14881F6J83l93J73j61M2q6M8L77n32L40Q1k54K31J69m58K78m7q1j02J53M7k74
$$ 66 249 -144 29 -132 -90 -176 -128 249 -283 57 138 -116 115 284 -174 104 57 -24 -126 27 74 -200
14903b00J68L05m36OP6N3r1n5K18k57J98O3k37J84J40R3k06k9J36l64L96l67K51
$$ -200 -32 273 -163 -157 -81 -28 -119 -174 44 -213 -15 48 -189 -5 135 228 22 -7 129 -235 161 -206 45
14926D5L8q3Q9j25J06k08K02Q0K61m34q3j25K71N8j96K63k43O4J55j02Ql7Rj47
$$ 45 83 0 89 -36 70 -138 64 144 405 -29 -112 -237 34 92 -104 159 -84 -20 135 33 41 4 13 -134
14950a34K81j62K6j20J34P4j32m6p1R2J72k1o4j29K30j13R5j5j86K54p7J4o3j82
$$ -134 147 -15 11 -109 25 99 -33 -79 -150 -58 114 93 29 -100 130 17 112 97 -89 165 88 102 39 -143
14974a43J6J38K70k30K79k7k93J71l31j36L31k62K00n5n7J53p6K73k25J12j69
$$ -143 -127 11 281 51 330 303 10 181 -150 -286 45 -217 -17 -72 -129 24 -52 221 -4 108 -61
14995f1K28j03J57k75j1J64ml48m8K78R3j4N7j09n7j54L19k55J48j3M29o67L05
$$ -61 167 64 221 -54 -65 99 95 -253 -301 -23 70 56 113 4 -53 -207 112 -143 5 -8 421 -246 59
15018E9p0J06j95r6L92k05K29Qnj43p9Ro6M9K00k87J4K95j26k7j2J54l97K56K04
$$ 59 -11 95 -100 -196 196 -9 220 228 223 80 1 10 -56 -7 193 -94 -80 215 89 62 50 204 -193 63 267
15043B67l12J15j68O8q7J26N6o7R7k3r6o1k2loM10k80n5K77p7j00R3J29m37Q2
$$ 267 -45 70 -98 -30 -117 9 65 -2 95 72 -24 -85 -107 -110 -116 294 14 -41 236 159 59 152 281 -156 -74
15068g4K7J98k42L37j69j09j27J57j49K28J08J59n93P8K73nj51Q0P2j04J67k48
$$ -74 -47 151 -91 246 77 -32 -159 -2 -151 77 185 344 -249 -171 102 97 -54 26 98 -6 161 -87
15090h7J50J90k01k23L12Lj46j72K07J71j85k71K33j1j58K30k3r9k01L03j50K76
$$ -87 63 253 52 -171 141 144 -2 -174 33 204 19 -252 -19 -30 -188 42 19 -80 -281 22 -128 148
15112A48j12Nj87K72M5k54K47n6j32n9J75j14j94J71K22k86O0R1p3K10l12K62
$$ 148 36 41 -146 126 171 -83 164 108 -24 -83 92 -22 -216 -45 177 -109 -49 42 -31 179 -133 129
15134A29j26J66j41j78J35j42L84m09J92j90K27O7j47K05rk83K58l7k16J03q0
$$ 129 3 169 28 -150 -15 -157 227 -182 10 -180 47 114 -33 172 163 -120 138 101 -115 -12 -92
15155i2J16P0j38N8O7j30j83J32jJ39K3J15j10P7k76N4J23J11o0j91L14k9l29
$$ -92 24 94 -44 14 81 -49 -232 -100 -101 38 61 176 66 143 -133 -79 44 155 95 -96 218 189 -140
15178a40J38M6j97L8N8O4k76K33J0j0o9J02j52O4J28J77k62m5J11J8j26J05K89
$$ -140 -2 44 -153 -115 -57 7 -269 -36 -26 -36 -105 -3 -155 -91 37 214 -48 -93 18 36 -90 15 304
15201C04l88K6o5J55r6K5J09k13J31Q6J49j01j57j9K47k97L00k47K11q1j81K05
$$ 304 -84 -58 -123 32 -64 -39 70 -143 -12 74 223 122 -35 -54 193 -104 196 -51 160 79 -102 103
15223A03O9m3j47J12j79O1J9k2J17k02J29O6k05J61M7j02R6j48o8N9m4l2K24k01
$$ 103 172 129 -18 94 -85 -24 -5 -27 90 -112 17 83 -122 39 86 -16 80 -68 -136 -77 -121 -153 71 -130
15247a30K31m1r6J83M8j44k2q3J06k2nj88Q6n7N3L7K05k42Q5J91k15L7K27J01
$$ -130 101 60 -36 147 195 51 29 -54 52 30 25 -163 -77 -134 -81 -44 161 -81 4 195 -20 17 244 345
15271C45n51K10q9Q5j8n4J78J4k18J57k54M26j74k4J8j0q0K4Rk48O8J90J87o3
$$ 345 -206 4 -85 0 -18 -72 106 120 -98 59 -195 231 57 33 51 41 -39 -15 -6 -254 -186 4 191 128
15295A28M1j62J43J7j14j27O8l01N55j59O0k35K5j67K62n7J2k1jJ27j85K1K07
$$ 128 169 7 150 167 53 -74 -6 -307 248 89 149 -86 -61 -228 34 -23 -11 -32 -33 94 -91 -70 137
15318A37j80M8K29j92R9j2j95L6j43J95r8j80O0L09l24K54o0k05L00k56M7L32
$$ 137 -43 5 234 42 141 129 -66 -30 -173 22 -76 -256 -196 113 -211 43 -17 -222 78 -178 -131 201
15340B01j50n7Q5j44j2K4K18J8k25k90J97N7j31M3L19j33M0K4K5k69K7M0K20j24
$$ 201 51 -6 79 -65 -77 -53 165 183 -42 -332 -135 -78 -209 -166 153 20 60 84 109 -160 -133 -93 127 3
15364CN0j3j00J20J8j24L0N5j08K08j76R6o0m2P1K7Q8m15P5J01J39j28q5J47j64
$$ 3 53 40 -60 60 78 -46 -16 39 -69 139 -37 59 -1 -43 28 55 143 -272 -197 -96 43 -85 -170 -23 -187
15389a87K37j68L44k77K76k43L86m22K90m51NL33k4J23j75j39J38k13N3J67r0
$$ -187 50 -118 226 -51 225 -18 368 -54 236 -215 -210 123 99 222 47 -92 46 -167 -114 53 -37
15410c7p5M31j25l85K44k24r8L59ML5k08J36k7j68L43l63K85j16J36j82J35Q4
$$ -37 -112 319 194 -191 53 -171 -269 90 94 129 -79 57 30 -138 205 -158 127 11 147 -35 100 184
15432A84l11J66OM7R3m6j95l5K76j67o7m8K2J37n8J27j65J64K8k52n3J65J69L3
$$ 184 -127 39 45 92 185 139 -56 -91 185 18 -49 -97 -75 62 4 131 -34 130 158 -94 -147 18 187 220
15456B20m31K04J33Q6M0l2q9k17J82j37j74L03j00L8j19K80j60j7j11Q4k8j15
$$ 220 -211 -7 126 212 252 220 131 -86 96 -41 -215 88 -12 26 -93 187 27 10 -101 -17 -45 -160
15478a60K08J9j68N4q7O8j09L06k6m93L23n3L2J68k26J00l20M17J65k30J45j0
$$ -160 48 67 -101 -47 -134 -66 -175 131 105 -388 -65 -118 -86 82 -144 -44 -364 53 218 -12 133 123
15500A23j45K12k0j91m2P3j98J69R5j24j51j8q4L09k2J53j69q7J11m6l2J32M1
$$ 123 -22 190 170 -21 -63 10 -188 -19 76 -48 -199 -217 -301 8 -14 139 -30 -117 -6 -52 -84 48 89
15523H9j66N7M4q3p1N8O7J37J07k82lR2O8k30K80r7j54J56L20j74l21m4K48J23
$$ 89 -77 -20 24 -59 -130 -72 -5 132 239 -43 -46 46 114 -116 164 67 -87 69 389 215 -106 -150 98 221
15547B21j97J17j7j76K54j44O3J7j2J50j06j21L16l89l9J85l22J02p9M42k04J97
$$ 221 24 141 124 -52 202 58 121 138 126 276 170 49 365 -24 -63 122 -200 -98 -177 265 61 258
15569B58j18k93L1R0J14j45J85j40N5m7K30n16M76m23L88j33l5L7o5j65J99K34
$$ 258 140 -153 -122 -32 82 -63 122 -18 37 -10 220 -296 180 -243 145 12 -23 14 -51 -216 -17 217
15591B17j57NR4k44O7J45j1j29p9K61l28K59k31J40J6k05j11M82p0j07k67M45
$$ 217 60 65 159 -85 -18 127 116 -13 -92 169 -159 100 -131 9 25 -180 -291 191 121 14 -253 192
15613A92l07j59J60Q7k7O5J83j89q2K98j66j50Q0R1p7M8n7k06K37O0j06j04L01
$$ 192 -115 -274 -114 -27 -54 11 194 5 -77 221 55 -95 -15 76 -1 47 -10 -216 21 81 -25 -129 172
15636A72j93o2J76j00J81j95J7P0l5Q5j81J39J3j00J52n0n9O8j45J01kj21j22
$$ 172 -21 -83 93 -7 174 -21 -4 66 31 116 -65 74 87 -13 139 89 30 98 -47 54 52 -69 -191
15659a91N0O5K87m02J75O1j9j00O4r4j5M1K42kk57j10J56K5q7J36k89M97o5l6
$$ -191 -141 -76 211 -191 -16 45 26 -74 -10 -104 -119 -78 164 162 -95 -205 -49 -24 -111 25 -264 233 168 132
15683A32J06j09k11K02j59q2J39J02n4k52L50l94K32j15O3M7O6P8k08J18mn0O
$$ 132 238 129 -82 120 -39 -121 18 120 66 -186 164 -230 2 -113 -50 -3 63 141 -67 51 47 -3 3
15706Cr5J39r6K62n9l32K5q9M15j12J14k87j4o6J84o3J82P8k47M6Q7K53j21l08
$$ 3 -92 47 -49 213 154 -178 -153 -242 173 61 175 -112 -126 -192 -8 -71 111 189 -58 -12 75 328 207 -101
15730a01R1L2j18K6M1l1L58k6m0j91jK1P2k28K48Nk08K18j95J0N9rj05ol4J43
$$ -101 -10 22 -96 -70 -29 -60 298 272 232 41 40 61 133 -95 153 158 -50 168 -27 -17 42 33 -72 -78 -112 31
15756C1K3P8O3M3l05J11j33m4J40m0j60J45jO3O0l7o5K24r7k51K22J08m60L20
$$ 31 54 132 195 238 -67 44 -89 -133 7 -33 -193 -48 -49 14 74 37 -28 196 99 -152 70 178 -282 38
15780C8j14j89K23p8K66k58O5J99k33K83k72L11q8j21l3q8K03k2l88L60Qr8M8
$$ 38 -76 -265 -42 -120 146 -112 -47 152 -81 202 -70 241 153 32 -1 -89 114 92 -296 64 72 -26 22
15803B2j93m0r0K04J67J14l14M00l50j21N1J22j78J5J90K1q0J40m7r4J08k2j20
$$ 22 -171 -211 -301 -97 70 184 -130 270 -80 -201 -150 -28 -206 -191 -1 20 -60 80 33 -61 47 25 -95
15826i5K43P6j19j07N5J49l77J97K51k72J8m8N5j06K04j20j25N13m27j2J13J17
$$ -95 148 224 105 -2 53 202 -175 22 273 1 19 -29 26 -80 124 4 -121 392 -35 -47 66 183
15848A83j83j69K13m4Q6L0j66n8J9N6J27k15L70l75k1n0L81j78J9Q9Q6j20q9L8
$$ 183 0 -169 44 0 86 116 -50 -108 -89 -33 94 -121 249 -126 -147 -197 184 6 25 114 200 80 -9 29
15872B9R8rmo5o3J83k16J40j73J3j2k8Q0J38j12K0L11j83p7K8j48J9j%N3M1L8
$$ 29 127 118 114 49 -14 169 -47 93 -80 -67 -79 -107 -27 111 -1 19 330 147 70 98 -50 -31 -32 -32 21 62 100
15899A00j00J5R1j4j84j27J06J36k08L47l07K31k03Q4Q5N0k28J2M2k4Kj3K68j58
$$ 100 0 15 106 92 -92 -219 -113 23 -185 162 -145 86 -117 -33 52 102 -126 -114 -72 -96 -94 -107 161 3
15923CO3N7m4k7m2J72j52q7J1K2K4j44K21n5Pj0j27J70l1p2K8L31k78q0M4p7K18
$$ 3 66 123 79 52 10 182 30 -57 -46 -24 0 -144 77 22 29 19 -108 62 31 -41 -13 318 40 -40 4 -73 145
15950A45j96Q2j8k86M91k35N7o9q1K10RK2j52N6p0k4N2m6J32M4o0J86k62R8Q0
$$ 145 -51 31 13 -273 218 -17 40 -29 -110 100 109 131 -21 35 -35 -59 -7 -53 79 123 63 249 -13 85 165
15975A65q1j4Q5M5r7j76r8L96j25l4j18J76k15K36k5k5N5p7k47L63k92m3K56p5
$$ 165 84 70 155 200 103 -73 -171 225 100 66 -52 124 -91 145 120 95 150 73 -174 189 -103 -146 110 35
15999C5j21R5J43j63k07K71nQ0j18P9n3L2j11K59k03n8n2K09n4j19R8j34L41l15
$$ 35 -86 9 152 -11 -218 53 48 128 10 89 36 68 -43 216 13 -45 -97 112 58 -61 37 -97 244 -71
16023g1o0J55Mo2k7J36j0M3Q5jk79J29L7q4j09K13K2j32k47J01P1K59m7o5j53
$$ -71 -131 24 28 -34 -61 75 65 108 193 192 -87 42 79 -5 -114 99 121 -11 -258 -157 -86 173 126 61 -92
16048i2K78L3l37K9J72k34J80J4n2J05j63J08k70K66j48J89j41J16j22Q1n5N9
$$ -92 186 219 -118 -89 83 -151 29 43 -9 96 -67 41 -229 37 -111 78 -63 53 -69 12 -43 16
16070A6q9r7K01j26R5Q1j33Q9j02p5L56j51N0j39J32k1r2j2R7N9j00j89L0J75
$$ 16 -73 -170 31 -95 0 81 -52 37 -65 -140 216 65 115 -24 108 87 -5 -17 80 139 39 -150 -120 55
16094E5J49Jk08m3n9L5P7O1o3J29l07L73o3k4j95J62j73P8J82k01j44J40l2oj56
$$ 55 204 205 -3 -46 -105 -70 7 68 5 134 -173 200 137 113 -82 80 -93 -15 167 -34 -178 -38 -70 -76 -232
16119b32L67Qo5J35l29K04jM3m7N6j75Op8K42m7n9n0j54p0K21J2k0K28j93q2L25
$$ -232 135 143 78 213 -116 88 87 130 83 139 -36 -30 -108 134 87 28 -22 -176 -246 -25 -13 -33 195 2 -80 245
16145B45m70J73J50p6m6j55L9J38K67k18l22L85j33l1O7J6k4J60j94j2K45l11
$$ 245 -225 -52 98 22 -24 -179 -140 -2 265 47 -275 110 -23 -54 13 29 5 165 -29 -41 204 -107
16167a07L3M8j32J85n6j23J14J42N1k63K57Q4k34M4N2kj49N2L9J09J3M6l86K24
$$ -107 -74 -26 -158 27 -29 -152 -38 104 155 -108 149 233 -1 43 95 93 -56 -4 35 144 157 203 -183 41
16191D1l00L35q7j0J32lk03M4J9K09j18q0K04m39K00r1N1P9Q4m6k98J75J76k89
$$ 41 -259 76 -11 -21 111 108 -95 -51 -32 177 59 -21 183 -256 -56 -147 -96 -17 67 21 -277 -102 74 -215
16215b15K28j47J24J5J95k01K79l21Q3o3j29L95o6r9j46J21o6o2l1J96j11j24
$$ -215 13 -134 -10 5 200 -1 278 -43 40 -23 -152 243 177 78 -68 53 -13 -75 -106 90 -21 -145
16237a45L54k11O6o6J41O0k05J97l89J78j53K81o8J8j03j44J85m7o4K27P0j03
$$ -145 209 -2 64 -2 139 199 -6 191 -198 -20 -173 108 40 58 -45 -189 -4 -51 -115 112 182 79
16259G9R7m36K30J62j18M5l0n7q9J01K27j65j9j4J77K2k10Q6j90k2J99j37O5P0
$$ 79 176 -260 -30 132 14 59 29 -28 -117 -16 211 46 27 13 190 212 2 88 -102 -124 75 -62 3 73
16283G3L3j71l5P9J71k03j19J41j9J49k04J35O8j20r0J48J13n0j37J82M1o6o0
$$ 73 106 -65 -100 -21 150 -53 -172 -31 -50 99 -105 30 98 -22 -112 36 149 99 -38 144 185 119 59
16306E9r2j7J52l70M32j05m8n2J71m10L11K69l33n3K42o4j52R2r7R1k3M6k2j64
$$ 59 -33 -50 102 -268 164 59 11 -41 130 -280 31 300 -33 -86 156 92 -60 32 -65 26 3 49 27 -137
16330a37K03Kj05J11l1j1K5q2j4o6J27r4o9L09J2l24K06m5p7r4l2K0J67J14k73
$$ -137 66 68 -37 74 43 32 57 -25 -39 -105 22 -72 -141 168 180 -144 62 17 -60 -154 -186 -166 1 115 -158
16355a58J62l2J3o9K7P5k3K72k61M0K9K56k75m5m4R8o5r9M3l0Q4L6n2M6P2k88
$$ -158 4 -28 -15 -84 -57 18 -5 267 6 46 75 331 56 11 -33 65 0 -99 -56 -86 -2 34 -18 28 100 -188
16381a88K6N2
$$ -188 -162 -110
16383a10
$$ Imaginary data points
##PAGE= N=2
##DATA TABLE= (X++(I..I)), XYDATA
0@%%%%%%%%%%%L2o4O4o4R6j28J29j61K24k56K88l52M16m88N84o76P73q98J041
$$ 0 0 0 0 0 0 0 0 0 0 0 0 32 -32 32 -32 64 -64 65 -96 128 -128 160 -192 224 -264 320 -356 417 -481 560
30E60j201J378j570J764j988K245k533K850l184L549l954M402m886N420o003O630
$$ 560 -641 737 -833 931 -1057 1188 -1345 1505 -1679 1870 -2084 2318 -2568 2852 -3151 3479
46C479p322Q079q901R805j0801J1899j3115J4465j5974J7674j9597K1791k4337
$$ 3479 -3843 4236 -4665 5140 -5661 6238 -6877 7588 -8386 9288 -10309 11482 -12855
59a2855K7324l0877L5201m0592M7527n6839P0087r0574J26768k09705P50230J30487
$$ -12855 14469 -16408 18793 -21799 25728 -31111 38976 -51598 75170 -134535 615695 746182
71G46182j444399j68204N99192Q50090o248m45873m48946Q2326K09523q645K5410
$$ 746182 -698217 -866421 -267229 582861 576613 130740 -318206 -235880 -26357 -35002 -9592
82i592L60881O4523l62937m95955r966M95550N49474n624o27329m78267K68927
$$ -9592 351289 415812 52875 -443080 -453046 42504 591978 586354 -40975 -519242 -250315
93b50315M25513J17219j48536j47909p9751l6635K0605O3759J74685K20315j82443
$$ -250315 175198 292417 143881 -4028 -83779 -120414 -99809 -36050 138635 358950 176507
104A76507m19558o0176L57051K75901j15859k62692j00180J14829J66490j01704
$$ 176507 -243051 -303227 53824 329725 213866 -48826 -149006 -34177 132313 30609
114C0609j83109J51095K52064j13467l61316o9379L32298L05196l6885l75977
$$ 30609 -152500 -1405 250659 137192 -224124 -293503 38795 343991 307106 -68871
124f8871k77356K41646M00190k6100l50771j25853K19749J59050j19079k35444
$$ -68871 -346227 -104581 295609 269509 -81262 -207115 12634 171684 52605 -182839
134a82839r599L44456K13598l15852m23315Q7239M80944K30259k41463l77268
$$ -182839 -192438 152018 365616 49764 -373551 -286312 194632 424891 183428 -193840
144a93840j13345K70386K84828o8543k25589m2060P9043l0396n8466Q6969J37030
$$ -193840 -307185 -36799 248029 179486 -46103 -88163 -9120 -39516 -97982 -11013 126017
155A26017K9328j44502k10554J7085K81387J79655j60105k49978j6912J44771
$$ 126017 155345 10843 -199711 -182626 98761 278416 118311 -131667 -148579 -3808
165c808R7961k9139j03248j1971Q9832p318j34265k0764J76725J06077j17506
$$ -3808 94153 65014 -38234 -50205 39627 32309 -101956 -122720 54005 160082 42576
176D2576j52637K695J47533J00612j01669j54958M7875J83635N239k04291j06750
$$ 42576 -110061 -107366 40167 140779 39110 -115848 -67973 115662 120901 -83390 -190140
187a90140J28446J92084K4965j88685j67038Q3991K12597M2239j42158p5057O8052
$$ -190140 -61694 130390 155355 -33330 -200368 -116377 96220 138459 -3699 -78756 -10704
198a0704O3487m1438r1019J3246J49152P1390j64180k03399M6125K31114J18995
$$ -10704 52783 11345 -79674 -66428 82724 154114 -10066 -213465 -167340 63774 182769
209A82769j08016j92744n5924J36083J35046k3667q0987p97J4523n1495l0363
$$ 182769 74753 -117991 -173915 -37832 97214 73547 -7440 -8237 6286 -45209 -75572
220g5572O2632R0503J2185j14758j37250K7687J81210R1856j08490j34951m073
$$ -75572 -12940 77563 89748 -25010 -162260 -134573 46637 138493 30003 -104948 -109021
231a09021R5672Q5331j7054q7715j7369P0615J0945p6289j4923P4142L2944n1734
$$ -109021 -13349 71982 54928 -32787 -50156 20459 31404 -44885 -59808 14334 47278 -4456
243d456p1127j5343P9136Q3151m7082j08661J5228J05961J7252o8440l5017K7634
$$ -4456 -75583 -90926 -11790 71361 24279 -84382 -69154 36807 54059 -14381 -49398 -21764
255b1764N8126J8696p9224q1250N8284J08343j9976r4317k5353L7050M5912K6880
$$ -21764 36362 55058 -24166 -105416 -47132 61211 41235 -53082 -78435 -41385 4527 31407
267C1407l3502m6047L8856N5059m8619n7669N1303O4523k1540o0978m9161N202
$$ 31407 -2095 -48142 -9286 45773 -2846 -60515 -9212 55311 33771 -27207 -76368 -71166
279g1166Q7749N6726q3032q7662M6821O8651j0402j3919J1857l995J094k89l8151
$$ -71166 16583 73309 -9723 -97385 -50564 18087 7685 -6234 5623 1628 2722 2433 -35718
292c5718L616Q3279J3441j05945n5487N4303N7283K0896j8827p3007l1456Q2925
$$ -35718 -32102 51177 64618 -41327 -96814 -42511 14772 35668 16841 -56166 -87622 -4697
304d697O2899m6948l2664K9755k288k2816J3542Q270l190J9753k3522p5335J5562
$$ -4697 58202 11254 -21410 8345 6057 -16759 -3217 5053 1863 21616 -1906 -77241 -61679
317f1679R8741P790p6432k3775K6624K8047L9111j594o3598o549O4395j303n3562
$$ -61679 37062 44852 -31580 -55355 -28731 -684 38427 36833 -26765 -33314 31081 29778 -23784
330b3784J0791K8005k2467j2732O464k0095J0672N0960j9298o0392K7065O1129
$$ -23784 -12993 15012 -7455 -20187 -13723 -33818 -23146 27814 8516 -51876 -24811 36318
342C6318j1696k6222L498r127P137L7325k3284n9918K4545N0801l1928l8517K4309
$$ 36318 24622 -1600 1898 -7229 -92 37233 13949 -45969 -21424 29377 -2551 -41068 -16759
355a6759J5081o614J6005o318k6089L2741M0168m0660l5284L7779J8862k7027
$$ -16759 -1678 -8292 7713 1395 -24694 8047 48215 7555 -27729 10050 28912 1885
367A885l538k680k4547J8005L4091l2551l2680L7531K4737k3233J393J5720j1920
$$ 1885 -1653 -4333 -28880 -10875 23216 -9335 -42015 -4484 20253 -2980 -1587 14133 2213
380B213O766K1464k6138k3489L7653J2021m8293j1786L1050R16q575P392j6802
$$ 2213 8979 30443 4305 -19184 18469 30490 -17803 -29589 1461 2377 -6198 1194 -15608
393a5608r710M1456J9316l7970p339L0041m713j3364J6576m611k4882R918Q760
$$ -15608 -25318 16138 35454 -2516 -9855 20186 15473 2109 18685 14074 -10808 -890 7870
406G870k6071K514L2406j0684k8518J1799J5606M41J8669L389l5916n296L7872
$$ 7870 -18201 -15687 16719 6035 -22483 -10684 4922 5363 24032 27421 -8495 -13791 24081
419B4081L052k5469L950K970k1342j78J4615o428J895J7445j4936k2964K1838
$$ 24081 27133 1664 5614 8584 -12758 -12936 1679 -4749 -2854 14591 -345 -23309 -1471
432a471K5827q954k883O643j6430j0165J8352M124j2835N908L40k5935n705K2265
$$ -1471 24356 15402 12519 19162 2732 -7433 10919 15043 2208 8116 8456 -17479 -23184 -919
446i19R047N85O586j3395j9819J6949K4793n176m820O005j2621j8902L520R771
$$ -919 8128 8713 15299 1904 -17915 -966 23827 18651 13831 19836 7215 -11687 -8167 1604
460A604O493J2300q906l6272r743L1183K3257K383l375j7765j8803J2122K4526
$$ 1604 8097 20397 11491 -24781 -34524 -3341 19916 22299 18924 1159 -17644 -5522 19004
473A9004M419k120l177k1914j8775Q688J5786J0637J0175j1494l7295j1219L2033
$$ 19004 23423 21303 18126 -3788 -22563 -13875 1911 12548 22723 11229 -26066 -37285 -5252
486e252L1829R326j0124l1303k3963J9642L5036Q605j1480k0068k7548l235K9602
$$ -5252 26577 35903 25779 -5524 -29487 -9845 25191 33796 22316 2248 -25300 -28535 1067
499A067J7545r598n321m829j6555r99K1722J7777R601j529l2002l2863J9444M5488
$$ 1067 18612 9014 3693 -1136 -17691 -18690 3032 20809 30410 28881 -3121 -35984 -16540 28948
513B8948J2382k0262l3449l2812R803N2498K3960k9441k8127m555M698K0030K2128
$$ 28948 41330 21068 -12381 -45193 -35390 17108 41068 11627 -16500 -21055 -16357 3673 25801
526B5801n197j0820M981j4790l0277J3112M3739J2684k2647l5366l5686R902O6338
$$ 25801 20604 9784 14765 -25 -30302 -17190 26549 39233 16586 -18780 -54466 -44564 21774
539B1774L7792l6648m7598j3429J1623L9580L9651j5707m4291p809O404r049J1157
$$ 21774 59566 22918 -24680 -38109 -26486 13094 52745 37038 -7253 -15062 -8658 -17707 -6550
552f550L1721K151k2539k2433l0222k411O3450N6123k5935o0165l2157K273N0409
$$ -6550 25171 27322 4783 -17650 -47872 -50283 13167 69290 43355 -16810 -48967 -46694 3715
565C715P0086n224q0191m4571J9708L0591K8146J2985l0163l2842P022L779j1966
$$ 3715 73801 68577 -11614 -56185 -36477 -5886 22260 35245 5082 -27760 -20738 -16959 -28925
578b8925K9761N0344o220m7351l4027j1573L4996P7232J6850q2676p0807J4048
$$ -28925 836 51180 44960 -2391 -36418 -47991 -12995 64237 81087 -1589 -72396 -58348
590e8348M9946M3052J2881m5819n2241J7369M0218k296j196K5358j869k9187j5958
$$ -58348 -8402 34650 47531 1712 -50529 -33160 7058 4762 3566 28924 27055 -2132 -18090
603a8090r067Q137N3435K9077n9683o7782O422M3996M0887K3258l5547o6911P24
$$ -18090 -27157 -19020 34415 63492 3809 -63973 -57551 -13555 27332 50590 15043 -51868 -51144
616e1144N9844K6330r577o754k0388k2405J5026J6126j2030Q396K2373k6196m3804
$$ -51144 8700 35030 25453 18699 -1689 -24094 -9068 7058 -4972 3424 25797 -399 -44203
629d4203L907K8797K6781K9870j4424p0712k5758O2000N8279p85l4817n2057k7308
$$ -44203 -40296 -11499 15282 45152 30728 -39984 -65742 -3742 54537 53752 18935 -33122 -60430
642f0430M5710N8038j4715m2590q233l78j986K2420J6863p403O166N060l7463
$$ -60430 -14720 43318 28603 -13987 -22220 -22598 -24584 -2164 14699 7296 13462 18522 -18941
655a8941k3619M2715M7463n816l5188m2346k3477M1695O3155p936n7147k0415
$$ -18941 -42560 155 47618 41802 6614 -35732 -59209 -17514 45641 37705 -19442 -39857
667c9857J3464J7283K5671J0788k3583j1943J4261n971j5817J8373K1094j1695
$$ -39857 -26393 -9110 16561 27349 3766 -8177 6084 113 -15704 2669 23763 12068
679A2068j5848j1561j7804R883M1321Q573l2394j6600N958P844K0347J7113j9154
$$ 12068 -3780 -15341 -33145 -23262 18059 26632 -5762 -22362 -16404 -8560 11787 28900 9746
692I746k1790J1025Q757j1059O61N585q647J562R681j7719j9023K0872K8247o24
$$ 9746 -12044 -1019 7738 -3321 -2660 2925 -5722 -4160 5521 -12198 -31221 -10349 17898 17274
706A7274j2642j4360j1862J7587L3929l201l0975r326O716J442O681M743j1944
$$ 17274 4632 -9728 -21590 -4003 29926 26725 -4250 -13576 -6860 -5418 1263 6006 -5938
719e938n096R630m655j1117J2966J9860j977j0575q174o592J1649K3760m807k8131
$$ -5938 -11034 -1404 -6059 -17176 -4210 15650 13673 3098 -5076 -11668 -19 23741 18934 -9197
733i197q594J0821N704L565R81j0973n529J0053L584l891P910P401q308n324M251
$$ -9197 -17791 -6970 -1266 2299 3280 -7693 -13222 -3169 415 -3476 4434 11835 3527 -1797 2454
748B454j231P43P965m001j4866j712O326N76L777L886q729o756R072P256l04M235
$$ 2454 1223 1966 9931 5930 -8936 -10648 -4322 -3746 31 3917 -4812 -11568 -2496 4760 4456 8691
764H691o57j0712m75R860j444o012J803j951n207K755K79o639N624J2698n169
$$ 8691 8034 -2678 -3153 6707 5263 -749 1054 -897 -6104 -3349 -3070 -9709 -4085 8613 3444
779C444j0495L403O123K310P591p50j4460m387Q833R13j966M239n814j1527L350
$$ 3444 -7051 -3648 2475 4785 12376 11626 -2834 -7221 1612 2525 559 4798 -1016 -12543 -9193
794i193Q500j330M632P565j0459j0727J1168J1288k401p83l822j2914J854J4395
$$ -9193 -693 -2023 2609 10174 -285 -11012 156 11444 9043 8260 4438 -8476 -6622 7773
808G773k436j0229K815j033r104O925J2724n083l598O552m960n576J3348P071
$$ 7773 5337 -4892 -2077 -3110 -12214 -5289 7435 2352 -1246 5306 346 -5230 8118 15189
822A5189j2766l343M816q302j339J2667l957j4228M933P127p916L941J3220o494
$$ 15189 2423 -920 3896 -4406 -5745 6922 2965 -11263 -6330 797 -7119 -3178 10042 3548
836C548p959R167J037o772R898N098j7286m955J3169l653r285Q623J29j2438O275
$$ 3548 -4411 4756 5793 -979 8919 14017 -3269 -8224 4945 1292 -7993 630 759 -11679 -5404
851e404J2658q920k929J2975k842q906J1186M062j3751J392R905j1049o883J2120
$$ -5404 7254 -1666 -4595 8380 5538 -3368 7818 11880 -1871 -479 9426 -1623 -8506 3614
865C614l312j3997R028J0132j0151J61J1274o519m959J6200J439j6190M549R660
$$ 3614 302 -13695 -4667 5465 -4686 -4525 6749 230 -4729 11471 12910 -3280 1269 10929
879A0929j2124l990J1535o609j2128J0279M101j1864N434J2299j0244l830J5727
$$ 10929 -1195 -5185 6350 -259 -12387 -2108 1993 -9871 -4437 7862 -2382 -6212 9515
892I515j002j1290J0270M836j5596O21J2604j0429j1043J1650O42j2253P909Q156
$$ 9515 8513 -2777 7493 12329 -3267 -2646 9958 -471 -11514 136 778 -11475 -3566 4590
906D590j1564J537J5324n863q685J3869L057j5018K959R975j1417n044J0427n890
$$ 4590 -6974 -5437 9887 4024 -4661 9208 12265 -2753 206 10181 -1236 -6280 4147 -1743
920a743j2307J1232O382j2046L643J2157q495m672J5303J098j1423O298M361j3985
$$ -1743 -14050 -2818 3564 -8482 -4839 7318 -1177 -5849 9454 10552 -871 5427 9788 -4197
934d197o20J2912p707j0500P594L51r177Q257R509j0533j287J3827k978r163J0860
$$ -4197 -4817 8095 388 -10112 -2518 -2167 -11344 -3087 6422 -4111 -5398 8429 5451 -3712 7148
949G148N042j2474l41O217r302k861R832m784j0888R026O787j0237J213J1275
$$ 7148 12190 -284 -625 5592 -3710 -6571 3261 -1523 -12411 -3385 3402 -6835 -5622 5653
963E653l404k754J0154k620j1423O641P706r820l523N998o536o611Q565J301p225
$$ 5653 2249 -505 9649 7029 -4394 2247 9953 133 -3390 2608 -3928 -10539 -1974 -673 -7898
978g898O460O833j0490j560J3997K194o467K135j874p998N354O702r147n109O848
$$ -7898 -1438 5395 -5095 -6655 7342 9536 3069 5204 3330 -4668 686 7388 -1759 -6868 -20
993b0l164q129O897O835l666J955L127o862p29J2909J674r140j239n4m963L126
$$ -20 -3184 -11313 -4416 2419 -1247 708 3835 -3027 -3756 9153 10827 1687 448 394 -4569 -1443
1009a443N840o263n650M758j370m687P882P780m997l104K788j147J292O853k473
$$ -1443 4397 -1866 -7516 -2758 -4128 -8815 -933 6847 1850 -1254 1534 387 1679 8532 6059
1024F059q048J832J519p812m46Q747K87n381k073l251J683J3705O044j1536p263
$$ 6059 -1989 -157 1362 -6450 -6896 1851 2138 -3243 -5316 -8567 -6884 6821 12865 1329 -5934
1039e934M984M185J664J805n570n821M817K11r921O36J2402L479p790p013l917
$$ -5934 -950 3235 4899 6704 1134 -4687 130 341 -9580 -8944 3458 6937 -853 -7866 -11783
1054a1783O804J8335M261j7426j0546P181O298K796J808o881q518K547K765n470
$$ -11783 -4979 13356 17617 191 -10355 -3174 3124 5920 7728 847 -7671 -5124 -2359 -7829
1068g829L463J0883k023q524j255m44K815J3604N412j3858r870K806J529M319
$$ -7829 -4366 6517 4494 -4030 -5285 -5729 -2914 10690 16102 2244 -7626 -4820 -3291 1028
1082A028J0466m614j7684l601Q921M810N723K489j1384o532J2487N805r045J168
$$ 1028 11494 6880 -10804 -14405 -5484 -674 5049 7538 -3846 -10378 2109 7914 -1131 37
1096C7R621k473p363m008o995M511K0292O37k6186j0515J5656J3391M530l714
$$ 37 9658 7185 -178 -4186 -11181 -6670 13622 14259 -11927 -22442 -6786 6605 11135 7421
1110G421j5845n666J9789J1603j6247q238J1000L139n983l506p821q9J9391N714
$$ 7421 -8424 -14090 5699 17302 1055 -7183 3817 6956 973 -2533 -10354 -10443 8948 14662
1124A4662k4315j1999J7374J3231L22j176j0671r999J3838J4981r997j0321N209
$$ 14662 -9653 -21652 -4278 8953 9275 8099 -2572 -12571 1267 16248 6251 -4070 1139
1137A139k522o260Q056K250j0226K939R990q356o169J0693K820l674Q963J356
$$ 1139 -1383 -7643 413 2663 -7563 -4624 5366 -2990 -9159 1534 4354 680 9643 10999
1151A0999j8668k483J6681M636o745l991j2176o293J9833J4725j8182j4285J1445
$$ 10999 -7669 -10152 6529 11165 4420 429 -11747 -18040 1793 16518 -1664 -15949 -4504
1164d504Q937l85J975o471n943J6115R219k2560j5565J8003J4626n883r420j2486
$$ -4504 4433 4048 6023 -448 -6391 9724 18943 -3617 -19182 -1179 13447 7564 -1856 -14342
1178a4342o427K1298J9548j6498j9697J0937J3072j676m3k958p702Q392J0181
$$ -14342 -20769 529 20077 3579 -16118 -5181 7891 6215 6172 3214 -4488 3904 14085
1191A4085j6471j4650J4698J2583r287o398j569m654Q486J6272n977j3667O556
$$ 14085 -2386 -17036 -2338 10245 958 -5440 -7009 -11663 -3177 13095 7118 -6549 7
1204GN449o619M900Q241j0142r048O637L11n828O289J296j1385L604J2753n640
$$ 7 5456 -1163 3737 11978 1836 -7212 -575 -264 -6092 197 1493 -9892 -6288 6465 825
1219H25q702R968P260m540m72k987q323Q387J4749j2469j9456O047J3235n46l685
$$ 825 -7877 2091 9351 4811 4339 1352 -6971 1416 16165 3696 -15760 -9713 3522 2976 -709
1234g09m839o489J0274J6411p849j7100P953J4203l226o611l740m267O622J0297
$$ -709 -5548 -12037 -1763 14648 6799 -10301 -2348 11855 8629 2018 -1722 -5989 633 10930
1248A0930j1125j6349Q669J4782m488p169O12P29N937Q722o710j1464Q045J0315
$$ 10930 -195 -16544 -7875 6907 2419 -4750 -4138 -3409 2528 11250 4540 -6924 1121 11436
1262A1436p746q102L539P29j825K185m179n154Q068O704q764l208J0300K885n469
$$ 11436 3690 -4412 -873 -144 -1969 216 -3963 -9117 -1049 5655 -3109 -6317 3983 6868 1399
1277A399K11Q14j349M185J85j0207k247J0358j53r648p57N117J882K480r50o839
$$ 1399 1610 2424 1075 5260 5445 -4762 -7009 3349 3196 -6452 -7209 -2092 -210 2270 1320 -5519
1293e519L293J2442j401j2315L92P890J057l088n514n439M923Q958m827j0979
$$ -5519 -2226 10216 8815 -3500 -3108 4782 5839 2751 -2763 -8202 -3279 5679 852 -10127
1307a0127M115J0134o5m211j535l01O188N840p405r303O300Q131n261p146o26
$$ -10127 -6012 4122 4057 -154 -1689 -1990 4198 10038 2633 -6670 -370 7761 2500 -4646 -5272
1322e272J733L887K780p076n596R763P678o555n022M478L253J405j019o624k725
$$ -5272 -3539 348 3128 -3948 -9544 219 7897 1342 -3680 798 4051 5456 4437 -2187 -4912
1337d912Q932K697j1417m037P798L074k759j284k301R44Q574J078r595k53J0021
$$ -4912 4020 6717 -4700 -8737 -939 2135 -624 -1908 -4209 -3265 5309 6387 -3208 -3461 6560
1352F560J83o827j098l6r3M688k121r890K156J0865j977q376K707N261J74J657
$$ 6560 6743 -84 -1182 -1218 -1311 3377 1256 -8634 -6478 4387 2410 -5966 -3259 2002 2176 3833
1368C833j732o003M635R362o330j0854M886O225l937k568l26k774L570P445o386
$$ 3833 2101 -3902 733 10095 3765 -7089 -2203 4022 85 -2483 -2809 -5583 -2013 5432 -954
1383i54p832R373Q190o274m126L216j079J837M547p424q242Q714O894r696n008
$$ -954 -8786 587 8777 2503 -1623 1593 514 2351 6898 -526 -8768 -54 6840 -2856 -7864
1398g864O359J168n49L122l971m314J0657N645j1269m424R644J557o002O02j877
$$ -7864 -1505 -337 -886 2236 -1735 -6049 4608 10253 -1016 -5440 4204 5761 -241 361 -1516
1413a516m167O490L646j0917k433J1819J087p900K477M064k332L451K948r252
$$ -1516 -5683 807 4453 -6464 -8897 2922 4009 -3891 -1414 2650 318 3769 6717 -2535
1427b535j785J1239j155j1463J534N714l999l62K903n179m17J1251q83j1199M450
$$ -2535 -4320 6919 5764 -5699 -4165 1549 -2450 -2812 91 -5088 -5505 5746 4863 -6336 -1886
1442a886J0243m581m264L426k805k234O595k226j1084M176R525o770n918O821
$$ -1886 8357 3776 -488 2938 133 -2101 4494 2268 -8816 -4640 4885 -1885 -7803 -982
1456i82K105k480N295l40q164N299R781p431q096O346K242o385J385N81o118L757
$$ -982 1123 -1357 3938 3598 -4566 733 10514 3083 -5013 1333 3575 -2810 -1425 -844 -6962 -3205
1472c205Q165p217o715R999N799o438j76L411l556J569N882o633p693P430L529
$$ -3205 4960 -2257 -8972 1027 6826 388 212 3623 67 1636 7518 885 -6808 622 4151
1487D151r169j077O126k237j282N776k969m216Q326M711q285j273O646k067m363
$$ 4151 -5018 -6095 31 -2206 -3488 2288 -681 -4897 3429 8140 -145 -1418 5228 3161 -1202
1502a202K973j985n470M660K813q001j76R080j440n408M316L057k823K796K572
$$ -1202 1771 -214 -5684 -1024 1789 -6212 -6388 2692 1252 -4156 160 3217 394 3190 5762
1517E762o509n89P363l324p864K961K992m352P42K542m179N54P865j499o098M592
$$ 5762 -747 -1336 6027 2703 -5161 -2200 792 -3560 -2818 -276 -4455 -3901 3964 2465 -3633 959
1533I59N393l897r29J775l829j261N182k696p116K946M431l747j292M335r45p06
$$ 959 6352 2455 1526 3301 -528 -1789 3393 697 -6419 -3473 958 -2789 -4081 254 -691 -1397
1549a397M567l27m106L783L700n179k282L133j844l005K548j43m071K024K910
$$ -1397 3170 2843 -1263 2520 6220 1041 -1241 1892 48 -2957 -409 -552 -4623 -2599 311
1564C11k977K4N397n81k855K467J317k490J794J894m993k459L963n82l761J594
$$ 311 -2666 -2642 2755 2174 -681 1786 3103 613 2407 4301 -692 -3151 812 230 -3531 -1937
1580a937R88k424J806K661k178l98N175O8l589J381Q68k584J283J807m317k755
$$ -1937 -949 -3373 -1567 1094 -1084 -1482 3693 3761 172 1553 2421 -163 1120 2927 -1390 -4145
1596d145L236K95k437K088N40k807J877M418k191j369L510J40k534J369j23l867
$$ -4145 -909 -614 -3051 -963 -423 -3230 -1353 3065 874 -495 3015 3155 621 1990 1867 -2000
1612b000J328L012k982l386J977O44j069L414O92m712J564N439p20k678J674r21
$$ -2000 -672 2340 -642 -4028 -2051 -1407 -2476 938 1630 -3082 -1518 3921 3201 523 2197 1276
1628A276k122K984O62n466r03M466j693k464K248k54j654M424K729n128j334M902
$$ 1276 -846 2138 2800 -2666 -3569 897 -796 -3260 -1012 -1266 -2920 1504 4233 -895 -2229 2673
1644B673N73j750J142k476m041M019M257n460l812L070N69m21L233j042m978M468
$$ 2673 3246 1496 2638 162 -3879 140 4397 -1063 -4875 -1805 -1236 -1657 1576 534 -4444 24
1660B4O214m170m217L383J021r46K129k855o421K853P383l659n570J918J283J40
$$ 24 6238 2068 -2149 1234 2255 1309 3438 583 -5838 -2985 4398 739 -4831 -2913 -1630 -1490
1676a490M590J45o864J744P413j732m902J948K58k512L825K77p658r39P480k4
$$ -1490 3100 3245 -3619 -1875 5538 3806 -1096 852 1110 -1402 2423 2700 -4958 -5897 1583 1559
1692A559m443J939K78k330N208M169o424l134O148R02l849J265m68n621L193N889
$$ 1559 -2884 -945 -667 -2997 2211 6380 -44 -3178 2970 3872 23 1288 820 -4801 -1608 4281
1708D281n854n335N389K504j730K529M7n924L749Q339m215o973L137K058k285
$$ 4281 -1573 -6908 -1519 985 -745 1784 1831 -4093 -344 7995 3780 -3193 -56 2002 -283
1723b83J941m63p490Q47Q861j493p244K351L772j008L382J323p114K1Q855l85
$$ -283 1658 1195 -6295 -5448 3413 1920 -5324 -2973 799 -209 3173 4496 -2618 -2597 6258 5873
1739E873q162K51K653k386J709J997o574j759Q128J317n979J221L721j969K025
$$ 5873 -2289 -2038 615 -1771 -62 1935 -4639 -6398 1730 3047 -2932 -1711 2010 41 2066
1754B066L988n115m147N808J726o128l26K102l708N71M918k690m574M829L550
$$ 2066 6054 939 -3208 2600 4326 -1802 -2128 -26 -3734 -3163 1755 -935 -5509 -680 2870
1769B870l301J555K721l877p90O520j724o913J289K840k555M7J327m182r16P388
$$ 2870 -431 1124 3845 -32 -822 5698 3974 -2939 -1650 1190 -1365 -1318 9 -4173 -5089 2299
1785B299N99o046J543M559j083K64K185m541k347O088L10o946j010L696p89l47
$$ 2299 2898 -3148 -1605 2954 1871 2135 4320 -221 -2568 3520 3830 -3116 -4126 -430 -1219 -1566
1801a566J980l425j612O790K427n470j54M249p31r69J640k891l230M051J138n790
$$ -1566 414 -3011 -4623 2167 4594 -876 -1030 3219 2488 1519 3159 268 -2962 1089 2227 -3563
1817c563m47L859j037j621L359n85j842L797J983l110o15L498k104k632K213m21
$$ -3563 -4010 -151 -1188 -2809 550 -35 -1877 1920 3903 793 178 3676 1572 -1060 1153 732
1833G32l233P66J686l184M17L489j655k068M146J876k401J63J915j200l78J714
$$ 732 -2501 -1735 -49 -3233 -2816 673 -982 -3050 1096 2972 571 734 2649 1449 1071 2785
1849B785l034k751L462O81l853r32K435K05J0K184j785j299M401J786l914o84
$$ 2785 -249 -3000 462 1143 -2710 -3642 -1207 -1002 -992 1192 -593 -1892 2509 4295 381 -303
1865c03K279n16j021L41k525j894L769O28m193k61L808N32r79J273o71l89L312
$$ -303 1976 1460 439 780 -1745 -3639 130 758 -3435 -3696 112 644 -335 938 267 -122 3190
1882C190J78l886k67K953j537j802M39o92j025K265J7l179J541L947j473j260
$$ 3190 3368 -518 -785 2168 631 -1171 -732 -1424 -2449 -184 -167 -3346 -1805 2142 669 -591
1898e91J890R59j578J381l03k939Q88K188k767k558K640N66j662P83J020j669
$$ -591 1299 2258 680 2061 1758 -1181 -293 1895 -872 -3430 -790 -224 -1886 -1103 -83 -1752
1914a752J955K553k526j531L778P21l244q1J602k277K84J321k926k066M417J279
$$ -1752 203 2756 230 -1301 2477 3198 -46 -127 1475 -802 -518 803 -2123 -4189 228 1507
1930A507m069O50L202r96L70J777k287j361L827P88m674k24K844j575j652J553
$$ 1507 -2562 -1912 1290 294 664 2441 154 -1207 2620 3408 -1266 -1490 1354 -221 -1873 -320
1946c20j249j197L535O86m330J171M923j584k166K464l92k007K524N05m907K59
$$ -320 -1569 -2766 769 1455 -2875 -1704 3219 1635 -531 1933 1541 -466 2058 2563 -2344 -2085
1962b085M035k735k638K478J112k419K304J588l383Q66M939j998l607L111J259
$$ -2085 1950 -785 -3423 -945 167 -2252 52 1640 -1743 -877 4062 2064 -1543 1568 2827
1977B827l646L57K015l547l20L590k371l395M012K821m046L04L560j779n61L700
$$ 2827 -819 -462 1553 -1994 -2314 1276 -1095 -4490 -478 2343 -1703 -1399 2161 382 -179 3521
1993C521j536l735L172J840m994p10L600j595k957L322n68l073L649L003l953
$$ 3521 1985 -1750 1422 3262 -1732 -2442 1158 -437 -3394 -72 -640 -3713 -64 2939 -1014
2008a014p78M827m36l186K467K63l246J609J885m891j565N106o79m008K340K269
$$ -1014 -1792 3035 2599 -587 1880 2143 -1103 506 2391 -2500 -4065 1041 362 -3646 -1306 963
2024I63k439J798K667l166r37M959m57m515Q96K494l371m12K317k849j695M222
$$ 963 -1476 322 2989 -177 -1114 3845 3388 -1127 -231 2263 -1108 -1520 797 -2052 -3747 475
2040D75L43m196K117L750k440k89L403j478k493L290M79m679N55L059l387k010
$$ 475 818 -3378 -1261 2489 49 -240 3163 1685 -808 2482 2961 -1718 -1163 1896 -1491 -3501
2056c501L358m48k649K709J659k699J565L446k411j882L828L1l712Q56J045k863
$$ -3501 -143 -591 -3240 -531 1128 -1571 -6 3440 1029 -853 2975 3006 -706 150 1195 -1668
2072a668J3K583k890k257M188J345l185Q67K558j010K29L006k659k693L488J142
$$ -1668 -1655 928 -1962 -4219 -31 1314 -1871 -1004 1554 544 773 3779 1120 -1573 1915 3057
2088C057m291l75J735j641o98K129j469j994M057K027l321L71L079j091q11J835
$$ 3057 -1234 -1609 126 -1515 -2213 -84 -1553 -3547 510 2537 -784 -413 2666 1575 764 2599
2104B599j268k711J692J214l193q97K729j612j345K659M67j671J956J665k136
$$ 2599 1331 -1380 312 1526 -1667 -2564 165 -1447 -2792 -133 334 -1337 619 2284 148
2119A48L2K977j549k045J438M81k651M39K66j982Q25K244j515j933L009J844j627
$$ 148 180 3157 1608 -437 1001 1482 -1169 -730 -464 -2446 -1621 623 -892 -2825 184 2028 401
2136D01M36J250j616M62K156k318k561J715R42k309k92O45r96N46K619j216j574
$$ 401 837 2087 471 933 3089 771 -1790 -75 867 -1442 -1734 -1089 -2085 -1539 1080 -136 -1710
2153a710K536J516j510k0J123j418n16J743j249k628J272O95k206P39K007j253
$$ -1710 826 2342 832 812 1935 517 1 1744 495 -2133 -861 -166 -2372 -1633 374 -879
2169h79n20K162K49r40J465M71k016P68J820k319k158J685L75j637J102k52k263
$$ -879 -1399 763 1012 72 1537 2008 -8 760 2580 261 -1897 -212 163 -1474 -372 -624 -2887
2186b887J650L115j467k189K421J412j179P69Q0k634N80K875k285k665J375J069
$$ -2887 -1237 1878 411 -1778 643 2055 876 1645 1725 -909 -329 2546 261 -2404 -1029 40
2202D0j484J095L68k654J403L641j024k427J759P53j259J485N00l412p03L437
$$ 40 -1444 -349 19 -2635 -1232 2409 1385 -1042 717 1470 211 1696 2196 -1216 -1919 1518
2218A518j096k713J263O14j308J541J834k787p02L751L73k440J182J67k234J172
$$ 1518 422 -2291 -1028 -414 -1722 -181 1653 -1134 -1836 1915 2288 -152 1030 1197 -1037 135
2234A35K414l168k600K857R40k448J199O40k541J675L785k155k360K819J228k268
$$ 135 2549 -619 -3219 -362 578 -1870 -671 -31 -2572 -897 2888 733 -1627 1192 2420 152
2250A52Q84P64l518K00L916k152l546K056J411j948J482J701l334J84M431l08
$$ 152 1036 1800 -1718 -1518 2398 246 -3300 -1244 167 -1781 -299 1402 -1932 -1748 2683 2375
2266B375l503J275J453j908Q27J758l550j828M058R6l761J273J703j982J498K770
$$ 2375 -1128 147 1600 -308 519 2277 -1273 -3101 957 1053 -2708 -1435 268 -1714 -216 2554
2282B554k615k422M696J465l636l4J049k068P99K622l322l443L922J799l145K92
$$ 2554 -61 -2483 2213 3678 42 8 1057 -1011 -212 2410 -912 -4355 -433 1366 -1779 -1487
2298a487K000j389O33L622j806l926L373K704l430q72J649k388p34L014j170l602
$$ -1487 513 -876 -243 3379 1573 -2353 1020 3724 294 -578 1071 -1317 -2051 963 -207 -3809
2314c809K210K971k504j04K560j034j143L382J86l548J142K062k755j068K442
$$ -3809 -1599 1372 -1132 -1236 1324 290 -853 2529 2715 -833 309 2371 -384 -1452 990
2329I90j858k773L453J151k820N68K467j821M17L228j562l037K691K288l202j161
$$ 990 -868 -3641 -188 963 -1857 -1289 1178 -643 -226 3002 1440 -1597 1094 3382 180 -981
2345i81J629j925m14K682j586l728K936L601k314j261K121L3j55K384r01l837
$$ -981 648 -1277 -1691 991 -595 -4323 -1387 2214 -100 -1361 760 793 638 3022 2121 -1716
2361a716J918K708k865k309J496l61p45J867l47k622K341L387k094j618K334O28
$$ -1716 202 2910 45 -2264 -768 -1129 -1874 -7 -354 -2976 -635 2752 658 -960 1374 2002
2377B002j501J452k89l098P87K041k481j829K325L33j906J510J458j636R53J959
$$ 2002 501 1953 1664 -1434 -647 1394 -1087 -2916 -591 -258 -2164 -654 804 -832 121 2080
2393B080j310r59K721l42k951Q58J164j975o62Q99j500j58K625j69k706J641K706
$$ 2080 770 -189 2532 2190 -761 97 1261 -714 -1376 -477 -1977 -2135 490 321 -2385 -744 1962
2410A962q09o19Q00q00o5K159j207l644R16K304j331j983R37J97L27J993p44k252
$$ 1962 1153 534 1334 534 469 2628 1421 -2223 -1307 997 -334 -2317 -1380 -1183 -856 1137 393 -1859
2428a859K054K931j617j691R51M69r63P18p71k358R40K084k042j202J983O13p75
$$ -1859 195 3126 1509 -182 769 1238 275 993 222 -2136 -1196 888 -1154 -2356 -373 240 -535
2445e35J020M62j576J593J859k363j350K092Nk540P51M12j372O41Q62j855p7L386
$$ -535 485 947 -629 964 2823 460 -890 1202 1207 -1333 -582 -170 -1542 -901 -39 -1894 -1971 1415
2463A415j5k366R54J935r51q7R95k088r27K804r97l140O62K375j077n08N23r31
$$ 1415 1400 -966 -12 1923 972 885 1880 -208 -1135 1669 672 -2468 -1806 569 -508 -1016 -493 -1424
2481a424L26L234l61l293J373K661j634j289Q91o22o48J664p97l221J739K581
$$ -1424 -1098 2136 1775 -1518 -145 2516 882 -407 484 -138 -786 878 81 -3140 -1401 1180
2497A180j706j483K293P9m17J776m44k124J297J915k511j555K543O8k316O38M92
$$ 1180 -526 -2009 284 363 -54 1722 1278 -846 451 2366 -145 -1700 843 911 -1405 -767 -275
2514b75j734J152K444k457j335L331Q95k485O83J249j291M51J262k793j032L085
$$ -275 -2009 -857 1587 -870 -2205 1126 2021 -464 219 1468 177 628 1890 -903 -1935 1150
2530A150J56l694L71K378j024K30J491j567j099L586M29l541O15K605j271j500
$$ 1150 1306 -2388 -2017 361 -663 -433 1058 -509 -1608 1978 2407 -1134 -519 2086 815 -685
2546f85J018q76j439K600J42l368N51L547j331j316J547N03j359J698Q45l014
$$ -685 333 -543 -1982 618 760 -2608 -2057 1490 159 -1157 390 893 -466 1232 2077 -937
2562i37K77L254k056k782K033N20j823O44J055k234Q55L115j323k535L054J592
$$ -937 -660 2594 538 -2244 -211 309 -1514 -870 185 -2049 -1194 1921 598 -1937 1117 2709
2578B709k430k26J342j598j34K158k042k917K619J900k778m21J954o18J45K003
$$ 2709 279 53 1395 -203 -337 1821 -221 -3138 -519 1381 -1397 -1818 136 -482 -337 1666
2594A666q27k067K624J579k944j064K443p94j881J349o28j967K036J855l017o02
$$ 1666 839 -1228 1396 2975 31 -1033 1410 616 -1265 84 -544 -2511 -475 1380 -1637 -2239
2610b239L529J0k018J549Q70j755J104J342l112q57K863o77k944R01J596j366
$$ -2239 1290 1300 -718 831 1701 -54 1050 2392 -720 -1577 1286 609 -2335 -1434 162 -1204
2626a204M48J434j645l04L324R3l364J543K214j873q78P74j624n15K505j067k977
$$ -1204 -756 678 -967 -1271 2053 2146 -1218 325 2539 666 -212 562 -1062 -1577 928 -139 -3116
2643c116J420K725j443n97J293m2k65J930M8k614P47J856j745j800J816o53j227
$$ -3116 -1696 1029 -414 -1011 282 240 -25 1905 1953 -661 86 1942 197 -1603 213 -440 -1667
2660a667J269J50k222J733K236j394j179K580L13j938J085L86j533L88R64k013
$$ -1667 -398 -248 -2470 -737 1499 105 -1074 1506 1819 -119 966 1352 -181 207 1171 -842
2676h42j635K625N3j821M20J492p36L21J683j780j40K552j15k500P3J484j147
$$ -842 -2477 148 201 -1620 -1200 292 -444 -123 1560 -220 -360 2192 2077 -423 -350 1134 -13
2693a3l00M52j369q94K645n1k464Q95J923m31K30N32n48p38J762q8k400K76J324
$$ -13 -313 139 -1230 -2124 521 470 -1994 -1099 824 393 623 1155 607 -131 1631 1543 -857 -581 743
2712G43j165r50J029p10o40J840M10j326R42J477j148m28J688m41j575O99K5j535
$$ 743 -422 -1372 -343 -1053 -1693 147 557 -769 173 1650 502 74 1762 1321 -254 445 470 -1065
2730a065M28R45j539p92K148J12j367R60R49p28Q34J193k193n08K086K07k540
$$ -1065 -637 308 -1231 -2023 125 237 -1130 -170 779 51 885 2078 -115 -623 1463 1670 -870
2747h70J64K21n40N82P41j494r22K379N22j413P18R81p37J33J348j678r14J573
$$ -870 -706 -485 -1025 -443 298 -1196 -2118 261 783 -630 88 1069 332 465 1813 135 -779 794
2765G94M05k148j16J053j249J35J979j392j325K452Q06j652P69J282j784k60J737
$$ 794 1199 -949 -1065 -12 -1261 -1126 853 -539 -1864 588 1394 -258 511 1793 9 -251 1486
2782A486q33j683P06N27j572O17J247j622n44K507J32k071J150J098j457Q42J376
$$ 1486 653 -1030 -324 203 -1369 -752 495 -1127 -1671 836 968 -1103 47 1145 -312 530 1906
2799A906k008j158K396Kk499N68P94j240N08J705j514j260K404R78j889N95R58
$$ 1906 -102 -1260 1136 1138 -1361 -793 1 -1239 -731 974 -540 -1800 604 1582 -307 288 1246
2816A246j285P2J593j152k121J626R21k084j08J543j448K15K164o03j933J497
$$ 1246 -39 33 1626 474 -1647 -21 900 -1184 -1292 251 -1197 -982 1182 579 -1354 143
2832A43J601j784K87J185j672o44K270q29k238R10J322j333k48J784j661n96K415
$$ 143 1744 -40 247 1432 -240 -884 1386 557 -1681 -771 551 -782 -1030 754 -907 -1503 912
2849I12N53k144P76J603j250k46J337j530j745K413J40k146p4J557r88l97K204
$$ 912 1465 -679 97 1700 450 204 1541 11 -1734 679 819 -1327 -1401 156 -832 -1229 975
2866I75p24j649K079J271k076M1J448r61q70J563o74k285J154J608k012j32J565
$$ 975 251 -1398 681 1952 -124 -83 1365 404 -466 1097 423 -1862 -708 900 -1112 -1244 321
2883C21p95o93K206J33j839R37J678j440q28J475j294j271J644N37k496N5J992
$$ 321 -474 -1167 1039 1172 -667 270 1948 508 -320 1155 -139 -1410 234 771 -1725 -1670 322
2900C22q34l38J278k63j103K092J056k446M8J815j323n48R49o37k120J855N19
$$ 322 -512 -850 428 165 -938 1154 2210 -236 -188 1627 304 -244 705 68 -2052 -197 322
2917C22j679k92J870j16r22J579J43j485J468J124j871m76J201o62j393J168k7
$$ 322 -1357 -1649 221 105 -817 762 905 -580 888 2012 141 -335 866 204 -1189 -21 -48
2934d8j574P04J000j015k46K172n57j077J773M50j775L03J234j219p41J059p33
$$ -48 -1622 -918 82 -933 -1179 993 436 -641 1132 1582 -193 110 1344 125 -616 443 -290
2951b90j582J115J108j506j21J447q1k17J443m74j228J371J001j775p65J089l57
$$ -290 -1872 -757 351 -1155 -1276 171 90 -127 1316 842 -386 985 1986 211 -554 535 178
2968A78j047N89l78j306J662J081j513l85J666K27o41R19N8j498J055Q60j814
$$ 178 -869 -280 -658 -1964 -302 779 -734 -1119 547 774 133 1052 1110 -388 667 1527 -287
2985b87p29J139l70r65M97K79p03P15J272j201n9J712j57j303J008L55j262N0
$$ -287 -1016 123 -247 -1212 -715 -436 -1139 -424 848 -353 -412 1300 1143 -160 848 1203 -59 -9
3003iK49j159J7R81l54j535J289J216r76k09J292n80J01J201o05j383Q48R81j707
$$ -9 240 -919 -902 79 -275 -1810 -521 695 -281 -490 802 222 323 1524 919 -464 384 1365 -342
3022c42m56N27m74j25J081m44j281J354J360j233m83J355K2n69Q41p12j265R93
$$ -342 -798 -271 -745 -870 211 -233 -1514 -160 1200 -33 -516 839 861 292 1133 421 -844 149
3040A49Q68j439j159J342p8n79R44K5r32R48J355j090o76J698l61j274O23K83
$$ 149 1017 -422 -1581 -239 -317 -896 48 73 -859 89 1444 354 -322 1376 1015 -259 364 647
3058F47j317O45N29j615j43J956o83j276J059J304r25j93R49q82l13K075r71k114
$$ 647 -670 -25 504 -1111 -1254 702 19 -1257 -198 1106 181 -12 937 55 -258 1817 846 -1268
3076a268R48J069j321l88Q90p98m00J829l33j845J618J592j248o17J267n38p53
$$ -1268 -320 749 -572 -960 -70 -868 -1268 561 228 -1617 1 1593 345 -272 995 457 -296
3093b96J428q90j404M38J583j018j098J313j80q46J316L25j390R89J640j492j071
$$ -296 1132 242 -1162 -724 859 -159 -1257 56 -124 -970 346 671 -719 270 1910 418 -653
3110f53J789j96j225K53M93j672L48J426j343q64J811Q02j873P23J275q22K14
$$ -653 1136 940 -285 -32 461 -1211 -863 563 -780 -1644 167 969 -904 -181 1094 272 486
3127D86P88j245q29J991m7k152J47J398j145M4Q26p43q49K034L94k069P08J714
$$ 486 1274 29 -800 1191 1144 -1008 -861 537 -608 -564 262 -481 -1330 704 1098 -971 -263 1451
3145A451n74j060J256m49j401J202L67j966k51K308j191j079J375Q3n71J148P33
$$ 1451 877 -183 1073 624 -777 425 792 -1174 -1425 883 -308 -1387 -12 71 -500 648 1381
3162A381j894L70J794r87j372J021M39j279L48K61j193n2J555m57j437J595J045
$$ 1381 -513 -143 1651 664 -708 313 752 -527 -179 82 -1111 -1163 392 -65 -1502 93 1138
3179A138j284J68R98r87p0J397r86j566J115J298j975o69J335m69n55J752n72
$$ 1138 -146 22 1020 33 -37 1360 374 -1192 -77 1221 -754 -1423 -88 -557 -1112 640 68
3196F8j281J642J346j528l01J061p7q30M23m57r65O21Q18j618q64K022K06j114
$$ 68 -1213 429 1775 247 -54 1007 930 100 523 66 -899 -278 540 -1078 -1942 80 286 -828
3214h28R96J47n01J022Q59j333o71J725p73j632P76M28j124N63M98r71n01J942
$$ -828 168 315 -186 836 1695 362 -309 1416 643 -989 -213 215 -909 -346 152 -819 -1320 622
3232F22m7j281P94J522j113j64P82j012n52J312p41j688P22J390j077m53P32q1
$$ 622 575 -706 88 1610 497 333 1115 103 -449 863 122 -1566 -844 546 -531 -984 -252 -333
3250c33LJ165j89j260J017J089j138o02N51j30r38R50o34j354J080J175r62n62
$$ -333 -330 835 646 -614 403 1492 354 -248 303 173 -765 185 -449 -1803 -723 452 -510 -1072
3268a072J308K29l82Q31J51j441Q04Q09j145p78J130m12j184N01L05o64N16O69
$$ -1072 236 465 83 914 1065 -376 428 1237 92 -686 444 32 -1152 -651 -346 -1010 -494 175
3286A75n03k54J707l02q47N70O25j023J0K65r27k33J131l56j513O61R16l23k39
$$ 175 -328 -582 1125 823 -24 546 1171 148 158 423 -504 -737 394 38 -1475 -814 102 -221 -460
3305d60Q67o61Q0J666l52j698O66Q32q97n33M39o55l37J335l91j167P30J295q04
$$ -460 407 -254 -174 1492 1140 -558 108 940 43 -490 -51 -706 -1043 292 -99 -1266 -536 759 -45
3324d5j50R39l33m85J143k02j171j21J405j483l53R38j76r89Q57M79r39Q60Q77
$$ -45 -195 744 411 -74 1069 867 -304 -425 980 -503 -856 82 -94 -1083 -226 253 -686 174 1051
3343A051j117k12J727o18j179O85K84q21r6N34r99m70J693l23j395N41J494p73
$$ 1051 -66 -278 1449 831 -348 337 621 -200 -296 238 -761 -1231 462 139 -1256 -715 779 6
3361FP0Q95j025j27J631m53j634P4J350j079m64R23o19q77J469M29j759O31J525
$$ 6 76 971 -54 -181 1450 997 -637 -563 787 -292 -756 167 -452 -1329 140 569 -1190 -559 966
3380I66o09n22J154p39n37J006K23j791J22J317r79n43R07j41r94J275P23j475
$$ 966 357 -165 989 250 -287 719 942 -849 -727 590 -389 -932 -25 -166 -1160 115 838 -637
3398f37M31J157n35o71J351l30j460P22R16j341l82J177q77r90J735L56j733P19
$$ -637 -206 951 416 -255 1096 766 -694 28 944 -397 -779 398 -479 -1469 266 622 -1111 -392
3416c92J167n47j12J016n96j326J578M07k024J03J113o40q52J244n73q85J556
$$ -392 775 228 116 1132 536 -790 788 1195 -829 -726 387 -253 -1105 139 -434 -1319 237
3433B37N19r91j75J558p17l48J023l41j502Q19P47j597k53J212o87o56J227K75
$$ 237 756 -235 -410 1148 431 83 1106 765 -737 82 829 -768 -1021 191 -496 -1152 75 350
3451C50j395R29J330j317j8R70j7j157J110L82j825L7Q23q01m14J064m21p68J164
$$ 350 -1045 -116 1214 -103 -121 849 832 -325 785 1167 -658 -621 202 -599 -1013 51 -370 -1138 26
3470B6P25j074PJ410m65p94J169n05q52L17J103j972k55J261n12p45J404j78r48
$$ 26 751 -323 -316 1094 629 -165 1004 499 -353 -36 1067 -905 -1160 101 -411 -1156 248 70 -878
3489h78J019P03n14n61J309o48n35P88m8j381J43R66j004n30J200k15p38J411
$$ -878 141 844 330 -231 1078 430 -105 683 635 -746 -603 363 -641 -1171 29 -186 -924 487
3507D87M01j178K11J177l83o53P45m90r78Q88L22j551l1R76l30o24J063Mn05R28
$$ 487 888 -290 -79 1098 715 62 807 317 -661 227 549 -1002 -1033 -57 -387 -1011 52 56 -449 479
3527D79O11j130J26R28o30l84K49j66q85L35P19j118P8P06m3m87J225J75q18L37
$$ 479 1090 -40 86 1014 384 0 249 83 -802 -467 252 -866 -788 -82 -125 -612 613 788 -30 307
3547C07P25o80k43M55k17j229R66J18j310J09J109l99o54J182k90k43J013N00
$$ 307 1032 352 109 564 347 -882 84 202 -1108 -999 110 -289 -943 239 -51 -294 719 1219
3565A219j231J46N61l60o84P25l05j132P19L68j038k07J289J29n02O39p7n38J028
$$ 1219 -12 134 695 335 -349 376 71 -1061 -342 26 -1012 -1219 70 199 -303 336 259 -279 749
3584G49N18r98n44J062o70n11L17K1r94N14Q87q56l02J243L8p50Q55K65q66N66
$$ 749 1267 269 -275 787 117 -394 -77 -56 -1050 -536 351 -505 -807 436 474 -276 579 844 -22 544
3604E44M62r61m12P63p07p65J029J34q04R0R34o98O7J129n6j201Q55Q10j248k8
$$ 544 1006 45 -367 396 -311 -1076 -47 87 -717 -627 307 -391 -324 805 749 -452 403 1213 -35 -63
3624f3Q13r61o39Q88k78q72Q03P41r61k90J376j15l00P97n32q71Q32J097j705
$$ -63 750 -211 -850 38 -240 -1112 -309 432 -529 -819 557 442 142 939 407 -464 368 1465 -240
3643b40n39J128m24p14Q26k05j247J266J300j694k25J427K53r60O77L36j437L10
$$ -240 -779 349 -75 -789 37 -168 -1415 -149 1151 -543 -768 659 912 -48 629 965 -472 -162
3661a62J049j125m74R81q3j270Q93M71j081K85J084m87m98J479k70j361O51J037
$$ -162 887 -238 -712 269 186 -1084 -191 280 -801 -516 568 81 -417 1062 792 -569 82 1119
3679A119j195m96R04n49p37J326j91j262Q36R07p09n72J190l10m50J136j10j714
$$ 1119 -76 -572 332 -217 -954 372 181 -1081 -245 662 -47 -619 571 261 -189 947 837 -877
3697h77N48J259j246p02R22r5m19K10N46j176M76J382o20n26J044Q4j057O55L83
$$ -877 -329 930 -316 -1018 -96 -191 -610 -400 146 -1030 -554 828 208 -318 726 810 -247 408 791
3716G91j243P1J021j074r20J576K08j315O29P69j089L11J037o83l61J220o4j441
$$ 791 -452 -381 640 -434 -1354 222 430 -885 -256 513 -576 -265 772 89 -272 948 884 -557
3734e57K83J051r48n66O73k51j040J368P39j720J36J705q35m07J086j16q78P91
$$ -557 -274 777 -171 -737 -64 -315 -1355 13 752 -968 -832 873 38 -369 717 601 -277 514
3752E14M44j509Q2J233r42j101Q19K18m09N93N49j281L81J654m38j197P80L58
$$ 514 958 -551 -469 764 -178 -1279 -460 -242 -651 -58 491 -790 -409 1245 807 -390 390 748
3770G48q30J33N45j260J43P76m69j122J069N01r35M10J156p21o2R19n49r77J159
$$ 748 -82 51 596 -664 -521 255 -214 -1336 -267 234 -701 -291 865 144 82 1001 452 -525 634
3789F34R7j252k57J177r79k21P08l50n82J017O76j043J58J136k22n12P56l67r95
$$ 634 731 -521 -778 399 -580 -801 -93 -443 -1025 -8 668 -375 -217 919 697 185 941 574 -421
3808d21P09N46j507m56J268k18p73N56M18o94O58Q78j028J1J274p82m47L52q5
$$ -421 288 834 -673 -1129 139 -79 -852 -296 122 -572 86 964 -64 -53 1221 439 -8 344 259
3827B59q10N44L47j154j97J065l1r19R08N82o94K55Q15n34r5M61l14j148Q09K47
$$ 259 -551 -7 340 -814 -1011 54 23 -896 12 594 -100 155 970 436 341 802 488 -660 149 396
3847C96j075j86O16r4l30P88j09p01R66O43p96k24J076n23m37N51o25q13O15N28
$$ 396 -679 -865 -249 -343 -673 115 6 -695 271 914 118 -106 970 447 10 561 -64 -877 -262 266
3867B66q10m84J183l17k40N77K99p45O59P67r99n20J051m27p42O03j03q36M40
$$ 266 -544 -1028 155 -162 -402 175 474 -271 388 1155 156 -364 687 260 -482 121 18 -818 -378
3886c78L96o63k33J037J54p27N05O72o04J87M55q26l58O24j8j261P20M71q77n0
$$ -378 18 -645 -878 159 313 -414 91 763 159 346 801 -25 -383 241 223 -1038 -318 153 -724 -774
3906g74J067o64m0J116k35j068J016P20j076n37J287n33r01Q23rj088M43O69o72
$$ -774 293 -371 -411 705 470 -598 418 1138 62 -475 812 279 -622 201 192 -896 -453 216 -456
3925d56l03J028l6m25R13K7j059L95Q42r45n82J044m01j031J040j54o97J56J251
$$ -456 -759 269 233 -192 721 748 -311 84 926 -19 -601 443 42 -989 51 -103 -800 -644 607
3944F07j099j86J167K07j222R87M15j017J02Q45j095n91J264M2j298K27J072q36
$$ 607 -492 -678 489 696 -526 461 876 -141 -39 806 -289 -880 384 426 -872 -645 427 -409
3962d09rJ076m92p24J139K05j143L46J043r10m20R10p28p19Q82K32j297N83J064
$$ -409 -418 658 166 -558 581 786 -357 -11 1032 122 -298 612 -116 -835 47 279 -1018 -435 629
3981F29o60n81J172k23n89P96L24j121J05R79q78r18J191k00r98P41N20j009J39
$$ 629 -31 -612 560 337 -252 544 868 -253 -148 831 -47 -965 226 26 -972 -231 289 -720 -581
4000e81J126l90n93R40K23j121P16O48q00n92J007o78r42P40M59j219N24J075
$$ -581 545 155 -438 502 725 -396 320 968 168 -424 583 -95 -1037 -297 162 -1057 -533 542
4018E42p74l03J209k2p77P79Q3j062K95O33o67m55P47j18j207P89M58p44K03Q24
$$ 542 -232 -535 674 652 -125 654 737 -325 -30 603 -64 -519 228 110 -1097 -308 150 -594 -391 433
4038D33l22l25O17K88r06Q72K05j106j54O70k14q07Q31k22q42O70R89r23k60J292
$$ 433 111 -214 403 691 -215 657 862 -244 -398 272 58 -749 82 -140 -982 -312 677 -246 -506 786
4058G86l76m89Q72K23j301N80M25q33q27J372n17n92M93L55r76L03J216n47l15
$$ 786 410 -79 793 1016 -285 295 720 -113 -940 432 -85 -677 -184 171 -805 -502 714 167 -148
4077a48O77on60L83N29j168j63O50l71q81R24nj022Q59N83o10r5J161j43m50O32
$$ -148 529 523 -37 346 875 -293 -456 194 -177 -1058 -134 -139 -1161 -302 281 -329 -424 737 594 144 776
4098G76j20j046M70M26q52n45R12l28q06J178j36n18L55R49n48j77Q93m89n06
$$ 776 656 -390 80 506 -346 -891 21 -307 -1113 65 -71 -589 -234 715 167 -10 883 394 -112
4117a12O10j54r22P8N64k91q69O53J17n53R72L97r25L49J125l44n88M92N1q13
$$ -112 498 344 -578 -500 64 -227 -1096 -443 -326 -879 93 490 -435 -86 1039 695 107 599 650 -163
4137a63K76M32j373J23Q10n86k67L69M83p69R20P29j106oJ157p02m77M51K46j226
$$ -163 113 545 -828 -705 105 -481 -748 -379 104 -665 255 984 -122 -128 1029 327 -150 301 547 -679
4157f79L12N31q47k67R44k2n11P94O77j158R8J308q74k89P77m06o12L61o5r58
$$ -679 -367 164 -683 -950 -6 -28 -539 255 932 -226 -128 1180 306 17 794 388 -224 137 72 -886
4177h86J75R53l50m19O30k8o80J007M37j175K35R94k29r56O75j78p62L13N77j397
$$ -886 -711 242 -108 -527 103 75 -605 402 839 -336 -101 893 664 -292 383 205 -557 -244 333 -1064
4197a064J18J284k84m13P33J23r63R54N39r10m71R60k20p13L81J5n94L73M73p64
$$ -1064 -946 338 54 -359 374 497 -466 488 1027 117 -354 606 386 -327 54 69 -525 -152 321 -443
4217d43o12J005K97q13Q32P36j357N41P17n84o03N73j24q21P50K72j346M11R61
$$ -443 -1055 -50 247 -566 266 1002 -355 186 903 319 -284 289 165 -656 94 366 -980 -569 392
4236C92o76k55Q25M5o80P43N53j003kP54k27q10M35J30j024O79N28j215K48R72
$$ 392 -284 -539 286 331 -349 394 947 -56 -58 696 469 -341 94 224 -800 -121 407 -808 -560 412
4256D12j10p65R31J34o29K78Q50j136k49O45L2j124M86K66p36p1J192p35l13J329
$$ 412 302 -463 468 602 -27 251 1101 -35 -284 361 393 -731 -245 21 -715 -786 406 -329 -642 687
4276F87r9r66O23P91r44j80O98n66m20N97j17r53L68J084j439J29J154m43n14
$$ 687 588 -378 245 1036 92 -88 610 44 -376 221 104 -849 -481 603 -836 -707 447 4 -510
4295e10R89K21q44M08Q87r88o74Q26j18j011R17K81r80j59J134p40l29J015L08
$$ -510 479 700 -144 264 1151 163 -511 315 197 -814 103 384 -596 -755 379 -361 -690 325 633
4314F33q80K55Q58r57k0R75r32q17J152k00j042M69Q30j044J0J027l13l60Q85
$$ 633 -247 8 866 -91 -111 864 -68 -885 267 67 -975 -506 324 -720 -710 317 4 -356 529
4333E29J81o50R2P31r46o7N60o55p63P09M67j006J08J090m83k68Q60J59r07Q83
$$ 529 710 60 152 883 -63 -130 430 -225 -988 -279 188 -818 -710 380 -103 -371 489 648 -259 624
4353F24N66j266J97O52o14o75P51l92p26O07N38j041K06J192l04q40R27L05n57
$$ 624 1190 -76 121 773 159 -516 235 -157 -883 -276 262 -779 -573 619 315 -525 402 707 150
4372A50L40K00q50M9N70o62p11N22K77o09J82N96j96k10J103k20o39P25J79p83
$$ 150 490 690 -160 -111 459 -203 -914 -392 -115 -724 -542 54 -142 -352 751 531 -108 617 796 13
4392A3J68M51r13k32N42k20q65P15L91o86L39Q43l56l35R04j11o62O27J83r43
$$ 13 181 632 -281 -513 29 -191 -1056 -341 50 -636 -297 546 190 -145 759 648 -14 613 796 -147
4412a47j28R15p32p81M90J16m97M85M07m77L45J020m50o74P59K30p98k30N85r27
$$ -147 -275 640 -92 -873 -383 -267 -764 -279 128 -349 -4 1016 566 -108 651 881 83 -147 438 -489
4432d89j91J049o13p82P34K90l12rJ081r53l4J244l73p35M89J13p05j65O66q95
$$ -489 -680 369 -244 -1026 -292 -2 -314 -323 758 -195 -229 1015 642 -93 396 509 -196 -361 305 -590
4452e90j22R57n05o96R04P53r67K64N95k91l00O53k26p74M44L01j104LN46j98
$$ -590 -712 245 -260 -956 -52 701 -266 -2 593 302 2 655 429 -345 99 400 -704 -701 -155 -353
4472c53m89Q23J03o73N68O13n63J52N36l40n19L83N5o08J39J07n21l00J153m85
$$ -353 -842 -19 84 -589 -21 592 29 181 717 377 -142 241 296 -312 -173 -66 -587 -887 266 -219
4492b19k78O34L52n13K04R35q51l67P92j43q73L39L71q78N3M19o49m8R24J25q45
$$ -219 -497 137 489 -24 180 1115 264 -103 689 546 -327 12 383 -495 -442 -23 -672 -720 204 329 -516
4513e16P35N44q44R6M65k95k10K69J34j074M08N10q85k05Q91k32m48R98k03l08
$$ -516 219 763 -81 15 480 185 -25 244 378 -696 -288 222 -663 -868 23 -209 -657 341 138 -170
4533a70K61J056r42l32Q36m39p44O07K95j185K58P55n77l56R72k16q02P39M87
$$ -170 91 1147 205 -127 709 270 -474 133 428 -757 -499 256 -321 -677 295 79 -723 16 503
4552E03o67L09P55q30k29M89J34j211O84J85n81j47P73m50n68R41M36q84M05Q41
$$ 503 -164 145 900 70 -159 330 464 -747 -63 122 -459 -606 167 -283 -851 90 526 -358 47 888
4572H88j213q5J052n61o05O53J87j064K61Q60q13j18P37j53k07N99K78r60L79
$$ 888 -325 -410 642 81 -524 129 316 -748 -487 373 -440 -558 179 26 -181 418 696 -264 115
4591A15P85p98m42Q32k51p99M59M19j154J07J035o06k11Q39J99q71Q33L83r66
$$ 115 900 102 -340 492 241 -558 -99 320 -834 -727 308 -298 -509 330 529 -342 491 874 -92
4610i2J42Q76n73q23N26L18j094M74L89o47j99N95Q9n42Q00J63n46K52R44o33
$$ -92 50 926 353 -470 56 374 -720 -246 143 -504 -703 -108 -19 -561 239 402 -144 108 1052 419
4630D19p04O25k13p79N42L56j227M62Q91o05n23R66L32o37O92K53q46QQ22n68
$$ 419 -285 340 127 -652 -110 246 -981 -519 372 -233 -756 210 542 -95 597 850 4 12 834 266
4650B66q85N87k1p93M43N12o97m8J082l83o33J126K82p85L08O45p16m78O14j48
$$ 266 -619 -32 -53 -846 -403 109 -588 -636 446 63 -570 556 838 53 361 1006 290 -188 426 278
4670B78j049M15L07r85N10O20m82j58Q16L32o77P71n0q41M11N10o75n74O54q5
$$ 278 -771 -356 -49 -1034 -524 96 -386 -544 272 604 -73 698 648 -193 218 728 53 -521 133 48
4690D8j049O16M67p24J00J100m29l99Q45J66p57N35L25q00k04L75l75m99M21L46
$$ 48 -1001 -385 82 -642 -542 558 129 -270 575 741 -16 519 844 44 -160 215 -160 -659 -238 108
4710A08q43M35O06p11j23Q90L0k78K84J14n43K79L68r14l87P92k64o43O02J28
$$ 108 -735 -300 306 -405 -528 362 392 114 398 512 -31 248 616 -298 -685 107 -157 -800 -198 -70
$$ [...]
16383a52
##END NTUPLES=NMR FID
##END=
