##TITLE=abcd
##JCAMPDX= 6.0         $$ Bruker NMR JCAMP-DX V2.0
##DATA TYPE= NMR FID
##DATA CLASS= NTUPLES
##ORIGIN= UXNMR, Bruker Analytische Messtechnik GmbH
##OWNER= root
$$ XWIN-NMR		Version 3.5
$$ Tue Jul 22 17:33:02 2025 Russian Standard Time (UT+4h)  servis@DPX200
##.OBSERVE FREQUENCY= 200.131235884673
##.OBSERVE NUCLEUS= ^1H
##.DELAY= (6, 6)
##.ACQUISITION MODE= SIMULTANEOUS
##.ACQUISITION SCHEME= undefined
##.AVERAGES= 16
##.DIGITISER RES= 18
##SPECTROMETER/DATA SYSTEM= spect
##.PULSE SEQUENCE= zg
##.SOLVENT NAME= CDCl3
##.SHIFT REFERENCE= (INTERNAL, CDCl3, 0, 16.5164)
##AUDIT TRAIL= $$ (NUMBER, WHEN, WHO, WHERE, WHAT)
$$ ##TITLE= Audit trail, XWIN-NMR		Version 3.5
$$ ##JCAMPDX= 5.01
$$ ##ORIGIN= Bruker BioSpin GmbH
$$ ##OWNER= servis
$$ F:\spectra/data/av/nmr/H1/1/audita.txt
$$ ##AUDIT TRAIL=  $$ (NUMBER, WHEN, WHO, WHERE, WHAT)
(   1,<2025-07-22 17:32:33.82 +0400>,<servis>,<DPX200>,
      <created by zg, POWCHK disabled, PULCHK disabled
       terminated by command 'halt'
       configuration hash MD5:
       00 E9 B6 7A A2 85 ED C7 34 08 36 98 17 FE 4E 26
       data hash MD5: 32K
       AA D1 D7 C4 78 0D 65 AE F9 C0 8C 14 2E 01 F2 69>)
$$ ##END=
$$ 
$$ hash MD5
$$ E2 DD 09 31 C1 1B A9 83 F3 FC 6E 75 F0 F5 A5 37
##$RELAX= 
##$RELAX= 
##$RELAX= 
##$RELAX= 
##$RELAX= 
##$RELAX= 
##$RELAX= 
##$RELAX= 
$$ Bruker specific parameters
$$ --------------------------
##$DU= <F:\spectra>
##$EXPNO= 1
##$NAME= <H1>
##$PROCNO= 1
##$TYPE= <nmr>
##$USER= <av>
##$AMP= (0..31)
100 100 100 100 100 100 100 100 100 100 100 100 100 100 100 100 100 100 
100 100 100 100 100 100 100 100 100 100 100 100 100 100 
##$AQSEQ= 0
##$AQ_mod= 1
##$AUNM= <au_zg>
##$AUTOPOS= <>
##$BF1= 200.13
##$BF2= 200.13
##$BF3= 200.13
##$BF4= 200.13
##$BF5= 500.13
##$BF6= 500.13
##$BF7= 500.13
##$BF8= 500.13
##$BYTORDA= 1
##$CFDGTYP= 0
##$CFRGTYP= 5
##$CHEMSTR= <none>
##$CNST= (0..31)
1 1 145 1 1 1 1 1 1 1 1 1 1 1 1 1 1 1 1 1 1 1 1 1 1 1 1 1 1 1 1 1 
##$CPDPRG= <>
##$CPDPRG1= <>
##$CPDPRG2= <>
##$CPDPRG3= <>
##$CPDPRG4= <mlev>
##$CPDPRG5= <mlev>
##$CPDPRG6= <mlev>
##$CPDPRG7= <mlev>
##$CPDPRG8= <mlev>
##$CPDPRGB= <>
##$CPDPRGT= <>
##$D= (0..31)
0 2 0 0 0 0 0 0 0 0.06 0 0 0 0 0 0 0.0002 0 0 0 0 0 0 0 0 0 0 0 0 0 0 
0 
##$DATE= 1753191153
##$DBL= (0..7)
120 120 120 120 120 120 120 120 
##$DBP= (0..7)
150 150 150 150 150 150 150 150 
##$DBP07= 0
##$DBPNAM0= <>
##$DBPNAM1= <>
##$DBPNAM2= <>
##$DBPNAM3= <>
##$DBPNAM4= <>
##$DBPNAM5= <>
##$DBPNAM6= <>
##$DBPNAM7= <>
##$DBPOAL= (0..7)
0.5 0.5 0.5 0.5 0.5 0.5 0.5 0.5 
##$DBPOFFS= (0..7)
0 0 0 0 0 0 0 0 
##$DE= 6
##$DECBNUC= <off>
##$DECIM= 32
##$DECNUC= <off>
##$DECSTAT= 4
##$DIGMOD= 1
##$DIGTYP= 9
##$DL= (0..7)
0 120 120 120 120 120 120 120 
##$DP= (0..7)
150 150 150 150 150 150 150 150 
##$DP07= 0
##$DPNAME0= <>
##$DPNAME1= <>
##$DPNAME2= <>
##$DPNAME3= <>
##$DPNAME4= <>
##$DPNAME5= <>
##$DPNAME6= <>
##$DPNAME7= <>
##$DPOAL= (0..7)
0.5 0.5 0.5 0.5 0.5 0.5 0.5 0.5 
##$DPOFFS= (0..7)
0 0 0 0 0 0 0 0 
##$DQDMODE= 0
##$DR= 18
##$DS= 0
$$ [...]
##$SUBNAM0= <"">
##$SUBNAM1= <"">
##$SUBNAM2= <"">
##$SUBNAM3= <"">
##$SUBNAM4= <"">
##$SUBNAM5= <"">
##$SUBNAM6= <"">
##$SUBNAM7= <"">
##$SUBNAM8= <"">
##$SUBNAM9= <"">
##$SW= 20.6817932712277
##$SWIBOX= (0..15)
0 0 3 0 0 0 0 0 0 0 0 0 0 0 0 0 
##$SW_h= 4139.07284768212
##$TD= 32768
##$TD0= 1
##$TE= 0
##$TE2= 300
##$TE3= 300
##$TEG= 300
##$TL= (0..7)
0 120 120 120 120 120 120 120 
##$TP= (0..7)
150 150 150 150 150 150 150 150 
##$TP07= 0
##$TPNAME0= <>
##$TPNAME1= <>
##$TPNAME2= <>
##$TPNAME3= <>
##$TPNAME4= <>
##$TPNAME5= <>
##$TPNAME6= <>
##$TPNAME7= <>
##$TPOAL= (0..7)
0.5 0.5 0.5 0.5 0.5 0.5 0.5 0.5 
##$TPOFFS= (0..7)
0 0 0 0 0 0 0 0 
##$TUNHIN= 0
##$TUNHOUT= 0
##$TUNXOUT= 0
##$USERA1= <user>
##$USERA2= <user>
##$USERA3= <user>
##$USERA4= <user>
##$USERA5= <user>
##$V9= 5
##$VALIST= <valist>
##$VCLIST= <CCCCCCCCCCCCCCC>
##$VD= 0
##$VDLIST= <DDDDDDDDDDDDDDD>
##$VPLIST= <PPPPPPPPPPPPPPP>
##$VTLIST= <TTTTTTTTTTTTTTT>
##$WBST= 1024
##$WBSW= 30
##$XGAIN= (0..3)
0 0 0 0 
##$XL= 0
##$YL= 0
##$YMAX_a= 912632
##$YMIN_a= -839121
##$ZGOPTNS= <>
##$ZL1= 120
##$ZL2= 120
##$ZL3= 120
##$ZL4= 120
##$ABSF1= 10
##$ABSF2= 0
##$ABSG= 5
##$ABSL= 3
##$ALPHA= 0
##$AQORDER= 0
##$ASSFAC= 0
##$ASSFACI= 0
##$ASSFACX= 0
##$ASSWID= 0
##$AUNMP= <proc_1d>
##$AZFE= 0.1
##$AZFW= 0.1
##$BCFW= 1
##$BC_mod= 2
##$BYTORDP= 0
##$COROFFS= 0
##$CY= 19
##$DATMOD= 1
##$DC= 2
##$DFILT= <>
##$DTYPP= 0
##$F1P= 11.0000007629395
##$F2P= -0.999999237060547
##$FCOR= 0.5
##$FTSIZE= 0
##$FT_mod= 4
##$GAMMA= 1
##$GB= 1
##$INTBC= 1
##$INTSCL= 1
##$ISEN= 128
##$LB= 0.05
##$LEV0= 0
##$LPBIN= 0
##$MAXI= 10000
##$MC2= 0
##$MEAN= 0
##$ME_mod= 0
##$MI= 0
##$NCOEF= 0
##$NC_proc= 0
##$NLEV= 6
##$NOISF1= 0
##$NOISF2= 0
##$NSP= 1
##$NTH_PI= 0
##$NZP= 0
##$OFFSET= 16.51637
##$PC= 1
##$PHC0= -275.1915
##$PHC1= 4.101552
##$PH_mod= 0
##$PKNL= yes
##$PPARMOD= 0
##$PSCAL= 4
##$PSIGN= 0
##$REVERSE= no
##$SF= 200.13
##$SI= 16384
##$SIGF1= 0
##$SIGF2= 0
##$SINO= 400
##$SIOLD= 16384
##$SREGLST= <1H.CDCl3>
##$SSB= 0
##$STSI= 0
##$STSR= 0
##$SW_p= 4139.07284768211
##$SYMM= 0
##$S_DEV= 0
##$TDeff= 0
##$TDoff= 0
##$TI= <>
##$TILT= no
##$TM1= 0
##$TM2= 0
##$TOPLEV= 0
##$USERP1= <user>
##$USERP2= <user>
##$USERP3= <user>
##$USERP4= <user>
##$USERP5= <user>
##$WDW= 1
##$XDIM= 8192
##$YMAX_p= 0
##$YMIN_p= 0
$$ End of Bruker specific parameters
$$ ---------------------------------
##NTUPLES= NMR FID
##VAR_NAME=  TIME,          FID/REAL,        FID/IMAG
##SYMBOL=    X,             R,               I
##VAR_TYPE=  INDEPENDENT,   DEPENDENT,       DEPENDENT
##VAR_FORM=  AFFN,          ASDF,            ASDF
##VAR_DIM=   16384,         16384,           16384
##UNITS=     SECONDS,       ARBITRARY UNITS, ARBITRARY UNITS
##FACTOR=    0.0002416,     1,               1
##FIRST=     0,             0,               0
##LAST=      3.9581328,     0,               0
##MIN=       0,             -839121,         0
##MAX=       3.9581328,     912632,          0
$$ Real data points
##PAGE= N=1
##DATA TABLE= (X++(R..R)), XYDATA
$$ [...]
4791 -74 -44 -115 -141 -125 50 -76 154 -5 -33 111 -53 -54 -123 93 68 -173 -174 -158 -226 -61 180 -149 -233 58 165
4816 165 19 106 65 47 -29 167 19 -129 100 -62 -202 127 121 -54 -81 -53 123 53 112 28 -58 137 209 123 -130
4841 -130 -103 27 -127 -20 -200 72 45 -99 -159 -214 248 66 185 79 -57 48 16 -102 -84 -114 -33 33 142
4864 142 74 -29 14 249 -132 4 83 181 135 93 20 -6 29 185 -4 -159 74 -120 -285 -182 18 -68 1 -35
4888 -35 -28 114 360 149 -19 -137 163 17 -128 -76 -42 -31 -136 -61 -275 -172 -35 129 20 -86 9 118 239
4911 239 121 47 -39 143 128 -85 -211 166 -75 -31 29 107 70 85 -11 -89 -110 76 -34 13 31 -36 64 -62 -25
4936 -25 48 71 43 11 -201 -103 135 36 -135 57 8 83 173 -244 -146 -233 338 17 -183 -68 -9 10 94 -127 -184
4961 -184 13 219 -70 8 105 53 24 218 -59 -152 -21 166 -73 -197 -63 -30 130 98 -76 -25 -30 -46 -163 -29
4985 -29 46 135 52 -138 -129 -158 -40 -91 -173 -87 214 78 -98 -6 21 315 80 49 97 73 17 63 -104 32 -68 7
5011 7 -125 -176 -8 146 42 -89 12 -21 298 173 -238 -64 35 10 189 -18 -281 -100 163 -27 -85 -88 -34
5034 -34 63 -19 -180 -4 182 -63 131 -34 132 -58 -34 -35 -62 19 -20 148 -60 157 127 87 -103 26 156 106
5058 106 43 112 -29 48 135 -56 -158 -70 98 -10 23 108 -36 175 139 22 -137 -152 68 69 116 -105 -47 -41 -18
5083 -18 -43 -34 -34 -36 -135 -33 -95 -172 65 55 102 78 128 101 -104 -69 -88 -127 -42 36 -155 -54 48 57 -190 -7 120 34
5111 34 -40 -61 -22 117 133 -4 -23 -135 111 78 -44 52 -79 -14 356 54 -46 -30 232 78 -10 8 -29 116
5135 116 -143 -31 -61 -161 42 -145 -185 -273 104 -38 22 -17 6 98 -11 247 -63 15 86 -166 -109 -35 31 -91
5159 -91 -70 -37 -32 -10 -12 72 -69 40 68 -28 -15 -81 -38 8 -45 -88 -94 45 83 -155 -140 -37 113 34 70 -104 104 51
5187 51 7 -149 -61 146 128 -137 54 -156 -19 80 -45 -100 -9 76 167 122 -62 -29 -15 -14 -143 95 113 12 32
5212 32 -116 -5 -45 -20 31 -11 -63 91 81 172 -78 75 -90 -21 19 -160 -11 -11 138 68 -10 20 87 137 -36 65
5238 65 91 57 198 -140 21 69 101 73 -149 -160 -159 -22 -63 -61 -136 127 -24 25 145 142 192 78 120 41 -121 21
5264 21 13 -80 56 52 9 67 175 -20 -29 -100 -25 -186 96 4 -243 -25 8 -129 -105 -73 -69 -71 54 130 38 86 45 17
5292 17 -44 -131 40 -7 105 96 -103 141 -10 103 -22 -78 15 204 62 44 -31 -193 237 41 -26 79 5 -63
5316 -63 35 -67 -59 -18 46 -16 -36 9 -116 57 -59 14 -57 -17 -75 -17 -33 67 59 93 -48 -158 -62 -120 100 -69 -129
5343 -129 46 50 -161 170 141 102 -37 -107 17 105 179 128 24 -99 -241 75 -174 -24 -38 105 -166 16 44
5366 44 21 52 -47 -14 127 59 172 179 -41 -174 -165 107 15 -72 39 -54 -17 -51 12 -61 46 -18 -77 30 -32 134 -85
5393 -85 38 29 -103 -64 -9 -117 41 -51 -19 100 -90 97 22 -74 158 27 66 -123 -14 -381 -63 -148 -30 -158
5417 -158 13 163 55 -69 9 5 66 187 -158 -121 123 -66 -68 -99 -89 73 -120 171 -94 13 -27 8 -12 49
5441 49 -24 40 40 87 120 -183 181 46 152 -130 80 129 -71 58 45 -12 55 135 42 131 223 10 -57 47 138 109
5467 109 10 25 -70 83 -98 -45 41 -75 -7 3 192 53 -89 152 2 -123 173 224 107 -71 -104 -35 55 -8
5491 -8 -18 -188 24 -19 282 45 134 -17 116 -114 -44 -285 -35 -42 -14 -98 41 14 62 11 -85 8 134 137 17 -51
5517 -51 101 51 46 -91 -187 34 -230 121 -122 -195 -54 90 97 -33 134 122 37 41 -3 143 -164 -49 -45 -87 -32 117
5543 117 26 -210 -2 7 -45 -32 -67 -36 -28 7 165 -121 261 84 31 5 -129 109 20 -157 -252 -100 212 -26 -92
5568 -92 18 14 15 136 44 -109 17 141 102 -103 62 -4 -66 9 43 18 15 -141 92 39 16 1 113 -55 -39 -204
5594 -204 12 94 -60 -172 -23 71 -61 -99 22 -40 67 -213 -174 56 104 -14 -80 -306 85 151 -152 -102 -217
5617 -217 -94 52 44 -56 299 77 188 94 -51 120 117 37 -10 50 -133 -135 0 161 64 76 126 -10 9 45 -105
5642 -105 13 -14 -83 -27 208 62 -199 -70 -151 9 25 100 14 -46 96 102 48 -16 109 49 158 -44 -159 87
5666 87 76 -17 -187 -134 -39 126 -19 -52 -66 60 121 -30 -3 -16 114 -42 8 14 79 25 70 75 -116 30 29 -99 -76
5693 -76 25 119 26 -23 50 7 61 125 35 49 97 0 20 -16 -57 -72 -23 93 16 5 37 21 67 -209 40 55 1 96
5721 96 48 -84 89 129 -68 -2 11 124 -133 -104 -123 35 34 -125 -119 -183 7 67 -5 -37 -57 16 128 -272 -62 125
5747 125 -36 95 -73 148 77 141 33 -173 -12 -140 28 156 39 -46 -40 -80 -20 -88 -140 85 209 26 61
5770 61 -79 70 -9 -37 -103 37 -5 30 -27 -102 72 -147 1 69 -66 70 -52 -71 -90 39 45 -100 53 0 15
5795 15 40 66 -64 60 12 -58 -76 1 86 59 61 20 43 -119 50 126 -33 -64 98 -15 -9 -80 -83 -208 23 -76 82
5822 82 45 -16 -77 72 181 -91 118 118 85 29 -72 269 -26 -162 -94 76 -111 48 -65 -198 -32 -29 50 -49
5846 -49 -17 76 -1 -126 30 -40 -23 -133 -22 -57 -13 -32 -68 25 -111 26 35 26 1 23 147 -75 48 -113 18 51
5872 51 -41 -42 -77 -11 -44 -3 -42 -21 -16 -11 -22 -17 113 8 -46 73 -129 43 -20 -246 -100 -112 -53 -127 27 -70 -159 77
5900 77 25 254 1 -80 51 -14 -56 -70 -57 -146 -26 -97 -131 119 -62 74 75 47 45 59 267 -160 -38 -14 103 -242
5926 -242 -97 50 230 -11 -151 -18 -47 137 -133 129 107 167 151 57 -11 104 32 45 -75 -178 184 39 28
5949 28 78 40 39 55 -16 33 66 -1 2 172 -49 111 -49 70 21 60 7 43 85 75 154 23 9 -9 -144 56 114
5976 114 153 48 -23 -62 -67 150 -51 -80 -47 -138 38 148 136 43 85 -28 48 -58 3 114 11 -95 -157 0 -122
6001 -122 -121 -123 -183 83 14 -119 56 -130 -10 -90 -61 55 130 49 15 -34 -95 96 -69 -28 -27 52 -77 -210 45 -47
6027 -47 -38 126 36 32 -46 26 -12 86 -110 23 24 -9 55 -128 -90 47 -39 -240 184 58 50 -65 -78 -51 7 198 36
6054 36 -7 9 157 121 50 -220 39 19 -38 -80 201 -59 88 212 48 8 -78 363 80 -11 212 7 -66 -86
6078 -86 -111 99 84 -62 4 -21 128 -5 92 53 -20 10 -70 53 -169 99 -139 -22 57 18 29 76 -208 89 -102
6103 -102 48 -36 -85 102 70 272 -43 -56 71 -139 38 76 97 30 84 -103 12 44 26 209 -3 121 109 -97
6127 -97 28 178 -9 38 -211 -78 97 2 -11 -53 -71 -130 -38 78 123 127 28 92 123 -16 -49 -179 -115 72 -109
6152 -109 41 -42 66 144 -58 10 -112 -54 -59 -194 -129 -89 55 13 -157 -18 -183 -11 110 35 87 10 12 110 5
6177 5 -163 -40 -27 -25 97 63 -20 -116 -126 -24 -1 -182 -163 70 -50 4 -84 207 109 -61 20 -93 52 -88 150
6202 150 30 -106 133 104 2 -2 18 94 -42 -85 114 -67 1 9 33 94 -93 -130 -279 14 -24 -158 126 -5
6226 -5 91 -52 -91 11 -47 -32 52 -21 29 90 -200 42 -109 -14 -73 45 -40 -91 -35 -17 62 14 24 -26 -50 195 -39
6253 -39 -74 -142 7 -207 146 -9 137 -148 73 157 -78 -153 -61 -89 46 75 237 128 61 -4 -116 1 19 97
6277 97 -75 -152 -30 -51 -16 40 -117 5 80 128 87 190 23 29 46 98 -170 49 95 -131 -43 -95 -107 113 49 198
6303 198 151 -64 178 168 -75 22 107 45 52 6 101 -20 -184 -19 -85 -17 -18 27 -36 -177 -50 -28 -60 -4 77 -155
6329 -155 -103 -73 22 119 -146 -102 8 -59 -16 -1 1 -13 16 -18 23 60 -89 180 50 -37 18 24 -191 -79 -14 -17 6 86
6357 86 81 -27 79 34 -108 85 -21 310 42 -56 -92 106 -40 8 -103 -30 77 -146 -28 -169 -37 -139 -140
6380 -140 31 -54 16 151 -228 -39 -159 40 -68 51 -1 -40 -86 -65 197 72 -17 -3 -69 5 -235 221 -29
6403 -29 39 -196 -8 -97 2 4 -166 -34 -57 49 75 115 111 -78 -34 53 -82 -50 76 62 -13 93 -16 -80 71 40
6429 40 64 -21 -47 2 105 24 42 -38 -112 -87 34 67 55 -157 -62 82 101 263 -62 67 -10 12 -36 82 1 72
6455 72 -4 8 286 116 45 -116 -68 -97 -182 30 -36 -53 86 -19 -162 -22 -49 -38 -43 18 -109 48 -44 -12 56 -20
6481 -20 -94 -247 207 2 -12 101 13 61 -6 -120 221 -9 92 87 -144 -71 47 -30 38 142 -67 -174 -25 91
6505 91 -30 -2 25 -71 24 75 89 42 -60 -86 -144 21 -53 -62 -30 11 65 91 61 -172 0 74 125 -95 -203 210 83
6532 83 -189 -93 32 -28 -91 -71 -107 235 77 112 -189 7 -74 -33 -58 81 92 165 -124 -108 47 -167 -156 -104 -117
6557 -117 19 76 -196 -82 -59 -77 57 -20 97 -108 69 83 8 -89 47 38 -26 -101 41 -35 237 -26 -37 -11 -125
6582 -125 -107 -33 134 43 119 -99 -89 -80 16 -96 -47 -88 73 51 21 132 -20 194 187 -78 29 94 -102 -75 2 199
6608 199 24 -29 -164 -39 -167 -134 -129 33 -45 13 1 -130 -65 57 -69 9 130 -48 49 -134 -186 -181 -1 -103
6632 -103 -52 -225 -204 109 71 55 24 -102 56 67 150 -48 -9 32 -246 126 -95 -328 92 -14 21 132 -18
6655 -18 -15 -2 91 21 -44 156 59 -38 -106 74 -133 -103 -30 13 87 178 -63 54 64 129 19 -121 -92 -1 69 89 -146
6682 -146 -85 -105 -1 -22 41 105 44 14 80 138 -22 114 -37 -9 -77 18 19 -57 96 -36 42 -9 32 123 -132 48
6708 48 -105 150 103 -52 -109 -72 182 -127 -65 19 -37 11 -88 -94 58 -112 -61 -61 95 5 28 -101 113 13 -40 126
6734 126 -33 59 2 49 135 20 -25 -14 60 10 92 -89 -84 -21 23 -34 -26 -154 214 125 -75 110 232 53 108 -25
6760 -25 -41 23 -34 30 161 198 -46 -102 -2 46 64 -49 -52 -65 140 -7 -68 -36 28 -34 196 70 57 28 -20 170
6786 170 -16 -166 27 102 29 12 85 -109 5 77 6 -52 141 141 -77 -52 -143 -170 54 15 79 -83 -22 58 -190
6811 -190 36 -39 5 -114 -79 -14 48 -154 25 -18 -99 -8 -72 -5 -83 103 -109 -78 26 11 25 264 81 70 -37
6836 -37 20 -24 7 -85 25 100 -107 41 103 8 -250 135 -10 78 143 -119 -38 -76 32 -34 154 -23 -133 -109 46
6861 46 -51 -53 -159 -57 55 -132 9 102 57 -74 9 32 72 -247 90 168 38 50 134 -159 -118 67 -16 23 83
6886 83 -52 -116 -24 44 186 -5 -3 25 83 83 67 28 77 2 -35 32 16 -93 -9 -30 -59 -27 96 -97 25 191 69
6913 69 16 -151 36 71 -60 191 56 -44 46 -28 -100 34 10 -48 21 -76 75 57 20 -129 155 -56 8 101 -26
6938 -26 -118 87 33 23 77 -74 -80 -151 -125 75 16 41 -81 69 42 -98 98 6 177 -24 3 149 -33 -80 -92
6963 -92 -10 -53 -85 29 -110 185 104 26 -18 -58 44 2 50 76 -6 -47 -35 -105 -21 -120 74 -72 5 19 159 150 109
6990 109 -55 -192 104 -139 -17 -156 -4 -88 -6 -10 -9 54 -12 19 44 14 -141 171 19 203 67 71 -56 -79 94
7015 94 -127 112 -136 -27 38 28 18 -26 161 -89 -13 -3 141 -41 77 -76 48 -23 -6 70 180 56 17 -39
7039 -39 54 156 90 105 23 78 -157 -158 -146 136 -127 23 138 78 -86 13 91 37 12 -201 -31 119 -52 -55 38 49
7065 49 -25 121 24 -144 -116 61 -46 -49 84 76 63 -108 109 5 44 -49 -25 -79 25 41 -127 180 2 -22 122
7090 122 43 -17 -5 13 -23 -16 5 46 -137 -144 28 60 25 27 -73 -131 -174 -6 121 67 -17 27 124 -30 21 -37 60 16
7118 16 -61 -57 -49 37 -50 -39 -69 -19 91 39 111 -5 -17 27 14 141 39 30 -173 -5 126 68 -52 132 30 -139
7144 -139 -46 14 -95 55 46 -224 56 -2 -17 40 -73 -2 -24 105 57 -91 -72 -34 -14 -196 -112 29 -257 31 64
7169 64 159 145 72 -10 80 -110 -79 -103 46 99 -34 -10 -113 166 3 13 147 -24 87 -21 81 38 44 74 11
7194 11 -83 -47 52 -31 -209 22 -112 225 -64 -56 40 -11 18 73 9 -27 9 20 -53 69 -96 6 86 19 -69 -139 84
7221 84 -91 -128 70 78 -14 93 106 109 -5 7 18 -92 7 -71 -53 76 113 92 -57 -81 31 160 -117 24 -138
7246 -138 -15 70 99 -91 -96 39 58 -6 -26 -80 50 -24 -1 -26 37 -74 133 55 82 -32 107 -9 59 -215 -27
7271 -27 101 -116 42 -18 -37 76 99 55 -192 56 53 -107 -114 12 6 -157 76 8 -28 -200 -92 41 51 -87 -32
7296 -32 71 -70 57 43 100 1 28 -29 248 -31 -50 -72 20 37 -214 25 -60 -52 -169 -170 43 -35 81 -101 33
7321 33 27 6 -117 -84 23 -124 -41 23 52 -261 -52 -38 2 87 50 -5 -53 -46 67 156 88 63 -91 72 68 20 12 113
7349 113 -35 143 -3 181 73 -35 263 -74 83 131 -50 -151 -249 29 -121 -49 214 95 -4 161 19
7370 19 -15 -112 -74 -19 -14 32 -63 -39 2 31 14 58 -75 -10 5 92 -161 92 -14 22 -96 26 104 -78 89 -15
7396 -15 164 -3 -21 48 -53 -23 69 106 -29 -20 -137 -82 46 33 63 10 98 38 8 -44 -116 44 -64 -26 -49 102
7422 102 -61 176 -133 -101 92 17 -186 60 -56 48 -61 -113 -87 21 -30 -26 65 120 139 -215 -143 -9 39 -101
7446 -101 82 71 22 -80 -34 -66 91 49 -30 5 92 -140 -28 60 2 32 212 -40 9 157 -237 100 -8 141
7470 141 -40 169 -57 -129 -151 128 103 -14 -22 -37 67 18 7 -7 -47 140 134 21 141 -32 -37 -17 67 -47 -21 -12
7496 -12 80 -7 40 26 26 184 53 -152 -55 -9 19 98 24 118 -59 -45 -21 -2 32 -10 -79 97 -23 16 -108 141 107
7523 107 -30 125 218 -12 -240 -112 -64 37 -91 8 78 56 58 -10 6 60 124 2 -5 58 -15 -36 86 -54 -214
7548 -214 -82 125 97 81 125 -51 164 59 -83 60 58 -172 84 -64 178 131 113 -28 53 -81 -5 -10 94 -115
7572 -115 -112 210 47 -190 3 43 -56 90 73 5 -94 73 -66 -7 -121 -56 160 -17 32 78 -8 -69 -132 -80 -105
7597 -105 -14 -146 -171 64 15 27 79 -110 -137 89 0 87 33 -157 -94 32 -47 53 90 -23 -41 -149 -119 8 -2
7622 -2 -98 104 100 20 91 -97 -20 -110 192 34 30 17 75 100 94 -84 -18 18 64 -64 21 55 53 -17 -92 83 34 91 37
7651 37 78 25 107 157 119 164 -67 -19 70 -20 -60 -16 152 104 159 144 -144 -7 -167 -11 58 18 -180 15 -55 -76
7677 -76 -39 -122 -62 8 -40 -183 90 54 188 86 147 49 -126 21 97 -49 36 -132 48 -63 -137 114 -28 103
7701 103 72 -79 -55 16 -114 -155 -99 -98 130 -7 112 49 -3 -79 29 84 19 81 -53 -13 -159 -87 0 -64 -50 34
7727 34 17 -53 100 -56 76 -13 176 94 -115 -39 0 118 107 13 -250 -180 -86 -121 -3 -99 -64 13 136 93 41 14
7753 14 -54 65 -41 7 51 105 -57 29 189 -89 -3 -44 -31 14 81 91 45 -14 51 80 34 15 -22 -201 38 -22 -122
7780 -122 213 132 0 58 -169 83 184 -68 22 -77 108 34 77 -32 -50 79 110 -32 25 5 -37 60 -90 -208
7804 -208 2 -79 5 15 -21 -132 -1 -7 193 183 -71 -128 33 -25 43 -101 -134 -111 7 4 -94 -83 -120 113 236 34
7830 34 -28 -62 63 90 125 36 -41 -42 56 -179 -109 38 -102 2 70 46 -153 165 -72 8 13 41 -67 18 -35 -117 -113
7857 -113 -4 -108 73 108 -170 -7 -18 21 88 98 46 -59 95 -111 78 67 74 78 32 -208 -173 -53 -115 31 89
7882 89 106 50 175 -23 -91 267 14 99 -128 -32 -48 -160 63 -17 79 -98 218 207 18 271 -111 45 -50 3
7906 3 -36 -56 36 109 166 -62 -15 61 64 32 -25 179 -24 81 100 11 167 -98 40 -71 -22 41 -3 141 70 -50
7932 -50 56 -106 9 -68 147 -8 87 -84 14 129 -25 -103 4 -15 -76 -177 69 43 29 -97 73 -129 -44
7955 -44 152 -56 -51 74 -34 -137 119 -46 10 170 71 -29 9 77 -96 -105 18 37 -51 -46 184 116 -42 181 85
7980 85 -42 69 179 109 -104 120 -63 -32 -88 -155 85 -78 12 -110 50 28 3 206 7 151 64 120 -79
8003 -79 25 27 -94 -11 55 -173 -13 -20 -4 -76 172 -26 120 -149 112 -130 -13 -46 -50 98 -154 -82 83 100 163
8028 163 6 -26 44 -38 168 -95 -256 50 2 -60 59 -52 -118 -139 43 96 41 -12 77 -89 -25 70 -2 128 164
8053 164 -28 129 98 -114 40 -26 -50 -77 -38 -92 51 48 -119 -84 -54 -14 76 -64 70 -36 -176 20 -55 -8 1
8078 1 163 -105 -7 -77 31 -8 -84 28 -165 -104 190 -37 -98 19 30 68 -49 156 85 -1 -70 36 -6 -128 -30
8103 -30 -86 101 103 -57 97 -48 176 66 -30 -5 85 -106 -79 -60 -103 -1 -31 23 -18 -147 8 -8 -105 123 27
8128 27 226 63 -134 -131 101 66 -62 -169 49 5 -26 13 94 23 -50 97 -48 -142 -25 73 -192 -19 -71 -12 -59
8153 -59 -31 -76 -41 41 -254 36 13 133 42 48 88 129 86 108 -93 -92 133 -135 -49 76 -47 12 -181 22 -74 92
8179 92 -72 101 -16 -10 -101 -140 105 7 100 -128 20 55 -177 25 166 -38 -36 -121 41 60 171 -138 83 -28
8203 -28 39 -104 -86 94 -128 -67 -98 -50 -75 191 121 -49 84 59 40 -43 -39 39 96 -77 -40 30 -130 -149 -26 65
8229 65 -188 120 102 143 31 -15 136 -35 -39 85 -26 -65 -147 2 -100 -70 -72 -115 71 -87 -91 10 -117 -116 109
8254 109 -87 108 99 -26 45 -171 47 107 8 99 29 -31 8 -15 10 -95 180 31 181 -57 -66 -19 -129 -33 -80
8279 -80 -48 -145 -2 -116 49 34 -31 -13 99 -187 -108 -106 56 -89 -4 221 -155 -72 -30 -20 -21 -11 25 67 -3 -27 38
8306 38 -40 -73 105 -79 82 171 -160 21 149 -46 104 51 -99 -26 15 -22 -39 27 -69 143 115 -67 53 -238
8330 -238 4 171 -5 -18 -115 -110 -115 36 -49 -51 -58 59 -24 -57 41 12 4 45 -27 -140 -115 -72 50 20 -12 -59 65 -74
8358 -74 71 175 -45 13 217 242 -43 -20 38 49 102 126 -169 -46 -153 -136 137 -43 29 -76 20 -11 -101 89
8382 89 -36 -20 -25 -42 -54 228 -87 11 -96 123 -37 21 196 -70 -193 80 8 -51 32 78 -61 -167 6 -47
8406 -47 -54 23 104 -84 53 61 -79 33 -62 -1 53 145 66 47 -3 -133 -28 5 -47 -85 -15 76 61 67 -5 4 -37 31 213
8435 213 29 7 87 -38 -15 -78 161 -89 -119 116 97 -26 -115 -7 -30 46 -40 -52 -81 -96 33 217 4 26 -84
8460 -84 -96 -35 51 -59 -201 -67 31 -132 -47 -127 65 -60 -60 2 72 48 -106 16 85 37 98 -121 -67 -117 -212 0
8486 0 -62 -55 -69 30 -49 23 -106 28 228 42 -80 -41 41 -73 29 137 -89 68 -1 -93 143 30 107 81 -4
8511 -4 254 56 50 -185 19 -92 -108 37 -186 -173 -124 194 7 -54 -50 -187 107 131 29 25 -30 -55 134 14 71
8536 71 6 -90 -16 -109 4 -124 37 10 -47 -53 -21 -59 33 19 200 100 -46 -57 -120 -33 -113 -173 -168 158 -188 124 -7
8563 -7 7 83 -8 -112 26 -60 -18 -70 -85 -76 92 -2 2 -2 -184 36 4 -51 131 24 -54 -77 57 -85 -8 -41 -30 0
8591 0 -111 72 46 -92 26 -19 -210 -28 -2 -1 110 -25 123 -72 1 156 5 -18 110 94 59 44 -40 18 -21
8616 -21 239 -140 -52 16 -69 -47 1 55 -47 -22 -40 -29 -106 -88 26 -22 -21 -27 -11 -72 137 11 161 56 -11 3 79
8643 79 133 -148 21 45 92 -92 71 -28 -77 -33 90 31 137 -67 46 -146 196 -101 -21 -70 11 125 86 39
8667 39 19 -6 8 5 -124 -96 204 -5 31 112 -38 -131 -75 30 -129 29 5 -110 96 -8 149 -86 -99 75
8691 75 -98 64 -63 -169 -40 55 41 355 -12 106 -39 -42 -97 -218 77 122 -87 -95 -203 105 -56 48 -96
8714 -96 -66 90 53 40 -55 -57 -51 -83 -22 132 -55 2 22 -37 32 -49 -100 -22 -121 17 33 45 -88 -244 -93 144 13
8741 13 -40 -35 -45 4 163 197 -62 -121 -100 31 61 80 -67 20 41 -268 -35 -58 -29 -92 107 -17 -15 -75 -51 -22 118
8768 118 144 41 18 -45 48 -73 61 58 20 151 -146 21 150 -10 20 20 -224 -62 -8 -16 -57 103 78 -86 -16
8793 -16 150 -67 23 123 67 117 121 -130 -30 228 25 -129 72 97 90 -39 -5 50 220 30 -125 196 106 86
8817 86 -161 -121 148 147 -90 24 120 -70 63 30 -67 -76 -19 -50 162 32 -71 -58 -6 -32 25 -29 31 -26 32 -36 74
8844 74 130 -132 72 181 77 -24 53 -3 -15 29 0 -174 75 -43 -171 -11 33 -125 69 -58 -134 -80 -6 -53
8868 -53 -13 -24 -261 -102 101 -106 -31 -139 4 63 122 26 2 7 70 34 64 74 156 82 -67 113 50 -12 111 -36
8894 -36 -55 77 -17 -128 8 52 128 3 -225 -46 -103 -80 -34 55 6 -61 -21 -57 150 -19 11 52 -88 -9 60 -11
8920 -11 89 -71 18 13 2 24 21 129 -77 -9 30 35 -106 -77 -1 42 -105 -173 -93 110 -196 43 -67 -20 -40 -14 -89
8947 -89 -108 -26 36 8 -18 26 9 -33 -21 13 153 39 -148 276 -17 -59 -31 19 -63 -107 106 -34 33 -55 -79 -36 -64
8974 -64 -39 26 102 79 -276 -51 18 -43 29 -106 45 31 34 262 172 -84 -88 153 43 -8 16 157 19 40 -57 9
9000 9 75 17 -35 -206 -84 44 67 -52 -86 -80 36 -35 -26 138 40 43 6 -232 55 -76 64 84 170 -53 31 -223
9026 -223 -57 30 26 99 -258 -3 132 -158 66 -64 -44 136 72 132 175 -121 -151 17 -39 123 76 123 -73 -13
9050 -13 -87 -10 126 -113 -76 74 53 -37 79 55 179 -88 33 -40 73 51 8 -121 57 -85 -112 -73 -193 -51
9074 -51 -70 -19 -32 -153 -195 82 87 -81 153 -58 -73 -167 26 -36 177 -16 15 90 -115 129 12 -9 144 -12
9098 -12 164 32 117 25 -6 76 88 -46 -75 99 115 -134 -244 31 -48 -204 73 162 -20 8 -35 16 -93 58
9122 58 56 111 82 -113 163 30 -62 63 35 -82 -25 143 55 17 69 31 -53 39 67 5 45 -166 29 64 -94 -56
9148 -56 -17 -18 32 88 192 85 -28 -35 90 145 104 -60 -63 -15 -41 -43 -119 -68 -132 -157 60 2 99 -134 -156 84 -182 -21
9176 -21 -111 61 144 -99 20 -51 1 80 -120 -97 67 -140 111 8 -24 45 106 115 -112 -138 135 122 -178 160 -103
9201 -103 20 288 -185 -49 -61 -18 39 -62 146 49 -4 -122 160 128 -56 150 -124 -154 -55 -38 -70 -39 -77 34
9225 34 98 -8 90 56 115 53 -87 32 71 41 -73 8 -43 24 137 84 7 162 57 -36 -42 23 -169 -14 -99 34
9251 34 5 67 43 66 -146 -188 86 64 -74 89 47 -31 46 62 107 17 39 -23 147 64 -35 -8 49 71 -58 -2 -5 37
9279 37 48 101 7 -25 -40 61 -112 46 -4 -155 -68 197 -16 88 -15 -75 -45 129 151 176 43 -106 50 -53
9303 -53 -62 99 8 116 8 -105 14 84 -26 -93 59 32 18 65 -92 94 -97 28 45 80 95 -78 -142 -131 149
9328 149 -23 19 26 71 70 -72 42 -131 23 -30 94 54 -5 -244 -95 3 53 -43 -36 35 -23 59 -132 60 -12 -91
9354 -91 234 95 -106 43 -40 187 1 -68 26 -12 -9 185 12 127 -30 29 -41 116 133 89 23 68 139 -101 91
9379 91 72 37 -78 30 76 -13 -48 247 -69 -57 138 43 -80 -22 102 89 -81 -7 60 -9 -6 -224 -99 -46 11 -20
9405 -20 -74 108 167 -133 -14 94 57 -4 -43 96 118 -76 77 29 -236 -45 -102 -237 157 70 8 1 118 91 44
9430 44 82 -140 -78 -92 -172 45 62 23 -156 -57 -43 -61 -29 3 16 79 -49 43 -40 79 140 -211 -49 36 -87 -174
9456 -174 -62 36 -150 -48 104 23 68 -93 95 -116 45 50 244 -89 136 107 45 133 41 -64 163 91 -115
9479 -115 -74 78 139 176 151 55 -48 11 -37 17 70 11 43 12 -45 19 -157 21 16 -173 25 113 95 -41 -14 93
9505 93 31 -6 -64 -65 4 11 -77 10 -71 -135 7 44 -24 29 -6 169 240 70 -118 -110 -143 13 -158 -15 -49 -1 -40 -114
9533 -114 29 -151 128 -36 77 -34 75 -186 -86 34 89 -81 -18 -142 -24 64 -194 -101 57 98 49 193
9555 193 45 139 -91 65 45 -107 54 -38 -163 -176 -14 -27 -183 42 -16 -60 163 -71 90 -28 47 -31 246
9578 246 -359 67 3 4 22 66 -123 -97 -179 -187 57 -27 -149 110 -82 -59 -9 -107 75 -107 -160 -143 89 -60 -6
9603 -6 -71 60 69 -145 -25 -68 -117 8 -19 15 -20 164 -66 54 -37 -120 -6 -73 -59 -41 -131 -131 -30 -155 -85 30
9629 30 -44 -47 137 -56 -8 -126 -106 -50 -45 -220 388 84 8 129 -107 116 -24 147 177 16 157 8 12 -41 152
9654 152 192 27 -136 -1 170 179 -63 -16 -4 -41 22 77 118 119 -33 -14 -23 1 155 -11 14 8 31 76 -4 -33 89
9681 89 55 -124 144 59 43 124 -50 26 -115 -221 45 -60 51 -54 28 270 40 -38 139 174 39 36 -104 -114
9705 -114 39 -41 10 133 -27 -15 182 -105 -107 80 -104 17 16 90 -10 91 -83 254 -7 26 144 59 51 -179
9729 -179 196 45 86 90 -23 -26 70 -86 164 -129 75 17 80 129 37 60 -57 -125 -45 -102 40 2 -19 -68 -39 194
9755 194 2 47 56 67 -140 -37 -53 57 247 63 -132 12 -115 155 94 -20 -56 9 7 -45 4 196 22 -71
9779 -71 -103 52 73 11 -129 -68 -59 57 -59 45 111 33 55 36 39 -47 -95 47 170 135 -45 -78 16 170 -100 23
9805 23 -20 -60 155 -183 2 161 -55 150 113 72 43 -87 -103 40 56 -64 -28 2 13 56 -179 -68 -188 -44
9829 -44 -46 53 160 22 160 -62 35 -89 -46 -103 53 -164 -109 35 64 5 -78 122 0 97 -74 -114 -11 70 -4
9854 -4 -22 -129 62 127 -258 -122 -240 44 11 30 99 -242 134 -88 -39 -74 -114 -42 39 -46 -107 -23 33 -18 -141 -57
9880 -57 48 35 -127 165 -115 117 -53 -42 14 -85 -65 48 -139 -220 145 84 48 71 26 -46 44 13 63 96 196
9905 196 134 111 -116 -105 5 -154 169 20 5 -91 14 -4 -24 59 35 -10 102 36 -16 -152 -6 24 51 114 -6
9930 -6 -121 -49 -131 -151 61 -6 -43 152 11 257 105 -32 -53 -49 46 -13 59 -55 -72 43 -55 -85 -2 22 54 -27 140
9957 140 9 55 -143 -1 161 103 -65 114 72 -4 -102 -29 1 16 13 6 162 -40 108 -71 135 -5 -95 15
9981 15 -85 51 -79 -43 -134 -197 79 -133 -3 -165 68 111 139 -1 13 -144 130 -16 33 23 123 47 -163
10004 -163 83 -78 64 -27 -22 28 57 -96 122 -43 56 -45 -13 -79 32 -199 17 16 196 -32 32 -15 -108 68
10028 68 34 117 130 118 119 118 65 138 -191 -6 -59 50 -15 36 86 98 -44 -96 71 9 8 -128 17 122 80 54 -30
10055 -30 104 -44 -12 25 -57 63 -157 -11 18 130 166 -20 -80 35 -63 -7 4 182 50 80 54 104 -14 179
10079 179 52 273 18 -172 33 -249 64 -19 159 67 70 103 -41 -33 -59 -41 -214 -13 10 4 123 -56 38 -18
10103 -18 -37 -72 185 225 22 -60 96 14 -27 124 50 142 202 73 -10 34 18 57 -37 -28 6 158 -138 140 -73 -15
10129 -15 7 27 -26 -155 -62 -193 67 -106 -83 -37 31 -153 195 -38 151 -14 59 -86 -153 7 2 12 158 31
10153 31 5 -73 -40 51 -85 -39 23 91 -12 6 -117 21 52 191 -138 68 55 -23 -9 -2 -49 -21 -11 47 80 -60
10179 -60 -46 -106 37 238 15 15 16 -23 -33 -65 59 16 -158 3 -195 52 48 -48 -38 151 21 -14 64 104 6 77
10205 77 6 -58 -21 -54 -61 3 -75 -35 -33 -42 125 137 3 -20 -21 -36 -28 -23 24 64 -67 53 -88 1 -49 8 -211 11 -180
10234 -180 48 -3 56 20 -91 64 35 145 -113 -48 -49 48 -64 71 7 89 -76 -6 -134 36 13 45 31 -6 19
10259 19 -169 18 -126 136 99 -77 -41 -44 45 27 -1 77 -44 35 -26 -14 25 96 -114 75 216 -123 -39 -124 78
10284 78 43 2 -21 -162 19 -33 -176 -3 95 -21 18 49 -111 200 32 -79 224 -100 -18 -55 -48 -181 -13 -116
10308 -116 -179 63 12 17 -98 119 -43 -15 -50 -185 190 14 -2 -88 100 -11 104 -53 -54 127 135 -17 123 -212
10332 -212 -1 30 27 -141 -102 -2 127 142 -43 -130 71 132 -42 134 -88 -67 6 145 -198 163 -17 16 -128
10355 -128 -81 -55 -63 -167 22 158 32 115 50 29 19 -55 82 -52 -61 -47 37 108 0 -50 -99 -66 -16 -79 -79 -185 139
10382 139 51 -53 105 61 82 25 -79 49 -107 -125 57 43 -37 84 -92 110 2 -133 46 -78 129 -7
10404 -7 -11 43 -75 174 -34 119 104 55 -124 -109 125 121 138 -91 47 69 177 -74 -89 -201 -69 39 -24 -58 -101
10429 -101 -15 212 208 -80 -42 18 -5 78 -2 18 26 107 -104 -204 152 -130 -83 51 -26 110 -69 -23 -33 -6 22 145
10455 145 -72 -76 86 120 -11 -14 -158 -71 -74 -9 68 -20 90 115 70 -39 -22 69 45 63 -31 -50 -111 82 106 230 107
10482 107 13 -177 -54 -71 58 1 43 38 40 -92 -19 -36 102 7 49 -94 81 144 -120 -111 -71 -49 -135 -106 21 207
10508 207 205 -51 -220 -38 -113 -151 -36 -31 18 -45 -12 152 55 -175 -1 -16 -91 -117 20 198 -23 -47 51 48 -96
10533 -96 14 144 -49 -75 -80 88 101 222 -110 5 108 104 29 87 94 -17 176 31 23 -118 125 -113 73 -61
10557 -61 -73 -202 -58 114 -10 -139 49 65 78 -14 -40 -191 38 -77 20 110 76 33 35 -88 -81 -28 -29 65 -61 -15
10583 -15 25 -2 5 -28 -113 36 -25 -48 32 -14 -105 109 -79 -8 -29 9 -107 19 -47 23 26 16 0 136 132 -71 120
10610 120 -39 -45 -191 -98 19 30 180 105 103 26 -59 35 -178 -2 82 -117 -64 -193 191 -76 86 -96 149 168
10634 168 52 116 -48 98 24 20 34 -71 -100 -75 -169 7 -100 -191 101 130 1 -35 -117 71 -24 36 -54 -32 10
10659 10 36 -70 50 -57 34 181 -122 -79 21 36 24 -65 34 102 215 55 -36 -83 64 46 14 -138 -10 55
10683 55 -39 29 -18 -59 -4 -43 100 -182 -46 6 -24 -28 2 -195 -45 33 -24 -1 13 -42 13 57 77 42 -126 -94 -48
10710 -48 -56 107 43 -169 99 86 -24 -34 152 -118 -88 -142 -4 -45 51 -4 144 0 -55 4 99 -41 -100 -30 -61
10735 -61 -13 109 -36 -116 90 -52 -118 -26 78 60 29 -3 -41 4 -179 -143 -2 304 35 9 137 84 -70 -70 52
10760 52 -3 -16 25 -148 43 -34 14 -65 62 101 76 112 95 12 -63 -19 -86 105 99 88 75 50 -90 -5 -79 41 -145
10787 -145 61 83 155 -157 -12 101 49 -111 57 -98 -74 -39 -18 -76 71 36 -118 -32 37 -58 -24 59 99 -20
10811 -20 34 66 -64 217 58 -2 -77 -133 -47 -77 3 -38 163 254 42 192 -136 28 -194 -173 -8 -245 19 -20
10835 -20 -187 184 -26 -40 -24 105 -18 31 14 -114 30 70 -41 35 -30 -7 55 -103 -97 -42 -49 -22 -163 -11 141
10860 141 -1 -124 -106 -52 107 -139 69 136 -1 -78 -18 10 73 -194 -3 153 0 -81 -58 -45 -250 136 -76
10883 -76 -92 -121 20 44 -77 -33 -144 -1 -15 -185 42 47 -10 8 63 -77 107 55 64 -96 -61 29 -10 -163 20
10908 20 28 -97 -53 -76 209 -12 -4 47 55 -19 2 -21 -70 -103 -12 81 72 -13 -12 165 -72 124 94 26 -75 8 67 88 -5
10937 -5 -5 -61 148 -26 -51 -94 -3 18 44 11 -173 -4 -58 -25 44 59 11 -102 -113 -20 -19 33 124 -170 229 39 59
10964 59 -4 72 77 -13 -128 -67 -90 -12 -178 -47 -32 -14 16 7 -185 -22 29 -193 65 -88 16 -38 85 -94 72
10989 72 -95 -80 49 46 -68 -125 42 -8 72 -80 80 -161 -18 -142 -102 139 43 53 -48 94 121 -20 -53 29
11013 29 49 -28 -40 115 -46 -112 -109 14 37 71 56 7 106 62 -155 13 -202 -70 17 -71 -39 -8 -59 36 -202 -28
11039 -28 79 18 116 123 2 -27 52 72 -80 -190 103 115 -87 46 -45 -89 91 -132 94 -82 -77 38 -49 90
11063 90 -40 37 -23 -27 27 -5 -80 -10 -9 99 -179 135 -117 -64 68 40 -32 -39 104 -185 154 -191 74 -34 13
11088 13 -117 -81 -107 5 -1 -89 168 66 137 -89 -38 -35 111 -37 -77 74 130 -79 -64 146 -88 51 -80 -26
11112 -26 33 83 -41 -82 -52 -97 -12 -5 -83 -144 -111 110 53 -93 -92 -42 -2 -70 58 -237 -29 185 4 -40 -12 -55 60
11139 60 106 79 149 -135 -9 -101 -150 19 -91 -37 -55 53 123 136 -10 18 47 -124 -72 130 -186 26 -61 83
11163 83 -5 -53 85 41 9 -106 -63 -31 -124 32 -55 13 -81 -88 82 -200 -77 10 -44 67 80 -134 50 0 59 -104
11189 -104 13 115 50 -188 -81 -110 120 -66 -20 218 7 106 7 72 223 223 -170 146 33 98 59 -15 -34 -108
11213 -108 18 -5 -131 -79 165 -55 -149 -120 -24 -75 45 -58 53 -151 -1 -269 34 -114 -94 -178 -263 129 38
11236 38 -30 74 15 1 -68 3 74 47 -78 -6 109 15 34 41 -116 -48 -74 -122 187 -75 134 -157 -148 15 7 -30 -71
11263 -71 -20 -145 29 -161 -54 -44 -126 71 -31 -55 -31 -20 56 61 146 -5 126 -102 117 -60 -96 -67 30 -9 54
11288 54 -120 -24 -54 -117 -77 16 -20 232 139 -68 125 31 -28 -11 -162 -47 114 18 -28 -44 53 -120 149 -61 -6
11313 -6 -29 -118 -134 40 -49 -94 60 -33 -108 58 -91 -38 46 84 48 192 9 17 69 -26 48 -7 115 119 -21 126 -56
11340 -56 93 26 -115 -17 -105 96 -42 -37 -73 128 -96 110 -9 59 52 15 -96 -8 12 -4 -65 -102 89 17 42 154
11366 154 -5 -83 57 34 -136 303 18 25 -23 80 -215 -160 4 15 0 -81 91 98 -12 -51 -85 162 161 -4 98
11391 98 46 -192 -133 188 129 150 -92 197 -56 23 25 -108 -29 125 -25 81 -34 -27 54 -69 21 -91 36 128
11415 128 30 -78 -123 -51 -41 284 -78 64 21 87 97 -104 206 153 138 103 47 -85 -62 1 74 -15 -15 6 -22 -30 134
11442 134 133 -22 -139 2 -47 -37 34 -90 -9 -226 -2 22 23 -1 16 38 10 -114 56 12 -74 109 -50 -65 -41
11467 -41 69 62 -100 39 -127 -74 143 75 -10 88 -19 136 -92 -57 -83 -7 156 21 40 9 -164 -90 -15 -75 -238
11492 -238 39 -75 -5 -25 31 -47 61 120 102 132 119 -50 -242 66 39 -17 84 -32 132 61 -47 106 14 33
11516 33 -161 -126 37 66 -68 73 -47 31 117 110 87 -186 -74 8 -67 -24 -102 134 -119 39 84 217 -47 119
11540 119 257 7 -10 28 -42 -116 100 -29 43 103 192 -3 13 -43 -25 -62 -118 35 145 9 146 -10 -140 68
11564 68 -54 -53 -20 114 -35 40 17 57 46 -165 -151 -175 -37 -13 70 -122 -50 -57 17 -8 94 -52 49 12 70 159
11590 159 -148 66 127 -202 -68 -39 -68 32 45 -63 61 59 -54 -18 -134 -160 -70 -12 -107 -79 -14 177 13 -74
11614 -74 49 73 -38 9 -80 95 12 39 64 -41 15 89 -56 157 -178 52 51 116 -107 -106 29 -2 85 -33 73
11639 73 -104 151 -27 9 30 22 85 47 98 29 -13 38 -129 99 -153 -36 -85 188 16 102 -85 19 47 -84
11663 -84 128 58 -20 -252 -86 -47 95 22 0 -56 -50 36 -28 12 -217 -16 39 67 -12 31 -62 -6 244 153 78 -39
11689 -39 2 174 -51 144 189 -129 49 73 -19 -14 15 -90 33 2 -34 141 -52 65 -25 35 99 -7 8 -173
11713 -173 181 -160 -85 -165 46 12 62 110 -21 41 -70 132 -18 0 235 -12 -161 -19 23 104 -43 -54 -229
11736 -229 -138 98 -92 -140 -95 78 144 18 -62 -106 160 -7 25 39 -128 88 18 127 -29 -13 168 -4 120
11759 120 90 -96 -12 48 119 128 -50 188 -16 49 136 28 -73 10 -136 51 204 18 140 -47 65 -55 -134
11782 -134 55 -81 -23 94 -24 -52 -92 24 44 -19 -42 -8 48 -53 -196 131 -6 26 -114 -25 -53 18 -33 -64
11806 -64 -15 67 190 -37 89 220 53 14 -59 131 -88 -47 -18 -44 53 47 21 152 -158 -2 134 186 -95 -113
11830 -113 68 -25 161 99 -98 110 -25 -22 75 -127 134 129 0 -67 -17 -92 -96 48 15 111 120 -90 -24 43 -5 -102
11856 -102 144 50 -30 24 -278 -10 -233 -28 27 142 110 76 14 47 5 19 40 -3 -76 18 4 -175 -26 102 140
11881 140 121 82 -2 -1 -15 -101 -35 -72 230 -40 40 15 -52 53 -37 -83 13 3 5 3 60 14 151 18 -136 -166 87
11908 87 13 52 -94 59 6 128 134 105 -32 10 90 28 -26 -164 177 162 81 -87 29 -52 -143 99 -82 -80 -30 33
11934 33 -82 -92 -93 -60 61 -75 -13 -116 -196 -71 -108 39 34 81 -85 15 -51 -59 135 -45 -90 69 34 124 -50
11959 -50 76 -51 -75 130 53 -68 -39 -118 -78 -70 42 -53 -97 28 124 -5 43 -57 46 137 173 9 72 -31 -117
11984 -117 135 -6 -66 -12 -25 -125 -248 -78 -170 -110 7 -71 198 31 -238 -135 39 4 63 -32 -41 -48 -24 -53 -78
12009 -78 15 -122 118 8 31 -70 -2 -176 26 69 33 -23 -87 -36 -41 -7 -86 -118 -5 -11 104 -78 -8 194 -88
12034 -88 66 -56 -105 141 -30 -93 -44 -183 151 -97 -174 -26 -140 92 6 55 -7 -112 58 168 4 61 -39
12057 -39 -153 22 -2 -128 -122 -16 43 -85 36 88 34 105 49 30 75 164 -38 8 -64 103 -39 -48 105 45 -12 -69
12083 -69 57 61 -30 -46 -48 -104 118 54 -89 -74 72 -57 116 -5 -20 78 -74 -93 -86 14 89 -79 -54 23 16 -106
12109 -106 9 90 -5 -122 78 -68 -108 -54 80 112 1 -79 -78 70 100 -71 -66 25 -67 -135 102 -61 -50 130 -110
12134 -110 -189 87 126 100 -120 180 -3 67 -106 54 -70 -78 60 19 0 124 -97 -58 96 10 -126 -120 117 160
12158 160 100 10 -88 -87 102 -159 61 -37 -91 13 4 -146 -50 76 -7 103 127 -122 -10 9 -142 -89 -113 44 -65
12183 -65 38 13 40 -29 75 40 -153 -104 -43 -8 67 40 76 -130 -46 229 -92 203 16 122 31 -132 62 -121
12207 -121 28 -53 -133 -30 16 82 -79 29 100 92 154 53 197 -44 -54 -63 -87 191 11 -60 31 54 86 32 -23 -3
12233 -3 77 42 -68 62 43 5 25 -5 -71 -52 -47 24 -11 -29 33 11 22 9 -14 18 54 266 71 9 -50 -90 -75 -61 -3
12262 -3 -44 14 -22 -8 -158 -61 -119 -199 -104 -18 -67 -26 -22 -31 142 35 -136 30 91 -10 -2 -39 -139 -131 -59 -2 129 14
12290 14 -108 -72 100 59 60 -14 51 27 -226 -8 -79 -3 -30 -99 -141 -80 117 68 69 6 101 -70 -34 -53 -135 52 -58
12317 -58 0 -41 -4 79 -179 -56 23 -27 -75 -154 108 22 -120 3 114 9 8 -14 127 131 10 23 63 -59 123
12342 123 34 -8 146 -188 -104 79 -21 -1 7 107 136 92 59 -81 -136 -112 -169 -38 76 -23 9 -30 81 -74 43
12367 43 -84 -24 -59 -35 110 -279 29 50 -58 -70 -93 52 42 80 -47 31 -22 137 92 41 211 -171 -56 -57 -18
12392 -18 -33 -178 58 -42 -111 -113 57 -18 -13 -7 65 90 22 -35 62 35 -13 -7 -50 -37 80 107 93 -19 85 -62 -85 -61
12420 -61 -54 -73 146 16 -103 -170 -61 -66 -106 -23 -65 84 175 26 -104 -91 -124 -145 -25 -100 -42 -155 87 32 -194
12445 -194 -77 103 24 59 71 -157 85 -188 -21 130 149 -154 -76 -63 -55 -300 -14 -33 44 -66 -93 137 -79
12468 -79 -66 88 -68 -50 -143 -91 69 77 -209 -32 11 9 16 16 60 -108 -31 -198 60 -62 -55 73 14 -18 -122 19
12494 19 -21 -16 -17 48 60 -35 28 132 80 -168 24 15 83 -103 -110 -60 -64 174 -14 -105 -120 74 11 39 80 -36 -67 98
12522 98 -67 27 -52 -62 50 121 -5 29 -184 -195 -17 60 -130 45 21 -28 91 -117 34 37 -85 34 -60 -80
12546 -80 93 80 75 -127 -68 -132 33 54 15 17 -19 -9 56 69 -140 -172 -35 79 -61 -2 15 -81 -95 77 98 -33
12572 -33 -91 -59 -51 4 -73 29 72 -103 -79 7 -32 14 -47 -39 -118 -94 156 -87 19 -24 -130 3 60 22 -75 -28 92
12599 92 127 -30 134 -208 -14 4 -50 221 -115 -23 -31 -23 192 29 -70 66 46 19 49 47 132 -52 -61 -140 -66 -39 -23
12626 -23 -53 12 -29 136 -12 26 53 60 51 -151 47 -13 -129 26 27 78 124 -59 -37 17 117 -277 62 -92 -79 -51
12652 -51 -56 29 -22 56 -133 -4 -134 46 72 -60 145 -41 21 8 24 -40 89 -23 -104 -11 -13 48 133 10 25 85
12678 85 -5 -170 93 -124 -40 -13 12 -19 -124 -1 -16 25 198 75 -105 145 97 76 5 121 -118 82 -51
12701 -51 34 45 77 32 -68 -141 -45 -10 -188 20 30 129 205 -11 -62 28 156 -99 74 -73 -4 99 33 69 4
12726 4 -137 -79 2 -54 102 -68 296 83 -190 -20 90 56 -121 133 -59 144 132 31 -21 -178 85 119 1
12749 1 -48 -33 77 198 -2 49 27 100 53 42 -18 -121 -55 23 -72 -146 -78 84 145 76 -154 -91 230 164 -152 -74
12775 -74 13 2 -9 91 -76 -8 2 41 -64 -41 82 -27 77 -20 33 158 -124 -28 -117 91 39 9 -26 37 -80
12800 -80 -40 -113 -148 37 162 -62 -47 -121 74 -171 50 62 -108 -37 -51 5 -67 53 64 140 -228 183 29 23 -4
12825 -4 163 -50 132 84 10 93 119 69 1 20 -74 -92 -9 51 18 -53 44 -51 -127 85 -10 -29 -217 -87 -121 62 -51
12852 -51 -90 -139 91 97 3 58 -232 74 -61 -65 -27 85 65 -33 53 -53 62 1 -160 23 41 29 120 -25 -56 -114
12878 -114 -11 -8 7 -124 -56 10 1 3 -124 -45 99 -77 11 129 89 18 49 -135 30 41 -54 -162 48 -56 -137
12903 -137 -28 65 -4 52 4 23 21 112 -10 -16 -1 -12 -160 -55 130 24 -18 -32 48 -62 -22 -45 125 165 102 88
12929 88 -14 -86 -95 17 -37 141 21 -165 -66 -3 -14 -28 -18 2 77 -84 35 -26 -74 3 -109 -9 83 66 63 -13
12955 -13 -61 -19 176 -38 50 -183 16 -35 -53 108 34 -134 -52 -1 75 -43 106 24 25 33 50 -70 19 103 69 -42
12981 -42 -185 -93 103 48 -221 40 -21 -115 198 -53 1 57 1 11 114 89 -3 -70 -148 171 -44 -97 27 70 -80
13006 -80 67 -105 4 -50 33 -132 -168 71 32 111 -171 34 45 24 85 -41 -169 107 -112 100 97 -33 -15 29
13030 29 -57 39 79 11 100 87 -26 -61 44 -159 -121 28 -12 -73 106 -147 -94 -127 77 -64 -4 -69 61 67 -149
13055 -149 -16 -75 2 -54 165 39 -21 32 19 -12 -73 19 -63 -15 108 96 -70 -227 69 -101 -8 -88 39 150
13079 150 -28 66 -12 39 -186 -8 -215 74 -32 63 45 -143 -93 183 -92 -27 75 -19 51 20 68 -74 -113 175
13103 175 107 -58 -263 37 46 83 51 5 -7 -50 -143 -96 27 153 23 98 3 107 -52 57 21 53 -102 -33 -51
13128 -51 -129 -18 7 -142 153 -66 -146 -46 -55 -58 -89 50 -74 148 -44 -65 -126 -163 139 -76 -25 149 -24 213
13152 213 21 91 3 95 60 -66 43 112 8 -71 -17 37 -89 15 -28 -62 -36 39 92 -137 -114 -19 130 160 123
13177 123 -123 45 39 -52 20 33 -99 -106 -68 -224 134 -152 -49 -53 11 -62 -9 57 -130 35 67 -109 17 -116 -12
13202 -12 -61 40 35 81 52 -43 83 -34 -41 -79 -27 60 39 -5 30 -104 46 31 96 -244 102 46 -13 89 -127 -23
13228 -23 63 -7 141 -8 84 -107 -56 -31 -71 27 31 -9 88 -32 -114 -240 9 64 -80 -44 -198 67 -81 -114 -43
13253 -43 33 -30 95 43 53 122 -132 -82 44 -59 166 52 28 21 -65 201 -9 44 71 -1 -21 141 15 -93 -82
13278 -82 8 45 -63 -6 83 20 22 93 28 174 38 -69 17 101 93 62 56 -16 53 36 102 53 -34 -84 73 -106 75 160
13306 160 19 -65 118 84 -41 105 142 -48 -19 195 108 -241 210 -2 -120 -136 37 10 40 83 88 -35 -85 11
13330 11 -21 -93 -35 -69 48 177 -37 68 -6 -56 -39 -33 -102 28 -144 154 144 81 7 122 112 -158 15 75 210
13355 210 -85 -72 81 88 -18 -50 104 65 34 17 -56 28 32 -58 -48 94 -4 39 -45 203 -17 -89 185 0 6 105
13381 105 67 -212 19 -153 54 40 7 -114 131 142 68 -19 -46 33 -94 -12 -36 -141 -111 48 34 14 -117 -21
13405 -21 69 15 -9 -13 -78 -48 193 -4 -40 8 -162 22 0 168 21 -30 55 -3 57 -90 122 123 -152 -41 108
13430 108 -152 -117 119 -147 91 216 96 -80 69 -25 -40 21 -143 38 -30 110 -41 -12 -126 -137 195 -78
13452 -78 37 152 -54 -27 -2 113 -46 56 18 -119 12 -114 185 57 -37 -76 0 125 -156 -81 -73 35 -32
13475 -32 153 -143 127 151 121 -32 -15 171 -87 199 -6 -18 -122 -68 -3 57 86 151 42 114 9 191 1
13498 1 54 66 2 27 61 26 109 -108 -114 3 -140 30 94 30 243 -172 -177 65 -112 26 31 -86 21 -2 17 -51
13524 -51 -44 -33 -38 42 28 -4 -19 -10 221 -185 -166 -31 -110 23 -75 -73 -51 -47 87 87 28 135 86 170 -93 -7 -43 55 -38
13553 -38 30 -60 -52 -8 -37 68 94 -83 -5 -183 -28 91 153 -53 130 13 -47 11 58 -127 -75 -11 -13 -42 103 31
13579 31 7 147 -8 -43 -30 -81 -125 53 -32 45 59 147 6 33 85 11 10 -73 -15 -66 -77 122 -4 -12 76 -27 -138
13606 -138 15 -11 -32 -47 -90 100 -237 41 140 -132 -100 98 -64 -33 -113 -86 50 140 72 43 -74 -120 -18 1
13630 1 -124 65 -2 90 -2 -38 41 -96 -21 28 123 -85 49 -116 -13 -141 132 -40 -137 -75 98 72 82 -184
13654 -184 28 87 47 -5 -17 -107 -96 -45 -85 -101 -106 22 -5 103 99 -24 80 -158 -24 94 50 -73 -2 -27 -68 -31
13680 -31 29 -41 -126 -47 173 -31 -16 -24 88 133 -137 50 -13 49 -63 190 81 -222 -34 4 -86 44 28 -150
13704 -150 47 24 137 -21 79 -165 86 14 -21 120 20 86 21 131 233 -110 -64 51 -60 -35 -58 -111 -35
13727 -35 -8 -106 23 -16 -66 89 -67 32 16 16 -1 91 120 -59 124 105 95 50 85 0 74 -31 -13 179 24 9
13753 9 -159 6 -44 32 16 -110 -161 50 -131 161 -61 -95 85 -61 -28 100 -30 -141 -47 -121 156 132 -113
13776 -113 174 -17 133 -4 42 65 83 49 -149 -102 -139 45 -52 -19 -61 55 19 32 -43 8 1 -81 75 -42 -92
13801 -92 -112 90 -15 -35 -83 -13 8 -125 73 40 92 -85 172 -143 -145 38 11 74 -179 6 133 130 55 -98 10
13826 10 -174 -15 89 -64 145 159 -9 -28 -124 62 -144 36 -158 -40 -35 -146 74 73 117 -122 49 -58 127
13849 127 -77 -15 10 -143 39 -128 39 -155 31 -236 -55 -2 107 -118 -82 -3 -142 -93 -152 -36 83 44
13871 44 -136 -20 44 38 -11 118 -152 -5 47 -46 48 10 64 60 17 15 15 -41 -55 28 -21 -107 -27 48 -43 74 16 80 32
13900 32 54 93 31 4 56 39 139 -135 168 2 11 63 -166 23 45 -28 27 24 -80 111 87 -18 -17 21 -72 -59 14
13927 14 -75 -171 -100 -39 135 21 58 117 -31 92 -149 43 -57 -16 112 41 108 -26 37 33 -11 -125 -53 -86 -6
13952 -6 -88 33 4 -80 -96 -27 -85 -13 7 60 64 53 -4 -51 3 -164 40 -1 -62 -16 105 -205 -101 38 -49 -164 119
13979 119 -103 -176 75 -24 24 -58 105 -13 -100 -11 65 47 132 68 -13 -112 -84 19 92 41 36 -55 -33 -81 -21 -24 54 -139
14007 -139 92 51 33 -8 57 48 -12 -69 -101 -61 151 93 -81 118 28 93 106 135 -37 -114 9 -3 -29 1 122 0
14033 0 58 -39 116 -46 -20 -58 101 -66 115 89 30 55 -153 -47 -35 -71 58 129 37 100 -81 28 79 56 -58
14058 -58 62 65 71 18 -19 -101 -17 -6 -12 200 159 -53 11 -38 -5 154 -57 -39 69 -16 41 -33 -64 117 -35 92 -78
14085 -78 21 44 78 3 62 -115 -87 56 -167 67 -15 -83 -97 22 -72 -3 -160 -94 228 -24 32 64 44 -37 -53 32
14111 32 92 77 -47 -55 -139 51 55 -72 -16 -15 -106 31 -1 184 42 -40 -90 -24 18 -50 -90 -32 -5 -53 -8 -24 77 -37
14139 -37 21 127 34 -37 -21 46 -186 74 166 -25 6 -11 -111 -6 -124 139 107 7 -12 -17 -61 -2 223 -26 -40
14164 -40 -127 -145 20 8 83 -42 -8 221 158 -14 15 -108 100 90 -25 -38 -130 35 -212 -9 4 28 -10 14 52
14189 52 -16 -124 -117 129 -70 -18 -118 -6 193 -67 -7 -197 101 -42 31 -32 57 54 -67 41 -105 -19 29 -50
14213 -50 60 85 147 125 72 90 13 -110 72 21 -38 -7 70 249 50 -46 -46 69 24 82 129 -176 -74 -16 47 146
14239 146 -28 20 128 38 114 9 134 -139 -26 21 -12 -70 -139 19 46 39 -106 -19 197 -51 -56 -27 -129 10
14263 10 -113 -108 -108 -85 138 -24 -19 1 9 -186 -96 -100 47 -125 -41 -88 -153 -3 21 -4 -93 42 -96 -87 -19 144 -51
14290 -51 -170 7 44 66 68 -37 28 -29 9 98 -193 94 30 -90 68 -23 132 1 45 13 -96 -183 267 92
14314 92 -53 12 -61 103 -143 -51 -6 -181 136 -82 -43 104 -122 21 -20 -4 -16 -106 59 32 -39 88 88 73 92
14339 92 1 -110 87 52 -119 -4 -6 -21 -124 -68 30 160 -50 -48 -64 -24 -17 56 -97 -114 -11 98 19 17 -138 -142 8
14366 8 -148 -83 -59 33 4 55 9 31 172 57 -74 -95 40 38 -97 23 -279 43 -1 -156 -6 -7 55 -78 -22
14391 -22 98 0 33 -148 77 -34 99 5 -105 72 15 -48 103 74 -30 7 -9 -198 -95 -44 57 -25 27 21
14415 21 -27 -1 40 -108 -17 39 123 -90 -151 -24 -151 106 96 78 50 110 45 -50 -63 -145 -67 76 -97 111 -57
14440 -57 77 17 79 -54 64 -148 131 -119 -140 -25 -51 63 137 -22 -103 61 44 89 -64 66 -94 -65 -6
14463 -6 56 -94 -134 -36 50 63 -24 21 -24 116 26 -129 164 7 -10 -113 -116 64 -157 14 -44 15 135 71 -155
14488 -155 162 -65 -103 -242 -151 127 90 -54 -144 20 -37 -73 -7 -79 -99 7 2 33 -228 24 -32 -78 108 -23
14512 -23 25 -80 -11 212 -217 25 -158 38 153 59 -171 -25 58 -31 36 25 117 89 -140 -38 113 -42 -34 97
14536 97 7 55 42 123 -21 -163 56 0 -16 -28 125 11 -10 94 -5 -57 -11 1 -80 1 18 12 83 15 -148 42
14562 42 -99 -112 -86 1 126 -22 -32 -42 68 11 62 -72 -25 -6 13 32 -71 -96 -76 7 -40 89 -151 44 65
14587 65 44 14 -1 36 -85 41 76 182 124 88 91 99 203 -62 -51 -12 -115 8 -49 -68 96 105 -78 -26 -4 59 6
14614 6 73 -95 -82 189 -255 -95 -126 43 -30 -51 51 153 -183 -104 -32 124 20 -81 99 -219 -6 73 9
14637 9 34 106 44 -27 -183 -40 50 57 129 -64 11 -106 -20 168 130 41 26 136 52 -170 -174 -67 -146 -18 -185 -39
14663 -39 -8 106 -80 -30 83 183 167 -44 47 -139 -160 -87 -61 -49 59 -75 70 -88 -259 -65 24 -58 -38 -183
14687 -183 48 92 -66 -147 93 -102 51 16 -79 -151 -105 164 5 -21 -113 -37 -95 17 17 -68 -53 -26 115 -106 -113
14712 -113 23 71 7 -116 -125 -125 -65 -42 -22 -66 67 -20 -66 164 -108 -144 115 16 -146 177 156 -94 65 -88 -15
14737 -15 -114 0 -12 -148 -100 97 33 -34 -118 56 -171 15 29 82 119 -53 -11 97 -13 189 -170 -78 -140 -134 90
14762 90 -214 -12 -87 188 54 78 250 59 -28 -3 28 -88 -151 19 -20 6 -121 14 -33 -85 -27 -51 201 40
14786 40 -23 -135 103 -88 1 141 -39 58 -112 186 -26 -100 26 120 83 19 -196 115 109 -125 -10 -98 71
14809 71 -11 -75 -24 -137 40 -69 -80 129 21 -35 -52 23 -49 170 -59 -7 -30 21 89 -215 34 -61 -196 -33
14833 -33 101 75 -13 -154 14 66 96 -125 -28 13 -15 -71 69 -18 -99 60 14 -14 -19 -145 -59 87 -109 54 38
14858 38 -56 67 39 -3 51 -7 -49 116 35 -83 66 132 54 44 -16 -145 -56 -54 -108 -6 14 -25 27 86 -43 37 71
14885 71 19 24 -29 -36 -78 -50 68 -43 -36 -96 39 -86 24 98 -13 159 96 100 113 -26 -71 -20 -52 -3 -319 -28 14
14912 14 6 -60 -97 -105 -59 251 -24 -26 -58 -47 -113 -59 40 -183 -30 250 71 -4 -18 -123 90 257 -103 -25 -51 -11
14938 -11 -5 -20 -14 -96 -28 49 -35 88 -89 -6 187 77 126 -17 39 -57 -87 -84 -63 16 -26 3 -161 -26 33 -25 55 61
14966 61 -44 30 -157 -38 3 -76 -2 7 -21 -128 278 56 12 -41 87 116 -53 -58 -142 -95 126 15 57 -48 29
14991 29 31 71 21 -79 57 159 112 -86 -55 -10 -90 102 179 -253 19 -120 12 -262 27 115 -14 -68 -54 -103
15015 -103 64 -131 24 57 -72 -82 -127 -61 -17 -82 208 80 5 68 -13 171 -35 9 124 -5 -175 45 87
15038 87 -168 83 226 -37 16 -9 111 -98 -133 -119 11 -4 -118 -23 126 -13 -17 -33 23 -157 25 7 77 71 113
15063 113 -21 -6 169 75 110 18 3 -35 -16 -38 -27 -7 -29 138 15 -118 -147 -42 -10 126 -81 -110 -14 118 -220
15088 -220 154 53 -150 116 4 -52 -55 41 69 -38 37 -131 103 59 75 -88 -84 113 125 -114 -130 -16 -100 92
15112 92 -23 -18 -170 -107 80 136 152 -85 15 28 149 24 16 -16 -206 -86 69 -48 -42 -139 -11 -149 -96 25
15136 25 -143 31 -123 -55 75 -27 -134 34 -99 63 57 -82 258 -4 74 20 -23 41 28 34 -129 -244 20
15159 20 -70 154 -74 -95 -39 92 34 25 168 -137 -67 -43 54 -85 73 146 -90 5 -81 -67 51 -70 12 -17 -6
15184 -6 149 73 52 -85 63 -96 -120 -36 -86 -246 21 -28 -133 47 -182 23 -204 128 -98 -59 84 -14 -20 7
15208 7 21 -74 -112 -54 -118 -80 -25 -180 -75 135 -59 129 -41 2 5 -41 49 -27 -96 -8 53 -140 -146 -40 -43 95 -48
15235 -48 26 -15 61 31 -108 -231 128 88 -84 79 16 59 -32 179 1 -14 74 -49 -138 0 108 190 -34 -3
15259 -3 55 20 27 -144 -12 82 -116 100 -35 -15 75 -48 73 56 33 59 111 62 -148 -93 -7 68 -82 -38 -10 -103
15285 -103 -88 -2 -38 62 -68 62 -104 -33 15 -66 -45 17 -60 -107 -127 6 -44 269 167 79 61 79 -26 113 31
15310 31 41 -115 -56 -134 100 -5 -47 87 -25 -168 -66 68 19 160 7 11 -71 -48 57 -30 122 -60 54
15333 54 226 -71 43 31 -57 -3 -58 -19 -213 -25 -33 -158 -10 26 208 125 -27 9 29 -75 -4 1 52 15 -83 142
15359 142 28 6 -83 -94 101 55 26 52 40 55 98 52 -132 111 35 193 58 176 10 -74 -238 -138 34 -99
15383 -99 -50 -19 -37 -185 19 0 89 -34 -9 -185 -112 -38 -55 -64 198 42 112 -5 48 116 -106 -75 -7 -53 -85 -94 56
15410 56 -131 -36 -112 -44 -18 -105 -36 24 -15 -109 114 43 59 106 158 -89 44 -39 -118 -137 -55 -139 -149 -98 230 25 -43
15437 -43 -31 18 -23 -33 65 -121 -109 -9 209 9 -6 -34 131 47 -188 -121 -160 210 -22 -126 -112 -92 67 -4 118
15462 118 -35 -75 21 5 67 82 119 -52 -52 48 -42 -10 15 -31 78 -108 -63 90 126 -59 0 -20 -138 19 153
15487 153 -110 88 106 56 11 7 5 31 -34 -10 -20 -97 116 -85 -52 79 -107 -14 3 88 50 -59 -118 -7 33 128
15513 128 -38 -56 -176 134 39 29 -19 -73 89 14 173 -130 -126 107 -2 -12 -45 32 37 -89 16 85 64 -142 8
15538 8 -182 -110 -194 129 50 33 103 16 -9 -92 5 5 89 -57 -51 147 104 -82 -35 5 -75 -112 111 127 -127 153 -22
15565 -22 115 -18 -43 -103 137 101 -110 89 -25 -65 -26 -64 0 -18 110 -10 -131 -64 -8 -2 6 19 23 57 27 -5 -20
15592 -20 -84 32 169 73 -179 29 108 -101 -40 188 -38 1 -10 42 -7 31 -30 -6 -20 51 22 28 45 -53 111 -106
15618 -106 15 142 28 35 73 -16 22 -107 60 -28 -113 -78 -122 150 114 28 -13 -137 -230 -114 -175 -149 94 3 -84
15643 -84 139 -62 74 58 73 -71 34 4 18 154 -39 4 -90 44 71 70 -12 153 -67 54 47 -56 81 31
15667 31 -18 198 -39 81 -117 -122 84 109 21 -118 -149 51 -79 -173 29 -114 -101 -37 97 26 -67 76 21 47
15691 47 -66 11 -176 -26 46 -39 102 56 95 173 54 -76 69 42 -103 32 8 -28 -28 -120 -121 -30 35 -149 33
15716 33 -45 40 40 14 -41 -37 -56 17 50 -28 -45 -33 192 -41 -63 19 39 -44 221 77 79 76 107 -37 -7 -146 40 103
15744 103 19 -47 57 -158 20 12 22 -120 -106 -226 -85 124 101 41 -135 35 48 18 118 146 12 73 -50 -102
15768 -102 46 -14 -27 77 4 -29 99 144 -222 -53 -10 15 -13 -19 -94 -31 47 6 56 -9 -137 0 -68 143 -32
15793 -32 -176 22 -63 61 37 99 99 -130 -35 -29 12 -76 -22 -110 61 152 -77 85 -61 89 -25 98 23 -68 258
15818 258 -6 -49 17 -215 -31 -67 143 -198 -10 -37 75 -66 -16 -86 8 52 212 -25 -31 -35 -16 196 -246 -65
15842 -65 12 -23 5 -26 102 41 -62 -49 146 12 85 -63 78 -34 12 111 -92 -73 43 23 -8 50 64 14 -39
15867 -39 117 -131 78 5 -133 -77 40 -1 10 35 -151 -79 93 -83 -32 54 -18 -73 -60 87 -7 135 -24 23
15891 23 -51 -11 -73 73 -19 15 -3 52 87 122 65 -139 89 62 61 43 -235 -186 -18 -39 -130 103 -184 -136 83 -47
15917 -47 77 -118 -153 -8 48 -128 -18 10 -19 -21 -100 7 -2 -9 16 20 3 13 -65 -43 -127 123 -132 -11 -55 122 -187
15944 -187 -57 -31 -97 -70 -64 71 -112 1 -46 -54 -94 -52 99 -3 -22 49 -52 4 -141 161 -43 87 34 27 18 -95
15970 -95 -54 -48 10 -19 -52 68 145 68 -35 68 134 -108 -75 24 24 -21 50 207 -17 -105 -163 -13 -115 177 -77 -135
15996 -135 45 122 -96 83 -7 86 -119 -96 108 -53 137 80 -60 -115 157 48 14 4 -128 -63 -159 -88 -20 -25
16020 -25 -79 -234 106 -109 -19 92 45 -66 -124 -98 -12 -38 141 2 -2 69 -253 8 251 56 92 -69 57 -9
16044 -9 -12 -166 111 -161 -100 -74 -118 56 88 149 -27 72 -170 62 -32 60 154 128 -60 -40 -164 -102 132 23 -18
16069 -18 91 -123 19 -108 114 66 12 49 17 -116 48 11 -111 -34 -170 2 40 -62 -93 8 -146 -7 27
16092 27 36 -2 29 76 -47 -108 12 46 -28 -61 -65 -28 -115 4 -55 -73 -131 -17 -13 75 112 -153 13 -70 -34 135 26
16119 26 -98 14 110 68 73 28 30 -151 14 -31 -29 42 109 -97 -148 58 -134 -87 -45 48 50 -150 -113 -128 -117 -89 83
16146 83 -26 176 -113 -1 -112 72 104 -142 -151 -50 -67 -17 52 49 -44 -45 -189 -80 -111 -87 -2 -74 -189 -14 -21 74
16172 74 -65 -81 94 51 22 47 -67 11 -132 -155 55 148 121 61 114 -100 -201 -55 3 -37 5 -39 -162 36 35
16197 35 -94 13 22 -22 69 -36 30 27 -153 -152 98 30 -155 33 121 41 126 -133 28 3 -127 150 -135 -70 92
16222 92 73 69 -73 -86 103 -12 95 36 -64 12 82 -36 139 -16 63 -18 -9 -135 89 96 -22 -47 40 -20 63 49
16248 49 34 -112 -30 30 43 154 -77 -59 38 -35 -15 -4 -155 -127 -154 -108 129 93 -46 105 71 -114 2 -55 -70
16273 -70 30 -33 72 -53 65 139 149 -16 -241 -32 127 -7 -125 186 -21 116 -35 -139 76 -96 11
16294 11 -44 -127 76 -38 -16 -161 -70 71 -111 -81 -63 -32 -181 176 73 80 113 -34 50 -85 -24 -88 37 -137
16318 -137 119 -59 85 -11 -190 -22 27 63 42 -94 -44 -116 -1 -22 1 -18 176 -21 -36 -36 -146 92 51 54 61
16343 61 -41 -21 -20 -71 -87 92 -67 27 110 -64 -20 -122 38 -42 -87 212 118 -5 78 44 18 83 101 -10 -27 -1
16369 -1 56 -44 64 -183 -125 -16 -3 -48 -55 -32 18 130 82 38
16383C8
$$ Imaginary data points
##PAGE= N=2
##DATA TABLE= (X++(I..I)), XYDATA
0 0 0 0 0 0 0 0 0 0 0 16 -16 16 -16 32 -32 48 -48 64 -80 96 -112 128 -145 176 -208 240 -288 336 -384 433
30 433 -501 576 -655 736 -832 937 -1055 1177 -1313 1471 -1633 1818 -2015 2228 -2466 2725
46 2725 -3007 3315 -3653 4027 -4433 4885 -5387 5944 -6567 7275 -8076 8995 -10071 11337
60 11337 -12859 14729 -17094 20187 -24429 30634 -40620 59337 -106645 488080 609462 -649563
72 -649563 -839121 -211527 567700 531131 92852 -269595 -234324 -164418 -96170 32637 307577
83 307577 335443 -28825 -508342 -491359 64134 605133 471192 -170711 -591529 -330121
93 -330121 200604 411565 190695 -85044 -180516 -137859 -84599 23985 200221 268858 38904
104 38904 -287673 -301911 49986 325656 200190 -115418 -203009 -32670 71057 -34014
114 -34014 -93552 73975 223083 49305 -278174 -309264 48341 374647 268805 -146366
124 -146366 -367915 -142794 214912 255792 -1630 -153919 -29052 96269 -22955 -187286
134 -187286 -56387 262484 289402 -110446 -437988 -226551 282901 448984 81863 -342140
144 -342140 -326247 40378 275002 154009 -71599 -116517 -33730 -16435 -53200 3543 132838
155 132838 136534 -54722 -224743 -134184 134100 252763 77530 -167516 -191216 2613 154394
166 154394 98083 -47151 -79069 -4298 16784 -38152 -28403 71346 91874 -42299 -148443
177 -148443 -47076 141172 143758 -59512 -183165 -45501 159587 141839 -69068 -183031
187 -183031 -55820 133197 137316 -32934 -142276 -58153 78137 78835 -21423 -50049 25433
198 25433 59438 -28166 -109114 -27326 138645 144448 -60923 -218380 -105042 143960 211272
209 211272 19701 -179038 -146244 43928 136562 54657 -40649 -33964 -841 -22982 -40202
220 -40202 20814 96123 64714 -65482 -140412 -51620 103404 134021 6349 -117292 -95163
231 -95163 26342 95550 45226 -36605 -39234 12685 15209 -30414 -22885 47863 66481 -18134
243 -18134 -97174 -54028 62847 96079 -1064 -90413 -47605 54057 63937 -17057 -56955 -1785
255 -1785 58860 31727 -45994 -62220 10211 69224 32012 -46136 -59999 -2134 44385 26469
267 26469 -20397 -25898 13739 28603 -13916 -42297 4631 65222 40670 -49648 -84424 -8932
279 -8932 81535 64279 -36705 -83018 -22536 46842 39127 -6478 -17687 1987 4594 -16241
291 -16241 -16467 23009 50498 12521 -53543 -59421 7407 65696 46348 -28492 -71968 -31805 42020
304 42020 57334 4529 -37010 -21428 10875 13512 -1572 2365 21480 12320 -31882 -48016 4382
317 4382 59947 34751 -39867 -62925 -9118 48173 41803 -9748 -36769 -11935 19179 15761 -2464
330 -2464 -2442 6321 1107 -12822 -16687 -568 21855 18386 -15861 -36286 -8884 31608 30508 -7737
344 -7737 -31285 -10080 26167 25180 -11689 -26392 2684 23109 1501 -23828 -12419 13887 15807
357 15807 -7533 -20733 -2903 20494 13682 -11829 -14268 7327 17697 4883 -11096 -13230 187
370 187 14818 8215 -14363 -19924 633 17142 8428 -9995 -13609 2694 16680 6816 -10771
383 -10771 -4745 13310 7956 -13802 -13537 8494 17084 -1227 -21670 -16595 9359 22172 4721
396 4721 -15689 -11295 4931 10606 7641 3627 -2469 -6162 -3404 -646 578 4716 5609 -4284 -15377
411 -15377 -12362 4078 19533 14637 -9691 -22594 -4400 19158 16438 -1033 -7054 -3095 -3113 -5509
425 -5509 -1552 8149 10086 -3595 -18466 -12943 6570 15498 8858 -511 -6029 -8424 -3531 7290
439 7290 13135 8008 -3283 -12563 -12894 -3432 7708 12262 6978 -7865 -19655 -11866 10639 20520
453 20520 9797 -3798 -7609 -7250 -6299 1131 14796 19563 1455 -26602 -30563 -1323 28164 26336
467 26336 -513 -23583 -25245 -5683 19707 28426 12924 -10714 -22657 -15023 3419 16840 17264
480 17264 7878 -9162 -27784 -26426 3935 36013 32564 -4423 -36975 -33368 2529 36092 36816
493 36816 6537 -26083 -36144 -15109 19823 35183 15393 -15813 -27663 -18695 -2498 13289
505 13289 24294 20600 -1825 -30038 -35134 -1693 41007 45807 5417 -39611 -48013 -13473 33806
518 33806 48575 14174 -32960 -44078 -14136 20385 29468 15174 -743 -8398 -16087 -23058 -6395
531 -6395 31524 47046 11548 -42550 -58382 -16997 42939 61392 17344 -43489 -59414 -19043
543 -19043 34026 52472 23651 -20324 -36747 -20058 2087 15900 26776 25434 -1734 -39391
555 -39391 -48868 -11294 45036 63697 17306 -50906 -70350 -21618 47578 74773 32951 -41131
567 -41131 -73328 -31177 35936 59381 26967 -19648 -40129 -28609 -5666 14179 30133 33884
579 33884 6252 -40578 -56638 -15356 49069 73704 27516 -52224 -84107 -28931 56453 80311
591 80311 21514 -52848 -67598 -16555 37169 41020 10917 -8492 -11343 -17513 -22163 -3616 32478
604 32478 48442 15922 -43070 -65789 -20181 49542 68619 18554 -49661 -68859 -20962 44589
616 44589 59509 16492 -30399 -38142 -14578 10083 21574 21194 12803 -4711 -28058 -35326 -8510
629 -8510 32896 46254 15651 -34041 -58609 -27872 36216 69752 31925 -38222 -66259 -25215
641 -25215 37341 56279 18320 -27847 -36567 -13932 6076 12637 14328 13286 2041 -19310 -33022
654 -33022 -15509 28136 52680 22667 -35962 -59030 -18704 43508 58736 9571 -46644 -47107
666 -47107 -344 33332 24327 -2820 -14819 -8430 -1963 -3364 -603 12760 19791 5287 -17758
679 -17758 -24810 -7290 19192 28717 7586 -24249 -31085 -5960 21381 23290 3073 -15497 -14229
692 -14229 77 9105 7207 3233 1527 -482 -3235 -5285 -6953 -2346 9779 14693 275 -20032
706 -20032 -20911 1914 25340 22222 -5615 -25670 -13880 11950 19882 6913 -7215 -9528 -3658
719 -3658 -81 -1862 -1149 6084 8823 -1521 -14761 -13338 4376 21582 18100 -6523 -24855 -13038
733 -13038 14469 22614 4762 -14018 -14512 -2520 6131 4596 542 -7 -1247 -5038 -4300 2730 7451
748 7451 5504 1169 -3338 -5609 -2353 4156 6028 1568 -4581 -7128 -3875 2120 4262 1633 -769
763 -769 -1266 -1634 -151 3183 3487 680 -437 882 111 -2908 -4165 -673 5370 4921 -5026 -11368 -3881
780 -3881 8484 9340 648 -5712 -4689 276 4626 4990 2222 -1011 -4281 -5402 -1456 3646 3932 597
796 597 -3162 -6512 -5056 3806 10688 5822 -5427 -8688 -1803 6989 8173 1446 -5157 -5552 -2705
811 -2705 -161 2856 4703 159 -6795 -6480 682 7179 6945 760 -5358 -4560 1371 4909 4578 1609
827 1609 -3778 -7009 -2981 3665 4365 -114 -3315 -3725 -2003 1734 4155 3759 1039 -2767 -4147 907
843 907 6224 3234 -3852 -4230 -731 -245 -535 696 580 -1280 -1991 -820 1622 3407 1953 -1594 -812
860 -812 2057 1192 -769 66 147 -1946 -1378 810 -228 -1950 -1176 307 1297 1684 -17 -1770 770
877 770 3554 1155 -1444 171 783 -1851 -1778 690 922 -725 -2504 -2519 -8 2935 1779 -1352 -374
894 -374 1249 436 597 2927 1102 -2778 -2235 1048 1389 -700 -1404 -1605 -794 340 186 316 1901 726
912 726 -2236 -585 3961 3407 -1101 -2416 -912 212 946 434 -1194 -1807 -1214 -1293 118 2918 2050
929 2050 -1620 -2237 756 2366 2179 1969 -425 -2534 -1938 388 1956 763 -1706 -3662 -1449 1524
945 1524 639 -930 1250 2843 -385 -2672 -171 3603 3083 -538 -3252 -2207 1156 1023 -1538 -1707
961 -1707 467 296 -1268 -842 168 1275 2526 2159 -454 -2026 -483 1889 2287 479 -2136 -2446
977 -2446 -889 -892 -1758 631 3696 1347 -4422 -5090 1403 7114 5348 -1674 -5506 -2062 2527 2413 9
994 9 37 -401 -2790 -3947 -2002 2104 5025 3139 -3065 -6353 -2414 4739 8046 4450 -3769 -7389 -2614
1011 -2614 3678 3824 676 -758 -2104 -4763 -4314 1117 6003 5592 -517 -6383 -4307 2894 5672 3344
1027 3344 1442 -508 -4839 -6584 -1287 5640 7381 833 -8571 -10853 -808 10121 9450 179 -6983
1042 -6983 -5835 889 5974 3476 -1081 57 2030 -3570 -9440 -4277 8600 12889 1346 -14856
1056 -14856 -15087 3704 18822 11663 -6540 -12995 -4613 5622 7723 2312 -2523 -2204 -1085 -4122
1070 -4122 -5693 538 8045 7694 -1981 -11335 -9627 4268 15617 10446 -4828 -12430 -7390 2659
1084 2659 9166 7517 -658 -8664 -9118 -2863 5494 8361 2529 -5139 -4428 791 1287 -688 2623 7600
1100 7600 5386 -5619 -14041 -7479 10613 18205 3049 -17479 -18201 985 17638 13887 -4732
1113 -4732 -15032 -5075 9612 8518 -3686 -6120 4117 9476 -1484 -15603 -11354 10520 21606
1126 21606 3533 -21152 -19844 4380 21700 14018 -6931 -16488 -6002 9043 10045 807 -4142
1139 -4142 -1786 313 -1680 -4729 -2886 4987 8777 695 -10192 -9557 1519 10960 10649 1101 -9173
1154 -9173 -10388 -982 8900 10653 2181 -10352 -13687 -1568 11478 8478 -4441 -9265 -1358 6823
1168 6823 3760 -5579 -5323 7247 12756 -932 -16350 -10864 9641 18911 4826 -16837 -19742 1402
1182 1402 20036 12031 -10204 -16002 -191 13519 7754 -7377 -9770 4885 13782 899 -15609
1195 -15609 -10314 9510 15863 1373 -14816 -13214 3632 14886 7322 -6926 -8929 -159 5707
1208 5707 4128 183 -1397 -337 462 -1704 -3242 164 3263 1020 -2467 -2564 -835 26 1240 2603
1224 2603 3263 1051 -3849 -6095 1234 10090 6035 -7544 -12076 -1195 10325 7291 -6215 -11188
1238 -11188 -566 10567 5528 -7342 -8332 4119 11201 3291 -9395 -9405 3986 12870 3433 -11790
1252 -11790 -11614 3683 12269 3522 -9611 -9069 4468 11264 1892 -9140 -4908 7504 9020 -2005
1266 -2005 -9382 -3181 6996 6282 -3965 -8668 -1374 6154 3149 -4259 -4251 2087 4892 1031 -3555
1281 -3555 -1846 3804 4424 -1856 -5227 -944 4354 2515 -3755 -5615 329 5704 1824 -5648 -4339
1296 -4339 4748 7119 -818 -6700 -1837 6726 6428 -3530 -8547 -1004 7720 3941 -6334 -7664 1114
1311 1114 7248 2604 -5544 -5637 3282 8419 1389 -6750 -3900 4758 6700 -934 -7399 -4176 4988
1326 4988 6513 -3011 -9098 -1771 7455 5211 -4136 -6626 1023 8344 4281 -5748 -6034 3725 8133
1341 8133 -528 -8098 -3696 4200 5063 -1928 -7042 -2841 5413 5670 -2475 -5671 689 6230 3498
1356 3498 -3285 -4913 350 5725 2325 -6115 -5714 2756 5585 -945 -6201 -2618 4503 5391 -1342
1371 -1342 -5934 -232 7149 4166 -4811 -5410 1976 5453 771 -5271 -4829 2064 5137 -712 -6161
1386 -6161 -2081 5194 5023 -1645 -4830 -651 5371 5222 -2487 -6981 -1008 5967 2978 -5124 -6115 819
1402 819 5616 1472 -5510 -4540 4063 7343 -370 -6554 -1528 5623 4834 -2059 -6027 -1892 4102 3188
1418 3188 -3746 -5554 631 4894 1358 -3739 -2953 2245 5453 1894 -4216 -3367 3385 5134 -896
1433 -896 -5353 -2120 3001 2879 -2143 -5210 -620 5233 3043 -4038 -3917 2725 5604 1294 -3630 -2616
1449 -2616 2342 3983 -761 -4816 -2027 3009 1753 -2677 -3813 -87 3819 3007 -1799 -3856 976
1464 976 5416 2372 -3330 -3381 1336 3615 520 -4530 -3430 2278 3958 -1828 -5464 -505 4858 3638
1480 3638 -2023 -3790 267 4860 3065 -2776 -3924 817 3450 216 -3166 -2652 615 2481 522
1495 522 -2945 -1991 2524 3561 86 -2466 -595 2388 2693 -510 -3236 -1219 2240 1405 -2798 -2713
1511 -2713 862 2035 -236 -1970 -446 2043 2575 -375 -1979 548 2970 987 -2028 -1825 88
1526 88 1151 317 -1918 -2325 271 2151 229 -2054 -568 1948 2516 483 -1844 -1442 1795 2984
1542 2984 -717 -3523 -1545 1645 1271 -1097 -2155 -396 1557 1174 -996 -906 1681 2272 64 -1041
1558 -1041 -285 326 803 382 -951 -1338 -534 9 -231 -82 180 -119 -154 -14 207 1126 1990 620 -1711
1577 -1711 -1125 1322 1441 -416 -1655 -1279 203 602 -767 -1428 367 1868 343 -1166 -465 857
1593 857 1778 1739 35 -2076 -1568 928 1737 201 -1806 -2256 -935 1716 1397 -1006 -1214 842 1744
1610 1744 627 -501 -297 688 1703 723 -1996 -2405 -459 1412 1504 -396 -2795 -2575 1551 3583 942
1627 942 -2370 -1608 1083 2651 1167 -1350 -1692 664 1602 -439 -2084 -1372 353 1346 871 -1381 -2734
1644 -2734 117 3303 3204 -575 -2750 -1629 1999 3708 655 -3419 -2824 937 1962 239 -1831 -2269
1660 -2269 129 2717 1752 -1973 -2597 1191 4026 2398 -1955 -4282 -955 4400 3762 -2968 -5832 -1393
1676 -1393 3675 3370 -1264 -4167 -1782 3350 4184 -610 -3440 -890 3128 3469 -276 -4130 -2896 2397
1692 2397 4319 -343 -5312 -3209 2069 4122 1299 -3145 -3232 1162 4469 1781 -1980 -2168 122 1835
1708 1835 1670 -1210 -3362 -1619 2214 2305 -1089 -3320 -1885 2119 4207 1121 -3282 -2715 2138 4440
1724 4440 1147 -2772 -3539 -298 3378 2216 -2771 -4702 -404 3497 2835 -1462 -3905 -816 4460
1739 4460 4338 -1600 -4926 -927 4488 3328 -2126 -5010 -1809 3123 3411 -1701 -4509 -1555 3239
1754 3239 3616 -44 -2975 -1596 2585 4052 129 -3634 -2170 1720 2549 -351 -2942 -2371 701 2579
1770 2579 231 -1823 -1151 1171 1848 1394 -68 -996 -547 953 1589 -178 -1752 -1840 -173 1791 684
1787 684 -2226 -2423 681 2609 1387 -939 -1582 47 2649 2168 -1059 -2936 -720 2064 1535 -1593
1803 -1593 -3389 -1338 2585 2542 -1639 -3621 -294 3583 2603 -1120 -2909 -122 3082 2219 -2233 -3309
1819 -3309 -109 2039 701 -1879 -2333 -101 2251 1682 -1061 -1727 990 2245 1092 -690 -1209 158
1835 158 1311 341 -1702 -1358 490 759 -935 -1256 171 816 269 -489 -227 903 1324 -105 -978 605
1853 605 1553 -421 -1745 -892 457 690 -377 -1618 -939 1214 1956 -214 -1543 -97 1855 1636 -167
1870 -167 -1731 -885 1696 1633 -1594 -2865 -135 2179 729 -1830 -2237 399 2680 1517 -1704 -1737 1745
1887 1745 2543 108 -2110 -1043 861 1443 -355 -2212 -1463 1414 1382 -946 -1827 -229 1643 1427 -134
1904 -134 -1390 -202 2008 1309 -1344 -1519 557 1377 -333 -1531 -851 778 1179 -468 -1359 309 1769
1921 1769 803 -911 -733 722 1194 199 -984 -1122 467 917 -585 -1773 -621 1256 974 -404 -1339
1938 -1339 -295 1753 1675 -542 -1730 384 1894 733 -1516 -1713 188 1604 193 -2018 -1638 1184
1954 1184 1986 -449 -1540 -3 1779 1568 -4 -1251 -209 1144 808 -1225 -1291 88 513 139 -1108
1971 -1108 -1347 11 1631 622 -1119 -828 1287 1592 135 -1123 -672 741 914 -693 -1894 -246
1987 -246 1363 216 -1531 -984 552 1211 731 -494 -616 827 1546 200 -972 -190 761 211 -697
2004 -697 -921 -741 422 530 -984 -1332 394 1350 632 -458 -312 584 1109 350 -1283 -723 932 926 -1279
2023 -1279 -1786 29 1123 457 -1059 -1187 372 1783 1093 -1004 -843 1049 1364 242 -1092 -946 271
2040 271 1049 -34 -1912 -1236 902 1404 -355 -1263 -333 1173 1938 301 -1175 -434 1533 907 -932
2057 -932 -1067 -33 407 -369 -885 -917 354 748 124 -855 252 839 530 139 26 209 437 189 -631
2076 -631 -532 295 611 -570 -1310 -323 784 862 -179 -1016 -86 1650 1335 -630 -1158 243 1436 381
2094 381 -1510 -1656 160 1443 5 -1654 -1214 957 1540 345 -881 -662 956 1600 627 -1141 -888
2111 -888 610 758 -314 -1053 -783 251 726 -374 -893 94 1348 759 -368 -238 662 907 31 -581
2129 -581 -426 329 138 -945 -1043 413 790 -359 -936 -522 349 1403 664 -924 -554 815 1265 -333
2147 -333 -1248 -599 449 886 -267 -1583 -963 1212 1365 -819 -1576 204 1561 1584 -21 -1281 -400
2164 -400 1296 920 -617 -968 -76 89 -173 -306 -430 -265 377 367 -200 -180 375 284 275 676 193 -652 -413
2185 -413 43 176 65 -43 -907 -1095 612 1425 6 -950 -562 849 1490 483 -1098 -931 970 1586
2203 1586 -445 -1650 -686 871 1055 -117 -1514 -1352 889 2032 538 -1167 -844 727 1777 1005
2219 1005 -986 -1643 221 1532 296 -1426 -1533 -24 1020 667 -750 -1266 277 1689 978 -229
2235 -229 -850 -459 560 1232 165 -1587 -1222 379 1062 26 -1134 -1171 214 1522 695 -1140 -909
2252 -909 793 1532 675 -713 -1108 -81 1439 881 -991 -1743 -552 938 904 -325 -1348 -824 1215
2269 1215 1490 -58 -1041 -263 1054 991 -5 -1071 -989 372 761 -160 -1048 -1058 -59 1081 1078 -391 -1581
2288 -1581 -56 1620 1384 -338 -1317 -400 859 1382 -579 -2034 -968 909 1234 -489 -1279 -791 1051
2305 1051 2045 296 -1590 -928 1395 1866 179 -1502 -1261 738 1702 -2 -1901 -1314 918 1296 -140
2322 -140 -1063 -520 965 1627 258 -1049 -543 734 1135 -125 -694 -732 -134 449 150 -687 -701 99 503
2341 503 273 253 190 -108 268 696 365 -67 -253 -669 138 784 -7 -1463 -856 650 1080 -59 -1189
2360 -1189 -674 1216 1895 218 -1589 -753 1201 1459 -273 -1608 -993 715 1331 -248 -2021 -903
2376 -903 1355 1401 -400 -1477 -571 1478 1870 -151 -1841 -654 1441 934 -1072 -1602 -443 633 482
2393 482 -796 -965 280 1292 277 -617 -3 642 716 187 -180 -125 234 220 -485 -693 36 209 -301 -713
2413 -713 75 714 657 -186 -780 84 1216 956 -860 -1369 363 956 120 -1365 -1520 352 1455 15
2431 15 -1579 -837 1406 1632 92 -1185 -608 1049 1476 -100 -1530 -701 1069 765 -901 -1502 -422
2448 -422 1089 926 -594 -1433 113 1821 884 -716 -703 515 832 138 -741 -791 347 621 -906 -1265
2466 -1265 -52 903 392 -676 -326 386 878 564 -650 -381 720 757 -678 -1263 -154 517 533 -698
2484 -698 -1412 -470 1558 1052 -950 -1213 534 1519 688 -850 -1026 221 1604 190 -1941 -1072 811
2501 811 1105 -526 -1468 -673 757 1213 117 -1263 -322 1324 826 -472 -710 -126 707 188 -820 -1098
2519 -1098 33 1026 75 -1152 -536 849 923 5 -469 81 789 794 -644 -1138 400 967 -390 -1312 -844
2538 -844 593 898 125 -1205 -665 986 1371 -92 -1016 14 1021 780 -443 -1227 -296 1018 696
2555 696 -1092 -1513 229 1254 590 -939 -911 388 1485 473 -888 -579 936 1026 -500 -1091 -91
2572 -91 738 377 -634 -1061 -81 1065 346 -614 -456 668 766 356 -593 -311 860 832 -378 -1365 -474
2591 -474 1072 601 -906 -1223 -157 1274 671 -772 -1059 470 1560 531 -879 -678 547 1061 130
2608 130 -1137 -798 577 847 -478 -1093 -228 732 649 -107 -666 -27 1188 720 -513 -536 288 653 -157
2627 -157 -768 -630 158 788 -189 -1016 -248 1151 487 -604 -426 432 1026 380 -612 -839 415 923 -89
2646 -89 -1444 -512 768 659 -298 -958 -519 769 1178 121 -845 34 1073 775 -256 -1027 -295 834
2664 834 522 -694 -1238 93 877 261 -604 -422 372 715 351 -312 -282 424 517 -314 -493 127 193 -289
2684 -289 -489 -409 172 405 18 -508 -183 632 394 -66 -120 253 743 578 -423 -932 114 1001 179 -1119
2704 -1119 -877 417 620 346 -674 -631 581 1204 268 -910 -238 692 589 -122 -847 -725 152 505 -63
2723 -63 -1012 -435 387 646 339 -97 -276 241 440 275 -322 61 117 -214 -388 -94 -230 -313 -252 -164 61 203
2745 203 174 -92 247 786 328 -453 -391 287 567 137 -804 -982 14 702 275 -656 -788 185 756 506 -58
2766 -58 -623 337 1143 303 -780 -995 180 865 241 -804 -1227 -13 835 386 -409 -434 212 696 668 123
2786 123 -343 43 515 266 -270 -512 -279 -32 186 21 -715 -464 395 637 260 -104 -257 61 571 769
2806 769 -154 -652 -488 375 186 -55 -656 -642 120 664 238 -804 -224 797 552 84 -278 -510 347 760
2826 760 193 -808 -758 170 470 152 -458 -791 -200 731 916 -255 -466 76 692 568 1 -509 -215 272
2846 272 419 -439 -815 -213 157 326 161 -442 -463 522 870 300 -247 -369 46 623 478 -525 -848 -75
2866 -75 327 -68 -501 -515 -370 428 337 -5 -463 152 737 624 -122 -459 -376 134 457 -308 -711 -412 149
2887 149 133 110 -227 -342 232 582 137 -44 -17 317 409 186 -146 -384 -369 50 405 -160 -702 -540 199 597
2909 597 208 -306 -301 328 536 321 -112 -224 -5 590 228 -692 -739 -12 474 170 -548 -573 -144 800 768 -329
2931 -329 -457 194 917 455 -155 -489 -155 619 118 -569 -644 190 447 -49 -163 -250 121 498 522 69 -173
2952 -173 -9 147 46 -227 -72 -242 -205 -237 -335 64 215 -176 -337 100 410 127 -186 30 549 241 -18
2973 -18 -435 -457 394 732 -368 -1139 -219 603 463 -171 -559 -89 565 888 -315 -817 129 693 207 -390
2993 -390 -665 -363 414 311 -621 -1014 143 850 329 -303 -430 263 640 367 -262 -350 405 433 -462 -511 -192
3014 -192 77 -254 -291 -381 -180 162 219 -197 -126 527 203 -38 -241 137 223 235 -211 -840 -270 495 60 -838
3036 -838 -669 305 845 351 -446 -432 703 994 -160 -918 -316 671 507 -333 -647 -410 237 505 -371 -934
3056 -934 -96 631 277 -184 -245 115 656 560 -359 -643 -42 666 -84 -634 -509 126 297 -121 -410 -166 595
3077 595 227 -266 -275 355 558 -15 -561 -261 93 324 -116 -644 -301 460 244 -395 -433 238 640 325 -180
3098 -180 -585 107 841 443 -840 -706 -25 440 65 -640 -751 293 822 -281 -739 -70 775 638 -331
3117 -331 -556 -46 492 467 -370 -799 -397 339 216 -246 -284 -105 120 334 -297 -165 651 685 -265 -414 91
3138 91 598 175 -406 -822 -162 362 63 -707 -421 528 661 -25 -349 -151 536 831 -71 -697 -391 811
3158 811 409 -701 -743 -247 456 269 -420 -521 0 837 508 -526 -305 409 824 481 -480 -638 69 601
3178 601 -56 -705 -287 262 254 -282 -293 234 538 392 -263 -490 349 534 133 -353 -176 194 62 -305 -535
3199 -535 -231 404 501 -281 -448 275 710 206 -382 -313 288 676 333 -818 -660 295 729 -155 -798 -382
3219 -382 481 746 127 -648 -161 458 689 -182 -437 1 179 184 -265 -662 -84 258 66 -571 -278 171 237
3240 237 176 -210 -173 285 409 -30 -247 272 413 -173 -416 -320 236 459 -106 -591 -425 478 605 -169 -559
3261 -559 -65 714 491 -266 -474 -147 712 328 -809 -780 110 623 239 -366 -577 61 746 462 -511 -461
3281 -461 359 736 91 -345 -362 192 259 -99 -805 -441 353 255 -26 -212 41 11 255 216 -34 162 293 14
3303 14 -204 -79 314 -73 -325 -165 -62 249 280 -186 -389 286 486 0 -217 -24 732 343 -168 -593 -250
3324 -250 593 436 -570 -956 -170 466 429 -181 -657 -147 701 612 -323 -527 -14 390 89 -88 -519 -391
3344 -391 330 62 -429 -699 72 461 178 -108 -153 96 349 469 -94 -186 190 10 -174 -128 -69 -228 -296 -121
3366 -121 78 -7 13 -61 -126 289 300 -90 -106 -51 165 164 -46 -328 -352 181 291 -300 -724 -204 308 412 -109
3389 -109 -470 -184 632 639 -144 -306 -122 479 88 -310 -409 -168 213 290 -178 -375 -13 340 422 238 -247 -289
3411 -289 300 360 -38 -166 -153 -114 -93 -72 -106 -109 34 139 166 334 -107 -28 61 339 340 -98 -213 74 157 -81 -128
3436 -128 -525 -205 164 282 -284 -349 -100 287 489 180 -220 -267 306 472 47 -222 -281 20 85 -10 -225 -415
3458 -415 276 301 -165 -184 -31 251 362 376 -12 -118 15 323 148 -140 -214 -235 -21 -32 16 -241 -124 55
3480 55 23 82 -65 -13 135 271 110 -136 -126 -280 -39 -49 -260 -249 -206 313 246 -34 -164 16 138 124 75 -176
3504 -176 -164 273 332 -125 -277 -323 -103 -51 35 -70 -296 -47 450 309 -117 -137 -29 179 325 -74 -261 -339
3526 -339 15 -77 -187 -331 -115 175 248 3 -443 -144 251 383 133 -248 -254 -184 262 346 -262 -422 -102 177
3548 177 145 -81 -273 49 459 336 -159 -339 208 334 254 -39 -294 -118 175 25 -150 -260 -80 -3 120
3569 120 234 9 -183 94 103 160 61 164 -13 24 239 172 -383 -265 55 138 329 -210 -403 56 431 286
3591 286 -175 -403 156 415 178 -71 -357 -232 369 86 -287 -277 -49 290 113 -290 -119 165 667 544
3611 544 -224 -509 218 431 9 -165 -520 -38 97 109 -44 -211 246 216 -54 127 4 83 129 45 -127 -91
3633 -91 127 -18 -192 -43 63 -320 -229 -30 61 142 155 -154 -364 226 485 10 -176 15 287 265 -92 -378
3655 -378 -348 512 307 -551 -543 28 396 371 -76 -320 -129 436 234 -61 -452 -167 -22 101 -210 -413 -248
3676 -248 134 58 -449 -225 89 492 248 -86 -23 210 288 302 -335 -97 294 93 -237 -210 -38 -31 -78 -157 -31
3699 -31 217 167 123 -97 104 284 17 -192 -182 113 31 -50 -431 -353 3 369 -90 -391 -68 216 368 47
3721 47 -128 -52 351 427 -126 -588 -166 87 131 -140 -334 -152 108 213 -312 -288 118 295 33 99 -12 160
3743 160 467 28 -293 -146 247 -13 -61 -431 -114 158 237 129 -240 229 309 139 -171 49 185 102 -94
3764 -94 -386 -104 158 94 -411 -365 -28 205 59 -86 -39 39 246 267 -140 -195 237 407 -181 -437 -361 -8 67
3787 67 109 -287 -309 57 213 -105 -149 111 332 12 -86 -253 -42 236 11 -274 -464 -105 -113 -36 -104 -95 72 233
3811 233 80 85 34 482 41 -363 -123 159 250 -54 -276 -387 -157 170 -81 -207 32 245 138 -112 -258
3832 -258 194 167 272 -101 -253 47 397 37 -350 -312 -202 96 43 8 -246 122 347 -9 -65 34 137 -86
3854 -86 98 -155 -403 146 124 -133 -288 146 256 -21 49 -151 100 282 158 -135 -50 241 -50 -219 -216 -130
3876 -130 -175 -169 -220 -69 108 300 49 -99 -193 305 279 94 -38 23 244 337 -116 -181 -194 43 189 -188 -257 68
3900 68 13 292 -22 -127 160 260 79 61 -121 29 127 10 -254 -166 -134 146 24 -199 -110 -23 168 -7 145
3923 145 79 17 147 -79 -128 15 -151 -102 -124 -75 -68 -45 -209 -126 -73 416 140 37 -117 71 122 288 116 -52
3947 -52 44 3 -105 -354 58 97 -53 -35 0 -262 121 473 199 -16 -91 53 36 55 -27 -202 -215 86 -185 -377
3971 -377 -9 190 -70 -122 66 41 122 177 33 173 31 -39 -51 -46 -76 -56 -102 -83 -108 -96 195 122 -69 5 158
3996 158 121 -17 31 135 69 -43 117 -153 25 138 58 -272 -189 -142 88 222 -75 -54 -61 146 208 -67 -23 9
4020 9 -47 -136 47 -200 -223 2 22 -202 -113 -300 63 173 128 -28 -58 220 -6 -91 18 -1 -226 2 -127 86
4044 86 -132 -97 23 8 159 177 -124 140 467 189 -93 -148 59 29 104 -129 -283 -241 23 85 -100 -208 -296
4067 -296 23 426 166 51 30 173 75 -26 -147 80 141 81 111 -301 -260 22 -6 104 77 -82 -14 110 196
4090 196 -31 -49 108 20 -169 132 -224 -85 115 110 -284 -241 -102 323 268 174 -66 -70 139 249 210 -52 -179
4113 -179 63 -23 15 -310 -335 -155 227 203 47 -88 4 108 131 137 -46 -1 197 389 -133 -180 -87 -141 -24 -12
4137 -12 44 -66 -21 137 168 138 30 118 -49 128 39 -224 -26 114 100 -145 -59 -49 -7 297 217 -89 -131 301
4161 301 174 -5 -6 -203 -60 174 -13 -215 -116 44 178 -41 -2 -84 -132 106 144 -94 28 189 198 171 62
4184 62 -178 -76 -37 32 -395 -110 -89 45 -5 222 -108 -55 203 82 74 -58 69 -5 -18 253 -83 -386 -164
4207 -164 166 92 -94 -92 -74 17 147 119 22 54 218 145 172 95 -42 150 180 118 -232 -187 -51 139 158 -135 -125
4232 -125 -74 145 231 58 76 236 -27 27 33 12 44 -55 -226 0 -204 19 -23 214 -19 -170 63 103 22 -37
4256 -37 -30 85 -76 -61 -57 -195 -87 -42 65 118 133 -74 -50 18 243 -59 78 76 217 44 30 83 -184 10 49
4281 49 -36 -221 -225 39 20 -6 -129 -201 113 237 -46 -86 170 144 178 -118 11 -138 -83 -1 66 -23 -85 71 -25
4306 -25 -82 15 -75 263 -29 -35 -2 106 93 -202 24 31 -115 -160 37 -53 11 5 149 -101 95 278 201 55 -96
4331 -96 -108 86 80 -101 -242 -177 123 -35 -212 -313 247 -51 -161 -102 -159 -21 111 156 -62 -38 -88 -32 -70 -162
4355 -162 -164 -145 -35 -19 -91 21 49 -2 -2 -86 166 -3 -110 18 -292 10 -39 -76 -297 7 -59 28 -39 -39 68 267
4381 267 -14 -94 -178 292 349 -110 3 -154 114 238 -112 -128 -67 75 44 -54 -183 -40 283 136 114 -16 102
4404 102 228 74 -311 -156 -84 -10 -61 -178 -200 -112 190 11 -15 41 99 178 174 -93 49 -224 133 -229 -223 6
4428 6 -107 -275 -253 -108 -76 -12 78 -43 80 245 87 -166 -133 172 -31 -272 -58 -94 -51 -62 55 -242 -59
4451 -59 174 116 -165 -28 106 91 58 4 -142 20 146 27 -262 -89 96 5 -38 -59 -163 -40 53 -40 0 4
4475 4 51 -35 -42 -106 -77 -59 113 -182 -228 -158 -49 96 -137 -87 -53 145 138 16 -84 -19 247 46 -245 88 -72
4500 -72 1 -14 -240 -46 105 67 -52 -14 -39 67 93 39 -111 -74 100 64 -160 -133 195 -138 -162 -284 3 33
4524 33 -72 -27 144 183 213 -65 39 188 157 64 -186 -202 -164 -135 135 -125 -139 4 160 47 125 -8 77 217
4548 217 59 -11 -51 27 109 -57 -249 -79 -30 34 14 -334 -154 85 87 136 107 88 241 243 219 -121 -23 70 25 -116
4574 -116 -206 51 -113 -140 -7 156 132 -132 -34 64 22 168 -84 -80 12 -129 -18 3 -14 -34 28 -29 -81 -133 18
4599 18 227 -41 -50 2 10 123 -50 -107 -328 -14 -8 15 -148 49 -28 26 63 -16 -152 30 278 -13 -5 41 20 219
4625 219 162 -70 -397 -118 189 -60 -75 -177 -231 16 30 50 -118 42 190 -10 -50 46 -105 -99 150 -65 -175
4648 -175 -2 62 4 -28 39 -144 -43 112 156 -43 -65 -18 -118 132 -60 -18 -54 -30 -12 -153 -419 -37 34 -9
4672 -9 51 57 -345 81 234 20 -141 -30 46 27 -2 -182 -117 -92 79 5 -81 -86 75 -32 122 -27 12 3 90 36
4698 36 -32 -96 3 75 39 -54 -26 -265 85 22 2 62 -54 76 71 222 36 -96 89 23 67 23 62 -48 -69 54
4724 54 -111 48 -100 107 124 22 -164 -85 50 233 92 -19 -18 152 -23 -122 -117 -253 99 96 -4 -20 -27 125
4748 125 -2 204 153 -43 -67 36 129 -39 -7 -62 -21 287 -74 -87 -106 41 -132 42 122 15 36 166 29
4771 29 -55 5 74 87 -97 -78 -96 66 -66 271 -54 -91 105 9 -6 66 82 1 -67 87 -86 -102 45 -138 -8
4796 -8 3 -189 -120 60 142 -16 61 231 200 -77 2 102 157 74 88 -133 2 93 -96 -156 116 8 250 134
4820 134 20 102 125 72 -84 -7 -88 37 -70 -172 -69 -32 -14 -40 31 53 125 -70 -67 -74 100 104 -132 -34 161 -32
4846 -32 71 -105 -131 -110 71 87 -159 -73 54 -32 212 234 -147 -100 64 127 -47 82 -82 -85 18 -82 -190 -101
4870 -101 -50 184 -28 153 -50 17 101 50 -10 83 282 58 -156 -28 57 -151 -109 15 -110 -22 25 -55 -83 -87 170
4895 170 -49 -76 44 -25 171 56 -86 -95 14 125 -239 -92 -32 0 19 -13 -78 36 132 327 7 -137 171
4918 171 32 -28 85 -99 13 85 -71 45 0 6 -84 75 -46 152 -18 114 85 93 172 60 -138 -46 57 -2
4942 -2 -8 -41 72 4 -106 104 84 59 28 111 226 -71 -32 112 -24 39 -196 -100 91 152 -128 -238 107 76 168
4967 168 -11 -41 -260 41 157 49 -219 78 54 -5 -11 -108 -97 -98 9 57 -64 56 56 -19 113 -2 -95 73 -38
4992 -38 -135 -54 31 116 -17 -37 97 -99 -96 -158 135 119 -3 90 11 79 159 155 -173 -71 36 110 178 -274 -165 2
5018 2 21 63 -7 66 -80 157 25 -108 -116 0 131 -81 -139 -120 -195 -64 -11 -40 124 25 86 -125 -164 99 255
5043 255 -4 36 50 135 81 123 -204 -12 40 45 -161 -25 -171 8 -104 97 -184 34 245 71 -14 17 127
5066 127 29 -218 62 -59 -183 60 -184 -168 -123 65 -84 -60 24 -102 270 135 99 -85 -21 48 20 37 -47 18
5090 18 -114 -137 -141 -51 62 -123 -19 76 -52 21 -131 19 95 -70 15 -31 -279 -157 114 76 -34 -150 59 3
5114 3 179 -4 -3 33 178 63 19 104 1 -141 -36 38 -83 -184 136 61 -67 -60 -20 10 140 207 40 44 110 -123
5140 -123 13 -97 -27 2 -75 -38 -65 -21 -50 21 -163 82 120 102 14 -131 -6 25 -62 -173 4 -95 30 -105 -155
5165 -155 -70 -64 -58 -119 65 30 -92 26 -58 62 -28 -14 -101 -242 -100 118 -166 -170 -11 -24 115 35 -136 -172 102
5190 102 118 164 56 89 -21 173 152 -55 -83 -62 15 0 -42 -119 -188 17 -18 -24 -123 68 120 42 -167 73 -38 -1
5216 -1 -7 -49 -115 72 -221 -89 103 10 -35 -114 9 39 65 37 74 -74 -37 -20 -39 -4 12 84 50 -95 99 22 3
5243 3 108 42 -22 38 -145 214 124 19 26 119 -98 53 2 -197 -139 98 -39 -14 122 99 -20 -176 -72 72
5267 72 12 -84 235 45 -268 97 -10 -60 69 -47 167 -40 186 156 41 154 38 87 71 -46 -15 -35 -91
5290 -91 -77 -20 -196 -221 136 57 154 160 20 65 -55 61 -12 169 1 77 -14 57 -110 71 -14 -23 -87 -43 98 27
5316 27 -27 86 -19 18 37 -28 39 55 -109 151 -106 84 -233 90 -158 -77 20 -12 51 37 78 -17 -77 -27 160
5341 160 22 69 -157 47 -195 28 26 -152 -41 22 -6 35 147 217 57 75 47 -87 -77 75 6 68 -9 -172
5365 -172 10 -29 63 -207 -25 7 38 126 86 -63 7 128 125 71 15 104 47 -10 246 -49 -40 142 -16 -23 12 -100
5391 -100 -49 83 64 29 -19 -62 54 20 -190 -126 -31 110 25 22 -62 31 22 5 119 162 60 -47 -27 6 -51 -9 -23
5418 -23 -111 -77 -4 -130 -50 118 146 13 -92 74 69 -54 154 -132 -93 232 -8 -121 -228 20 -45 -55 25 124
5442 124 -136 -74 146 -13 30 -16 73 -37 134 -50 -82 -53 157 56 -31 -97 -124 96 -51 93 -48 34 41 6
5466 6 31 49 117 -34 38 -91 -131 124 -33 -147 -39 49 -22 0 46 154 54 99 -21 26 -123 178 -39 73
5490 73 -58 -13 -133 -123 7 29 72 -37 109 -29 3 35 31 115 89 -14 -62 -215 14 -82 21 -161 -172 -79 -113
5515 -113 -128 35 93 -15 -219 -35 161 19 33 -21 169 139 14 -58 -226 -100 3 -92 33 43 95 38 205
5538 205 61 121 -23 -29 -108 15 18 -150 66 -3 -26 -22 87 26 -15 -80 48 94 120 -111 3 -17 145 -164 202
5563 202 39 -143 -12 -116 73 5 68 160 9 -15 38 80 144 111 27 9 -57 -178 -30 67 -116 58 62 86 -91
5588 -91 122 35 -64 24 -121 103 186 160 -25 2 80 92 -47 -59 -93 -48 -121 96 53 -90 6 -45 195 -25 -156
5613 -156 36 -158 -190 -208 160 63 24 51 -57 -80 -28 -21 43 3 0 131 11 187 67 60 13 186 -117 42 65 -69
5639 -69 -55 -105 115 153 -94 65 8 -18 -26 59 81 57 37 -26 44 41 8 -17 6 -92 94 -16 -88 -51 -84 -24 75 45 50
5668 50 198 129 42 -45 -11 14 -71 21 -203 -97 -60 15 -90 129 -99 -8 -47 165 -87 53 -55 -76 -19 50 -62
5693 -62 21 -56 80 -75 -92 -25 -19 118 -8 21 187 74 112 -141 5 147 -61 -15 43 56 -10 41 155 45 50
5718 50 -39 194 163 79 121 -9 -13 19 103 70 207 51 -196 40 92 -20 -30 -13 -105 10 -26 107 139 93 -156 -5
5744 -5 -80 4 76 125 13 -97 -84 134 43 -148 87 24 64 210 133 -32 -49 166 0 -133 97 42 -72 -54 -30
5769 -30 55 -75 139 39 -10 -159 39 45 10 -145 -37 24 -130 224 -16 -43 -66 -74 -20 -301 -41 -154 -50 152
5793 152 67 -103 85 64 166 -94 -59 1 -52 -28 99 -181 -22 -192 -150 51 -75 69 -128 -28 53 112 -80
5816 -80 116 -120 27 89 30 36 50 -45 80 11 2 44 43 -51 89 -175 -50 167 -94 -32 88 131 72 -106 -25 -53
5842 -53 -158 -25 48 68 -45 -67 -125 80 86 129 15 126 -49 44 25 98 -5 34 31 -262 77 -144 -176 148 -62
5867 -62 -181 -113 21 57 -75 -49 90 -234 46 53 -1 -14 30 -44 118 7 92 8 149 -151 -173 -69 -15 74 -52
5892 -52 73 24 -7 29 32 -69 -95 14 26 -18 131 115 43 80 136 160 61 184 128 -19 29 204 55 -103 42 -35
5918 -35 -52 -79 44 -237 124 60 14 -1 181 -10 -71 -122 -5 -93 80 -127 -20 -1 79 -51 62 99 100 -6 -77
5943 -77 104 48 45 83 21 59 -2 104 -15 -116 180 23 -110 -43 112 17 97 -46 1 100 268 -166 -110 53 53
5968 53 32 -84 -38 -145 69 45 90 -153 -84 -97 148 19 278 -71 -11 -60 -41 213 -47 -120 28 67 104 -17
5992 -17 -7 90 118 106 -85 167 50 72 170 121 -142 202 11 -28 190 -40 -80 51 -65 -167 68 -53 132
6015 132 97 224 73 106 170 -56 -26 -32 103 -174 -78 -83 231 12 -21 100 -83 4 2 11 35 118 76 -29 -124 -110 -82
6042 -82 8 62 25 12 -159 -2 -132 -91 28 137 -68 -57 -52 142 44 46 -25 120 -95 -33 -125 81 157 -124 7
6067 7 -115 90 72 260 -67 63 -43 -76 7 33 60 -95 -215 4 -88 -22 42 40 15 150 13 45 117 6 142
6092 142 66 -10 -72 -69 -96 100 4 -122 38 -48 -1 19 -114 58 -62 -54 -1 -37 -92 15 -116 146 -185 -180 -113 -59
6118 -59 162 -125 -71 -59 -58 -62 -15 -85 -9 50 151 -69 11 -58 -60 -186 -75 -94 -164 11 -72 -56 33 64 -109 9 48
6145 48 46 53 -35 -95 123 164 87 -127 40 131 81 -15 51 39 150 7 30 39 -28 62 86 -97 -90 -38 42 -163 43 -96
6173 -96 -178 -2 -60 -25 -26 5 -73 -142 30 -52 -67 107 28 -111 34 93 72 54 -29 77 -22 -34 13 -83 -74 128 154 -150
6201 -150 189 184 -39 19 -51 -41 -51 -54 -62 137 69 -91 -122 41 23 33 33 -82 -30 -12 146 18 75 91 -7 -80 -16 -77
6229 -77 -31 42 -66 -107 -48 -145 104 -2 -100 21 -12 77 58 110 -129 -99 -71 -7 -79 -60 -59 128 7 81 9 -97 146
6256 146 141 -35 -30 -73 -43 -184 -21 -132 -75 -28 -170 -114 -84 70 102 -109 -20 63 -19 -208 49 22 -38 -63 -28 -5
6282 -5 -94 16 54 171 -45 -224 -113 78 59 -35 66 99 -77 66 -150 -179 -168 -120 15 60 -9 -108 -187 87 -42
6307 -42 -47 31 60 -177 -16 26 -18 134 94 -99 98 -4 10 19 -38 192 -28 69 37 133 10 50 -103 -64 65 26
6333 26 -8 -114 -104 63 -46 19 91 46 -76 14 -101 70 132 -66 -62 27 52 -63 -53 -139 75 -82 -54 2 -30 -248
6359 -248 242 53 -107 22 144 36 151 -42 -131 161 109 73 111 37 -39 -40 159 -20 9 24 -26 12 200 -120
6383 -120 53 -21 249 44 -80 23 -92 4 -56 -36 69 -36 -57 -56 0 45 -86 -56 -14 30 21 28 -22 -116 -79 -210
6409 -210 -103 10 -21 -47 44 51 -86 -71 -67 -5 28 56 -55 125 8 -79 205 182 -125 36 65 -13 -85 -25 -140 -18
6435 -18 25 175 178 -192 150 94 -76 -96 139 -51 -15 -99 -34 -28 3 22 68 -42 -66 -25 -179 26 -42 -18 -45 -53 2
6462 2 -50 136 -243 -225 41 141 -43 5 -162 -111 1 -137 -181 -74 51 94 13 -45 270 177 -176 -79 -42 79
6486 79 -74 -151 71 12 -91 -80 -95 4 23 -56 -84 -80 -30 51 116 -58 -56 -73 -105 3 -80 27 84 -76 87 -104 -19
6513 -19 136 -85 91 -71 150 20 19 -49 57 -22 -2 -16 -58 139 59 10 77 91 135 144 190 67 -110 87 -185
6538 -185 56 -61 -94 119 99 50 -84 -131 110 -63 -66 174 88 -17 133 81 101 -82 -20 -130 -167 -110 -203 54
6562 54 72 53 51 -69 201 86 114 -2 62 -1 -73 -34 -64 9 -16 -30 -76 -95 -70 -119 -158 -15 118 98 -17 93 -26
6589 -26 0 -54 -88 -145 65 6 -21 72 -165 37 -75 78 70 -33 38 123 -65 60 -137 21 -90 74 -29 131
6613 131 -11 -26 -203 -41 138 153 291 16 -21 13 103 -57 -66 10 120 17 112 12 1 77 -4 -57 -12 69 83
6638 83 -52 57 -112 -45 -80 138 -92 -32 -41 91 56 -14 8 51 83 -160 114 -173 52 52 122 0 122 -85 149
6663 149 75 -18 45 18 -33 1 58 -11 96 -66 41 -18 -61 -166 89 64 68 -112 -47 -6 45 140 -229 -136 -62 -60 -8
6690 -8 -5 88 0 23 105 -97 -17 72 -87 -66 -37 47 3 -40 -121 -79 -19 -117 -29 -233 131 84 83 -60 -64 -13 14 61 -145
6719 -145 27 11 59 -33 151 -94 19 -51 -75 -2 87 -115 128 -70 -26 156 181 -73 38 -19 -27 77 -55 52
6743 52 -110 -39 -110 -79 -161 -155 -52 247 141 26 -98 131 -1 -38 -2 48 -15 -82 141 -221 33 -59 59 -179
6767 -179 86 -116 -96 58 162 17 -19 -57 41 -36 116 78 -61 -195 42 -2 87 -18 88 60 54 48 -194 -106 -1
6792 -1 80 -77 -12 40 -31 -66 -79 -30 -157 -129 43 -8 -37 -114 -137 24 -84 -127 -57 5 65 -19 19 36 50 -84 -5 -22
6820 -22 -211 80 148 -104 132 -157 183 7 20 -44 -81 -101 31 116 -142 -57 62 -150 -84 -147 -97 -67 10 -79 57
6845 57 94 68 -8 71 -5 -123 -58 -19 40 3 171 -80 -6 42 -57 -140 147 98 -92 60 -56 23 -57 8 175 -41
6871 -41 52 -34 -58 -68 -28 -5 -145 28 8 -90 104 25 7 65 105 -74 -43 48 -188 -84 -57 99 5 -130 79 -141
6897 -141 -92 105 -164 71 13 -66 -69 76 -207 15 -44 -42 14 30 -44 -52 -6 93 178 -155 189 -103 -133 -112 42 -22
6923 -22 69 -54 -9 84 52 -72 146 -69 35 19 4 50 85 83 17 8 -158 -44 -33 -139 43 86 -113 -109 -5 -68
6949 -68 17 73 -93 101 -66 -16 44 73 31 -57 -36 15 -134 105 -13 25 -6 -35 -74 1 -119 -107 -24 -86 -95 95 125
6976 125 58 21 -86 49 -48 27 -48 -99 -172 100 -118 -103 105 -7 82 -33 84 3 -161 -72 -180 -45 121 37
7000 37 99 -55 45 8 -155 -47 -74 140 145 97 -22 6 96 42 -125 -57 -161 -142 -113 38 21 -124 139 -77 -88
7025 -88 19 52 5 -14 54 -6 41 64 -130 38 141 -118 -56 -38 159 -7 165 -22 -81 -187 -103 -17 -57 -39 -107
7050 -107 -29 53 -53 -16 142 -108 -136 -83 91 -86 11 -67 40 28 -90 60 -30 44 12 -48 -27 -10 52 -85 17
7075 17 -35 26 -31 97 84 4 33 -18 17 81 -121 11 144 -73 44 -233 -74 -62 -52 -158 -224 82 -76 3 26
7100 26 -106 221 26 14 -5 -140 103 -1 -8 -55 29 37 57 -150 106 15 -112 -22 -120 9 59 -139 89 -4 -39
7125 -39 -100 -116 -41 1 -16 16 -30 48 79 -71 77 44 -56 101 80 30 -45 -148 47 -84 -52 -30 14 -56 -4 -2 -77
7152 -77 46 18 120 -65 170 74 -39 -36 90 -204 11 -174 55 -89 48 -18 -56 52 64 -35 -121 28 -129
7175 -129 -94 -41 103 192 -39 -45 28 -51 149 -67 86 180 -40 9 -19 89 -43 66 34 93 100 -82 1 -27 -181
7200 -181 -114 116 -100 31 -29 -11 147 -74 191 3 65 285 270 -52 90 53 15 -139 -1 16 15 11 83 -21
7224 -21 -164 -86 57 50 -31 18 23 -85 149 59 159 -29 -52 -87 -146 -59 -31 -65 28 -138 -48 116 228 -15 62 75
7250 75 17 5 -117 95 89 14 -95 65 -62 -96 144 13 -28 -51 -57 -95 -168 103 -11 58 -212 -19 -43 68 -196
7275 -196 -87 -32 138 -59 9 69 23 164 -91 -9 -97 -25 44 21 -27 -57 14 121 -55 36 -87 -13 69 10 104 14
7301 14 81 -41 -47 115 83 5 -78 98 -19 71 -84 -53 19 -35 -56 32 -90 209 -31 -21 -185 -83 96 21 -28
7326 -28 -119 163 2 -93 -32 -128 -30 29 6 85 -75 -22 125 33 26 -21 108 -23 13 32 -43 -74 -1 -185 6 115
7352 115 77 38 -95 -100 -82 39 83 -83 16 101 -42 -109 -68 -16 -86 -164 -103 -153 -94 -29 0 -124 94 -24 22 60 -8
7379 -8 3 23 -97 -150 -173 -91 -2 -7 -143 39 4 32 44 -7 22 77 116 9 108 -116 25 -48 -45 90 -45 -79 -33 -229
7407 -229 5 -15 -131 44 -35 -113 -46 130 175 -45 106 -133 173 -88 -7 -1 -100 76 97 83 104 52 -70 45
7431 45 -15 78 -150 60 7 23 -77 -68 42 -1 28 -123 -162 -95 -14 -106 46 -25 22 -108 163 46 -107 50 52 -17
7457 -17 -23 4 56 -40 -69 201 165 -10 49 -14 -14 101 -64 20 -104 -54 32 60 -40 34 -103 90 -45 -14 129 -78
7483 -78 -43 13 140 96 27 120 -40 -52 -12 34 -45 8 97 -69 -13 -4 19 -141 -53 115 -29 -1 -35 76 -95 24
7509 24 -41 109 147 -69 -69 -101 75 -80 -157 111 -53 165 -177 63 -36 109 -14 -55 -25 -59 -55 54 31 -35 -21
7534 -21 70 0 146 80 118 8 24 67 62 89 40 71 100 83 -62 -40 -33 -76 94 109 -75 53 129 -3 25 -12 -16 39
7562 39 53 23 -71 37 -77 -50 -31 105 -113 -23 -26 42 89 63 211 -97 125 -24 41 111 -3 -56 -26 -31 142 1
7588 1 -149 -29 -177 183 252 79 115 4 -73 9 -146 -16 64 -110 73 73 49 -31 -5 -21 65 66 -19 21 -39 55 -59
7615 -59 -90 -148 94 -17 -43 70 -98 14 -101 146 76 -56 -34 -61 -45 8 92 -87 122 -36 -232 -43 -110 -98
7639 -98 77 4 -177 -21 -99 -43 14 58 -8 148 -72 -172 -29 141 179 132 -41 76 -110 -77 136 -34 -151
7662 -151 -121 -29 41 -91 -63 5 -23 -100 132 51 200 -60 -87 52 -160 33 -10 -16 214 39 -4 12 -28 146 -22
7687 -22 68 -12 10 -190 -19 58 43 63 -139 -107 18 -111 -96 -165 125 108 -113 22 -22 -60 110 15 -93 152 88
7712 88 -64 -60 76 29 -51 -69 -2 -87 -71 -19 -204 42 135 67 -24 -241 -2 35 101 32 -6 -110 85 -70 100 -41
7738 -41 -18 7 32 -60 11 51 174 5 17 56 102 -75 81 4 74 29 -47 -78 -63 -6 40 22 -10 29 193 110 18 -62
7766 -62 16 -25 -46 -59 -119 91 -68 -82 -69 -47 22 17 -25 -16 214 122 -137 -78 -49 -20 83 -76 -44 98 -30 11 -102
7793 -102 -67 16 -22 42 74 -25 63 -53 -14 -26 -101 0 54 -37 -2 -55 -48 -45 130 81 103 96 71 12 12 12 84 102 -27 62
7823 62 -29 -17 89 7 -87 88 -165 -53 -109 49 29 127 17 1 115 81 32 23 48 -171 -48 10 -8 -125 42
7848 42 -22 -97 12 -90 152 -53 -9 -18 -95 188 53 -145 -110 18 19 -16 97 -93 227 -54 -11 22 83 42 -62
7873 -62 136 76 -28 8 -62 24 138 -1 154 -181 9 135 -166 105 59 97 30 5 -25 -141 157 12 -55 -16
7897 -16 111 -252 -95 -96 -140 -72 -43 -16 -48 32 4 -62 -3 -14 -110 80 -106 30 26 -40 -55 6 -40 -19 29 70 8 127
7925 127 -18 -73 139 126 -6 12 -38 -55 12 -124 -106 -56 101 36 24 -44 91 84 5 109 -98 41 -82 -16 32
7950 32 66 -11 -143 -89 -135 -65 14 -62 53 43 -121 -12 152 117 43 87 4 113 46 -45 150 -8 -86 -16 92 -22
7976 -22 -35 -50 291 -23 53 119 -100 -29 100 -32 -20 -81 -98 154 15 7 -19 36 -84 139 64 -78 -15 45 -23 -35
8002 -35 -44 25 48 67 68 -34 55 62 -30 -36 -74 -90 1 83 -280 42 -200 -119 64 167 140 -84 122 57 3 182 -9
8029 -9 -15 59 -51 -51 -142 78 121 70 -5 -56 72 -108 96 23 -53 -39 59 39 -3 -39 -17 5 211 140 46 127 179 -131
8057 -131 -220 36 52 0 -115 45 -94 17 -59 -78 -182 -28 -86 5 25 119 92 -13 -115 98 109 -129 -138 106
8081 106 25 -49 -61 -9 -78 42 76 -174 81 9 -7 -97 -9 2 115 165 -25 -34 45 28 -28 -124 -40 -104 150 -39 69
8108 69 -68 -149 38 -22 45 132 2 88 -46 75 -124 153 19 37 -149 79 72 64 186 -34 -69 -41 -11 0 172
8133 172 183 56 88 -41 -93 15 -12 -4 -75 -29 -29 59 1 -3 -61 28 -169 -40 94 32 -94 50 -80 -15 -24 -27 69 25
8161 25 103 139 0 -1 -47 -178 130 -21 10 -54 37 49 150 -26 99 149 87 -58 -69 4 95 61 -27 42 75 146 30
8188 30 77 89 -37 -24 45 -9 18 -40 -7 -66 0 -142 7 144 -61 -62 141 25 -10 26 -93 -89 -54 -59 75 87 -187
8215 -187 71 12 -45 -40 -3 183 -19 115 49 -53 -84 21 57 -112 122 137 -37 -28 -103 -74 -99 88 -276 58 -47
8240 -47 51 46 -15 -18 51 -6 -98 -26 -173 35 -172 -28 17 63 -46 65 -70 -96 -144 -30 30 -84 -23 -9 -15 -25 13
8267 13 8 -197 139 -202 69 41 -158 -12 -11 269 128 -160 -24 -38 -62 114 36 -38 -106 -1 -100 23 6 84 -110
8292 -110 68 -109 167 115 227 28 24 61 -150 -63 -15 142 -17 -123 8 15 138 103 39 79 174 127 30 51 -35
8317 -35 -9 35 -9 11 57 41 16 -41 102 -95 11 -30 -93 -11 -186 190 -40 -84 124 100 79 -115 158 -149 -157 -79
8343 -79 -111 -78 174 -191 -37 22 144 77 -168 33 -14 35 63 -29 18 -29 73 -146 -95 14 -61 48 -142 132
8367 132 102 -157 -75 -28 152 -119 204 1 -220 -56 39 -94 64 -141 95 70 -73 -10 178 -107 115 -112
8389 -112 -16 52 9 39 -185 -20 -99 -95 44 87 -91 45 -72 119 -104 -120 -227 225 -139 -152 -11 15 -19 42
8413 42 -112 -221 -31 76 77 0 88 43 79 47 53 80 -26 -127 34 -10 49 -141 -88 -89 47 -44 -120 33 -88 133
8439 133 -125 135 52 69 48 -8 -99 -35 -70 -92 15 -49 -87 -213 -37 43 -68 -119 11 -67 -90 186 52 29 31 -4
8465 -4 -136 73 23 68 52 -43 -209 -124 -65 -55 -42 -112 91 -45 -115 26 17 -34 98 48 147 -35 -1 102 -108 -77
8491 -77 18 -51 -20 -108 66 150 81 -10 -10 -33 56 -63 57 -59 128 -41 -148 -20 -103 -149 34 -58 -48 -16 -48 -33
8517 -33 41 26 -52 25 -10 -6 -157 -72 -136 83 -38 25 -59 -233 -71 -71 -42 55 12 37 8 -33 -187 -178 -16 -126 14
8544 14 -67 61 114 -15 -92 67 148 -34 1 108 190 -56 -82 28 -180 -37 -186 -28 -70 64 8 9 46 -12 29
8569 29 -84 278 -120 93 -136 2 86 -84 -96 75 -121 -41 95 -5 -12 155 93 31 76 44 51 172 11 30
8593 30 -130 36 -75 -176 22 -30 160 -80 -101 91 -24 83 73 -54 -204 165 -83 -72 2 23 20 -101 -80
8616 -80 -190 18 -43 -10 -105 41 120 71 -57 187 -105 -43 83 61 14 -17 152 -101 50 -72 35 -65 173
8639 173 55 25 171 -5 -56 2 53 -59 -82 142 33 3 -11 -68 37 12 43 -76 -41 -51 56 -48 -42 124 -99
8664 -99 -93 -50 66 59 49 -84 -219 147 8 -70 67 -109 41 -55 -130 -133 95 207 -3 -55 -92 -96 1 104 71 6
8690 6 -125 -108 132 -42 -71 35 -38 55 89 45 38 159 -34 -7 83 -56 104 -22 -212 -10 -94 -9 -51 -33 -44 23
8716 23 -12 -109 64 9 6 116 -133 -4 -27 -54 60 -81 53 -16 -103 25 63 -118 -6 77 -94 41 -62 47
8740 47 -54 -190 116 -217 79 -168 226 178 44 43 20 63 -46 -95 19 -56 15 -28 -185 35 -6 -157 47 -9
8764 -9 8 116 96 -43 -187 -15 -63 31 134 -11 37 6 43 -31 85 -161 -64 -100 -73 -33 -89 60 39 43 58 254
8790 254 63 105 -68 193 -95 -80 64 138 -116 -38 -128 -17 36 -240 0 -33 -144 -46 107 145 -3 65 -53
8813 -53 -97 -48 -83 -205 -31 150 114 18 -70 -178 39 163 40 1 18 -4 -78 40 156 93 -18 -180 13 -38
8837 -38 111 25 -72 67 -45 -106 66 -79 -11 11 95 -73 163 12 78 149 -114 -17 28 90 26 98 -36 50 -30
8862 -30 111 -43 93 -66 -88 -71 -63 108 36 -65 20 -74 -65 -62 -42 -72 89 -86 -10 -38 -37 107 -239 84 103 125 -51
8889 -51 -35 -37 43 9 -103 -89 -12 -169 8 92 31 24 -46 24 -23 -76 -128 -69 -91 111 -71 93 66 110 -45 -88 -83 -181
8917 -181 58 65 166 164 92 142 -102 85 1 8 -107 -6 -9 -74 -58 148 46 -116 31 82 22 193 32 115 28 -157
8943 -157 95 -100 -125 -39 33 -101 -80 68 -77 0 6 -115 28 -111 -12 -178 46 64 -255 -210 -47 52 -42 -34 66
8968 66 -127 -149 7 94 64 159 -18 28 -56 16 -3 -268 84 -100 0 -65 -87 -20 24 27 -52 33 -99 -60 32 45 86
8995 86 -40 -60 -51 -75 -54 -120 88 142 -232 -45 -43 10 57 15 121 -42 169 -100 151 27 -43 -70 -76 -124 -27 -47 -15
9022 -15 -12 -21 -159 170 178 114 -153 -101 52 97 127 -64 -53 -19 -165 -80 64 31 94 60 -40 -39 28 -97 -3 -104 64
9049 64 -78 41 -96 116 174 -19 8 -171 -18 96 87 -41 111 -37 11 -45 139 -78 -158 -185 30 14 123
9072 123 41 -64 57 54 -43 -87 -7 -83 32 -114 -19 -6 -7 -129 -27 -59 -208 85 -84 -107 -93 -90 -93 -167 -55 -138 -34
9099 -34 -3 27 150 -95 136 -112 -66 209 -68 -226 -151 -11 -63 -67 -184 -20 -38 -30 102 147 -35 29 16 -13 67
9124 67 8 3 -104 -60 80 163 54 18 93 -95 76 161 -91 -5 49 -162 78 -35 -104 21 -79 2 1 -59 10 72
9150 72 -65 18 76 34 -15 55 85 100 40 -31 75 -18 26 34 82 49 12 -37 -71 123 0 115 -29 -51 47 67 -166
9177 -166 50 79 -86 -98 -41 -135 6 17 153 -49 -73 23 -80 -146 74 78 -26 119 -133 -69 210 41 118 92
9201 92 -34 -42 -96 126 33 -118 139 -74 41 95 96 -48 190 14 -165 37 196 -34 -52 131 78 -118 -78 28
9225 28 17 75 -73 -51 -35 6 -100 42 -144 2 83 -176 -142 -144 -280 29 -29 23 86 -30 -9 15 -24 125 -170
9250 -170 -81 -147 78 -55 105 -16 -45 13 42 -21 -30 144 -50 -125 132 0 -39 74 36 8 63 35 70 -34 21
9275 21 -6 -66 -15 -38 -46 -131 -168 79 152 105 61 84 -47 -38 -63 36 -56 13 85 -79 45 -138 -146 31 132 -61 0 195
9303 195 139 -3 102 58 50 -194 -116 29 59 -102 27 65 -34 -26 -100 -1 108 -41 71 -36 -174 25 190 -49
9327 -49 41 -156 102 193 -136 -58 50 -38 -13 70 -116 34 -106 -10 28 115 -150 -113 56 -9 -145 93 -43 52
9351 52 77 -58 -45 -45 62 50 92 233 96 10 -152 -28 -3 58 29 -255 7 -103 -58 -103 -103 161 -24 -16 57 235
9377 235 -69 -31 59 -133 -64 169 -95 90 88 -97 175 18 -116 144 60 -11 33 82 -23 -201 -110 -27 46 0
9401 0 58 29 143 54 -8 29 174 -14 1 -79 -123 8 -10 -57 -87 71 -48 -130 -57 26 91 58 -81 -92 -103 86 -56
9428 -56 89 29 103 -128 49 118 -89 38 -76 -60 -33 56 62 22 43 -48 77 32 31 64 42 95 -49 -6 -164 71
9454 71 42 -66 -123 -37 -69 75 -92 -173 88 -155 65 26 47 -158 -12 -154 -104 33 41 95 -100 -34 -37 -6 -16 102
9480 102 -91 24 -16 -122 -63 -54 160 -36 29 -80 -55 10 1 -41 -73 27 -102 27 -10 -100 -133 -145 -114 -47 -54 109
9506 109 -62 53 -88 -81 -8 151 -40 -136 -150 -142 22 10 -28 56 105 -5 -89 -54 -104 -34 -21 89 50 -1 149 12
9532 12 -47 -6 -92 106 50 75 148 80 -9 10 111 -5 5 50 75 131 -16 -11 -1 48 89 64 -111 95 59 -33 22 118
9560 118 148 -32 -118 -9 24 32 40 -15 -155 -207 -10 -63 23 18 -8 -4 -199 -85 137 -68 96 20 -57 -30 -23 -96 70
9587 70 80 13 -94 -51 157 -40 -2 33 -22 59 34 57 -72 -48 37 12 -152 -57 -15 -13 0 156 81 -8 -17 -50 28 216
9615 216 24 2 124 -65 -25 -34 -44 22 10 -100 37 -53 -174 -15 47 22 126 85 103 91 79 -144 -95 9 60
9640 60 -49 14 88 -25 111 -170 -19 -95 -11 28 21 -18 -47 -5 -9 51 -132 -9 12 -61 54 -3 -33 -11 28 25 -16 44
9668 44 -23 101 175 -130 13 158 -99 18 -43 -116 -34 -135 -5 -59 -74 -64 -26 67 -127 133 16 80 63 147 -24
9693 -24 -210 79 -56 -40 -49 -148 -4 82 17 71 -34 172 -76 81 -42 -98 -13 8 -36 -16 109 74 128 -10 -72
9718 -72 240 -53 13 -53 -121 57 159 -19 171 -139 -27 80 -95 61 -238 -112 -33 -121 -74 148 73 -153 23
9741 23 86 33 2 -65 -59 32 31 38 89 7 -38 -68 -137 11 -25 82 76 -23 -9 63 78 -119 53 158 105 -19 2 -78 27
9770 27 -31 179 141 62 -99 69 -9 -89 -7 26 47 -38 -61 45 -75 9 -98 -94 -81 -58 159 91 49 37 -22 8 -140
9797 -140 102 203 75 -88 70 79 -35 48 -46 178 94 -12 2 18 66 19 39 5 -129 -20 77 -34 212 -64
9821 -64 68 154 -125 -156 181 91 87 -16 32 72 165 -29 -163 -79 -98 38 11 18 -112 64 -56 -107 21 79 37 -2
9847 -2 -26 -50 191 78 26 -112 34 43 -78 -109 -27 32 -58 -147 -19 -129 -52 -214 -37 62 -53 2 -22 -74 47 174
9873 174 90 -51 320 8 4 52 19 -37 18 125 132 -26 -11 102 -29 55 58 24 67 77 24 29 -73 -4 -182 0 113
9900 113 -106 -41 -104 -56 -267 90 106 -57 -41 66 -88 -40 -98 -19 73 140 64 100 133 -115 86 -126 -139 73 187
9925 187 117 -59 -83 49 -18 -64 -30 -89 169 -67 63 -99 -91 1 126 -87 -8 -24 -9 -136 40 -35 -60 162 -80
$$ [...]
16383a6
##END NTUPLES=NMR FID
##END=
