##TITLE=abcd
##JCAMPDX= 6.0         $$ Bruker NMR JCAMP-DX V2.0
##DATA TYPE= NMR FID
##DATA CLASS= NTUPLES
##ORIGIN= UXNMR, Bruker Analytische Messtechnik GmbH
##OWNER= root
$$ XWIN-NMR		Version 3.5
$$ Sun Jul  6 15:26:59 2025 Russian Standard Time (UT+4h)  servis@DPX200
##.OBSERVE FREQUENCY= 200.131235884673
##.OBSERVE NUCLEUS= ^1H
##.DELAY= (6, 6)
##.ACQUISITION MODE= SIMULTANEOUS
##.ACQUISITION SCHEME= undefined
##.AVERAGES= 32
##.DIGITISER RES= 18
##SPECTROMETER/DATA SYSTEM= spect
##.PULSE SEQUENCE= zg
##.SOLVENT NAME= CDCl3
##.SHIFT REFERENCE= (INTERNAL, CDCl3, 0, 16.5164)
##AUDIT TRAIL= $$ (NUMBER, WHEN, WHO, WHERE, WHAT)
$$ ##TITLE= Audit trail, XWIN-NMR		Version 3.5
$$ ##JCAMPDX= 5.01
$$ ##ORIGIN= Bruker BioSpin GmbH
$$ ##OWNER= servis
$$ F:\spectra/data/av/nmr/H1/1/audita.txt
$$ ##AUDIT TRAIL=  $$ (NUMBER, WHEN, WHO, WHERE, WHAT)
(   1,<2025-07-06 15:26:33.37 +0400>,<servis>,<DPX200>,
      <created by zg, POWCHK disabled, PULCHK disabled
       configuration hash MD5:
       00 E9 B6 7A A2 85 ED C7 34 08 36 98 17 FE 4E 26
       data hash MD5: 32K
       82 20 26 41 EC AA B0 A4 48 22 ED 10 D7 B9 58 6C>)
$$ ##END=
$$ 
$$ hash MD5
$$ 5D E8 21 0D FF 31 AE 84 87 8C B2 13 CD 5F 54 0F
##$RELAX= 
##$RELAX= 
##$RELAX= 
##$RELAX= 
##$RELAX= 
##$RELAX= 
##$RELAX= 
##$RELAX= 
$$ Bruker specific parameters
$$ --------------------------
##$DU= <F:\spectra>
##$EXPNO= 1
##$NAME= <H1>
##$PROCNO= 1
##$TYPE= <nmr>
##$USER= <av>
##$AMP= (0..31)
100 100 100 100 100 100 100 100 100 100 100 100 100 100 100 100 100 100 
100 100 100 100 100 100 100 100 100 100 100 100 100 100 
##$AQSEQ= 0
##$AQ_mod= 1
##$AUNM= <au_zg>
##$AUTOPOS= <>
##$BF1= 200.13
##$BF2= 200.13
##$BF3= 200.13
##$BF4= 200.13
##$BF5= 500.13
##$BF6= 500.13
##$BF7= 500.13
##$BF8= 500.13
##$BYTORDA= 1
##$CFDGTYP= 0
##$CFRGTYP= 5
##$CHEMSTR= <none>
##$CNST= (0..31)
1 1 145 1 1 1 1 1 1 1 1 1 1 1 1 1 1 1 1 1 1 1 1 1 1 1 1 1 1 1 1 1 
##$CPDPRG= <>
##$CPDPRG1= <>
##$CPDPRG2= <>
##$CPDPRG3= <>
##$CPDPRG4= <mlev>
##$CPDPRG5= <mlev>
##$CPDPRG6= <mlev>
##$CPDPRG7= <mlev>
##$CPDPRG8= <mlev>
##$CPDPRGB= <>
##$CPDPRGT= <>
##$D= (0..31)
0 2 0 0 0 0 0 0 0 0.06 0 0 0 0 0 0 0.0002 0 0 0 0 0 0 0 0 0 0 0 0 0 0 
0 
##$DATE= 1751801192
##$DBL= (0..7)
120 120 120 120 120 120 120 120 
##$DBP= (0..7)
150 150 150 150 150 150 150 150 
##$DBP07= 0
##$DBPNAM0= <>
##$DBPNAM1= <>
##$DBPNAM2= <>
##$DBPNAM3= <>
##$DBPNAM4= <>
##$DBPNAM5= <>
##$DBPNAM6= <>
##$DBPNAM7= <>
##$DBPOAL= (0..7)
0.5 0.5 0.5 0.5 0.5 0.5 0.5 0.5 
##$DBPOFFS= (0..7)
0 0 0 0 0 0 0 0 
##$DE= 6
##$DECBNUC= <off>
##$DECIM= 32
##$DECNUC= <off>
##$DECSTAT= 4
##$DIGMOD= 1
##$DIGTYP= 9
##$DL= (0..7)
0 120 120 120 120 120 120 120 
##$DP= (0..7)
150 150 150 150 150 150 150 150 
##$DP07= 0
##$DPNAME0= <>
##$DPNAME1= <>
##$DPNAME2= <>
##$DPNAME3= <>
##$DPNAME4= <>
##$DPNAME5= <>
##$DPNAME6= <>
##$DPNAME7= <>
##$DPOAL= (0..7)
0.5 0.5 0.5 0.5 0.5 0.5 0.5 0.5 
##$DPOFFS= (0..7)
0 0 0 0 0 0 0 0 
##$DQDMODE= 0
##$DR= 18
##$DS= 0
##$DSLIST= <SSSSSSSSSSSSSSS>
##$DSPFIRM= 0
$$ [...]
##$SUBNAM0= <"">
##$SUBNAM1= <"">
##$SUBNAM2= <"">
##$SUBNAM3= <"">
##$SUBNAM4= <"">
##$SUBNAM5= <"">
##$SUBNAM6= <"">
##$SUBNAM7= <"">
##$SUBNAM8= <"">
##$SUBNAM9= <"">
##$SW= 20.6817932712277
##$SWIBOX= (0..15)
0 0 3 0 0 0 0 0 0 0 0 0 0 0 0 0 
##$SW_h= 4139.07284768212
##$TD= 32768
##$TD0= 1
##$TE= 0
##$TE2= 300
##$TE3= 300
##$TEG= 300
##$TL= (0..7)
0 120 120 120 120 120 120 120 
##$TP= (0..7)
150 150 150 150 150 150 150 150 
##$TP07= 0
##$TPNAME0= <>
##$TPNAME1= <>
##$TPNAME2= <>
##$TPNAME3= <>
##$TPNAME4= <>
##$TPNAME5= <>
##$TPNAME6= <>
##$TPNAME7= <>
##$TPOAL= (0..7)
0.5 0.5 0.5 0.5 0.5 0.5 0.5 0.5 
##$TPOFFS= (0..7)
0 0 0 0 0 0 0 0 
##$TUNHIN= 0
##$TUNHOUT= 0
##$TUNXOUT= 0
##$USERA1= <user>
##$USERA2= <user>
##$USERA3= <user>
##$USERA4= <user>
##$USERA5= <user>
##$V9= 5
##$VALIST= <valist>
##$VCLIST= <CCCCCCCCCCCCCCC>
##$VD= 0
##$VDLIST= <DDDDDDDDDDDDDDD>
##$VPLIST= <PPPPPPPPPPPPPPP>
##$VTLIST= <TTTTTTTTTTTTTTT>
##$WBST= 1024
##$WBSW= 30
##$XGAIN= (0..3)
0 0 0 0 
##$XL= 0
##$YL= 0
##$YMAX_a= 400762
##$YMIN_a= -335828
##$ZGOPTNS= <>
##$ZL1= 120
##$ZL2= 120
##$ZL3= 120
##$ZL4= 120
##$ABSF1= 10
##$ABSF2= 0
##$ABSG= 5
##$ABSL= 3
##$ALPHA= 0
##$AQORDER= 0
##$ASSFAC= 0
##$ASSFACI= 0
##$ASSFACX= 0
##$ASSWID= 0
##$AUNMP= <proc_1d>
##$AZFE= 0.1
##$AZFW= 0.1
##$BCFW= 1
##$BC_mod= 2
##$BYTORDP= 0
##$COROFFS= 0
##$CY= 19
##$DATMOD= 1
##$DC= 2
##$DFILT= <>
##$DTYPP= 0
##$F1P= 11.0000007629395
##$F2P= -0.999999237060547
##$FCOR= 0.5
##$FTSIZE= 0
##$FT_mod= 4
##$GAMMA= 1
##$GB= 1
##$INTBC= 1
##$INTSCL= 1
##$ISEN= 128
##$LB= 0.05
##$LEV0= 0
##$LPBIN= 0
##$MAXI= 10000
##$MC2= 0
##$MEAN= 0
##$ME_mod= 0
##$MI= 0
##$NCOEF= 0
##$NC_proc= 0
##$NLEV= 6
##$NOISF1= 0
##$NOISF2= 0
##$NSP= 1
##$NTH_PI= 0
##$NZP= 0
##$OFFSET= 16.51637
##$PC= 1
##$PHC0= -271.4733
##$PHC1= 1.101538
##$PH_mod= 0
##$PKNL= yes
##$PPARMOD= 0
##$PSCAL= 4
##$PSIGN= 0
##$REVERSE= no
##$SF= 200.13
##$SI= 16384
##$SIGF1= 0
##$SIGF2= 0
##$SINO= 400
##$SIOLD= 16384
##$SREGLST= <1H.CDCl3>
##$SSB= 0
##$STSI= 0
##$STSR= 0
##$SW_p= 4139.07284768211
##$SYMM= 0
##$S_DEV= 0
##$TDeff= 0
##$TDoff= 0
##$TI= <>
##$TILT= no
##$TM1= 0
##$TM2= 0
##$TOPLEV= 0
##$USERP1= <user>
##$USERP2= <user>
##$USERP3= <user>
##$USERP4= <user>
##$USERP5= <user>
##$WDW= 1
##$XDIM= 8192
##$YMAX_p= 0
##$YMIN_p= 0
$$ End of Bruker specific parameters
$$ ---------------------------------
##NTUPLES= NMR FID
##VAR_NAME=  TIME,          FID/REAL,        FID/IMAG
##SYMBOL=    X,             R,               I
##VAR_TYPE=  INDEPENDENT,   DEPENDENT,       DEPENDENT
##VAR_FORM=  AFFN,          ASDF,            ASDF
##VAR_DIM=   16384,         16384,           16384
##UNITS=     SECONDS,       ARBITRARY UNITS, ARBITRARY UNITS
##FACTOR=    0.0002416,     1,               1
##FIRST=     0,             0,               0
##LAST=      3.9581328,     0,               0
##MIN=       0,             -335828,         0
##MAX=       3.9581328,     400762,          0
$$ Real data points
##PAGE= N=1
##DATA TABLE= (X++(R..R)), XYDATA
$$ [...]
4549 -535 -298 345 114 -205 498 466 -90 362 693 57 -224 389 -90 -602 -116 39 -574 -250 258 -265
4569 -265 -310 477 383 -123 264 487 -26 139 471 -189 -468 116 47 -594 -340 46 -437 -356 268 -154 -356
4590 -356 392 626 -157 198 545 -31 -219 366 17 -545 -71 93 -461 -279 178 -238 -226 527 455 -31 398
4611 398 546 -51 135 479 -53 -493 105 21 -663 -229 82 -411 -385 440 42 -183 410 541 -79 101 511
4632 511 -173 -299 299 -200 -659 -167 143 -504 -415 252 -155 -88 434 279 -237 439 498 29 -16 238 -95
4653 -95 -421 116 73 -664 -259 250 -406 -325 448 168 -198 460 450 -34 228 472 -124 -238 279 -205 -589
4674 -589 -86 115 -544 -331 284 -15 -113 533 331 -84 269 599 82 -105 296 -211 -448 -7 -86 -653 -245
4695 -245 234 -252 -244 462 130 -170 577 435 -119 164 472 -125 -194 98 -88 -752 -79 64 -505 -215 276
4716 276 65 -111 402 318 -51 359 576 -109 -131 351 -120 -550 -142 -126 -709 -131 174 -236 -162 602 200
4737 200 -104 530 542 -180 211 589 -200 -287 91 -255 -531 -37 98 -636 -154 308 63 -238 494 316 -14
4758 -14 394 476 -203 -52 401 -356 -557 31 -19 -637 -167 185 -394 -85 476 195 -108 592 412 -102 226
4779 226 405 -246 -393 189 -154 -653 -149 66 -649 -130 366 -25 21 465 338 -71 295 469 -128 -120 398
4800 398 -163 -560 7 69 -511 -37 204 -223 -159 557 224 -169 411 487 -183 82 363 -345 -374 303 -68
4821 -68 -720 -161 122 -358 -69 346 39 -256 479 404 -190 347 455 -178 -210 392 -257 -653 43 -155 -688
4842 -688 -21 271 -237 -47 473 131 58 508 430 -197 43 446 -310 -387 122 -171 -480 -27 113 -418 -46
4863 -46 424 -109 -134 566 361 -97 349 432 -327 -158 249 -383 -686 43 -144 -525 -225 283 -196 -39 542
4884 542 196 -150 502 300 -306 28 388 -154 -322 207 -192 -634 17 -9 -346 53 524 75 -137 601
4904 601 477 -107 285 402 -345 -108 234 -285 -596 -113 34 -505 -82 366 -180 -111 537 182 -98 373
4924 373 356 -228 4 294 -382 -352 257 -195 -660 -19 169 -307 -66 442 100 45 581 217 -179 273 367
4945 367 -415 -279 205 -275 -428 30 -61 -555 -30 438 -64 -46 546 133 -70 385 430 -224 66 163 -421
4966 -421 -395 222 -171 -615 -80 142 -230 -59 504 23 -46 665 297 -114 106 341 -143 -308 18 -277 -500
4987 -500 84 -59 -466 -5 328 -81 26 575 294 -181 415 425 -324 43 276 -285 -511 70 -215 -376
5007 -376 -22 174 -306 67 532 -1 -111 513 389 -309 67 290 -341 -169 191 -358 -638 21 51 -487
5027 -487 -3 373 -86 170 618 264 -102 413 449 -211 -116 170 -326 -416 188 -246 -561 127 286 -347 -4
5048 -4 501 188 -49 394 201 -125 290 204 -276 -217 155 -280 -466 -57 -53 -509 13 300 -162 73 664 179
5070 179 -222 396 429 -271 -197 177 -374 -359 129 -206 -420 95 311 -186 -3 409 198 19 604 317 -274
5091 -274 77 385 -245 -255 235 -253 -497 119 -42 -407 88 435 -60 17 586 262 27 356 337 -400 -138
5112 -138 204 -359 -471 -1 -135 -437 147 307 -274 55 602 100 34 510 175 -223 118 217 -347 -326 40
5133 40 -276 -340 180 99 -372 89 429 -50 -37 564 49 7 434 361 -505 -190 137 -457 -557 16 -22 -487
5155 -487 87 235 -185 111 594 86 -81 352 203 -256 76 82 -496 -343 134 -174 -537 24 91 -271 81
5176 81 376 -104 63 571 159 -292 316 146 -390 -102 154 -402 -445 190 -155 -415 224 295 -37 88 573
5197 573 160 -33 457 182 -271 287 75 -471 -381 169 -134 -588 77 -34 -340 254 370 -77 35 513
5217 513 176 -106 178 179 -470 -46 245 -456 -517 168 -12 -437 123 249 -69 107 482 60 -29 379 206
5238 206 -256 -22 151 -358 -336 140 -339 -372 152 136 -225 141 418 5 85 502 115 -299 270 107 -390
5259 -390 -122 45 -392 -436 94 -109 -345 115 265 -155 119 574 30 -182 481 142 -331 -40 72 -477
5279 -477 -273 200 -286 -371 209 214 -179 211 438 3 168 452 90 -233 274 145 -370 -188 194 -271 -373
5300 -373 195 -58 -232 178 282 -118 135 602 53 -68 328 46 -277 -64 50 -434 -291 39 -226 -416
5320 -416 225 210 -159 192 509 6 -15 444 85 -116 123 94 -426 -263 165 -260 -333 157 120 -274 300 332
5342 332 -213 162 464 263 4 314 20 -408 38 118 -465 -276 66 -157 -305 221 184 -179 143 446 99
5363 99 109 382 54 -314 136 -23 -530 -117 100 -254 -313 127 -1 -190 222 397 -53 189 501 111 -66
5384 -66 192 -12 -418 -126 97 -399 -306 67 -151 -381 200 311 -35 373 403 -98 36 472 66 -227 1
5405 1 131 -451 -139 39 -252 -209 179 116 -124 144 249 -99 165 460 -26 -65 196 85 -423 -29 -29 -357
5427 -357 -216 66 -146 -334 259 268 -246 37 432 39 -34 399 123 -328 109 82 -338 20 66 -314 -238 295
5449 295 -20 -157 147 319 25 58 396 50 -60 219 8 -435 -168 -13 -431 -235 154 -225 -282 315 311
5470 311 -147 125 392 10 32 394 20 -399 165 11 -557 -280 54 -256 -238 152 120 -169 308 344 -53
5491 -53 68 607 32 -127 179 64 -390 -116 21 -527 -284 185 -129 -314 191 374 -7 201 526 -9
5511 -9 -82 376 -14 -303 26 6 -425 -225 -2 -260 -213 179 109 1 341 416 -161 -17 399 -19 -146 134
5533 134 -143 -392 16 19 -391 -347 188 -136 -64 319 220 -98 328 484 15 -87 284 79 -285 -49 -103 -475
5555 -475 -164 194 -231 -296 408 40 -73 206 405 -49 32 362 -42 -199 166 41 -394 -28 82 -345 -238
5576 -238 86 -70 -47 263 265 -38 242 405 -14 -70 178 -39 -343 66 23 -372 -236 146 -113 -321 225 222
5598 222 -76 315 314 -84 239 306 22 -250 136 53 -342 -91 90 -358 -203 317 44 -145 224 316 -142 172
5620 172 395 -46 -93 231 -183 -275 -48 -68 -473 -129 115 -157 -127 292 26 -74 371 414 -96 45 413 35
5642 35 -377 84 -146 -430 -155 -20 -318 -297 220 -60 -119 219 310 -19 205 311 -34 -153 151 -20 -367
5663 -367 -50 -121 -292 -83 112 -113 -110 401 196 -162 212 395 21 96 237 -70 -266 118 -18 -444 -144
5684 -144 44 -325 -145 208 84 21 242 321 -28 -22 382 -18 -190 227 -130 -416 -75 56 -445 -127 113
5705 113 -147 -204 219 73 -114 361 402 11 112 286 -174 -200 157 -20 -382 -186 181 -238 -25 319 -43
5726 -43 -96 441 380 -138 58 172 -96 -184 167 -88 -297 96 69 -298 -97 142 -79 -126 313 215 -125 209
5748 209 240 -88 24 226 -186 -289 -72 -78 -317 -190 146 -284 -133 235 56 -42 257 433 8 -42 258 -11
5770 -11 -44 252 -232 -315 25 67 -297 -8 195 -88 -54 358 167 -24 354 429 -91 -56 182 -85 -331 -6
5792 -6 -210 -394 -130 105 -203 -80 201 2 -26 393 180 -128 126 295 -35 -82 177 -203 -334 -145 -24
5813 -24 -274 -91 179 -14 35 263 213 -84 224 233 -85 -1 262 -153 -275 130 -79 -365 -57 83 -140 -175
5835 -175 242 98 -49 385 160 -139 208 208 -242 -259 132 -127 -451 -10 -47 -248 7 316 -30 -190 239
5856 239 205 -67 255 93 -216 -186 193 -175 -269 131 57 -346 46 87 -190 42 423 120 -71 298 210 3
5878 3 107 252 -98 -240 81 -167 -259 -129 43 -202 -70 242 -230 -27 349 177 -15 174 297 -275 -213
5899 -213 172 -257 -447 13 -41 -364 -136 139 -182 31 324 52 -140 214 299 -38 134 175 -84 -197 66
5920 66 -109 -476 -48 49 -307 103 216 -90 -10 311 137 -173 151 232 -252 -63 37 -333 -338 -63 -14 -265
5942 -265 -111 138 -226 -31 318 -23 -45 273 213 -185 52 212 -296 -139 45 -223 -497 -45 55 -261 61
5963 61 181 -92 52 370 150 23 246 221 -227 -38 154 -181 -346 157 11 -230 -147 183 -197 -52 324
5984 324 196 -56 319 144 -223 -28 198 -167 -211 135 -221 -378 -84 147 -255 14 265 7 -77 299 191
6005 191 -127 77 228 -199 -290 22 -152 -336 62 -60 -304 55 224 -38 -15 330 65 4 234 299 -184
6026 -184 -15 62 -306 -284 106 -148 -418 -91 38 -241 -39 295 -62 -60 410 83 -71 187 215 -189 -177 92
6048 92 -178 -309 19 -64 -295 -33 263 -195 -7 248 82 -70 268 325 -124 47 88 -262 -232 39 -67 -306
6070 -306 -60 253 -225 73 308 -69 11 339 231 -42 118 40 -425 -122 133 -294 -314 53 -61 -470 108
6091 108 171 -50 35 432 131 -122 228 16 -241 -45 26 -234 -230 90 -81 -328 -12 100 -59 94 281 -13
6113 -13 160 420 43 -15 59 89 -297 -83 14 -235 -384 -1 5 -198 -10 245 24 87 425 160 -49 239 201
6136 201 -218 -106 141 -295 -256 -30 -87 -231 25 214 -240 124 325 127 -14 350 18 -196 2 82 -231
6157 -231 -137 105 -238 -278 72 79 -250 19 109 -4 12 428 195 -72 215 74 -225 -91 139 -292 -214 47
6179 47 -90 -316 -33 149 -98 -24 299 -30 -6 408 -13 -197 214 3 -354 -207 -63 -134 -250 144 44
6200 44 -291 176 173 -105 82 328 59 -13 105 42 -233 -29 87 -246 -177 120 -170 -163 188 132 -152 -85 279
6223 279 -65 103 263 107 -149 -37 124 -261 -213 -27 -182 -269 50 -3 -224 69 306 21 69 245 124
6244 124 -57 247 62 -244 -1 106 -340 -286 160 -77 -146 156 80 -73 50 251 159 0 222 85 -57
6265 -57 62 69 -308 -281 67 -226 -241 117 35 -191 177 243 35 138 294 72 -79 88 103 -348 -5 71 -149
6288 -149 -306 118 -20 -164 30 116 -118 149 281 -237 -51 173 137 -164 11 157 -190 -100 129 -290 -251
6309 -251 49 31 -59 121 345 7 58 341 31 -183 61 99 -115 -15 11 -185 -246 87 -74 -165 27 161
6331 161 -58 -33 285 5 -55 196 -31 -174 -65 44 -269 -183 -34 -166 -218 85 -33 45 125 218 39 81 326
6354 326 0 -95 167 -122 -188 -47 136 -195 -108 138 -133 -108 86 118 -115 147 278 38 13 193 80 -268
6376 -268 118 92 -315 -302 109 -137 -61 210 -4 -216 162 312 32 -101 133 -8 -166 74 -1 -263 -237 -40
6398 -40 -238 -94 177 47 -103 74 253 -90 158 237 44 84 298 -102 -224 47 -48 -238 -107 146 -209
6419 -209 -151 107 69 -130 67 340 -42 122 244 -2 12 38 13 -255 -77 -74 -175 -72 181 -78 -96 87 143
6442 143 -75 74 230 -44 8 97 82 -252 -8 -6 -160 -65 69 -99 5 157 106 -59 47 260 34 -23 192
6465 192 -105 -96 25 -41 -311 -165 61 -130 -94 84 -25 -165 214 250 -14 46 304 31 61 218 -109 -268
6487 -268 -6 47 -298 -133 35 -131 -77 195 88 -7 92 246 -30 -40 277 -34 -222 185 67 -226 -191 16
6509 16 -201 -200 179 70 -17 191 229 45 240 239 83 -56 196 -35 -361 -35 -1 -323 -164 -20 -185 -65 121
6532 121 310 -64 253 352 -38 -2 252 -87 -132 91 -7 -170 -152 159 -203 -157 114 6 -75 161 204 -56 74
6555 74 188 -49 -122 93 23 -256 -57 -116 -286 -87 63 -83 -158 289 93 38 124 51 43 -40 104 -109 -218 29
6579 29 33 -204 20 -6 -184 -272 190 35 -181 148 153 45 -110 150 -36 -133 69 -73 -154 -14 -7 -171 -94 207
6603 207 -86 -87 151 155 -75 56 220 -8 -37 276 -128 -183 1 31 -316 -41 -76 -212 -71 33 -112 58 209
6626 209 170 35 85 211 26 -56 94 -79 -84 60 57 -214 -167 93 -82 -103 96 130 -134 126 148 -5 32 143
6650 143 -78 -132 31 27 -249 5 135 -166 81 138 -7 -44 142 107 -133 -17 99 131 -88 48 -127 -131 32
6673 32 -98 -154 -142 -46 -148 -23 255 116 -239 185 181 -25 -28 204 -36 -115 38 -12 -251 -32 0 -24 -183 92
6697 92 137 29 189 235 35 59 173 52 -32 141 -56 -207 74 0 -295 -66 -38 32 -168 228 65 -134 120
6720 120 232 -63 80 259 -148 -239 -110 29 -270 -229 154 -98 -85 91 164 -139 158 141 36 34 130 -87 -163
6743 -163 -27 -121 -136 -97 84 -182 -19 153 36 -85 259 30 -233 76 144 -59 3 37 -149 -190 -61 -183
6765 -183 -315 -55 162 -122 -164 155 6 51 179 88 -80 22 163 -90 -224 117 -109 -260 -6 58 -189
6786 -189 4 168 -72 68 142 153 -46 26 108 -19 -85 86 -55 -190 -24 -15 -190 -42 30 -120 -9 174 -59
6809 -59 -144 145 198 24 214 68 -129 -28 -72 -77 -222 -5 26 -95 -28 182 31 -52 125 70 -161 27 134
6832 134 -153 -150 108 -34 -254 -79 -39 -257 131 44 -166 51 293 129 23 241 206 -129 12 198 -166 -210
6854 -210 23 -83 -171 -43 -29 -74 -108 147 -15 -64 176 32 -19 107 104 -172 -33 -54 -169 -172 -70 -118 -112 -44 136
6879 136 27 -15 -9 48 -35 91 202 -94 -75 91 -71 -23 4 -55 -193 -134 94 -164 90 199 -44 -43 289 147
6903 147 15 58 -26 -88 -49 37 -60 -187 29 32 -220 97 199 -109 -31 163 70 33 192 145 -76 60 29 -90
6927 -90 -48 88 -85 -127 15 41 15 -48 112 119 61 155 134 35 153 203 -121 -97 -63 -95 -75 -61 9 -94 50 180
6953 180 39 -108 91 5 -23 215 84 57 -57 183 -72 -162 -98 -69 -165 -32 44 -55 -29 158 -21 29 165 181
6977 181 -50 68 9 -204 -87 -25 -47 -162 40 45 -129 91 162 -39 25 188 86 -7 95 236 -62 164 54
7000 54 -86 -93 -125 -94 -68 73 76 -58 55 230 -49 122 218 130 -100 -27 91 -199 -56 -103 -72 -189 -39 50 -156
7025 -156 -22 142 35 -25 126 117 -77 136 89 -128 -71 0 -102 -100 30 -99 -136 40 83 -94 111 304 46
7048 46 -3 206 153 -99 20 -4 -214 -119 29 -102 -117 86 -27 -107 62 142 -70 63 163 -3 14 96 -18
7071 -18 -95 76 20 -205 -194 4 -126 -131 13 138 -55 56 80 -18 4 168 -16 -209 144 136 -179 -179 7 -56 -67
7096 -67 74 -43 -26 47 62 -84 14 249 184 -127 56 64 -34 -5 41 -142 -118 64 -71 -162 23 98 -12 -24 172
7121 172 19 36 161 47 -50 62 -68 -200 -115 -16 17 -67 101 26 -131 175 -26 60 120 223 97 -49 74
7144 74 82 -40 11 144 -143 -108 -3 -39 -140 -8 28 2 43 169 -15 -232 148 17 -123 78 2 -162 -126 -97
7168 -97 -182 35 160 66 -16 63 136 14 -4 180 36 -14 -7 188 -120 -14 51 -119 -117 72 33 -199 4 22 -36
7193 -36 46 64 -14 90 53 98 -105 -65 121 -120 -33 23 -37 -70 92 -58 -53 100 202 -25 20 134 113 -94 40
7218 40 -14 -323 -89 1 -58 -161 6 15 -19 109 123 -63 55 299 29 72 132 25 -104 30 47 -109 -84 34
7242 34 -91 -153 -30 86 -54 99 178 34 43 137 34 -84 151 -5 -241 -106 -47 -19 -210 83 35 48 113 125
7266 125 -124 24 241 180 -12 116 -23 -156 99 -31 -94 -72 144 -18 15 120 112 -136 42 154 -41 24
7288 24 236 51 -74 64 2 -175 -30 -27 -237 -140 122 -162 -110 30 217 30 21 147 -34 -68 111 -75 -174
7311 -174 -34 103 -92 -108 -31 9 -186 90 179 -94 188 177 43 -7 86 -168 -86 90 -12 -199 -196 104 -108
7334 -108 -102 45 -53 -56 176 58 74 16 260 62 -41 155 70 -66 -53 71 -198 -31 83 -48 -183 50 53 -103
7358 -103 75 112 -99 53 92 -75 -22 0 6 -101 -83 12 -30 -224 -18 47 -101 92 106 113 35 136 11 -172 106
7383 106 -47 -138 20 -48 -214 -40 13 50 94 39 19 -15 20 150 -51 47 180 -136 -66 11 -16 -232 -3 18 -188
7408 -188 -154 69 15 -189 11 214 -100 -17 54 -143 32 27 74 -206 27 -12 -192 -112 78 -59 -130 189 133 19
7432 19 65 160 3 69 208 71 -104 24 2 -230 -86 81 -135 -48 47 -47 -164 140 113 -72 34 185 -103
7455 -103 -150 78 -28 -92 -40 -102 -138 40 8 15 -121 55 12 76 19 128 6 -11 145 -12 -173 51 -8 -122
7479 -122 -29 110 -94 -30 263 95 41 206 222 36 116 113 -29 10 59 -86 18 -79 -10 -192 -41 -5 -14 -71 169
7504 169 180 79 75 192 -80 -71 88 -41 -59 -46 -104 -212 -106 58 -116 -87 163 76 -54 194 43 -23 -17 158
7528 158 112 -132 31 40 -24 58 108 -23 53 102 51 -45 165 74 40 22 110 78 -1 -11 -26 -35 -5 -75 -206 -65 26 -108
7556 -108 7 95 80 -81 63 85 -248 131 63 91 -227 199 44 -165 -2 -48 -100 -31 69 -60 17 122 88
7579 88 14 142 219 23 86 89 78 -181 122 -29 -210 70 26 10 -137 68 97 130 -58 18 -39 84 140 -63 -126
7604 -126 26 -71 -143 72 0 -110 -33 83 -62 -105 139 23 48 137 114 -68 134 83 -99 28 -101 -81 -78 11
7628 11 87 -13 -42 7 107 -15 118 1 -8 54 68 -103 -108 2 12 -80 -172 -21 -160 -79 68 -132 -55 91 183
7653 183 120 28 18 -20 -64 19 -49 -201 37 1 -138 -106 1 -149 60 207 8 -9 127 182 -21 -74 139 -15
7677 -15 -115 124 -54 -107 -124 57 -85 -15 121 -29 43 160 27 4 14 83 -47 -125 148 -37 -220 44 -117
7700 -117 -201 109 113 -64 -96 131 81 -115 -28 238 -84 14 115 118 -120 25 -41 -122 -20 84 -147 90 114 96
7724 96 8 109 197 39 -4 78 21 56 87 -155 -124 -57 24 -123 -92 41 -24 -106 139 120 31 102 -9 -68 6 2 -126
7751 -126 -197 -69 -116 8 -110 15 -126 -37 6 -14 37 55 91 33 19 91 8 -62 87 -158 -62 -40 20 -132 -55 234
7777 234 -121 -18 69 89 -15 78 -37 -46 36 10 -100 -69 -26 -90 -18 51 -97 -100 58 189 13 -53 87 134 91 -130
7803 -130 25 -94 -114 -77 -67 -217 -30 -100 -61 -29 21 -47 -12 172 145 -69 152 -50 -143 19 82 -67 -58 -51 -66 -77
7829 -77 36 -52 -112 46 -20 -5 -92 107 -135 -29 119 3 77 -196 34 -61 -42 -4 -44 -92 71 120 -2 37 189
7854 189 100 -13 175 -115 24 59 18 -27 -94 84 96 -122 -84 22 -10 44 107 -26 64 97 -39 -76 56 -17 -12
7879 -12 15 85 -11 51 -32 -50 -91 2 6 61 48 148 9 -72 123 -8 9 -100 22 -28 -133 -20 2 -75 11 -57 -174
7906 -174 124 157 -98 21 318 52 -82 35 -10 -145 6 -37 -140 -85 7 -80 -47 39 67 66 6 89 82 -55 -59 35
7932 35 -155 -58 75 -38 -25 48 -155 -108 -69 41 -50 28 23 -58 96 221 67 -48 -83 51 -132 27 121 -20
7956 -20 -139 21 -57 -97 -13 57 31 -106 138 -48 -107 1 -21 71 -57 -51 -102 4 -21 -7 -134 88 93 -53 38 1
7982 1 -14 135 65 -3 -57 84 -92 -78 -160 27 -73 -61 20 32 -69 -39 93 -15 85 101 -21 -33 41 -4 -27 -18
8008 -18 119 -125 -47 -52 -28 -20 81 128 55 -6 -29 -57 79 134 -54 5 -111 -23 -70 -45 123 61 -168 0 -118 -67
8034 -67 -100 83 2 -99 103 25 80 -42 -1 -37 36 -16 -115 -64 -13 -120 -121 -59 106 -80 45 147 -45 86 62
8059 62 121 -87 48 49 -107 -103 34 -42 -60 12 -63 115 35 171 82 135 53 26 -40 -17 -1 61 130 60 -142 10 -108
8086 -108 25 -69 11 4 -11 42 140 102 -13 170 -9 -40 91 102 -143 -167 4 -35 -28 88 73 -181 156 140 -17
8111 -17 -18 157 93 -5 -7 -27 90 14 35 -68 34 190 -9 -47 41 51 43 57 104 12 -42 147 -82 -41 6 -218 -49
8138 -49 -105 77 -120 -173 48 40 -36 -15 132 16 86 0 17 -56 11 -19 -139 -112 46 -81 -118 29 -50 -36 48 23
8164 23 -84 -15 20 -103 24 160 3 -32 -39 -39 40 -72 -103 44 -75 117 106 -90 -77 51 -59 -57 138 -33 -104
8189 -104 19 -47 0 -11 -4 46 -96 63 -9 -41 117 114 45 76 134 -24 52 97 -31 -53 -38 -4 -166 6 141 -88
8215 -88 -92 18 2 -19 18 108 5 91 -10 24 -86 -17 60 -101 -55 23 38 -146 36 -102 -141 24 24 -52 45 50 49 46
8243 46 81 23 -194 -49 21 1 -23 48 -12 31 50 75 115 120 173 24 86 90 -116 -2 28 2 -54 141 -78 -51 -44 74
8271 74 30 -28 150 11 9 47 48 35 -8 90 -112 -75 24 -17 -13 -5 2 -18 15 124 150 -42 29 73 -84 25 17 56 -35 -10
8301 -10 -120 -44 -39 9 -52 63 57 27 -11 138 98 -15 117 175 18 30 132 62 -26 -34 64 27 -40 -124 -202 -11 -13 -5 -107
8330 -107 -42 14 -109 -152 41 -50 34 49 -107 -50 -223 -31 -69 -81 -26 -63 12 -11 -5 103 -75 -28 52 0 212 -94
8356 -94 -26 37 12 -23 76 48 14 41 39 22 65 107 87 59 136 56 30 -110 97 107 -134 -63 0 -87 110 -57 -17 -5
8384 -5 -3 110 34 -46 90 -3 65 23 5 -98 -62 -63 -99 49 95 -23 57 59 -49 -73 70 98 59 -71 53 -9 -88 -35
8412 -35 -76 -133 -141 77 4 -57 18 -60 70 109 155 24 37 62 81 -38 14 -28 -66 -60 108 -14 43 -104 -54 38 82 24
8440 24 -11 104 32 -62 81 16 50 -40 -89 31 -93 -68 90 56 -62 92 14 79 114 136 -59 116 22 -82 -61
8465 -61 116 -121 -156 -35 -191 -92 -152 56 -24 46 48 139 14 188 47 55 25 44 -45 -132 -17 -36 -203 64 99 -140
8491 -140 -98 -86 122 10 51 46 61 88 7 -53 -42 61 112 -37 -22 -49 -169 -66 62 -12 -9 48 119 6 72 50 46
8518 46 -73 22 -68 -92 -65 15 -66 5 37 -109 77 36 -26 -123 115 230 29 82 156 -13 32 -69 72 -98 101
8543 101 -61 -156 -65 102 66 -105 104 23 16 -7 88 50 -155 74 -88 -33 61 -4 -37 -37 -70 -131 32 152 -39 79
8569 79 80 -55 15 -25 -22 -79 -94 -64 8 -25 156 57 -24 3 -24 172 10 -10 79 82 66 80 -1 -55 158 -4 -41 23 29
8598 29 -91 -36 7 -99 -35 177 9 44 168 179 -16 60 24 -130 -84 67 -27 -85 46 70 -4 15 -74 -15 135
8623 135 104 -28 -78 23 56 40 6 25 -32 -57 -34 -103 -192 13 -5 -7 -60 153 58 -63 -90 46 19 4 -43 -67 -25
8650 -25 -24 -22 -14 -77 27 -37 -13 117 -40 -87 76 -59 15 56 76 54 -82 43 -74 -58 46 75 -118 31 34 30 -279
8677 -279 125 -45 -81 21 82 -99 41 19 -44 106 51 -34 -172 70 26 -15 84 151 51 29 13 49 -63 114
8701 114 27 -26 94 33 -113 -10 22 -15 -119 12 29 -62 108 179 5 -11 94 171 -32 28 -34 -52 -117 -52 44
8726 44 -63 -49 14 -74 3 15 -31 37 60 123 29 47 -107 -13 -174 89 9 -66 53 -65 11 2 -30 -33 12 89 72 -129
8754 -129 102 163 -88 18 160 -94 -54 65 99 -161 -4 40 -58 80 83 9 -5 121 60 -63 -14 -38 66 -98
8778 -98 62 -22 -45 34 -78 7 78 175 -98 -39 64 28 -19 203 58 -63 -6 58 -153 -39 52 -65 -30 43 150
8803 150 -57 -3 108 31 85 -12 10 -90 86 107 -67 -181 18 25 39 22 -98 -2 3 51 -139 78 169 -29 -15
8828 -15 71 -22 -15 -7 139 -1 -4 44 -47 -28 -15 -12 -98 174 17 -65 -6 46 18 19 -53 44 -95 -26 -82 7 59 75 -5 2 24
8859 24 98 39 13 48 8 -13 58 11 -104 -77 -5 -221 83 103 -10 77 -7 82 25 51 122 -19 155 64 13 -17 56
8886 56 -7 17 128 8 62 -28 141 24 33 123 35 45 108 70 -66 -49 115 48 -64 -98 67 -85 -53 56 4 -28
8912 -28 -21 11 -16 92 57 -24 -31 49 7 -133 68 -50 -74 -50 -7 -49 -88 71 -57 -102 52 -41 -39 87 25 -79 62
8939 62 37 39 -158 88 1 -86 -26 -52 -4 -48 2 16 48 41 197 63 -17 7 -99 -115 -66 51 -32 -91 31 -126 -97
8966 -97 -64 53 -31 50 81 -24 53 102 33 -84 5 -12 -247 44 115 -186 -53 -5 -50 30 94 34 -41 7 88 30 -35
8993 -35 -12 29 -26 21 -100 -146 -73 26 -209 20 10 -14 -2 77 151 36 76 91 -96 -30 34 5 -68 -32 -71 -154 40
9020 40 11 1 3 14 79 20 81 64 39 -63 126 -10 -61 156 67 8 -26 78 -3 -6 -2 25 -35 64 -9 -9 24 25 -29 -7
9050 -7 12 27 -158 76 31 -45 12 11 -118 -27 82 -101 -16 56 49 -202 -103 184 -63 -153 -40 43 -78 41 115 64
9076 64 -47 103 46 -101 57 62 57 -2 94 -46 -161 -27 81 -66 138 -6 44 51 6 -53 -29 103 7 -55 164
9101 164 -52 -147 10 -15 65 16 -20 -102 -94 -4 27 -63 -10 75 14 36 45 -129 2 -57 164 -43 -59 131 37 -149 25
9128 25 82 -91 -25 62 129 -41 138 10 -2 -34 128 -4 78 139 83 -78 87 57 -99 -23 129 -61 -84 100
9152 100 98 -82 100 83 -13 -37 41 2 39 46 32 -64 -2 -21 -84 -71 83 -48 -11 -16 -5 -36 -18 69 -30 -17 29 -126 -32
9181 -32 54 -69 -88 3 33 -93 -75 72 40 38 30 -60 1 87 95 101 73 56 -92 -113 -9 190 -190 -29 63 -60 -47 31
9209 31 21 -109 146 123 25 -17 -84 -36 -88 98 95 -50 61 32 -53 -19 52 7 -8 41 34 -61 -155 -13 9 -42 31 -103
9237 -103 -33 1 18 -74 -18 55 -48 -8 69 56 41 109 42 28 16 -5 -130 10 38 9 -109 -131 -32 -76 -34 63 -48
9264 -48 34 52 40 -16 8 9 -96 58 -14 17 -222 -23 9 -42 -35 84 -71 -73 12 57 65 -54 49 -10 11 97 -120 107
9292 107 35 36 -7 35 -67 -86 9 -152 -50 -24 -77 21 -67 74 115 -46 -69 109 -76 -74 156 57 -6 -18 105 54
9318 54 41 118 117 95 -20 95 50 -8 71 -92 11 42 43 -135 0 -40 -112 56 -127 -8 -111 57 -9 -90 53
9343 53 -110 48 48 124 186 -148 18 42 -41 -92 45 -32 50 -1 -8 13 154 4 -59 42 -88 22 52 52 -10 -98 34
9370 34 90 -70 78 80 -61 -32 119 -5 55 -30 129 -101 38 71 14 -31 58 -22 -71 70 -66 -25 -9 67 70 -69
9396 -69 56 42 -137 -39 79 -61 -30 62 55 -12 66 -96 -53 8 83 52 -50 -15 74 24 39 129 -31 40 -26 -41 33
9423 33 35 59 -87 123 6 71 39 56 59 -65 10 70 -118 85 70 -2 -80 32 -18 -35 -54 -58 -13 -52 -27 -86 99 -57
9451 -57 -63 8 -20 -83 6 1 -141 51 -5 48 40 20 -50 -97 -54 62 56 -35 9 -65 91 -3 -2 168 -58 -30 -27 -108 -92 9
9481 9 66 17 72 33 -51 56 -11 46 -65 129 88 -78 -44 -75 -27 2 37 -81 -54 -109 32 -28 31 -10 -51 -7 -104 31
9509 31 -84 85 11 -13 -166 82 110 -31 36 -23 -74 -24 155 26 71 84 13 -44 -9 23 -57 16 -10 -7 36 26 46
9536 46 -11 -5 134 -62 -40 3 141 -34 96 146 -25 -57 23 -49 -21 38 32 -81 63 -40 -163 -117 104 2 -115
9561 -115 153 123 -107 -109 -84 -107 -74 41 -31 -33 16 167 21 70 22 80 2 68 97 86 114 -17 0 -11 50 -97 112
9588 112 56 35 9 87 6 -50 -42 8 4 67 121 105 -172 50 90 -33 19 -130 -57 -54 83 -96 57 -62 201 32
9614 32 -45 78 112 18 127 65 72 60 66 -36 -36 61 12 -109 60 106 4 79 89 19 -39 46 110 139 25 -27 -103 -15
9642 -15 -24 -7 -12 -59 -83 33 -4 14 -112 -73 -20 99 -95 6 2 114 -10 -28 -32 -44 -31 68 7 108 92 -73 65
9669 65 -84 -44 19 26 82 -93 59 108 -2 -5 -5 -52 23 19 -67 33 -14 74 -68 5 29 -71 41 50 -49 45 -48 92
9697 92 -111 -101 65 50 -136 33 86 -25 54 85 -41 -59 42 -57 -106 -33 182 -98 -129 1 -29 -76 97 119 94
9722 94 119 -75 18 66 178 -13 -194 36 -44 -85 80 -28 -101 -62 -25 -46 -23 1 -109 -92 -32 -10 -12 -48 57 76
9748 76 12 -40 -3 35 15 130 -100 -181 112 49 24 -69 84 54 -47 -17 -19 -65 63 19 -75 2 89 31 -29 -6 11 -62
9776 -62 65 50 -96 -38 99 59 -129 34 56 57 -55 99 -98 -1 109 3 -51 40 22 50 -42 -89 -107 56 -41
9801 -41 -92 -29 119 75 0 21 23 -40 57 55 63 91 83 46 76 -32 -72 -26 -25 51 99 -82 55 -136 -41 55 -10 17 -67 -31
9831 -31 58 17 119 82 38 -58 21 36 -98 -23 3 -112 -161 53 -88 -3 46 -36 -17 50 14 -21 -62 -25 -32 -11 134 28
9859 28 -86 -21 134 28 -14 43 -55 38 34 77 -40 -45 16 10 -92 188 -57 -1 172 129 11 -33 58 -19 6 -22 51
9886 51 -33 6 -73 -30 2 40 34 -89 -35 7 -71 3 -13 -125 -69 -61 -33 119 61 43 20 40 141 -66 -14 25 40 -129
9914 -129 48 -40 6 -21 -28 -126 -25 -4 2 -11 40 -5 -25 137 147 -40 -17 26 -53 -39 12 -87 -148 -155 -28 25 -14 -21 -24 -69
9944 -69 72 25 -43 -6 -66 -66 -13 96 -62 -77 6 30 -26 64 -75 4 10 23 116 -31 -33 -60 -31 99 172 16 16 53 44
9973 44 -47 16 25 13 -46 -60 -30 -28 -34 -40 -17 -91 36 -80 14 47 51 -86 21 149 7 -89 10 83 93 56 -51 -8 -113
10002 -113 64 50 26 0 43 -20 16 -51 -71 -120 76 -52 -87 102 -2 -22 -93 120 4 -30 60 14 -28 279 -56
10027 -56 -22 -36 39 -2 -68 -41 -21 -86 27 -136 -100 -50 34 -6 84 -26 27 -85 -20 87 -178 -151 -159 71 -72 -15
10053 -15 107 -16 -103 49 -21 84 -20 80 -23 86 -95 -41 66 104 -112 -4 4 -60 30 116 -35 -89 13
10076 13 43 54 -48 -39 -90 -113 -47 -87 -155 4 -34 -10 51 87 74 -24 -75 48 -109 -31 -5 -84 69 -4 -59 -88 38
10103 38 94 -1 44 68 91 181 -28 -37 -95 53 -39 87 -1 34 127 -104 47 6 14 -151 45 3 74 -10 114 -20
10129 -20 13 -50 -101 -13 48 29 -57 -55 63 10 132 -19 61 -77 -1 64 15 -33 -22 -76 -64 75 -55 -12 -64 37 -24
10156 -24 60 87 -6 64 177 -14 -25 137 87 -88 15 60 95 -89 16 -135 -19 133 68 -69 -130 30 -60 -90
10180 -90 77 21 -101 -30 -21 12 -30 47 -47 -19 83 -20 55 -45 -47 -15 -31 -76 59 94 -82 95 40 -88 73 24
10206 24 -5 114 29 28 -14 -24 -56 33 41 -51 51 94 56 16 11 35 -110 34 27 24 73 7 35 -74 -31 -40 -89 -18 81 -61
10236 -61 -23 -2 183 -3 -57 -1 -46 78 108 102 52 88 -1 -15 -113 77 -112 1 18 15 146 110 95 9 17 145 17
10263 17 -4 78 -95 -97 8 103 58 -63 64 61 -21 17 90 68 -24 68 -186 -43 60 35 62 -3 144 -35 -110 -60
10289 -60 -78 36 36 48 -144 25 4 -78 -70 76 41 -112 -12 96 -12 14 -38 -125 -13 22 -84 31 81 -47 -9
10314 -9 1 67 -148 42 -15 22 -42 127 46 -55 39 -1 -47 -96 60 -36 -98 -83 12 -81 41 -2 -168 -120 87 -89
10340 -89 -12 -49 24 -48 -46 40 -5 11 -36 48 -82 -35 0 -43 26 52 -124 19 -30 16 -44 -101 -15 -14 40 113 -46 -17 15
10369 15 -2 -64 -128 62 -2 -141 -119 -94 -112 34 -39 -38 18 -22 -114 66 -117 -34 3 4 140 -71 -49 16 -82 27 115
10396 115 -91 -164 -51 59 -122 -21 21 -44 32 57 24 25 89 74 -5 -15 43 -78 8 -71 -29 64 -80 -14 44 -149
10422 -149 91 -67 -1 -102 -32 -54 83 46 -101 -54 -84 -132 -131 -18 123 21 -85 1 -144 -38 10 53 -149 96
10446 96 20 -73 61 105 61 77 40 21 11 -46 85 63 -54 106 55 -158 43 27 -68 128 92 57 -152 -21 27
10471 27 -11 109 97 42 107 -70 -31 -78 29 -20 10 -54 -16 -70 13 12 15 45 20 103 -45 12 -5 77 -49 -29 92 61
10499 61 43 -65 -17 -46 -79 -62 18 54 -18 -90 1 -2 -37 38 61 -43 -2 161 -90 -111 10 3 73 -61 30 -50 1 6
10527 6 37 -73 -104 2 -22 18 4 -50 -86 -127 37 30 -8 125 -20 -13 87 69 -78 56 122 -9 13 34 129 -89
10553 -89 107 73 7 24 -69 0 -11 72 44 -110 -23 -84 67 -112 21 -121 -152 88 96 20 115 -40 -73 82 46 82
10579 82 -76 -36 -71 -101 -3 146 18 14 1 48 -109 -21 70 -71 -158 90 -5 -111 45 19 -48 71 -68 54 -42
10604 -42 26 40 -46 89 30 120 18 10 -29 0 -5 13 87 -40 68 -92 -94 147 43 34 58 -76 -94 110 97 -122 -8
10631 -8 144 5 96 40 -61 -21 -89 32 33 103 132 0 89 157 8 -12 -13 87 29 -20 10 -110 -138 -44 95 96 37
10658 37 69 -112 -1 15 114 -49 -33 81 -54 -83 -15 -25 0 -21 -19 -64 110 148 13 25 -16 24 29 19 -26 31 93
10685 93 137 -42 -45 97 138 -55 -30 69 33 -8 117 1 10 107 19 -96 41 -51 -133 -19 -102 -86 -95 18 -29 -155
10711 -155 106 51 1 -109 11 30 -91 90 -144 -66 -59 -26 -59 55 7 -141 -43 0 31 -24 -106 83 -64 49
10735 49 67 38 -118 140 94 -112 147 107 89 -23 40 32 -113 -11 82 -70 92 67 -51 -50 34 -13 -91 12 60
10760 60 25 -8 -50 -13 -201 -6 30 -21 -93 54 -92 6 22 61 -98 180 -29 0 26 -10 62 5 3 67 -37 -10
10786 -10 6 -34 100 38 41 -51 82 11 99 41 -4 -41 174 25 -8 31 123 1 -61 -27 -27 58 46 237 57 -128 13
10813 13 19 -54 -29 74 103 -79 -147 43 -93 -3 -9 17 46 -9 -15 -89 117 3 -12 28 105 -34 45 -106 -48 90 -54
10840 -54 35 -39 134 20 -10 88 83 132 155 -18 46 -36 -20 182 12 -50 -38 -95 -35 18 19 -130 84 74 -53 -10 -15
10867 -15 71 -50 -44 -2 -60 -48 105 -98 -126 -96 146 -131 11 14 -117 18 -58 61 -53 14 32 17 23 26 -22 -24 61
10894 61 11 25 50 36 -21 105 9 -84 32 122 47 -66 -14 -43 -26 -5 8 97 -39 -33 43 -88 18 52 -120 54
10920 54 19 -38 33 -1 42 74 -150 -7 -231 -29 71 6 61 9 120 25 25 80 -27 49 -46 -28 22 -63 27 89 -132
10947 -132 -5 -9 -15 87 30 42 -70 23 -105 -26 70 -28 3 45 -23 -59 43 -65 22 -92 13 -3 -53 43 -63 -73
10973 -73 46 26 38 -21 10 -3 -53 30 76 -59 -40 81 -37 -91 -36 -31 -58 7 99 77 98 55 120 14 68 -17 -8 108
11001 108 -8 -24 -56 -47 -64 -129 50 11 -90 -61 -54 -96 -47 -47 -9 -126 1 -70 -81 -180 -67 -37 -109 170 6 -1 -28
11028 -28 74 -25 -2 29 -6 -114 47 90 -53 -14 148 -42 41 3 62 -24 -61 -8 -185 -21 130 -110 -61 39
11052 39 23 -104 -2 15 -78 -148 -44 1 -55 35 34 -148 -42 21 -49 49 0 -26 -60 45 10 -89 -23 31 -13 -97 75
11079 75 -73 -9 86 17 39 -95 73 -20 -86 16 32 67 106 7 52 60 -24 57 -51 -9 -23 22 -35 121 -49 19 -126
11106 -126 -16 -165 -308 79 -128 -146 -64 -42 38 -6 -36 -136 76 9 -65 -53 71 64 44 19 99 -16 41 70 -100
11131 -100 -19 -12 89 -97 -39 49 -148 166 50 21 9 -94 4 35 3 -11 -40 -63 -32 19 -27 -56 24 95 102 20 -134
11158 -134 -67 47 -62 -34 -20 75 -35 57 -28 3 74 -55 -4 -126 53 93 -39 53 42 -55 32 55 0 -60 110
11183 110 79 -92 56 -67 -3 -83 164 27 -112 63 -12 45 1 64 -10 -188 -51 48 -169 -51 80 -132 -51
11206 -51 -56 -15 -68 44 64 -37 -1 2 59 -6 -57 67 -112 -61 34 12 2 36 -4 33 6 101 -26 4 -2 13 80 90 2
11235 2 -40 50 -57 -73 -57 11 -120 -62 168 24 -159 -49 64 18 31 -9 -39 -119 -2 37 37 127 -15 -126 120
11260 120 79 -25 -52 -41 -5 -152 40 65 31 -31 -60 9 30 32 37 -127 31 66 -51 2 32 -36 -21 84 58 -24 1
11287 1 -25 -33 28 105 17 -26 -44 80 -35 -83 -83 -12 -12 32 103 10 52 11 -108 -9 -125 -33 85 105 9 -10 121 63 14
11316 14 -84 -47 -3 -88 20 37 14 25 197 -28 -44 57 -80 -21 82 25 99 3 35 73 38 -19 58 -76 3 167
11342 167 160 -25 82 -77 -34 0 -1 -134 93 54 -6 -88 39 -24 -87 -70 75 -57 -72 30 -163 -112 -45 127 -111
11367 -111 82 -34 75 83 36 -22 34 4 68 -46 50 96 -68 24 80 -6 -120 162 -102 -101 55 -17 -215 83 45
11392 45 -39 -51 -53 56 0 132 -41 -39 -54 -11 -40 15 -60 -97 -51 69 58 22 -18 10 25 -5 98 73 4 24 32 -22 58
11421 58 10 53 1 39 93 26 26 52 74 -57 88 116 -107 -11 -27 -131 -33 68 63 -38 51 31 -82 -7 97 -64
11447 -64 42 -21 -93 32 -60 -102 -23 -22 46 -32 -59 31 13 -20 44 -13 74 -46 151 101 11 89 28 61 -20 12 68 -44
11475 -44 22 -150 -15 -87 10 50 -22 63 28 -28 142 -80 60 68 26 -11 -62 76 -68 -30 -96 -96 -143 -102 1 -132
11501 -132 -29 68 -37 -18 52 136 13 99 84 5 -9 110 -23 -38 -24 63 -25 -29 -20 30 -77 -5 -8 -56 21 135 -28
11528 -28 -29 -1 -176 -43 47 -26 -17 78 134 72 55 -1 162 -1 -25 6 -31 79 166 114 -44 69 -26 -55 -37 28 -26
11555 -26 -155 -13 63 -31 -36 116 -44 43 93 -27 62 -1 29 18 10 -67 -71 -39 -103 37 77 109 -31 -57 148 -42 -100
11582 -100 18 80 33 -54 -14 -104 -119 23 -95 30 -55 -9 34 12 83 -4 -92 0 16 63 7 -34 -75 -47 -3 46 -45
11609 -45 1 41 -88 121 7 -103 -3 160 206 -26 13 -64 9 -85 131 57 35 -59 -39 19 72 59 17 59 -5 -6
11635 -6 -10 159 11 18 -6 2 -145 -12 36 80 6 -123 -115 76 128 76 -59 -67 49 -19 124 95 186 -1 94 44 -32 -28
11663 -28 65 94 -203 25 89 -116 -2 47 58 13 -17 161 43 8 17 -56 -68 0 20 -27 78 45 70 -49 14 -65
11689 -65 -144 -70 32 -103 -15 -4 -13 -24 85 -17 -110 36 8 -123 -13 45 -51 -28 98 -8 49 130 57 -48 62
11714 62 -17 -38 -35 77 -52 -99 54 -3 -45 -43 20 65 101 -59 77 10 -58 -68 -114 -122 -63 -134 -20 -38 8 78 83 -73
11742 -73 -58 -24 78 -5 -117 61 -69 -65 -13 31 -17 -87 11 47 -103 41 63 38 16 57 -23 -8 67 57 -47 -20 120
11769 120 -117 -44 -99 12 -58 -27 148 -98 -57 12 -31 -12 93 -62 -59 138 -53 -84 14 -21 -67 -4 27 -40 -79 -61
11795 -61 -62 39 -52 64 123 -101 135 69 47 -37 76 -78 173 61 50 -51 -21 8 -14 8 227 -102 17 26 -67
11820 -67 102 115 122 -101 68 36 -46 -16 4 -116 -46 52 -117 7 59 91 -90 157 41 -31 34 85 -31 -76 -85 -16
11846 -16 -55 -46 29 -84 -53 -26 85 -41 46 -10 -32 80 -72 -81 -47 -34 133 -41 -3 62 51 -50 20 40 65 10 -45
11873 -45 46 33 -88 -84 -48 14 -57 -13 -63 -128 -110 25 49 -51 -31 42 122 -93 2 177 46 -30 7 59 -61 89
11899 89 14 -6 -46 81 61 11 132 90 11 88 6 152 -2 76 -35 -36 -123 90 -36 8 -42 -33 -118 132 -19 29
11925 29 30 -10 55 -7 106 -37 -61 -4 37 -38 -83 -60 77 -130 136 -38 -157 48 -86 -93 17 -68 48 53 -47
11950 -47 -62 25 -62 44 -23 -97 32 -5 -82 -16 98 4 -78 114 7 -64 114 -71 -13 -25 -53 -27 61 121 -34 -134
11976 -134 94 20 -121 19 28 -27 6 122 33 -51 36 -1 -42 42 42 -44 -139 16 9 -10 212 -27 -143 22 115 -157
12002 -157 8 25 126 -52 124 96 -72 -12 -18 -70 -89 -81 58 27 50 30 -4 -48 39 -156 -81 -78 -25 -8 -47 47 26
12029 26 -40 -33 -15 -25 61 60 40 1 13 -88 -187 35 -52 -12 -36 71 -103 -78 108 -130 22 -12 9 -12 83 -50 -7
12056 -7 23 10 41 -15 4 14 36 6 -101 7 -16 88 -86 -44 24 226 70 -18 -13 -29 -97 -19 -1 -184 82 19 11
12083 11 -63 1 3 -59 -29 61 -61 -5 35 -134 -8 130 69 34 72 49 44 -8 -93 -5 -71 107 -56 94 39 87 60
12110 60 -29 -24 -114 32 68 -64 -14 -21 -10 9 -4 96 -68 45 -25 -78 -13 70 -5 -15 -86 25 -48 43 -8 15 43 12
12138 12 27 -57 -44 -17 32 -6 24 47 -55 -6 30 -149 -42 67 -19 -120 -17 -59 -33 54 54 92 -46 43 -70 99
12164 99 51 36 65 15 -33 106 -76 -10 -91 -13 85 -31 -20 17 13 -34 -110 -37 128 -21 -16 -38 101 -32 -60 -16 -175
12191 -175 -45 -4 30 91 5 99 -56 84 83 -41 0 -36 39 -17 62 54 -79 77 74 2 84 -53 -91 21 39 68 18
12218 18 74 106 -29 94 113 49 -37 40 16 -69 -87 105 -14 -50 28 -33 -17 107 66 -56 23 52 24 56 35 -92
12244 -92 -46 46 -60 -73 30 -61 -48 110 84 87 -7 70 65 -49 43 96 -15 -11 9 -10 -5 -72 -5 21 -127 72 -53 -31
12272 -31 -23 34 -73 -18 -12 -17 -47 37 -121 -44 -30 46 34 -39 71 -60 -67 -85 87 -68 6 22 -48 49 44 -33 -16 16 -60
12301 -60 -14 -19 162 56 -122 -66 15 25 15 135 30 74 85 48 -53 130 78 -69 22 -6 57 -3 -71 -36 35 75
12327 75 78 -9 -25 17 -32 17 -11 -12 -152 22 -138 -37 -70 -136 -31 68 59 -54 86 73 69 17 30 -23 -23 22 39 11 56
12356 56 -35 64 -53 -45 131 57 -23 105 -111 9 47 -5 -42 -123 -27 -48 18 -9 3 -106 -38 120 63 -88 6 -56
12382 -56 64 42 -100 -30 -107 15 -91 -9 39 -15 -42 -25 -52 107 30 -152 -90 -1 -73 20 -33 -10 -14 -12 22 37 41 -99
12410 -99 75 -84 -131 -30 26 19 110 -48 -64 -63 -5 5 -111 119 -41 37 -139 89 -52 -50 36 66 26 -14 -14 0 -22
12437 -22 -77 -8 24 97 -19 90 71 106 66 41 98 -16 -24 39 36 -93 -47 26 50 51 1 40 -15 122 153 -29 64 -107
12465 -107 14 10 -67 5 -35 102 -12 -30 -40 26 -14 -6 147 -12 -59 -25 -57 4 -10 -38 26 -145 -8 81 123 -4
12491 -4 -13 44 12 16 97 -98 110 123 -77 -26 97 -72 29 64 -93 -48 72 54 25 -6 119 51 -38 4 14 25 -86
12518 -86 -19 14 2 -48 27 -17 -88 105 38 -24 109 61 35 3 -71 -66 133 10 -26 -100 52 82 -115 133 -4 57
12544 57 -101 -13 37 -29 17 120 -84 -94 -50 -11 43 135 58 -68 160 -52 121 29 54 -26 -66 -22 7 62 70 60 -47
12571 -47 17 84 -16 -70 -21 -40 -59 37 106 51 56 -87 -71 48 10 -23 -121 -89 134 -33 30 21 15 45 -12 43 -9 91
12599 91 60 -99 45 138 41 -37 -7 34 -61 -6 44 -28 -100 74 -38 -125 31 14 34 -32 -46 -97 50 -33 18 30 6
12626 6 -123 -16 -104 -66 9 -53 -8 118 -148 -2 31 22 42 -3 -18 9 120 82 8 58 26 24 14 43 28 23 -46 6 -15
12655 -15 -92 45 2 75 71 -6 -42 -67 -167 -185 -89 90 -167 -32 -128 -11 -54 -49 -94 27 28 10 39 6 52 -80 71
12682 71 44 12 -73 103 20 20 -31 59 74 -73 -12 -51 -40 8 130 -26 -22 -99 43 -105 2 11 -44 -86 13 34 69 -118
12710 -118 15 -95 -87 71 -63 -2 48 69 -98 46 -16 -93 52 13 3 10 -85 -70 33 11 -40 81 -8 -42 -30 -41
12736 -41 5 -20 -77 22 -141 -22 10 -49 -17 -25 93 46 92 -31 -28 -91 -21 62 -34 -24 46 85 -32 7 -84 -97 17 -32
12764 -32 -99 -24 -34 9 -112 -67 56 -73 -107 -20 37 -27 38 49 -39 -39 70 -48 34 70 34 -55 -121 52 21 -87 151
12791 151 91 56 51 -43 10 34 0 -97 -54 70 -11 46 17 84 -67 -37 72 93 -64 -17 -49 31 111 -55 -140 -56 -18
12818 -18 -108 -71 -56 49 -23 -111 20 -5 27 211 25 -54 22 11 -99 9 31 21 -41 39 145 -7 115 76 45
12843 45 -34 193 2 -97 -84 -58 -138 -95 30 -60 11 -7 41 -42 89 88 10 -108 18 75 -44 -50 21 -85 -49 66
12869 66 -81 -5 27 26 -55 18 51 -87 28 65 32 -48 72 38 -81 4 82 -32 -45 -31 -78 75 -16 -97 -79 -51 108
12896 108 -29 40 114 -8 -1 -5 62 -148 -91 61 -9 -38 55 69 -61 115 -4 -7 10 -24 15 -4 -13 -30 -23 100 1 -20
12924 -20 -1 83 -70 -108 91 19 12 -14 41 -18 39 62 -36 23 74 -120 45 107 62 -87 15 77 -90 29 69 -18
12950 -18 31 66 92 25 19 98 29 -148 27 8 -82 -89 -37 -69 -69 -91 21 48 46 -17 21 24 26 64 15 112 74 20 4 -93 59
12981 59 44 99 -85 -79 20 10 12 25 92 67 -78 48 46 -15 -25 152 -65 29 72 2 110 67 15 -13 -50 4 46 -39
13009 -39 -41 -11 -67 -54 19 -4 27 36 -116 -75 -49 -19 -60 -20 -80 -7 86 -45 91 -3 -51 132 7 14 -49 35 -15 54 146
13038 146 7 -16 2 37 123 63 -74 25 90 58 -33 3 50 -100 72 -23 -33 -47 -79 -99 -77 -48 31 57 -14 63 16
13065 16 -71 72 -28 -54 43 111 -69 64 -47 -100 -11 45 -26 -16 202 108 -42 60 82 97 45 66 38 -115 44
13090 44 -130 18 -47 -44 -6 -165 118 53 11 56 75 44 90 83 56 -38 -54 -139 -31 -14 22 16 -14 -16 -36 80 -10 15 -7
13119 -7 -33 -67 -51 -52 80 102 -43 7 9 -121 21 -101 112 -65 -70 13 -16 13 122 -177 19 12 138 16 -17 -14 -28
13146 -28 2 -17 134 -57 109 37 126 -72 -110 26 -33 -74 47 39 57 -21 -48 25 72 124 17 61 -44 -53 40 -4 111
13173 111 -7 36 111 -80 7 48 90 58 -59 1 -45 111 -161 -21 141 26 -23 36 108 56 70 106 -69 18 -46
13198 -46 0 54 -87 81 -71 71 -133 -1 -127 78 2 -86 56 -14 -99 -46 28 31 -67 3 -51 -44 -95 4 65 -142
13224 -142 214 -38 -67 -82 72 -59 33 99 29 3 141 50 45 12 13 -29 94 -26 -102 68 -123 54 -218 -42
13248 -42 -41 -12 -66 1 52 37 40 -99 11 7 83 -65 -22 -58 24 -94 90 2 -75 0 90 14 100 -46 21 -145 5
13275 5 36 -32 -5 60 -70 -20 -23 -11 -149 78 -71 -59 106 39 -59 131 71 -8 -154 -49 108 -155 -67 109 23
13300 23 21 52 15 -87 142 21 86 13 134 -8 -79 -143 37 -8 46 125 11 -2 112 126 -89 77 -47 0 2
13325 2 -73 -56 -4 39 -34 81 5 -20 -16 -23 93 19 -40 34 22 -78 30 -94 -66 -158 -36 23 16 52 -113 -58 -43 -69
13353 -69 23 -36 56 43 -123 49 64 12 85 69 -2 -44 -28 29 34 84 40 86 -18 -44 -116 15 72 38 -17 138 80 -61
13381 -61 7 -149 51 -42 -42 85 -2 -23 94 -60 -78 54 -102 156 -31 7 1 -89 44 43 0 -45 43 8 18 -72
13407 -72 70 -118 66 -59 -13 -97 37 -48 -51 182 -16 -37 157 21 60 16 83 -85 38 82 12 -40 34 79 -61
13432 -61 83 32 -38 -124 120 -46 -121 -28 70 32 84 -11 -62 -79 57 73 44 46 19 15 186 15 60 -1 36 46 -61
13459 -61 91 119 -112 -22 11 -26 -89 124 -18 -17 96 -16 5 -51 132 70 -137 -23 41 -60 73 -4 -26 -11 89
13484 89 -38 47 54 98 17 -7 48 26 -78 -41 1 10 -63 42 -35 -157 -80 61 -69 -49 -71 22 -44 -30 19 68 17 -63
13512 -63 21 -1 46 -2 -83 103 131 22 41 82 79 -4 48 -24 62 14 2 150 26 -86 -97 -81 96 49 66 -34 37
13539 37 45 -27 11 17 -52 99 -102 -30 -132 23 26 -23 61 -29 -51 -38 50 -33 136 110 16 13 -133 69 35 35 42 -56 -3
13568 -3 52 -91 -41 6 -40 -58 -82 -1 -86 33 -48 -52 -98 43 44 -42 -65 -35 -28 48 -5 -4 -84 -124 49 -77 23 -52 30
13597 30 19 17 -153 -31 -8 -24 -90 -27 -73 -115 -10 13 -47 26 -72 -144 94 -37 81 63 -61 54 27 -33 21 -73
13623 -73 -75 30 28 -70 -1 128 -73 8 113 179 186 -12 96 -28 -2 -33 -3 -109 -45 -35 -167 -11 -126 43 -13
13648 -13 31 -10 -82 68 -99 -141 -85 4 -42 -71 -34 42 -54 25 111 -83 38 38 -5 44 48 -2 -71 -14 100 -41 -3 -90
13676 -90 -64 -64 -82 -29 -45 148 -63 -51 -42 80 18 112 54 33 1 107 -7 -108 -110 17 -121 -136 63 -59 -53 11 1
13703 1 28 57 31 9 -41 -13 22 50 -53 72 -93 10 -40 124 84 125 30 -78 -103 95 5 -34 -28 -56 -135 48 12
13730 12 -42 -130 70 71 7 -81 -49 -94 22 65 -115 -77 51 -19 -143 -6 16 -71 -39 -22 -120 -100 34 -118 75 87
13756 87 70 71 -53 154 -35 -83 -12 74 6 19 184 -18 63 -36 -73 -96 58 57 -57 -117 57 105 -35 50 57 -109
13782 -109 -30 -50 -33 148 4 -112 -195 -13 -123 -176 -149 -87 -31 -4 43 -67 12 -28 -56 -92 45 109 138 54 -147
13807 -147 41 -104 5 121 4 -76 134 -40 -1 90 -176 -19 -24 -112 -160 -46 -66 -5 -208 58 -12 -102 21
13830 21 -99 -33 86 68 58 -87 -2 159 -34 46 -10 -90 -31 17 -34 -106 73 -29 -100 -22 97 -70 24 132 157
13855 157 -63 -16 11 -15 56 63 -42 0 53 -56 -78 95 -38 -103 88 90 21 20 -27 54 8 -50 -3 66 -56 48 9
13882 9 -150 42 34 24 -83 35 -54 15 82 110 -24 -34 -13 -49 42 44 25 -158 -55 18 20 -8 87 18 -61 69 46 36
13910 36 24 136 52 -6 139 21 -52 30 -37 55 17 -53 -48 39 4 71 -42 144 -19 -123 77 -55 28 136 10
13935 10 78 -138 98 -33 -22 -52 16 37 -58 84 -30 45 88 56 -47 138 0 52 163 -77 62 -54 -28 -14
13959 -14 -13 -60 148 46 -37 63 68 74 -13 231 -14 -1 34 6 -100 18 -76 -57 39 -44 -82 113 46 0 -113 32
13985 32 -80 -141 -10 -26 -120 29 47 -107 -79 -38 -13 -140 53 36 -12 70 55 60 16 -89 2 58 -114 115 -46
14010 -46 -45 115 9 125 -3 119 -16 -6 163 -84 104 21 -14 1 -44 34 -8 22 -3 -46 -1 72 -9 21 32 99
14036 99 33 106 96 -31 -120 60 -10 -138 -23 4 -57 33 167 -32 -17 25 22 -98 -7 57 73 59 88 20 -61 34 77
14063 77 36 35 73 64 -86 54 21 25 -9 120 -59 -75 17 -33 -115 -102 98 56 -38 -61 -13 -45 34 -35 39 -5 15 -61 -26
14092 -26 49 -93 -35 -13 -1 116 63 126 -17 -23 97 18 -87 67 30 26 24 44 49 11 67 -21 -100 64 113 -18 70 11
14120 11 -115 -113 21 -39 34 -58 -9 -12 30 86 8 -46 46 35 -29 -124 20 -32 -62 19 19 -65 -37 112 -20 -81 114 2
14148 2 106 14 40 22 34 55 -104 38 70 -44 -36 -26 35 50 10 135 -129 -4 19 113 -43 -85 -19 -23 -54 -74 13
14175 13 -94 -86 33 -106 131 3 70 16 -26 -16 27 83 31 -16 59 -104 -25 50 -35 62 -29 0 -28 -93 70 46 -23
14202 -23 85 136 67 -106 -45 27 13 -21 88 -13 18 -85 -99 -111 37 -29 34 73 111 -163 -79 55 -59 -96 15
14227 15 -18 -1 -44 -28 -43 -24 -41 39 -28 55 -3 37 -18 16 -91 -62 54 30 -98 -76 -82 -100 -46 -29 -8 -9 9 64 26
14256 26 52 33 -92 -79 101 64 -35 -16 -67 92 -6 -71 29 -26 100 75 122 74 60 -9 24 75 -18 -44 -13 -90 112
14283 112 -29 4 -52 -108 -23 -15 -12 23 62 -33 135 63 -85 -65 101 37 -15 55 94 -146 55 32 45 -21 91 -32
14309 -32 -26 -89 7 -91 34 52 8 33 -53 -13 10 -15 -44 -39 18 -39 61 55 -9 -83 64 -38 54 -87 14 77 57 73
14337 73 6 -87 -47 72 29 35 60 12 90 60 -106 67 53 39 -44 78 -37 37 23 -90 -60 -17 107 -8 -50 -80
14363 -80 -40 81 0 -63 56 126 39 -55 -1 13 11 -19 92 63 43 -52 -23 -19 219 198 55 -39 101 -20 -3 -61 -76
14390 -76 -34 131 -126 23 87 -22 -48 -157 101 92 -90 63 -37 22 -48 115 -1 -45 51 -99 -35 -110 30 26
14414 26 79 -103 13 -20 -26 51 -21 44 59 -83 27 42 42 -91 137 -134 7 -88 -35 58 31 125 66 -28 -36 116 23
14441 23 0 -23 -25 27 78 -74 108 45 13 -122 -55 -37 -106 63 69 -103 -13 40 113 67 -18 12 31 -50 -81 37 19 -3
14469 -3 36 43 69 48 -51 -88 12 -32 23 61 81 -112 8 3 -98 74 92 -111 101 143 114 -10 73 -2 12 1 58
14496 58 -24 38 38 152 84 18 -2 103 -31 56 -25 3 -2 124 -2 47 116 -3 -20 89 37 -40 -65 44 19 -109
14522 -109 -8 -47 12 -115 89 -11 -23 45 -28 -21 61 68 -23 -55 44 -57 -39 -47 31 -159 -96 89 31 78 100 37 -84
14549 -84 112 -37 78 -39 60 118 37 21 -46 11 17 8 -163 9 -15 -9 -30 -58 106 -129 52 107 -32 36 58 -29
14575 -29 -167 -34 -41 37 80 -77 12 -11 22 -9 34 24 26 -26 28 97 -108 2 52 -36 54 134 26 36 40 -22 52 -80
14603 -80 -56 -87 -26 -10 16 -78 19 6 -47 -137 -7 -27 -40 17 -12 36 8 -15 47 -29 142 5 -31 -20 70 25 -9 20
14631 20 2 -7 2 -1 -2 20 80 -29 -32 65 -49 81 -14 62 -64 -60 40 -9 -20 -55 -71 52 62 18 -68 25 -23 55 58 77
14661 77 72 -18 -40 13 -83 -63 25 -2 19 -70 -143 -23 -26 43 82 24 100 1 41 -65 5 -63 -19 20 17 15 27 7 -2 33 16
14692 16 -30 15 -36 31 80 6 -73 13 18 -74 78 -9 37 4 -19 67 -2 -196 -104 100 -21 -64 -1 101 76 -72 -3
14719 -3 -86 -19 -122 -41 21 69 -103 -5 56 5 76 21 38 -3 44 22 27 -10 14 -61 -21 -64 -47 10 -91 51 22 8 -7
14748 -7 167 -45 -39 94 -1 -67 104 -42 121 -8 -34 -118 -137 125 97 -79 2 23 -82 71 -34 89 40 4
14772 4 73 81 23 107 -80 -61 68 -51 -73 20 -41 58 26 39 99 -2 89 -37 -96 -59 49 12 52 10 46 -60 128
14799 128 49 -95 -38 114 78 -27 60 -18 32 -35 143 -111 -46 -121 -132 -121 -24 -156 -68 -11 -58 -11 -68 177 60
14824 60 -19 23 14 -16 55 83 -116 -86 46 -53 52 -5 -114 32 -24 88 -78 -48 -3 24 69 51 -30 0 -47 -12 -25
14851 -25 -12 -43 -46 -23 -38 -55 -79 57 16 30 -73 50 -7 51 3 61 -118 -6 60 -87 -150 -80 7 -56 14 61 -20
14878 -20 -16 88 53 17 42 86 3 129 132 -94 16 -55 -47 39 110 71 -47 81 92 -24 21 137 -57 -134 20 34
14904 34 28 -157 -57 40 -43 38 72 -23 59 19 76 4 -15 14 36 31 19 -65 5 -28 -23 -7 27 2 16 153 62 42 -25 110
14934 110 4 38 9 7 -39 66 87 -83 -9 16 -23 -61 45 -86 -77 -6 1 29 -106 52 71 -39 -112 -4 -53 -85
14960 -85 51 -22 -35 -37 27 6 33 -4 46 81 -10 56 -4 41 143 77 52 79 14 105 131 -19 -12 -41 -2 -12 36 115 -1
14989 -1 147 33 87 0 -24 68 -93 -4 -14 -106 21 20 -28 43 15 16 -13 8 112 -154 -61 -16 -66 96 6 45 44 -16
15017 -16 -12 39 -105 57 -17 47 111 75 -106 -18 127 -38 -4 85 87 26 -57 162 88 -100 1 -8 -2 83 -16 -75 129
15044 129 52 -136 -10 11 72 58 51 5 -51 -3 -8 -36 -127 3 8 -56 -97 7 22 39 50 -112 -89 47 -1 -39 -14 -60
15072 -60 -23 -30 83 59 -52 125 45 44 2 39 -4 69 70 73 -36 64 146 108 6 95 84 39 23 66 -23 29 107 59 107
15101 107 101 -105 6 -21 -53 -72 -34 89 -109 -50 14 98 -22 -40 -30 -17 -5 65 -24 -154 47 6 37 17 14 -58 -9
15128 -9 -8 18 21 14 -91 36 96 122 8 -3 -83 -37 -23 -5 -14 -83 -82 47 -58 -11 -85 33 -39 -82 -35 -124 -22 -9 74
15157 74 -77 63 -34 -68 -75 -66 -52 -111 6 -105 -79 93 -2 -86 47 109 132 49 80 45 -130 -9 12 9 -25 124 56
15184 56 -61 83 25 5 81 -44 10 -51 16 -58 -8 -55 11 -128 30 9 -54 -77 112 106 14 -41 48 -34 24 -26 56
15211 56 -82 -14 -37 -20 64 -81 -11 -71 67 -128 -103 -90 89 -121 -44 -29 -26 -9 -20 -63 81 55 18 -70 -88 -24 -25
15238 -25 45 41 -72 -64 43 -51 21 -80 -7 -56 92 103 98 -76 -48 24 -11 -39 -42 20 99 127 54 23 18 35 -1 145 19
15267 19 -50 -5 -67 35 -49 53 -58 -149 -1 12 105 -66 52 1 0 -99 35 100 23 15 94 12 101 -49 -78 62
15293 62 134 -24 -5 -45 -118 42 116 -30 24 -3 -43 8 -27 -52 -20 104 -13 12 -14 -136 54 -31 -3 19 48 -131
15319 -131 98 70 42 114 111 -45 -83 -2 97 -21 -50 45 -69 40 -17 114 6 62 65 21 76 24 -69 -78 35 -30 -143
15346 -143 7 56 -41 -69 -25 7 -113 73 7 -77 167 -41 82 -38 19 -16 -82 36 -20 -83 85 -22 -1 32
15370 32 59 43 150 14 -22 54 -101 112 82 1 -1 -99 -31 62 52 64 -43 40 11 87 68 28 25 48 61 -63 20 20
15398 20 -12 -66 -29 -8 -20 33 -90 -108 35 -74 13 63 35 -67 -64 37 -3 -103 27 42 -13 56 26 37 -55 -10 83
15425 83 110 -91 -12 69 1 -59 -57 -11 -4 105 -20 82 -8 46 3 8 23 6 25 -9 -82 -68 7 -28 -18 -61 -50 43 -132
15454 -132 -16 34 6 -139 73 30 70 40 81 37 4 -10 46 -27 -20 -53 -53 -64 77 33 112 47 -76 39 19 -99 -10
15481 -10 -37 -92 -79 7 70 -71 41 62 -46 -120 51 53 5 -15 -116 -55 -115 -36 85 -94 8 47 168 96 60 -19
15507 -19 -7 -30 50 -132 32 92 -70 80 151 -47 -97 -12 21 -5 -6 65 6 119 11 67 61 39 30 -40 41 38 31 70 20
15536 20 0 -88 -21 33 -46 5 46 -37 -57 85 -13 -116 -22 86 3 88 146 9 -4 -66 34 9 78 72 30 1 76 23
15564 23 -74 -11 -37 105 -18 -70 -112 16 46 -36 78 75 38 -7 77 132 107 -25 -82 -19 -110 12 9 -33 -58 17 65 -82
15592 -82 54 -5 77 -40 -21 -51 -9 -29 3 -80 60 -149 -84 -17 24 -83 73 25 -59 98 -30 16 -46 68 133
15617 133 57 -13 64 -77 -33 -12 34 -9 95 133 -15 35 106 75 -12 88 62 -52 65 -91 -67 -150 -37 18 -100
15642 -100 -10 -21 31 -31 -26 33 -55 -86 -22 -84 -46 -36 45 -94 52 7 63 -35 62 -89 -48 223 35 -70 40 7
15668 7 -37 -28 119 9 -88 50 -21 -78 68 155 55 -70 46 -121 7 63 -18 -82 -34 103 -50 39 -5 -64 -8
15693 -8 -19 -74 -17 15 -18 22 -47 53 74 111 62 170 49 39 -69 117 -21 42 -103 -74 93 -13 -96 47 179
15718 179 -107 23 -94 -68 -61 58 -28 -56 -22 108 9 -20 34 -38 -77 53 17 -79 61 64 -62 -1 -66 -35 52 28
15744 28 -31 -14 68 38 3 -73 19 -24 -12 -31 -67 16 -95 17 85 -35 64 -32 -89 10 -44 -42 -35 21 -141 -80 -28 -21 -19 76
15774 76 68 -130 -59 49 -10 36 -56 37 -36 -59 -56 -2 -50 -6 84 18 -29 3 10 1 -13 -24 -46 -48 -25 -13 -22 -15 -91 -40 156 55
15806 55 5 64 55 -19 -13 7 34 14 160 -80 -26 144 17 101 61 -32 -133 -21 23 -54 -6 -30 -26 27 -104 -13 72 -80
15834 -80 5 21 -112 -9 -65 38 -58 69 -29 -50 -11 -103 -71 109 -124 -77 16 13 63 -210 50 1 -34 -80 -56 -96
15860 -96 -30 -4 25 87 24 50 82 24 102 54 -51 56 -20 86 -51 3 -114 -39 -4 124 -54 -38 -231 -88 39
15885 39 -49 -33 -29 45 -75 2 62 56 87 38 56 -100 -115 -121 -18 14 -16 41 -31 38 156 38 -73 55 36 -88 -12
15912 -12 122 -96 -136 -35 22 42 98 96 27 8 90 -138 -29 17 65 14 5 -145 -98 -35 13 -75 -19 118 -9 88 -171
15939 -171 36 -102 -53 80 -1 -31 12 -67 -121 -30 66 42 -17 20 -36 52 19 67 116 46 162 10 25 73 34 24 -129
15966 -129 52 28 -64 48 42 -49 -38 -67 -60 -67 86 -42 6 101 -53 7 33 -50 11 35 51 -106 -56 16 -44 -117 60
15993 60 -49 -40 -5 107 37 71 66 149 68 -34 -45 -66 -3 53 26 100 80 20 -87 -108 24 -35 159 87 39 -83 58
16020 58 7 -95 -90 53 -38 26 -5 -65 -145 -54 -147 -110 -16 123 18 36 196 -125 17 35 71 -7 90 125 -48 -95
16046 -95 24 -34 -39 69 32 82 38 -50 55 94 -23 -87 -20 -60 -26 -37 -220 -49 -49 36 -86 34 48 -7 22 -66 -17
16073 -17 39 -14 -51 -100 -37 -56 -13 70 -184 -118 30 36 -187 11 -46 -120 -15 41 -10 -22 98 -42 28 159 29 -73
16099 -73 -106 111 26 -154 20 62 2 -15 -31 -43 -50 14 136 -81 -11 70 -71 124 67 -15 -35 -83 5 -33 13 9 -37
16126 -37 -18 -56 46 1 -25 57 41 -88 -80 -29 -96 45 -99 -68 24 -51 -67 164 43 -107 84 1 -31 25 -11 -49
16152 -49 63 -55 25 -68 -38 -57 14 31 42 36 -95 -12 -44 -11 44 -83 -100 -6 87 -43 -5 24 -62 -51 -119 92 -57
16179 -57 44 25 86 14 -33 24 -33 -21 14 92 -74 7 -71 -62 1 52 84 44 -11 -128 13 17 19 1 -85 -47 35 -41 -119
16208 -119 44 103 -84 -49 -11 -64 -59 -6 21 -115 -62 -117 -32 -38 -55 -30 -122 -78 -54 -68 -184 -105 -50 -34 -16 -50 45 -41
16236 -41 -113 -34 39 -35 -105 38 6 -102 4 164 -4 -27 116 14 6 8 120 -40 24 7 9 -12 -49 -42 -9 -1 82 -172
16264 -172 -83 -19 -73 -76 29 -48 -122 -23 -13 -31 -81 44 47 -94 49 23 -41 99 33 -161 52 -7 -50 -41 81 -37
16290 -37 -96 57 53 183 110 72 -30 2 -107 -32 -2 13 173 118 -68 25 45 33 -76 -25 -9 -60 46 -50 116 -18
16316 -18 -137 -121 27 0 69 3 89 -91 -136 36 190 -77 36 8 -75 -129 2 22 61 -8 60 31 22 88 21 -81
16342 -81 113 -25 63 -38 26 -63 66 -16 -118 -1 43 39 -52 -144 -89 -43 -180 -7 -30 21 32 29 -104 -17 -71 -101
16368 -101 -8 10 -149 -33 28 -47 -49 -61 34 -74 3 44 68 -73 24
16383B4
$$ Imaginary data points
##PAGE= N=2
##DATA TABLE= (X++(I..I)), XYDATA
0 0 0 0 0 0 0 0 0 0 0 0 0 0 0 0 0 32 -32 32 -32 32 -64 64 -64 96 -96 128 -128 160 -180 193 -225 257 -289 352
34 352 -385 435 -481 545 -609 673 -760 833 -929 1027 -1144 1260 -1390 1532 -1690 1864
50 1864 -2048 2260 -2492 2750 -3040 3367 -3735 4164 -4659 5241 -5946 6813 -7903 9335
64 9335 -11286 14148 -18746 27345 -49055 226994 267953 -279515 -335828 -97877 201746 212848
76 212848 51214 -129254 -107262 -52470 -48907 -19621 124283 152274 -1383 -175306 -167066
87 -167066 11041 227925 216788 -40748 -234775 -125861 76136 136075 63554 -31088 -92609
98 -92609 -72005 -20732 3388 44628 103830 42117 -103220 -114751 30942 127305 84717 -20308
110 -20308 -84043 -42992 39001 19855 -53847 -16210 73641 28186 -94622 -106446 3685 114183
122 114183 118539 -11606 -133714 -68916 91951 111342 -1257 -60544 -23834 19403 8123
133 8123 -54005 -67457 43047 126453 10660 -154132 -114070 71919 164965 83631 -70882
144 -70882 -135080 -28405 106226 82939 -27846 -49637 -11045 -16230 -34163 -13473 23547 48996
156 48996 24507 -59850 -89205 15005 113337 70034 -29937 -63610 -30453 27978 56453 10065
168 10065 -43787 -21363 8148 -24892 -36609 18413 46336 6515 -35529 -35488 10793 67177 46183
181 46183 -40989 -53202 29441 58352 -6165 -53474 -35370 10555 41962 13058 -56112 -53798
193 -53798 27697 56299 5532 -20459 1817 17685 15003 -3184 -21655 8509 55309 13445
205 13445 -78259 -72952 21399 70746 32836 -39822 -78990 -29226 61848 69268 -189 -26048
217 -26048 -2320 -2224 -8607 14723 29191 15738 -10384 -49056 -59377 6202 69856 33770 -41718
230 -41718 -55193 -16717 29856 57929 30383 -24762 -26163 8567 5488 -7098 16333 23151 -14586
243 -14586 -42993 -35314 -4725 38137 42048 -20249 -57761 -7322 45405 32768 4482 -5137 -8838
256 -8838 1579 12666 -6401 -17004 10808 14509 -26103 -36678 -3287 16414 15382 7574 -15553
269 -15553 -19643 19823 36998 526 -16579 7912 14290 -2902 -11500 -16536 -10005 16232 12054
282 12054 -30405 -32008 13712 25720 2217 -2837 2462 1814 12118 13604 -6500 -3564 18684
295 18684 2302 -29930 -18510 7834 7237 378 -8551 -25237 -11382 28239 26398 -7951 -9263
308 -9263 9548 8174 6036 9288 -2529 -7266 4009 -8067 -26950 -3556 22580 509 -24278
321 -24278 -12609 4239 14813 23057 6342 -18507 -3054 22362 9097 -7007 1335 -2148 -15456
334 -15456 -7157 -440 -9089 -576 9854 -10300 -19847 8649 24581 10123 1608 -1822 -7646 7651
348 7651 22824 -216 -21923 -5044 4643 -11184 -10385 2863 -2181 -4763 2826 -3767 -4053 18490
362 18490 19973 -6805 -8714 9859 7325 -562 2954 -7062 -17614 -1966 6758 -10382 -11591
375 -11591 5054 2474 -4093 6215 7270 585 10873 13269 -6641 -6958 12676 6044 -12898 -8669
389 -8669 -2500 -7761 -2394 1530 -10423 -7021 11941 6955 -6521 5345 14393 2240 856 7822
403 7822 -2225 -6536 5232 76 -14701 -6872 2307 -7126 -6379 4570 -727 -2825 10974 8131
417 8131 -5708 4486 16975 3042 -7221 249 -1769 -6403 1675 -1281 -14718 -7650 4053
430 4053 -4150 -4693 10333 7506 -4536 3216 9906 2144 4873 10589 -3296 -12187 -1163 284
444 284 -7202 -817 481 -12934 -9759 6523 5111 521 9571 6570 -6425 556 12719 6460
458 6460 439 861 -9214 -12742 2331 4295 -10137 -7345 2766 -4141 -6308 7106 8788 2547
472 2547 7651 5983 -6129 -544 12303 4080 -6601 -4311 -8336 -11943 2250 7555 -8412 -10773
486 -10773 3266 4312 760 7875 6511 -920 5942 9144 -4582 -5973 5990 1590 -8184 -4089
500 -4089 -4989 -12360 -1754 10088 -220 -7596 1709 5075 4295 10927 6974 -6449 -785 10464
514 10464 65 -10496 -3446 -1421 -5876 -254 -842 -12415 -6163 11681 9217 -1253 132 1056
528 1056 1842 12905 11553 -8947 -11706 5633 5909 -7239 -8480 -6799 -6306 4643 7144 -8944
542 -8944 -10148 9333 14222 4170 1910 -464 -4000 6988 13560 -5058 -16813 -2958 5005 -2517
556 -2517 -5439 -7142 -8974 4703 15660 260 -12034 1942 13288 8570 6311 320 -12036
569 -12036 -5877 10907 4954 -11146 -9873 -4862 -4499 3136 4884 -6990 -3753 13207 9585 -6043
583 -6043 -2594 7760 8083 8356 1333 -17143 -16471 8123 14979 -3187 -14525 -14044 -6935 11606 20035
598 20035 -273 -14693 1123 13810 5986 504 428 -2324 1937 4092 -11708 -18090 2885 14653
612 14653 -436 -12583 -10830 -4499 11412 23042 5487 -16172 -6468 12011 11248 4391 -2351
625 -2351 -12144 -8006 6473 1145 -13073 -5853 6186 1308 -2406 898 -2378 995 15213 12313
639 12313 -6083 -8226 1528 3195 4554 3756 -10532 -16683 121 8425 -3459 -7048 567 2234
653 2234 4743 8389 -1336 -7286 8558 17352 1579 -11007 -8846 -4425 4260 11379 -3701 -21400
667 -21400 -10317 9307 8196 959 107 -2067 1122 10119 4701 -5960 2892 12484 -358 -12923
681 -12923 -8453 -2812 2123 8580 -572 -17579 -10976 9005 12267 5816 2685 -4163 -5213 7638
695 7638 11162 -1118 -3998 1777 -4144 -9240 -1979 -309 -4366 1298 3338 -6387 -5917 6241 8166
710 8166 5385 7340 547 -9132 -947 10270 3136 -5367 -4355 -6837 -7468 1315 2607 -4931 -830
725 -830 6465 -295 -4409 4130 7440 5363 7310 1284 -11559 -7146 7888 6485 -4130 -7341 -9399
740 -9399 -7928 4006 8783 -820 -2374 4079 611 -2651 6977 10478 2027 -1229 -2821 -9047 -4474
755 -4474 7451 3754 -7693 -7877 -5334 -4450 5596 12097 1636 -5544 943 3198 2157 8109 6972
770 6972 -5194 -7927 -1548 -2400 -1952 3620 -1631 -10288 -4106 3969 1171 2631 8048 2103 -3883
785 -3883 2650 5694 1526 2753 1702 -7568 -7619 1616 209 -5264 -1117 -396 -5284 223 7462 2179
801 2179 -769 5465 3995 -1371 2630 3843 -2921 -2522 1071 -4815 -6920 856 142 -6160 -1357 3960
817 3960 -240 529 6209 2549 -397 5407 4325 -3289 -640 2669 -4151 -5264 931 -2318 -7060
832 -7060 -385 2391 -2975 66 5439 1030 255 6406 3572 -1943 2468 3132 -4677 -3172 2429 -3598
848 -3598 -7442 -784 73 -4216 639 4025 -1639 -316 6643 3340 116 5184 3134 -4613 -1364
863 -1364 3463 -2719 -5018 -272 -3321 -6933 454 3607 -1843 255 4588 -125 -79 7508 4923 -2472
879 -2472 448 2003 -4511 -2890 2678 -2381 -6860 -1673 -997 -3802 2383 5422 -1562 -1172 6122 3268
895 3268 -360 5005 3785 -4553 -2590 2044 -3119 -4513 550 -2880 -6795 188 3091 -1742 1083
910 1083 5636 27 -1050 6606 4780 -2413 309 2057 -4107 -3133 1538 -3197 -6220 82 15 -4401
926 -4401 1020 5503 -345 -524 5759 3063 -686 3798 3098 -4251 -2189 1694 -3615 -4635 577 -2122
942 -2122 -5994 406 3221 -1818 1108 6376 1362 -1329 4776 4134 -1487 681 1259 -4841 -3527 1346
958 1346 -3311 -5887 977 1263 -4443 -292 4941 1073 1454 5878 1551 -2391 3141 3847 -2715 -1743
974 -1743 834 -4848 -5659 739 -755 -4227 1421 2717 -3331 -519 6732 4033 962 3562 536
989 536 -3415 1687 3242 -3816 -4117 783 -3551 -6581 312 2903 -688 1180 2186 -2450 856 8609
1005 8609 4825 -2034 243 478 -3295 -135 2359 -4111 -5366 407 -1798 -5591 709 5457 1285
1020 1285 781 2035 -1259 1005 8372 4465 -4407 -2732 11 -3428 -2095 2196 -2305 -5647 -828
1035 -828 -395 -2623 3330 6720 569 -1068 3300 1097 -777 4567 3512 -4070 -4065 -1872 -5125 -2640
1051 -2640 4612 1009 -6507 -3608 1324 2229 6103 6532 -2304 -3741 4706 4388 -2526 -770 1680 -2661
1067 -2661 -3843 -3031 -5775 -2065 7307 3934 -7185 -5210 3781 6180 6738 4890 -4127 -6004 3971
1082 3971 6084 -2755 -4071 -611 -2892 -3539 -915 -3045 -2038 5944 5059 -4807 -3723 4953 5739 4240
1098 4240 4007 -2501 -7315 -252 4287 -975 -2925 -1558 -5879 -5276 3421 4038 -1694 809 3958 -11
1114 -11 383 4406 1445 -243 4635 1103 -8506 -6325 2079 2229 324 -1487 -8171 -6901 6895 11030
1130 11030 -208 -4578 977 3219 3968 3803 -2699 -4612 3623 3854 -8127 -9617 927 4604 1735
1145 1735 -1440 -6709 -5676 7562 12920 1246 -6062 -554 2878 2736 3545 -1701 -6999 -1139 2971
1160 2971 -4678 -6861 1449 3246 -496 373 -502 -2701 4049 9365 2348 -3299 -115 -581 -2242 3015
1176 3015 3068 -6104 -7382 -866 -96 -191 2908 -186 -4122 2510 7152 285 -1950 3865 3642 76
1192 76 -421 -4191 -6563 2435 7028 -4140 -10909 -3234 3853 4533 3832 -1551 -5472 3328 10398 1674
1208 1674 -5559 483 4103 157 -2212 -4582 -6203 1200 6281 -2999 -9532 -1100 5836 3891 2570
1223 2570 820 -2877 1323 7486 1642 -4769 19 1833 -3676 -3603 -677 -2484 -1320 2240 -1461
1238 -1461 -4003 2579 5392 78 862 4791 656 -2262 1748 1242 -1768 155 -1297 -7111 -3324
1253 -3324 4343 942 -4580 -979 1981 1471 4047 3084 -2495 463 6986 1779 -5928 -2287 2080
1268 2080 -187 -1394 -3078 -6537 -1543 6429 1794 -5766 -588 5670 3436 1460 1240 -1208 783
1283 783 5020 -363 -7246 -2051 3206 -1427 -4092 -1946 -2057 -119 4647 1314 -3680 1823 6936
1298 6936 1463 -1894 1633 1375 -540 369 -2361 -5649 -418 3189 -3471 -5435 1401 2968 -39
1313 -39 1335 1763 -19 3288 4952 -1523 -3195 3216 2315 -4069 -3325 -1027 -2248 -331 1064 -3474
1329 -3474 -3357 4265 4396 -1642 -108 3962 2199 1467 1688 -2273 -2582 3030 854 -6681 -4217 2143
1345 2143 175 -2417 -528 -681 383 5161 3384 -2898 241 5945 1845 -2754 -721 -368 -1613
1360 -1613 396 -1277 -6224 -2259 4249 412 -3939 532 3108 1800 2981 2068 -1769 856 5295
1375 5295 -329 -5489 -970 1798 -2325 -2751 -1444 -2997 -230 3943 -337 -3325 2991 5683 394
1390 394 -455 2289 328 -122 1778 -2168 -5179 161 2051 -3845 -4197 1050 938 -214 2051 633
1406 633 -904 4104 5352 -1624 -2438 3363 1691 -2802 -1845 -1692 -3062 419 1124 -4254 -3285 3996
1422 3996 2983 -1609 920 3156 1160 2311 2685 -2217 -2374 3038 650 -5382 -2952 443 -1602
1437 -1602 -1254 773 -1847 -1046 4928 3103 -2184 679 4988 1285 -875 650 -1227 -2046 1303 -836
1453 -836 -5905 -1960 2760 -1110 -2809 1351 1801 525 3338 2583 -1680 1371 4783 -432 -3672 272
1469 272 305 -3039 -1213 -760 -3747 -964 3063 -730 -2692 2999 4181 -56 840 2560 -167 343
1485 343 2637 -1864 -4588 419 909 -4111 -3004 939 -610 -873 2189 364 -788 3824 4248 -1147
1501 -1147 -772 2978 556 -1800 18 -1607 -3802 -96 1107 -3556 -2672 2546 1476 -982 1923
1516 1923 1999 165 2768 3339 -1610 -1605 2423 7 -3703 -1205 -299 -3028 -1175 827 -1986 -1317 3315
1533 3315 1922 -1069 2111 3563 -72 381 2423 -1076 -2334 908 -918 -4335 -1094 1078 -2265
1548 -2265 -1793 1759 486 -165 3202 2156 -1144 1781 3711 -496 -1780 1032 -627 -2983 -564
1563 -564 -642 -3592 -982 1923 -1184 -1432 2536 1793 -49 2630 2855 -853 -35 2591 -689 -2712 146
1580 146 -910 -3587 -868 555 -2337 -1156 2317 521 -491 2940 2369 -598 1653 3194 -875
1595 -875 -2010 776 -953 -2721 -191 -743 -3901 -1023 2174 -527 -1150 2470 1681 40 2790 2714
1611 2714 -1161 -136 2494 -710 -2760 -413 -1382 -3031 96 742 -3078 -1719 2782 1555 -180
1626 -180 2184 1662 -390 2215 2958 -1440 -2315 812 -367 -2740 -925 -1326 -3427 170 2647 -1221
1642 -1221 -2045 2478 2939 1089 2008 1201 -1604 895 3286 -1301 -4036 -675 -346 -2208 -553 -238
1658 -238 -2974 -245 3837 978 -1411 1698 2811 946 1935 1346 -2633 -1659 2302 -410 -3848 -1740
1674 -1740 -603 -1967 505 1855 -1548 -1260 3447 2713 11 1332 1478 -775 1006 2204 -2503 -4049
1690 -4049 449 725 -2215 -1551 -896 -2129 1006 4040 331 -2068 2046 3404 1045 1036 377 -2543 -725
1707 -725 2519 -1198 -5059 -1624 1091 -605 -308 -35 -1858 706 5092 2267 -2192 444 2999 691
1723 691 352 388 -3016 -2718 1613 53 -4049 -1872 999 -130 492 2227 -437 -658 3762 3182 -1239
1740 -1239 -530 1432 -733 -728 790 -2118 -4038 -76 1108 -1692 -906 966 -499 637 3854 1527
1756 1527 -1606 1362 3010 -102 -829 -4 -2387 -1802 1426 -775 -4503 -1526 1900 383 -4 1336
1772 1336 -311 254 4265 2732 -2071 -845 2140 8 -1317 -757 -2589 -2532 1427 643 -3490 -1547
1788 -1547 2584 1546 349 1684 599 -166 2729 2355 -2007 -1663 1170 -866 -2282 -496 -1297 -2650
1804 -2650 443 1647 -1387 -451 2823 1398 56 2291 1853 -855 424 1419 -1577 -1907 264 -1685
1820 -1685 -3068 60 865 -2138 -714 2076 918 446 2323 952 -589 2393 2271 -1898 -1930 855
1836 855 -795 -2121 -794 -1346 -2275 996 1956 -1608 -1015 2850 2272 293 1474 748 -693 1449 1571
1853 1571 -2661 -2932 677 -105 -2684 -1186 -164 -1041 985 2197 -614 -154 3305 2353 -841 468
1869 468 1092 -755 -595 420 -2480 -2713 601 -195 -2691 -455 1716 -36 322 2273 713 219 2712
1886 2712 1499 -1705 42 1595 -1351 -2498 -379 -1009 -1953 188 -107 -2002 753 3053 215 -700
1902 -700 2327 2160 -30 947 420 -1756 -424 966 -2073 -3328 86 380 -1597 -372 754 -484
1918 -484 1219 3050 147 -994 2373 2362 -959 -933 87 -1376 -1094 178 -2048 -2880 650 1298 -1606
1935 -1606 -328 2193 1111 837 2220 492 -830 1586 1369 -2165 -1726 592 -1169 -2144 -240 -670
1951 -670 -1533 997 1603 -1065 344 3134 1453 -551 1235 1140 -796 238 301 -2608 -1797 795 -1032
1968 -1032 -2925 -100 1192 -531 546 1771 96 623 2933 1118 -1579 666 1565 -1262 -1468 -209
1984 -209 -1789 -1852 625 -592 -2392 639 2501 -84 -149 2194 1171 390 1859 541 -1888 176
2000 176 1190 -2123 -2601 136 -468 -1801 53 243 -947 1106 2848 12 -570 2505 1692 -745
2016 -745 75 286 -1689 -637 545 -2284 -2691 683 602 -1591 5 1622 405 1090 2464 295 -693
2033 -693 2174 1383 -1836 -935 484 -1529 -1782 -177 -1124 -1799 976 1209 -1257 493 2772 787 -113
2050 -113 1804 945 -784 784 402 -2349 -1266 997 -1326 -2567 -138 410 -716 724 1265 -475
2066 -475 1030 3301 579 -1401 1149 1545 -1095 -798 -218 -2089 -1271 801 -1247 -2514 468 1822
2082 1822 -154 319 1797 476 750 2525 389 -1795 464 1144 -1761 -1752 -230 -1221 -1489 584 -223
2099 -223 -1474 1206 2436 -231 103 2356 1309 -457 956 261 -1534 -291 350 -2297 -2101 682
2115 682 -359 -1946 192 1108 -139 1133 2073 -200 -94 2468 1042 -1572 -401 509 -1315 -1170
2131 -1170 -252 -2016 -1649 1262 517 -1514 344 2262 640 607 1719 98 -341 1527 512 -2233
2147 -2233 -921 387 -1523 -1743 141 -596 -1253 1045 1046 -581 914 2389 398 -263 1722 690 -1156
2164 -1156 58 113 -1967 -1068 422 -1643 -2040 1014 934 -996 217 1591 366 1201 2199 -184 -1164
2181 -1164 1420 1103 -1880 -1320 -134 -1337 -1061 460 -1059 -1607 1507 1975 -307 249 1832 705
2197 705 542 1727 -275 -2018 317 905 -1760 -1659 -262 -1130 -1073 1143 304 -1245 1045 2367 341
2214 341 234 1742 166 -722 1218 287 -2381 -952 381 -1231 -1328 123 -834 -1147 1693 1752 -590
2231 -590 339 1995 660 196 1439 -209 -1722 525 759 -2071 -1805 17 -803 -771 969 152 -1273
2248 -1273 1615 2804 124 -113 1443 404 -314 1103 -427 -2586 -861 816 -1372 -1783 160 -331
2264 -331 -487 1787 1356 -945 505 2745 819 -432 599 -324 -1225 806 166 -2804 -1810 935 -113
2281 -113 -1135 429 111 -422 1864 2296 -576 -322 2167 982 -703 0 -709 -2033 -88 546 -2253
2298 -2253 -2070 799 519 -561 892 934 -436 1359 2528 -195 -958 1176 390 -1478 -203 -377 -2153
2315 -2153 -1097 829 -1035 -1546 1010 1067 -373 1219 1784 -299 46 1951 487 -1087 130 -492
2331 -492 -2019 -315 464 -1915 -1882 985 731 -553 814 1083 70 1449 2415 -457 -1142 1392 826
2348 826 -1441 -910 -750 -1876 -308 1053 -1314 -2032 1267 1749 -86 541 1323 34 948 1784 -632
2365 -632 -1788 608 694 -1870 -1465 -283 -1291 -552 1085 -296 -1029 1438 2096 -204 574 1834 80
2382 80 -332 1005 -225 -1755 -134 99 -1916 -1082 898 -644 -1031 1082 1230 -81 1070 1541 -362
2399 -362 420 1956 -299 -1886 23 353 -1585 -1051 -254 -1507 -534 1575 -59 -1365 1177 2238
2415 2238 314 193 1129 -184 68 1377 -721 -2450 -282 746 -1344 -1578 108 -522 -86 1643
2431 1643 614 -965 1411 2419 -115 -458 1058 28 -928 281 -752 -2086 -364 642 -1424
2446 -1424 -1321 1096 502 -463 1100 1422 -26 990 1656 -630 -844 1181 -62 -2068 -745 -63 -1336
2463 -1336 -706 425 -955 -488 2048 1330 -893 775 2073 484 9 655 -807 -969 871 -357
2479 -357 -2657 -1059 934 -556 -894 555 221 65 2027 1274 -940 547 2171 155 -1092 216
2495 216 -315 -1302 30 -324 -2129 -591 1202 -191 -1077 1275 1311 145 1029 1312 -435 267 1324
2512 1324 -771 -1896 276 170 -1816 -882 126 -774 -238 1340 -141 -609 1879 1998 -433 -31 1324
2529 1324 32 -459 423 -1206 -1864 309 397 -2108 -1276 991 374 -295 1094 564 -120 1752 1834 -984
2547 -984 -718 1294 -119 -1407 -319 -527 -1566 -251 454 -1424 -720 1829 775 -635 1042 1520
2563 1520 2 718 1171 -918 -858 976 -388 -2225 -516 356 -1195 -660 499 -322 -50 1976 887
2580 887 -903 1155 1967 -118 -661 551 -542 -1166 102 -661 -2314 -281 1020 -1014 -883 972
2596 972 862 196 1374 907 -611 754 1700 -686 -1569 382 -154 -1604 -503 -182 -1436 -70 1267
2613 1267 -371 -687 1883 1443 -315 604 1223 -195 -173 554 -1021 -1649 315 45 -2023 -800 854
2630 854 -268 -258 1222 339 -90 1857 1591 -796 -25 1360 -203 -1004 26 -745 -1578 190 161 -1771
2648 -1771 -598 1492 324 -443 1193 1104 39 1047 1144 -898 -409 1034 -635 -1758 -289 -177 -1352
2665 -1352 -326 382 -740 -40 1727 614 -419 1408 1540 -429 -21 933 -497 -835 444 -923
2681 -923 -1902 -22 617 -1207 -706 1102 415 98 1380 613 -388 1085 1547 -823 -1015 519 -458
2698 -458 -1243 -230 -659 -1682 18 1014 -690 -602 1417 940 247 1168 869 -467 388 1179 -957 -1349
2716 -1349 134 -363 -1513 -249 67 -1195 -43 1197 250 -131 1505 939 -276 768 1155 -629
2732 -629 -724 338 -708 -1284 60 -503 -1538 -31 1089 -519 -369 1228 932 150 1241 642 -984
2749 -984 292 1242 -698 -1601 -39 -447 -1073 19 62 -1343 11 1715 233 -530 1259 1240 68
2766 68 682 792 -1112 -666 871 -656 -1855 -311 -216 -1135 179 767 -624 -58 1707 862 -234 992
2784 992 913 -544 169 648 -1187 -1542 156 -326 -1259 -210 37 -1057 284 1689 238 -409 1252
2801 1252 1111 -35 634 515 -1167 -351 633 -788 -1856 -168 30 -1005 10 539 -633 202 2085
2818 2085 855 -538 705 1029 -211 210 545 -1375 -1288 464 -266 -1451 -388 385 -636 363 1259
2835 1259 -31 -101 1617 1197 -612 188 542 -755 -487 480 -1160 -1841 170 247 -999 -178 672 -211
2853 -211 394 1732 536 -560 976 1243 -494 -173 227 -1021 -905 597 -578 -1727 -67 935
2869 935 -353 152 1042 31 59 1722 929 -803 297 691 -786 -683 133 -1085 -1521 253 22 -1145
2887 -1145 -67 1032 -10 215 1483 311 -414 1036 1098 -733 -402 289 -989 -1011 421 -629 -1603
2904 -1603 57 741 -276 139 1108 309 166 1698 674 -853 199 980 -553 -996 -191 -960 -1123
2921 -1123 506 -12 -1408 2 1286 164 56 1118 416 -78 1082 622 -1099 -396 595 -779 -1281
2938 -1281 -168 -521 -1052 331 550 -642 141 1500 450 38 1222 696 -581 312 549 -981 -762
2955 -762 95 -1075 -1293 379 201 -1017 110 1159 207 264 1363 220 -177 1083 671 -1236 -728
2972 -728 498 -643 -1154 -237 -839 -1062 586 822 -745 -32 1680 730 34 844 329 -444 584 429
2990 429 -1502 -987 413 -519 -1242 -193 -39 -576 566 1153 -319 138 1426 671 -342 581 441 -789
3008 -789 -404 19 -1123 -1015 169 -506 -1218 296 700 -281 154 1293 400 173 1141 238 -554 406 593
3027 593 -1166 -1101 60 -410 -857 63 -282 -833 592 1510 -49 -304 1229 677 -273 400 60 -893 20
3046 20 499 -1441 -1461 295 63 -661 74 212 -265 711 1399 137 -342 1124 664 -661 -117 198 -1017
3065 -1017 -698 122 -998 -1051 561 509 -758 239 1084 187 338 1156 273 -257 782 203 -1308 -379 586
3084 586 -771 -1129 -119 -347 -511 629 466 -582 437 1624 341 -383 686 573 -440 -1 -136
3101 -136 -1188 -620 660 -808 -1386 215 547 -130 435 826 -105 423 1603 298 -801 450 585
3118 585 -847 -541 -52 -916 -668 408 -366 -983 581 983 -166 290 1306 380 19 746 8 -818
3136 -818 159 186 -1441 -1051 298 -452 -901 206 176 -407 915 1129 -145 68 1456 491 -471 123 107
3155 107 -785 -203 137 -1306 -904 752 -22 -1038 160 872 173 618 1112 -62 -83 1181 274 -1122
3173 -1122 -310 183 -786 -742 21 -667 -742 643 287 -744 550 1472 151 3 875 388 -231 464 -22
3192 -22 -1271 -382 455 -820 -1083 303 251 -526 497 642 -169 763 1488 0 -554 678 545 -651
3210 -651 -336 -247 -989 -431 441 -625 -1111 725 903 -225 402 844 150 350 1069 -96 -762 530 383
3229 383 -1220 -741 44 -664 -625 270 -212 -515 857 921 -217 281 1251 277 -328 468 34 -894 -73 -89
3249 -89 -1529 -653 601 -357 -896 252 592 -2 752 890 -170 280 1225 141 -994 -26 199 -649
3267 -649 -502 -149 -1047 -593 728 -7 -803 518 1159 158 307 813 -115 25 781 -35 -1221 -236 285
3286 285 -1075 -807 33 -395 -407 821 519 -343 597 1175 -63 -47 1056 117 -683 179 -81 -1059 -302
3305 -302 145 -933 -801 540 158 -450 464 883 123 636 988 -122 -270 890 97 -1154 -460 -57
3323 -57 -764 -407 147 -723 -446 931 735 -484 243 1119 442 240 581 -342 -703 372 12 -1509 -764
3342 -764 228 -471 -497 280 42 -288 958 1066 -92 244 1005 165 -296 485 -122 -1051 -75 5 -1038 -598
3362 -598 546 -245 -483 708 790 -125 536 1189 38 119 782 -268 -920 365 47 -1282 -795 119 -430
3381 -430 -265 489 13 -380 966 1050 -143 166 764 158 -337 289 -495 -1038 -99 257 -1117 -904 233
3400 233 -49 -167 800 395 -201 709 1211 -186 -180 726 -102 -720 45 -172 -1251 -357 302 -511 -491 671
3420 671 116 -337 978 948 -230 309 1042 -48 -362 322 -252 -1083 -197 135 -1005 -707 394 -105 -211
3439 -211 878 419 -297 741 1121 -15 -274 526 -47 -590 203 -267 -1212 -355 385 -608 -684 666 471
3458 471 -66 843 790 -196 258 1119 -44 -645 272 -325 -1011 -238 75 -1006 -607 582 27 -350 719
3477 719 655 -172 713 1071 -145 -227 575 -333 -993 -61 -274 -1211 -171 493 -592 -619 754 577 -190 842
3497 842 794 -306 328 1052 -136 -692 224 -268 -1034 -73 -59 -1021 -332 778 69 -307 912 700 -95
3516 -95 697 880 -356 -287 736 -112 -995 -134 -155 -1048 -216 438 -544 -520 815 436 -20 784 800 -298
3536 -298 201 938 -472 -907 236 0 -1028 -465 -125 -842 -158 819 -31 -545 681 719 40 621 675
3555 675 -468 -155 673 -320 -1104 -123 -42 -880 -258 345 -599 -271 985 545 -276 773 904 -128 274
3574 274 773 -520 -750 223 -216 -1010 -369 1 -883 -242 818 -82 -261 822 687 -75 578 619 -401
3593 -401 -161 642 -328 -1181 -204 -77 -868 -249 259 -561 -70 1180 462 -413 641 922 94 87 348 -530
3613 -530 -553 320 -323 -1352 -369 229 -591 -212 543 69 -126 1058 557 -337 359 795 -233 -425 360
3632 360 -452 -998 -25 -53 -1017 -250 540 -326 -87 873 462 -100 760 900 -190 50 555 -613 -833 327
3652 327 -264 -1119 -305 198 -523 -71 709 -171 -143 1068 743 -390 264 761 -181 -389 146 -740 -987 291
3672 291 -32 -1134 -313 441 -162 -10 809 345 -129 1069 745 -448 -52 664 -307 -808 116 -627 -1001
3691 -1001 -10 263 -565 -206 868 258 -84 1015 681 -195 468 647 -480 -259 474 -533 -1162 14
3709 14 85 -791 -190 507 -189 -84 953 259 -148 799 814 -416 -239 408 -527 -739 200 -437 -1183 67
3729 67 599 -462 -228 839 186 -15 958 537 -319 495 719 -740 -637 277 -270 -949 -109 -56 -850 160
3749 160 588 -189 -136 1054 432 -264 573 700 -313 8 388 -742 -824 137 -320 -1118 -180 265 -365 110
3769 110 735 92 44 1032 610 -496 323 650 -362 -587 -23 -609 -991 186 -43 -993 -48 722 -2
3788 -2 -131 893 546 -8 713 517 -494 -116 365 -460 -742 57 -247 -786 36 361 -411 23 1001 233
3808 233 -95 967 712 -285 136 452 -520 -468 254 -654 -997 141 87 -827 -118 612 -134 -6 878 258
3828 258 -169 744 686 -565 -321 371 -470 -636 -19 -238 -787 155 459 -432 -49 1099 509 -3 677 399
3848 399 -253 350 456 -669 -459 116 -377 -802 46 -20 -586 69 733 -269 27 992 378 -310 454 392
3868 392 -504 -90 375 -740 -928 141 -155 -764 175 596 -336 -81 879 165 75 826 304 -522 163 445
3888 445 -573 -588 207 -514 -808 134 30 -642 247 881 -237 -99 870 546 -153 451 302 -738 -120
3907 -120 308 -575 -879 107 -240 -723 21 407 -226 215 939 183 -72 756 400 -538 43 276 -798 -520
3927 -520 157 -430 -847 221 219 -448 240 905 58 123 863 375 -195 509 393 -725 -120 266 -600 -921
3947 -921 179 -133 -674 339 464 -525 254 1170 236 -277 744 337 -466 106 307 -842 -685 292 -468
3966 -468 -943 110 360 -496 213 746 -39 7 1076 358 -418 318 166 -699 -229 213 -705 -801 129 -60
3986 -60 -657 260 544 -287 275 1046 143 -110 672 312 -513 0 120 -791 -535 354 -340 -877 47 229
4006 229 -376 238 758 -49 -53 984 286 -372 199 203 -649 -358 57 -666 -790 304 -161 -580 4 510 -88
4027 -88 293 991 47 -288 716 420 -572 -91 193 -659 -572 221 -459 -835 217 325 -353 181 721 58
4047 58 206 931 215 -505 248 320 -544 -281 23 -765 -618 363 -62 -578 200 402 -85 219 869 147 -202
4068 -202 651 366 -570 -83 190 -590 -487 179 -491 -727 261 458 -284 242 725 46 170 808 158 -449
4088 -449 229 207 -703 -497 78 -612 -568 263 -8 -643 257 669 -47 218 660 103 -68 656 298 -630 -169
4109 -169 75 -521 -517 163 -478 -677 478 146 -264 321 867 117 75 713 52 -402 251 235 -714 -446 191
4130 191 -442 -575 240 -83 -566 470 693 -134 296 808 48 -218 538 142 -621 -189 147 -585 -459 125
4150 125 -415 -600 466 393 -414 187 853 185 105 646 3 -342 231 -20 -798 -431 162 -561 -486 264 26
4171 26 -362 429 713 -215 239 821 -10 -146 452 169 -784 15 212 -678 -600 181 -252 -495 364 338 -270
4192 -270 377 941 106 -24 525 16 -488 132 28 -783 -307 204 -497 -606 270 128 -352 531 771 -167
4212 -167 202 720 18 -229 321 -31 -773 -152 171 -737 -534 219 -184 -439 456 337 -212 494 913 -119
4232 -119 -141 652 77 -502 27 -50 -737 -294 200 -509 -574 279 266 -199 340 490 -123 195 857 25 -464
4253 -464 304 19 -682 -345 77 -551 -517 286 -143 -462 445 610 -158 362 686 -58 88 582 63 -510
4273 -510 -52 46 -728 -322 249 -262 -308 339 197 -152 514 592 -79 60 903 -112 -325 238 -11 -680 -180
4294 -180 -113 -666 -370 188 -216 -431 567 438 -78 307 639 -81 -10 498 -82 -514 80 53 -627 -410 132
4315 132 -412 -325 452 121 -373 541 747 104 110 655 165 -227 162 -40 -732 -80 54 -668 -344 308 6
4336 6 -202 409 412 -28 250 810 -82 -234 597 -13 -562 -138 -100 -637 -213 156 -567 -316 423 413 -149 428
4358 428 637 -87 219 600 -87 -421 329 -50 -735 -296 106 -448 -354 313 -158 -138 704 470 -159 304 755
4379 755 -109 -165 366 -95 -586 36 -204 -739 -238 352 -397 -391 475 460 -112 500 524 26 222 678 -100 -473
4401 -473 152 7 -571 -300 -76 -627 -282 462 -98 -390 612 461 36 182 590 -71 -57 456 -170 -548
4421 -548 47 39 -678 -417 195 -283 -196 536 186 -65 531 535 -123 72 638 -101 -299 100 -235 -575 -135 82
4443 82 -605 -287 372 -53 -215 449 478 -30 420 538 -174 -183 384 -139 -649 -69 -40 -603 -265 209 -275 -203
4465 -203 660 266 -318 393 681 -93 116 403 -81 -380 190 -211 -680 -137 213 -473 -249 381 149 -160
4485 -160 566 442 -138 259 526 -157 -202 399 -42 -601 -50 3 -558 -68 292 -223 -400 518 304 -130 518
4506 518 563 -125 190 463 -215 -528 157 -11 -734 -176 6 -356 -160 374 2 -153 704 413 -98 204
4526 204 631 -229 -98 371 -214 -561 -4 56 -695 -341 279 -134 -216 604 316 -126 439 637 -175 81 464
4547 464 -299 -514 -12 -205 -736 -170 196 -446 -6 474 33 -185 627 579 -71 282 410 -160 -100 299 -321
4568 -321 -704 8 108 -644 -222 279 -10 -147 571 208 -143 472 538 -114 -71 306 -150 -360 65 -258 -777
4589 -777 22 312 -349 -215 387 91 -108 542 339 -252 299 520 -211 -320 182 -248 -599 12 -91 -504
4609 -504 -136 405 -77 -128 561 348 -240 422 444 -183 -132 321 -204 -477 82 -138 -714 9 254 -374 -211
4630 -211 476 182 -43 605 362 -139 175 565 -187 -440 128 -128 -613 -13 -35 -578 -246 409 90 -26
4650 -26 564 234 18 413 435 -225 -167 358 -224 -550 34 -150 -651 -52 256 -294 -115 492 158 74 455
4671 455 464 -144 269 532 -280 -399 78 -217 -357 69 -121 -597 13 451 -37 -54 450 215 -78 495 389
4692 389 -387 -119 364 -239 -515 -18 -240 -620 -19 300 -334 25 675 199 -29 477 426 -219 188 369
4712 369 -435 -441 299 -350 -647 -48 19 -435 -134 415 -61 -26 653 412 -65 312 400 -324 -196 232 -264 -537
4734 -537 -2 -126 -531 112 276 -247 95 526 215 -54 570 346 -173 115 175 -406 -269 192 -326 -701
4754 -701 -162 51 -260 -78 375 -62 74 661 226 -84 459 439 -216 -202 274 -475 -431 66 -115 -526 20
4775 20 307 -82 103 609 160 -120 451 231 -251 65 410 -475 -335 123 -220 -550 26 194 -422 46
4795 46 427 -20 -17 630 341 -291 459 335 -318 -224 218 -381 -643 134 -112 -469 16 290 -225 5 517
4816 517 163 -110 334 334 -274 217 334 -394 -337 79 -277 -592 64 -16 -374 26 546 50 -27 580 322 -213
4838 -213 384 189 -477 -146 204 -403 -509 -21 -33 -569 119 412 -128 179 680 235 -132 538 323 -303
4858 -303 -39 209 -434 -339 207 -201 -502 26 96 -337 221 436 43 23 538 292 -167 308 260 -357 -284 144
4880 144 -465 -453 129 -181 -350 124 396 -175 79 700 128 -76 398 126 -422 108 150 -465 -311 109 -245
4901 -245 -568 -88 232 -242 78 541 -106 -6 703 260 -301 200 312 -427 -150 33 -490 -406 168 -122
4921 -122 -451 104 309 -84 20 625 41 48 506 286 -353 40 189 -444 -437 34 -203 -502 116 160 -280 115
4943 115 600 55 -83 615 167 -243 242 124 -314 -135 109 -446 -527 137 134 -477 88 464 -67 44 537
4964 537 201 -137 433 267 -466 -122 223 -470 -374 77 -214 -344 225 152 -277 81 766 108 -44 452 220
4985 220 -251 235 124 -622 -318 189 -289 -663 12 39 -350 326 387 -265 60 616 187 -174 210 209 -311
5006 -311 -101 23 -386 -298 50 -326 -495 246 259 -123 76 574 66 48 438 7 -296 176 304 -575 -267
5027 -267 88 -296 -421 152 -23 -312 237 462 -149 -16 493 246 -128 292 33 -411 -42 94 -451 -464
5047 -464 154 -175 -358 292 118 -197 234 614 8 -61 633 270 -160 103 149 -455 -240 58 -431 -420 253
5068 253 -50 -306 239 488 -34 57 440 66 -73 318 53 -586 -160 182 -490 -463 94 -25 -279 200 177
5089 177 -347 303 698 45 -164 311 127 -269 47 -31 -488 -164 110 -237 -603 173 156 -119 288 334 -130
5110 -130 190 531 120 -183 294 207 -428 -177 68 -560 -427 238 -160 -353 232 267 -187 299 621 -7 -90
5131 -90 392 112 -256 73 48 -473 -220 186 -201 -461 141 158 -117 298 472 -58 82 583 199 -281 193
5152 193 100 -367 -181 -59 -569 -502 277 -107 -399 253 383 -244 293 514 99 -71 383 29 -545 -13 61
5173 61 -524 -105 144 -326 -447 353 118 -189 289 480 -6 31 446 48 -252 229 19 -460 -105 158 -569
5194 -569 -330 291 -60 -243 297 264 -161 97 556 -19 -18 467 56 -402 -29 182 -349 -136 151 -265 -350
5215 -350 261 219 -178 214 416 95 84 508 -32 -290 155 -22 -553 -171 27 -398 -291 185 -75 -219 255
5236 255 314 -149 126 496 -58 -1 351 31 -513 -39 -1 -391 -250 196 -326 -303 218 221 -129 268 353 -116
5258 -116 128 418 140 -112 218 5 -475 -275 75 -332 -290 318 -77 -247 331 346 -158 245 484 7 -75
5279 -75 218 -125 -382 82 -39 -590 -255 129 -132 -240 272 169 -261 387 440 25 3 336 -48 -218 181
5300 181 20 -434 -116 -17 -559 -348 267 101 -181 337 376 -103 287 580 -47 -43 255 -57 -490 -96 105
5321 105 -472 -215 102 -243 -149 357 175 -96 350 614 -131 47 358 -84 -345 70 1 -487 -121 81 -462
5342 -462 -381 317 100 -174 390 363 -80 307 413 19 -85 254 1 -556 -94 -12 -371 -224 232 -148 -261
5363 -261 316 285 -27 424 402 34 30 395 -9 -435 -5 -139 -473 -196 31 -365 -302 188 -2 -221 288 419
5385 419 -18 132 446 -136 -97 159 -46 -429 -100 -31 -338 -193 311 -94 -155 254 209 -42 326 476 -42
5406 -42 100 216 -95 -342 -10 -52 -485 -164 74 -363 -180 287 -1 -110 338 366 -78 274 361 -97 -172 98
5428 98 -149 -430 -126 25 -343 -192 223 -150 -215 446 207 -229 210 334 -1 -186 263 -239 -348 82 -39
5449 -39 -530 -165 28 -244 -9 306 23 -143 352 238 -37 133 406 -105 -222 196 -169 -462 64 34 -448
5470 -448 -189 121 -107 -164 302 263 -42 165 434 -149 -62 298 -73 -339 70 -120 -487 -192 164 -228 -104
5491 -104 312 146 -39 344 391 -24 151 373 -79 -204 200 -176 -460 -50 66 -476 -126 226 -133 -38 303
5512 303 235 -122 343 427 -46 -81 112 -185 -408 -161 -135 -493 -33 80 -153 -103 391 28 -25 378 287 3
5534 3 173 375 -137 -228 153 -157 -416 -175 67 -315 -184 293 -56 -79 391 169 -123 267 278 -44 -24 106
5556 106 -187 -370 61 12 -381 -101 134 -212 -106 331 202 -113 290 371 -125 13 200 -93 -251 94 -129
5577 -129 -427 43 89 -395 -139 358 -34 71 397 309 -179 168 301 -130 11 97 -258 -355 -98 -6 -339 -59
5599 -59 170 -276 -4 364 80 -123 266 389 -38 45 163 -292 -191 21 -183 -494 -79 94 -271 -173 262
5620 262 -59 -74 430 145 36 201 357 -195 -183 166 -76 -412 36 -112 -317 -75 27 -148 -83 352 153
5641 153 -1 235 299 -80 28 139 -193 -133 139 -239 -416 0 157 -174 -94 219 -78 -92 406 356 -113 102
5663 102 225 7 -180 169 -319 -257 25 -2 -278 -79 175 -128 -5 354 86 59 345 222 -96 -1 267
5684 267 -235 -207 146 -182 -370 -67 73 -222 -3 350 -21 -87 491 352 -195 40 185 -150 -108 73 -238
5705 -238 -465 -13 -56 -383 6 230 -62 16 372 87 -57 372 246 -204 -77 137 -328 -293 -20 -136 -418
5726 -418 28 -4 -136 -85 289 217 23 263 251 19 138 133 -213 -206 33 -193 -329 39 -23 -251 28 322 -81
5749 -81 32 458 134 -55 229 87 -165 28 289 -296 -261 36 -210 -428 -40 182 -162 74 294 2 25
5770 25 256 105 -125 51 232 -200 -119 128 -54 -397 9 59 -323 74 264 -90 105 362 169 -6 239
5791 239 196 -215 4 90 -266 -311 43 10 -289 107 81 -144 109 386 23 46 458 197 -117 89 132 -329
5813 -329 -267 9 -210 -314 43 38 -309 -4 274 -35 70 457 121 -120 238 106 -182 -91 77 -74 -302
5834 -302 -41 -103 -161 0 69 -57 31 371 95 63 212 73 -188 32 194 -227 -194 91 -151 -349 41 65
5856 65 -212 99 219 40 24 351 -31 5 167 210 -244 -31 -11 -239 -360 18 -167 -443 31 191 -89 73
5878 73 377 -105 43 382 276 -159 10 76 -206 -186 17 -138 -307 120 178 -187 83 328 -1 47 350 139
5900 139 -143 226 178 -244 -131 138 -216 -240 50 -58 -295 45 201 -137 33 394 174 -41 151 185 -151
5921 -151 -62 169 -277 -159 -8 -169 -331 176 -30 -214 86 285 15 31 427 177 -128 178 180 -231 -40
5942 -40 56 -221 -329 11 -134 -365 195 144 -159 57 382 108 -69 259 65 -286 -78 68 -245 -235 -17
5963 -17 -113 -289 273 62 -279 100 398 70 109 304 52 -141 284 138 -342 -177 51 -317 -223 98 14 -152
5985 -152 177 244 -50 124 376 182 -83 360 146 -271 61 196 -439 -274 59 -126 -213 74 193 -148 133
6006 133 411 -29 -27 373 -74 -166 51 118 -319 -92 36 -307 -268 39 58 -207 159 47 -142 71 368 129
6028 129 -59 302 114 -187 -1 0 -210 -227 58 -116 -322 100 101 -251 214 339 67 -19 510 82 -172 56
6050 56 82 -274 -90 -4 -124 -327 75 -5 -261 187 257 39 144 242 88 74 175 118 -257 -29 46 -275 -203
6073 -203 87 -144 -219 -3 166 1 189 412 136 -10 308 -53 -181 162 21 -304 -110 27 -280 -312 141
6094 141 -71 -95 166 221 -7 163 250 -36 -18 233 81 -328 18 13 -236 -269 27 -44 -254 179 79 -127 106
6117 106 354 148 91 228 113 -100 -55 140 -268 -159 136 -201 -360 143 111 -126 173 302 -55 62 355
6138 355 150 -80 249 105 -202 -81 115 -295 -100 65 -137 -192 138 193 -182 77 245 -17 57 264 -61
6159 -61 -213 210 58 -222 -288 5 -227 -253 189 67 -156 278 213 -140 78 375 33 15 134 -68 -293 -21
6181 -21 112 -225 -214 125 0 -53 218 103 -45 251 398 -32 108 181 32 -182 19 -18 -379 -218 -60 -176
6203 -176 -112 161 62 -59 253 212 20 -4 394 3 8 89 -25 -390 -9 122 -281 -163 68 -70 -141 156 105
6226 105 6 212 293 -58 -15 236 78 -223 67 78 -383 -185 70 -172 -172 78 126 -30 241 304 -67 99 399
6249 399 147 -141 104 -176 -318 -168 -92 -316 -195 82 3 -121 59 85 -120 259 356 -29 35 253 -4 -229
6271 -229 1 -68 -188 -167 181 -184 -174 99 147 -229 152 261 12 110 351 47 -182 8 -2 -259 -121 -1
6293 -1 -372 -165 93 -61 -198 241 164 -67 255 150 17 46 219 -50 -328 -66 13 -323 -157 190 -209 -100
6315 -100 258 -5 56 200 350 1 82 326 -67 -95 133 -110 -320 4 -35 -195 -144 121 26 -9 229 153 22
6338 22 210 206 -40 -5 119 3 -212 -63 -26 -288 -54 112 -143 -102 154 15 -104 354 341 59 85 189 18
6361 18 -181 135 4 -327 -49 125 -210 -119 75 -45 -130 154 133 -80 184 200 -31 -50 282 -152 -213 -1
6383 -1 -51 -256 -101 99 -191 -161 129 182 -98 236 164 -90 99 280 -160 -209 84 -128 -333 -51 18 -231 -178
6406 -178 157 -68 -95 260 75 -54 185 265 -65 -41 122 -51 -307 121 -40 -216 9 -29 -49 -45 263 62
6428 62 -94 233 157 12 -56 134 -17 -197 94 15 -225 23 -26 -290 -44 138 113 -2 270 84 -15 145
6450 145 248 -62 -173 53 -175 -295 -18 -129 -151 -20 121 -69 -112 171 115 -47 247 172 -108 119 238
6471 238 -51 -319 83 -151 -320 -34 63 -138 -142 79 -14 -119 241 83 -75 204 277 -123 -114 52 -31 -275 -20
6494 -20 -92 -220 14 249 -70 -153 284 61 5 241 214 -166 -33 221 -197 -132 -5 -65 -274 60 141 -165 -20
6517 -20 129 9 -99 289 221 -67 48 137 -160 -29 149 -4 -173 -30 -70 -266 -100 150 -79 -73 232 53
6539 53 -102 296 229 -93 -77 55 -131 -282 5 -102 -356 21 110 -68 -87 291 -3 -43 219 149 -141 55
6561 55 147 -156 -57 156 -59 -272 -20 -53 -130 -65 96 -34 53 352 96 -100 116 54 37 -25 179 -217 -137 78
6585 78 -119 -255 9 120 -209 -28 154 106 4 340 107 -73 85 195 -152 -138 151 -81 -220 118 134
6606 134 -160 -15 194 -104 -67 185 -21 52 232 130 -56 -54 133 -117 -268 -159 -181 -257 -142 134 -137 -76
6628 -76 211 110 -9 204 227 3 111 134 -19 -152 11 -77 -308 -45 -15 -287 43 217 -118 1 210 -14
6650 -14 -150 150 173 -15 -36 176 -60 -239 -49 -92 -276 -73 122 -100 -51 170 136 2 160 174 -19 35 143
6673 143 -124 -152 114 -22 -212 2 -93 -120 -20 253 19 0 161 88 77 95 209 -154 7 157 -132 -140 59
6696 59 -154 -172 21 110 -155 19 138 9 20 154 108 -111 83 76 -10 -126 98 -91 -205 -64 -68 -122 12 220
6720 220 -4 -56 157 57 50 101 58 -150 -65 111 -122 -294 -80 0 -54 135 -47 -125 38 316 91 -27 153
6743 153 172 0 -30 63 -244 -179 44 -104 -207 -21 -37 -43 70 282 -7 -96 267 89 -4 100 170 -143 -98 48
6767 48 -77 -39 -63 -66 -102 113 140 -57 74 237 135 13 263 123 49 117 58 -117 -49 105 -85 -203 31 132
6791 132 -156 27 173 41 20 278 45 -35 50 35 -15 -20 43 -41 -270 37 -62 -160 116 217 9 -45 107 182
6815 182 50 250 138 -211 39 -1 -111 -151 -27 -127 -168 -55 117 -57 55 142 138 87 105 148 -21 10 46 -168
6839 -168 -75 4 -212 -177 29 -75 -237 30 65 114 -2 262 43 132 169 109 -2 -23 22 -35 -184 -60 -106 -182
6863 -182 39 -45 -137 -2 125 7 46 56 138 33 240 107 -121 -74 29 -41 -183 36 11 -104 23 14 -43 66
6887 66 285 69 -12 188 28 -169 -41 22 -93 -83 18 -89 -214 -19 -18 -120 219 89 -19 33 161 129 -43
6910 -43 6 65 -249 -143 87 -168 -213 113 -45 -189 15 107 57 86 94 82 -3 120 87 -21 64 -14 -155 -129 -45
6935 -45 -181 -190 79 35 -128 163 111 70 24 222 84 -96 39 -54 -104 -105 47 -85 -145 93 -69 -129 173 193 -27
6960 -27 125 205 63 -11 115 33 -108 33 34 -164 -79 -26 -39 -64 76 16 -123 165 130 131 23 194 56 -185 101
6985 101 56 -262 -46 51 -162 -71 -39 26 -139 39 139 20 125 172 46 -122 208 27 -18 -116 -65 -142 -30
7008 -30 37 10 -163 43 226 -207 130 69 86 25 219 43 -43 -54 158 -187 -182 89 -139 -294 -58 -57 -99 16
7032 16 5 -157 50 208 91 -141 145 28 -218 -43 -124 -159 -159 36 -78 -80 183 113 -9 18 233 -35 48 186
7056 186 66 -9 -14 41 -225 2 -52 -131 -122 135 -40 -124 112 178 25 37 188 109 13 176 91 -165 -34 -22 -72
7081 -72 -195 161 -131 -170 170 88 40 -41 184 15 -87 169 46 -153 25 43 -252 -49 -76 -30 -127 33 102
7104 102 -50 169 154 -110 98 60 -39 30 -1 160 -267 -8 1 -212 -107 120 34 -20 150 93 113 157 193 -33
7128 -33 115 129 43 9 53 -76 -160 -157 49 -143 -137 0 109 28 17 100 -44 67 132 -65 -69 -26 74 -86 93 27
7154 27 -153 -149 87 -103 -111 123 71 -88 209 189 85 -77 127 8 2 39 -111 -160 -130 -48 -163 112 173 -144 -112
7179 -112 20 199 17 39 229 -61 -100 42 -160 -234 -72 -68 -213 -60 125 32 -95 39 209 -56 82 183
7201 183 118 27 140 -22 -114 237 -18 -52 -68 -104 63 -136 153 172 28 17 148 -5 -54 164 -23 -121 34
7224 34 20 -151 -116 -37 -149 -129 137 7 23 108 96 -20 117 160 48 41 128 93 -132 46 -119 -196 8 -33 -75
7249 -75 -20 9 150 -127 -55 127 21 53 228 -58 -67 -18 -48 -161 -51 89 -147 -158 79 -164 -62 173 93 3
7273 3 42 245 55 -8 54 -68 -72 2 -81 -243 -90 -66 -91 -23 110 91 47 281 222 82 -62 47 13 -97 205
7298 205 -91 -173 70 12 44 8 138 89 -2 163 230 15 65 166 -88 -79 64 -94 -278 70 30 -265 -98 87
7322 87 -98 -64 164 109 -19 41 184 14 -26 133 -6 -169 -8 -21 -118 -23 21 -154 -6 20 -71 -4 225 85
7346 85 61 103 228 -23 -52 78 -134 -217 -25 69 -199 54 136 -68 -93 127 55 -29 173 114 -30 -37 173 -89
7370 -89 -56 96 49 -205 10 149 -28 3 79 99 -42 108 165 -38 104 98 -43 66 155 -21 -203 -32 -8 -76
7394 -76 -48 103 -53 -49 58 -11 -23 162 199 1 -34 -8 -165 -173 1 -105 -91 -71 -14 -141 18 83 54 41 62 -9
7420 -9 85 156 94 -34 -72 28 -99 -194 -16 -75 -95 -32 81 41 -7 122 86 -26 134 114 16 -83 19 -28 -68 70
7446 70 118 -59 7 83 8 -80 142 190 -86 197 232 68 54 66 -49 -74 42 -126 -133 33 70 -217 -107 107 -153
7471 -153 31 123 -4 -17 48 89 33 -1 144 -21 -143 53 -57 -109 32 79 -74 -122 119 79 57 108 1 37
7495 37 54 38 -8 -35 17 8 -165 39 -63 -184 11 -57 -102 -141 226 85 -5 133 191 -42 -145 89 -79 -108 12
7520 12 -97 -203 18 109 -68 -30 -2 26 14 12 71 48 -13 75 -60 -93 104 4 38 19 -24 -103 84 59 -44 49
7546 49 159 200 -119 -28 90 -108 -4 -42 -125 -159 42 8 -73 0 25 -186 27 200 70 5 158 184 70 42
7570 42 30 -61 21 8 -89 -117 -21 -14 -183 -82 46 32 86 45 2 45 115 117 16 -7 105 -97 -259 4 110 -101
7596 -101 -22 62 -66 58 78 -9 93 168 30 -119 105 108 -168 43 7 29 -61 -56 30 -86 88 173 83 30 155
7621 155 14 -1 121 17 -155 -125 17 -59 -91 24 82 -184 -7 76 -62 22 120 12 -72 98 33 43 63 78
7645 78 -109 -66 -17 2 -84 65 103 -114 -86 80 -12 53 157 63 -111 31 22 -146 -97 -80 -35 -30 -25 63 -39 27 116
7672 116 51 129 202 32 32 84 158 -65 29 66 -69 -23 119 -24 -53 -51 12 -112 122 36 72 23 196 93 86 57 2
7699 2 -9 -117 -26 -78 -58 41 -49 -90 24 16 -110 37 95 -4 -122 67 -16 -149 37 -7 -48 31 48 -96 -47 34 59
7726 59 56 107 73 -16 -37 120 126 -126 63 69 -139 -54 7 -32 -160 39 -96 -150 144 -84 76 41 116 4 80 94
7752 94 -3 -84 47 48 -78 -85 146 14 -97 19 88 -103 -12 203 -54 -160 177 119 -60 38 134 -196 -90 87
7776 87 -153 -20 -21 -22 -119 87 89 -78 64 99 79 98 92 14 -35 58 -18 -110 -138 74 -126 -38 -12 -41 -68 90 186 -6
7804 -6 121 177 89 48 -59 -68 -29 -114 -27 -72 -158 -42 -95 -202 -6 38 -47 56 241 53 -114 144 6 -93 -29 76
7830 76 7 -70 58 -76 -3 96 -17 -3 30 88 -30 -21 142 -17 -76 146 37 -3 -40 48 -69 -81 23 0 -148
7855 -148 127 116 24 18 78 -90 -132 61 -60 -163 13 72 -105 -72 67 -92 -83 47 49 17 42 170 -21 -9 107
7880 107 70 -67 116 129 -106 -74 -72 -123 -96 62 71 -92 95 76 -31 -19 180 103 -2 -50 -67 -142 -48 -64 -125 -14
7906 -14 -51 -32 -84 6 82 46 111 160 -128 -59 -5 82 -76 19 -161 -129 66 44 -154 -147 80 61 92 63 158 -5 94
7933 94 105 111 10 -53 52 -107 -91 -10 -78 -68 -1 21 -62 -7 79 -97 -33 58 -8 110 87 49 -155 80 -44 -165
7959 -165 -2 -98 -18 -124 30 -45 9 -18 140 -3 28 119 -3 -2 40 -28 -117 -15 66 -83 -26 6 88 -39 -113 65
7985 65 60 154 73 37 -7 25 16 -72 68 20 -76 -175 151 -26 -46 64 -62 -38 -30 163 -11 83 89 25 -1 -43 -28 -85 57
8014 57 -2 -106 13 39 46 42 -88 91 -5 13 10 129 -3 78 63 -107 -75 11 -34 36 62 -131 -54 54 98 39 185
8041 185 33 -64 113 31 -83 -38 -42 -24 -111 -87 49 -116 -117 195 61 -92 245 75 -34 95 42 -25 -33 102 -93
8066 -93 -95 14 -76 -67 45 51 -2 -85 41 52 -68 61 102 -5 53 -54 140 -45 132 -22 -47 -56 -71 -130 -69 48
8092 48 -20 -7 86 145 50 136 150 26 26 2 -116 -35 -18 -81 -194 -35 -83 29 -57 102 -83 -38 42 85 86 -4 108
8119 108 -63 -50 42 25 -215 -72 64 -98 -67 111 25 -34 64 111 -42 145 59 -82 21 104 85 2 -47 -54 -142
8144 -142 -27 -6 -134 1 -2 40 2 -58 82 110 29 15 -65 -64 90 -44 -47 7 29 -84 22 -6 -68 -6 148 110 -33
8171 -33 12 66 43 96 60 22 5 -41 -97 -40 1 -9 -67 -107 113 126 -141 63 114 -88 -28 -25 -78 23 159 -5 -206
8198 -206 31 27 -187 -61 53 -64 -93 53 -97 -3 64 49 -130 -83 84 -9 -3 -76 -28 -70 -21 102 -21 69 60 -47
8224 -47 21 81 69 22 41 -5 -44 -146 85 87 -98 -30 44 62 -79 87 -167 -95 61 -29 -41 47 120 -80 22 51
8250 51 -32 -16 -79 -14 -129 -140 148 -25 -113 183 -78 -37 72 -21 11 31 -23 -162 -124 115 -4 -149 12 119
8274 119 -44 -11 100 83 -81 127 -7 -79 97 47 -107 -81 47 35 -52 -16 72 -133 60 26 -21 92 26 141
8298 141 40 139 93 59 26 57 -85 -112 -12 -58 -36 45 20 82 43 103 -10 63 55 -30 10 -62 17 -45 -167 43 76
8325 76 -92 99 -7 -61 3 -20 -125 1 138 -3 -92 141 18 11 -17 -6 9 -87 -52 -59 -35 -123 -62 29 -74 36
8351 36 183 -134 -69 -17 -42 36 65 39 14 5 -62 -145 -97 -25 8 -31 4 -90 -11 150 48 -72 135 87 -83 7 -45
8378 -45 45 66 69 -26 -119 48 83 -1 -89 -13 13 41 19 19 -16 57 106 -83 26 -34 52 -43 -161 80 -71 112 22 -39
8406 -39 1 -20 61 -139 60 41 53 27 -70 -59 22 28 -66 -23 109 -70 37 -24 168 18 -16 90 32 -69 123 70
8432 70 19 -13 -76 7 -27 -22 45 2 63 -4 -91 80 11 93 -95 -111 65 -4 11 0 18 -66 11 -133 -45 29 -44 -40 147
8461 147 264 29 189 49 47 72 19 34 -77 -17 -28 -30 -19 -49 37 -103 -56 36 2 -56 24 -47 -98 24 -9 5 115
8488 115 -90 -119 -30 -56 -105 30 26 44 -11 81 5 -33 17 -70 54 -78 56 -34 -59 -91 92 -28 50 52 56 5 5 3 124
8517 124 82 64 91 -28 58 -1 -82 65 -66 17 -24 -55 -15 -24 19 19 154 141 71 39 -65 138 116 -110 13 31 -31
8544 -31 -41 159 -117 -73 8 14 -68 11 28 -64 103 115 -22 -36 39 97 -24 -43 -17 -124 -50 16 10 -225 -66 14 7 -9
8572 -9 8 -83 -67 37 27 -18 65 2 -43 -6 -13 -4 -41 83 -47 -103 37 75 19 -29 106 47 -23 8 -36 -30 1 -7 -63 -23
8602 -23 -115 -114 67 101 -15 3 3 142 4 -33 3 -37 -5 -6 1 -83 -22 51 -106 -25 87 -49 -19 11 99 24 111 6
8630 6 -49 63 -26 40 -137 85 -55 -111 -92 -1 -76 -65 -54 111 4 -7 76 14 0 73 85 -9 48 -40 -91 -8 -61 -51
8658 -51 -9 99 28 -166 84 100 20 70 90 -49 -58 71 -23 22 75 30 -181 -48 2 5 -20 -44 57 -30 210 31
8684 31 82 14 42 73 -43 -2 122 -130 -17 -59 -51 22 21 37 76 -78 39 11 124 29 -47 -16 -38 83 -12 31 -69
8711 -69 -35 -111 -62 58 -139 48 -25 -75 35 91 -98 8 40 21 25 56 34 -132 -61 -12 -39 -67 112 30 -15 121
8737 121 111 25 18 141 -44 -18 26 -55 -30 -132 41 17 15 44 -88 -79 16 -43 -2 -20 47 -86 -16 66 26 -14 -73 -108
8765 -108 17 -77 9 -121 -73 -27 -41 33 -127 92 -59 -15 87 85 18 79 10 -65 -7 76 -184 -48 -5 114 -189
8790 -189 11 -72 -20 64 65 -62 38 -48 9 -120 62 19 -22 -17 12 108 -28 95 86 37 49 73 -32 69 10 146
8816 146 -88 150 -146 -26 22 62 -204 33 80 55 -6 143 84 -108 24 64 -93 5 48 -69 -93 -55 -21 -136
8840 -136 -46 -11 -67 -138 -16 60 -126 87 18 5 26 47 -36 7 -20 3 -15 -51 26 -37 2 69 3 -106 9 130 22
8867 22 34 45 -57 -7 64 -46 -97 -52 -5 18 33 -9 -71 -20 88 79 -56 27 71 39 54 75 -135 20 127 6 -63
8894 -63 -71 -8 -31 -167 104 65 -2 98 -114 -5 36 41 -24 -47 149 -2 -55 22 13 -73 -40 135 -34 -20 12 -98 50
8921 50 56 119 -10 -71 -46 20 -54 -19 70 -127 27 11 -38 -75 -27 118 44 -28 30 28 25 75 -20 -57 73 -105 -30 45 55
8950 55 -68 -24 -1 -78 -144 -21 68 33 111 95 11 -10 0 -103 11 -23 49 -121 31 47 -54 101 17 -26 10 26
8976 26 118 -175 22 -53 92 -102 104 20 16 65 -112 -76 -79 -27 -113 67 24 -26 -14 78 19 85 12 85 -48 3 -31
9003 -31 -26 -182 -34 31 0 -16 -19 -20 14 71 12 38 -47 87 -133 -7 6 -39 -130 105 1 -76 56 11 58 -16 50 43
9031 43 -42 -13 130 -6 76 -31 -60 13 23 -15 -113 4 49 -27 -154 -14 116 24 111 -8 -20 -25 -111 19 -29 -50
9057 -50 -122 -140 -40 44 61 -6 62 -16 7 35 17 -35 41 130 -5 -25 0 -2 -74 -3 -50 -94 46 43 -32 68 146 54 -48
9086 -48 -7 71 -106 117 13 134 -46 106 -4 -11 52 19 -102 -41 20 55 62 101 43 -40 93 38 1 92 118 -95
9112 -95 -80 53 102 -169 -125 -31 -99 20 74 -63 -18 -4 74 -43 66 125 -154 -69 61 -25 -82 -82 -89 -125 97 -7
9138 -7 -86 13 55 -21 -73 62 84 -43 35 80 43 -97 26 71 26 96 41 -51 32 130 4 -18 153 89 -85 -28 93
9165 93 -41 -24 -22 -95 -170 -4 -132 3 45 -6 -28 -86 129 60 -88 -22 -48 -123 70 128 -2 -45 -79 -88 12 -2 40
9192 40 61 91 125 5 80 68 -31 -19 90 85 53 -93 -123 40 -99 33 15 -58 38 -17 -45 47 136 32 8 -62 50
9219 50 -81 -75 -6 75 -76 3 -39 -65 30 24 -14 -63 -34 -16 45 119 97 -255 70 20 -65 -29 45 -18 -8 44 36 -130 27
9248 27 18 83 35 73 75 -68 -17 -8 81 58 133 -108 -49 -17 0 -61 -21 69 -35 -157 91 29 -128 31 66 -55 -19 128
9276 128 -55 -15 2 113 52 -32 4 -4 57 -4 7 53 40 20 18 62 -31 51 34 -51 102 -153 -4 -96 -23 -50 -104 -19
9304 -19 80 40 -21 -13 -52 183 3 85 -34 20 -113 6 34 -147 -42 21 -81 -67 -54 66 -4 82 -40 -57 -8 -99
9330 -99 -81 33 91 46 36 -17 -100 -39 61 90 -25 -44 -12 -19 160 -4 -20 -52 -147 81 68 18 53 4 -85 -56 60
9357 60 34 173 7 56 31 105 -4 -47 -17 -27 -136 -75 -83 40 -16 39 -16 -42 -35 17 -39 13 26 -52 -18 -33 -41 -178 97
9386 97 -5 -9 -24 123 -39 6 57 -5 -107 3 16 3 -55 9 53 -71 -52 63 -113 53 202 57 -7 -1 73 87
9412 87 34 -22 -133 1 20 -6 101 20 -119 -27 49 -62 -67 -18 73 45 -9 11 108 27 -56 65 -115 75 155 -33
9438 -33 59 119 -61 -59 -40 101 27 -38 -24 4 -67 1 80 98 -21 43 0 29 42 59 -89 50 212 -106 -30 40 -99
9465 -99 -7 -2 -42 45 30 -57 4 -4 2 -7 -56 25 80 -21 -5 52 -9 19 17 -25 -44 75 48 -66 62 182 -8 67 -2 0
9495 0 -27 4 100 12 -45 8 -141 -117 23 119 46 -74 49 -79 -201 0 47 -38 -58 -48 -42 -5 41 -30 -52 37 -60 -77
$$ [...]
16383C0
##END NTUPLES=NMR FID
##END=
