##TITLE=abcd
##JCAMPDX= 6.0         $$ Bruker NMR JCAMP-DX V2.0
##DATA TYPE= NMR FID
##DATA CLASS= NTUPLES
##ORIGIN= UXNMR, Bruker Analytische Messtechnik GmbH
##OWNER= root
$$ XWIN-NMR		Version 3.5
$$ Thu Jul  3 17:51:54 2025 Russian Standard Time (UT+4h)  servis@DPX200
##.OBSERVE FREQUENCY= 200.131235884673
##.OBSERVE NUCLEUS= ^1H
##.DELAY= (6, 6)
##.ACQUISITION MODE= SIMULTANEOUS
##.ACQUISITION SCHEME= undefined
##.AVERAGES= 16
##.DIGITISER RES= 18
##SPECTROMETER/DATA SYSTEM= spect
##.PULSE SEQUENCE= zg
##.SOLVENT NAME= CDCl3
##.SHIFT REFERENCE= (INTERNAL, CDCl3, 0, 16.5164)
##AUDIT TRAIL= $$ (NUMBER, WHEN, WHO, WHERE, WHAT)
$$ ##TITLE= Audit trail, XWIN-NMR		Version 3.5
$$ ##JCAMPDX= 5.01
$$ ##ORIGIN= Bruker BioSpin GmbH
$$ ##OWNER= servis
$$ F:\spectra/data/av/nmr/H1/1/audita.txt
$$ ##AUDIT TRAIL=  $$ (NUMBER, WHEN, WHO, WHERE, WHAT)
(   1,<2025-07-03 17:51:27.43 +0400>,<servis>,<DPX200>,
      <created by zg, POWCHK disabled, PULCHK disabled
       terminated by command 'halt'
       configuration hash MD5:
       00 E9 B6 7A A2 85 ED C7 34 08 36 98 17 FE 4E 26
       data hash MD5: 32K
       67 E4 B2 E6 82 91 2F 19 7D 63 56 33 A3 54 F6 C9>)
$$ ##END=
$$ 
$$ hash MD5
$$ D8 E2 7B 4A F0 EC B7 2E D1 D7 B3 89 11 A6 4C 6F
##$RELAX= 
##$RELAX= 
##$RELAX= 
##$RELAX= 
##$RELAX= 
##$RELAX= 
##$RELAX= 
##$RELAX= 
$$ Bruker specific parameters
$$ --------------------------
##$DU= <F:\spectra>
##$EXPNO= 1
##$NAME= <H1>
##$PROCNO= 1
##$TYPE= <nmr>
##$USER= <av>
##$AMP= (0..31)
100 100 100 100 100 100 100 100 100 100 100 100 100 100 100 100 100 100 
100 100 100 100 100 100 100 100 100 100 100 100 100 100 
##$AQSEQ= 0
##$AQ_mod= 1
##$AUNM= <au_zg>
##$AUTOPOS= <>
##$BF1= 200.13
##$BF2= 200.13
##$BF3= 200.13
##$BF4= 200.13
##$BF5= 500.13
##$BF6= 500.13
##$BF7= 500.13
##$BF8= 500.13
##$BYTORDA= 1
##$CFDGTYP= 0
##$CFRGTYP= 5
##$CHEMSTR= <none>
##$CNST= (0..31)
1 1 145 1 1 1 1 1 1 1 1 1 1 1 1 1 1 1 1 1 1 1 1 1 1 1 1 1 1 1 1 1 
##$CPDPRG= <>
##$CPDPRG1= <>
##$CPDPRG2= <>
##$CPDPRG3= <>
##$CPDPRG4= <mlev>
##$CPDPRG5= <mlev>
##$CPDPRG6= <mlev>
##$CPDPRG7= <mlev>
##$CPDPRG8= <mlev>
##$CPDPRGB= <>
##$CPDPRGT= <>
##$D= (0..31)
0 2 0 0 0 0 0 0 0 0.06 0 0 0 0 0 0 0.0002 0 0 0 0 0 0 0 0 0 0 0 0 0 0 
0 
##$DATE= 1751550686
##$DBL= (0..7)
120 120 120 120 120 120 120 120 
##$DBP= (0..7)
150 150 150 150 150 150 150 150 
##$DBP07= 0
##$DBPNAM0= <>
##$DBPNAM1= <>
##$DBPNAM2= <>
##$DBPNAM3= <>
##$DBPNAM4= <>
##$DBPNAM5= <>
##$DBPNAM6= <>
##$DBPNAM7= <>
##$DBPOAL= (0..7)
0.5 0.5 0.5 0.5 0.5 0.5 0.5 0.5 
##$DBPOFFS= (0..7)
0 0 0 0 0 0 0 0 
##$DE= 6
##$DECBNUC= <off>
##$DECIM= 32
##$DECNUC= <off>
##$DECSTAT= 4
##$DIGMOD= 1
##$DIGTYP= 9
##$DL= (0..7)
0 120 120 120 120 120 120 120 
##$DP= (0..7)
150 150 150 150 150 150 150 150 
##$DP07= 0
##$DPNAME0= <>
##$DPNAME1= <>
##$DPNAME2= <>
##$DPNAME3= <>
##$DPNAME4= <>
##$DPNAME5= <>
##$DPNAME6= <>
##$DPNAME7= <>
##$DPOAL= (0..7)
0.5 0.5 0.5 0.5 0.5 0.5 0.5 0.5 
##$DPOFFS= (0..7)
0 0 0 0 0 0 0 0 
##$DQDMODE= 0
##$DR= 18
##$DS= 0
$$ [...]
##$SUBNAM0= <"">
##$SUBNAM1= <"">
##$SUBNAM2= <"">
##$SUBNAM3= <"">
##$SUBNAM4= <"">
##$SUBNAM5= <"">
##$SUBNAM6= <"">
##$SUBNAM7= <"">
##$SUBNAM8= <"">
##$SUBNAM9= <"">
##$SW= 20.6817932712277
##$SWIBOX= (0..15)
0 0 3 0 0 0 0 0 0 0 0 0 0 0 0 0 
##$SW_h= 4139.07284768212
##$TD= 32768
##$TD0= 1
##$TE= 0
##$TE2= 300
##$TE3= 300
##$TEG= 300
##$TL= (0..7)
0 120 120 120 120 120 120 120 
##$TP= (0..7)
150 150 150 150 150 150 150 150 
##$TP07= 0
##$TPNAME0= <>
##$TPNAME1= <>
##$TPNAME2= <>
##$TPNAME3= <>
##$TPNAME4= <>
##$TPNAME5= <>
##$TPNAME6= <>
##$TPNAME7= <>
##$TPOAL= (0..7)
0.5 0.5 0.5 0.5 0.5 0.5 0.5 0.5 
##$TPOFFS= (0..7)
0 0 0 0 0 0 0 0 
##$TUNHIN= 0
##$TUNHOUT= 0
##$TUNXOUT= 0
##$USERA1= <user>
##$USERA2= <user>
##$USERA3= <user>
##$USERA4= <user>
##$USERA5= <user>
##$V9= 5
##$VALIST= <valist>
##$VCLIST= <CCCCCCCCCCCCCCC>
##$VD= 0
##$VDLIST= <DDDDDDDDDDDDDDD>
##$VPLIST= <PPPPPPPPPPPPPPP>
##$VTLIST= <TTTTTTTTTTTTTTT>
##$WBST= 1024
##$WBSW= 30
##$XGAIN= (0..3)
0 0 0 0 
##$XL= 0
##$YL= 0
##$YMAX_a= 275834
##$YMIN_a= -236524
##$ZGOPTNS= <>
##$ZL1= 120
##$ZL2= 120
##$ZL3= 120
##$ZL4= 120
##$ABSF1= 10
##$ABSF2= 0
##$ABSG= 5
##$ABSL= 3
##$ALPHA= 0
##$AQORDER= 0
##$ASSFAC= 0
##$ASSFACI= 0
##$ASSFACX= 0
##$ASSWID= 0
##$AUNMP= <proc_1d>
##$AZFE= 0.1
##$AZFW= 0.1
##$BCFW= 1
##$BC_mod= 2
##$BYTORDP= 0
##$COROFFS= 0
##$CY= 19
##$DATMOD= 1
##$DC= 2
##$DFILT= <>
##$DTYPP= 0
##$F1P= 11.0000007629395
##$F2P= -0.999999237060547
##$FCOR= 0.5
##$FTSIZE= 0
##$FT_mod= 4
##$GAMMA= 1
##$GB= 1
##$INTBC= 1
##$INTSCL= 1
##$ISEN= 128
##$LB= 0.05
##$LEV0= 0
##$LPBIN= 0
##$MAXI= 10000
##$MC2= 0
##$MEAN= 0
##$ME_mod= 0
##$MI= 0
##$NCOEF= 0
##$NC_proc= 0
##$NLEV= 6
##$NOISF1= 0
##$NOISF2= 0
##$NSP= 1
##$NTH_PI= 0
##$NZP= 0
##$OFFSET= 16.51637
##$PC= 1
##$PHC0= -271.4733
##$PHC1= 1.101538
##$PH_mod= 0
##$PKNL= yes
##$PPARMOD= 0
##$PSCAL= 4
##$PSIGN= 0
##$REVERSE= no
##$SF= 200.13
##$SI= 16384
##$SIGF1= 0
##$SIGF2= 0
##$SINO= 400
##$SIOLD= 16384
##$SREGLST= <1H.CDCl3>
##$SSB= 0
##$STSI= 0
##$STSR= 0
##$SW_p= 4139.07284768211
##$SYMM= 0
##$S_DEV= 0
##$TDeff= 0
##$TDoff= 0
##$TI= <>
##$TILT= no
##$TM1= 0
##$TM2= 0
##$TOPLEV= 0
##$USERP1= <user>
##$USERP2= <user>
##$USERP3= <user>
##$USERP4= <user>
##$USERP5= <user>
##$WDW= 1
##$XDIM= 8192
##$YMAX_p= 0
##$YMIN_p= 0
$$ End of Bruker specific parameters
$$ ---------------------------------
##NTUPLES= NMR FID
##VAR_NAME=  TIME,          FID/REAL,        FID/IMAG
##SYMBOL=    X,             R,               I
##VAR_TYPE=  INDEPENDENT,   DEPENDENT,       DEPENDENT
##VAR_FORM=  AFFN,          ASDF,            ASDF
##VAR_DIM=   16384,         16384,           16384
##UNITS=     SECONDS,       ARBITRARY UNITS, ARBITRARY UNITS
##FACTOR=    0.0002416,     1,               1
##FIRST=     0,             0,               0
##LAST=      3.9581328,     0,               0
##MIN=       0,             -236524,         0
##MAX=       3.9581328,     275834,          0
$$ Real data points
##PAGE= N=1
##DATA TABLE= (X++(R..R)), XYDATA
$$ [...]
8434E9kl4m5J5pM4J5K5o6o0J19n6J8n3L6K2Jj8l5J35j02l9j6mM1j0k9K9r1M6R4
$$ 59 57 23 -22 -7 -14 30 45 70 4 -56 63 7 25 -28 8 30 31 13 -22 113 11 -28 -44 -48 -7 -17 -46 -17 -108 -62 32
8465C2K0j45J19J09q1j12OR3j9o0N6j13JR9J09q0k1j7p3P2kl7P2On5L4l0k4N5
$$ 32 52 -93 26 135 54 -58 -52 41 22 -38 18 -95 -94 5 114 34 13 -4 -77 -5 -7 -44 28 34 -21 13 -17 -41 14
8494A4Qm9K4Pk0L0j6j2J04j08K2N0n6K7k7MjJ4k8N3KL1n5j01J26l9J6K7p3l0J1
$$ 14 22 -27 -3 4 -16 14 -2 -14 90 -18 4 54 -2 25 -2 2 1 15 -13 40 42 73 18 -83 43 4 20 47 -26 -56 -45
8525d5K5J23r7O4j00R4n6q0J63j57P5r5L4R1r7O1K9K7m8Mj0P0r3L0Pj1l0N6k2
$$ -45 -20 103 6 70 -30 64 8 -72 91 -66 9 -86 -52 39 -58 3 32 59 11 15 5 75 -18 12 19 8 -22 34 12
8554A2l8J0N6ro7P8p8P2r9k5j5K06j73J16nJ3q5M4jk2j32J09M4l2M6n3N2J3Nj29
$$ 12 -26 -16 40 31 -36 42 -36 36 -63 -88 -103 103 -70 46 41 54 -31 13 12 -10 -142 -33 11 -21 25 -28 24 37 42 -87
8584h7P5M0pk4j4P1j07M5J34j44K9m7P5n9M5o8M4K0j9K0l0m6n0M8K0J9Q7m0l3
$$ -87 -12 28 21 -3 -17 54 -53 -8 126 -18 11 -36 39 -20 25 -43 1 21 2 22 -8 -54 -104 -56 -36 -17 70 30 -3
8613cj0n4J11K6l3p8P3n2j3KM9p4N7k5j1O5j4j2o3K8J06q8N3l0k7l2M5L6jq8O2
$$ -3 -13 -67 44 70 37 -41 32 -20 -33 -31 18 -56 1 -24 -35 30 16 4 -59 -31 75 -13 40 10 -17 -49 -4 32 31 -57 5
8644Eqj8K1O8j11J14j20j1J75o9m2K7lj2m2P3Mj34P7RM4m3p5R5p8M7m1J8N1o7
$$ 5 -3 -21 0 68 -43 71 -49 -60 115 46 4 31 28 16 -26 47 51 -83 -6 3 47 4 -71 24 -54 -7 -48 -30 21 -46
8674d6K6M5l3l7J8qN6j76K02r4J1M1l2M8k3oL3l3j1O5o5m7J10q4L5OJ3k6J4rn3
$$ -46 -20 25 -8 -45 -27 -35 21 -155 47 -47 -36 5 -27 21 -2 -8 25 -8 -19 46 -19 -66 44 -40 -5 1 14 -12 2 -7 -60
8705f0N0J24n2p3K1K9j03J03m4O7j13k1Q6k5O4j40R2K8Ml9K2K1q0j3O5j3N7K2
$$ -60 -10 114 62 -11 10 39 -64 39 -5 62 -51 -72 14 -11 53 -87 5 33 37 -2 20 41 -39 -52 13 0 57 79
8733G9j26P5j7j7K5m5J1l9nM4K0M3o2k5M6Oq8J26l0J6lK3j30N8j2k5L7mK4n5J28
$$ 79 -47 28 11 -6 19 -26 -15 -54 -59 -15 5 48 -14 -39 7 13 -75 51 21 37 34 57 -73 -15 -27 -52 -15 -19 5 -50 78
8764G8j2o2RqK8KJ8r0L6Mj06N1N1N0q3O8m6l5J01qp3L5K3n1K5p0O3K4k0%q2O0
$$ 78 66 4 13 5 33 35 53 -37 -1 3 -103 -52 -1 49 -34 34 -12 -47 54 46 -27 8 31 -20 5 -65 -2 22 2 2 -80 -20
8796b0L8Q6m5j01J0Qm7J01Qo8rknQ3k9Kj9n8P9k6o8J17J1JqM3p1n6KP8q4J6j9
$$ -20 18 104 59 -42 -32 -24 -71 30 38 -30 -39 -41 -46 37 8 10 -9 -67 12 -14 -82 35 46 47 39 82 11 -45 -43 35 -49 -33 -52
8829e2l8P9qL4k6J26j68J36p1ql0R7qj12J2j1Q6j41R0M2M1q0Mk4N7N1j38P6Nq9
$$ -52 -90 -11 -19 15 -11 115 -53 83 12 4 -26 71 63 -49 -37 -48 38 -103 -13 29 70 -10 -6 -30 27 78 -60 16 21 -68
8859f8NJ8O2m3j9J8L1j13J54j6K1o5k0J44q5qK1o3J18j33M8L0k1j6j12R3o2N6
$$ -68 -63 -45 17 -26 -45 -27 4 -109 45 29 50 -15 -35 109 24 16 37 -26 92 -41 7 37 16 0 -112 -19 -81 -25
8887b5M2n0k0L0J03p9oL6j9l0L2p2R1K0Oj01rJ1M2m0R0j7j02J06Ml0K1p1J01m2
$$ -25 17 -33 -53 -23 80 1 -5 31 12 -18 14 -58 33 53 59 -42 -51 -40 2 -38 52 35 -67 39 43 13 34 -37 64 22
8917B2mn9O9k8L4M3m2L2j00rO6r0K1J09m2p7J81j16n6P7q0%nJ22j07N8k7K9KJ6
$$ 22 18 -41 28 0 34 77 35 67 -33 -42 24 -66 -45 64 22 -55 126 10 -46 31 -49 -49 -54 68 -39 19 -8 21 23 39
8947C9k4J0j10M4P9n4j5J9o3P8J3N8o2j0lmr7R0J39k05R2Jk3j5l9L3J16q0j7j1
$$ 39 15 25 -85 -41 38 -16 -31 -12 -75 3 16 74 12 2 -1 -5 -102 -12 127 -78 14 15 -8 -23 -62 -29 87 7 -10 -21
8977b1j6P6n1P2L4l2q5qQ5l8ok6j6Q4j8n2l3J27m4n9l8K0M6j7K4n3O2q6J0R6j15
$$ -21 -37 39 -12 60 94 62 -23 -31 54 16 10 -16 -32 52 34 -18 -51 76 32 -27 -65 -45 1 -16 8 -45 17 -69 -59 37 -78
9008g8O4l5l7J39j66J34oO4r5JL5j8m3J03k8q8RL6j2K8n7n9N5M2j1J04j59R2j5
$$ -78 -14 -49 -86 53 -113 21 15 79 -16 -15 20 2 -41 62 34 -54 -45 -9 -21 7 -50 -109 -54 -12 -23 81 -78 14 -1
9037aRj8O0p3P5or8K0P4p6M1K2j8ql5%N2j8K8j07L2J29q1p6R8l3q2Q1M7p6M4k9
$$ -1 8 -10 50 -23 52 46 -52 -32 42 -34 7 29 11 3 -32 -32 20 2 30 -77 -45 84 3 -73 25 -8 -90 -9 38 -38 6 -23
9069b3Jm5Q4n8J0N4J4k1j4o1J15n9j0l2M3l4K3O0j23K6P9m9Q2p7O5p3Q9k5r7%
$$ -23 -22 -67 17 -41 -31 23 37 16 2 -59 56 -3 -13 -45 -2 -36 -13 47 -76 -50 29 -20 62 -15 50 -23 66 41 -56 -56
9099e6J5N3k1O8K2l9j04O1%j6mM8r2J1o3M4Q1OK0r0L9n5O4N6m3J0m1j7P9j03K8
$$ -56 -41 12 -9 59 81 42 -62 -1 -1 -17 -21 27 -65 -54 -117 -73 8 14 34 -56 -17 -72 -8 48 5 15 -26 -43 36 -67 -39
9130c9L2Q8m4j6L6o7O2q4K7k6k8k5N0Q8n0K4l6JLj3J1k7M3q5P1o4P3k2o7P9N0
$$ -39 -7 81 37 21 57 -10 52 -32 -5 -31 -59 -84 -34 54 4 28 -8 -7 -4 -17 -6 -33 10 -75 -4 -68 5 -17 -84 -5 45
9161D5Pp2Q0o1M7N3j32n3Q2k1N3O1j54P1Lp5P0K0Mm6N7p4NL7N1q2Jp7N4J19j48
$$ 45 52 -20 60 -1 46 99 -33 -86 -4 -25 28 89 -65 6 9 -66 4 24 28 -18 39 -35 -30 7 58 -24 -23 -100 -46 73 -75
9192g5J11pp2rM4lo7Q5No8J6p3MJ26L0M1k00M6J8N7qo0N5%j5M0n4O5k7K9L9n4
$$ -75 36 29 -43 -52 -8 -11 -78 7 12 -56 -40 -113 -109 17 47 88 -112 -66 -48 9 1 -59 -4 -4 -19 21 -33 32 5 34 73 19
9224A9l5L8n3k5Q7n9n7Q9m4RL1k7n1J58p0J9r0Q3p8J12j22K3N2Lm6lO6j7mn8R3
$$ 19 -16 22 -31 -56 31 -28 -85 4 -40 -31 0 -27 -78 80 10 29 -61 22 -56 56 -66 -43 9 12 -34 -37 29 12 8 -50 43
9255D3k8mj01l2J26pJ6k3NQ4m9j0k6PK7k0qJ07j14k0%R2r1O2k2j2j1O5j1l9k7
$$ 43 15 11 -90 -122 4 -3 13 -10 -5 79 30 20 -6 1 28 8 0 107 -7 -27 -27 65 -26 36 14 2 -9 56 45 6 -21
9286b1Q5r1rQ4k7l4M2k7K4o1K5M9j11P9kq9O8j0M3K0K6m0J1j15O8Q1q4M8p0N5
$$ -21 64 -27 -36 48 21 -13 29 2 26 -35 -10 39 -72 7 5 -84 -16 -26 17 37 63 23 34 -81 -13 68 -16 32 -38 17
9316A7N8r4OK5o2o6J00K2l8l3O0Q1j24J2kn4R8K6j7%j5k4J34q7j0j53P2LM1P0
$$ 17 75 -19 -13 12 -50 -116 -16 6 -32 -65 -5 76 -48 -36 -38 -92 6 32 15 15 0 -24 110 23 13 -140 -68 -65 -24 46
9346D6m5n1N7J9N1m5J7r0P1n2M8l7J1l7L9j04R3l2M6Lk3M2J4j07K9K3m6K4Q7j27
$$ 46 1 -50 7 26 77 32 49 -41 30 -22 26 -11 0 -37 2 -102 -9 -41 5 8 -15 27 41 -66 -37 -14 -60 -36 51 -76
9376g6K3o9J39L1p4J00j03j3N0p9Q9P0p8m4J63p6p4J8j7k5L9J26j16m1Q8Jj01
$$ -76 -53 -122 17 48 -26 74 -29 -42 8 -71 18 88 10 -34 129 53 -21 -3 -20 -45 -6 120 4 -37 51 52 -49
9403d9Q7lj7J1L7p1N9l2j7mK8m9j7o4M0J29j1j04L0J5K8l7K6kJNr7O6o6K2jP0
$$ -49 38 35 18 29 66 -5 54 22 5 1 29 -20 -37 -101 -61 68 57 -47 -17 -2 26 -11 15 13 14 19 -78 -12 -78 -56 -57 13
9435A3p1J7L5n8J16l3nm7J06n7Q5j59J30m7L0o9K7J3j28J15N0r7P5j8k6M5Rq3
$$ 13 -58 -41 -6 -64 52 19 14 -33 73 16 101 -58 72 25 55 -14 13 26 -102 13 63 -34 41 23 -3 42 51 -32
9463c2mQ4L7Oq6Knn3K6o2J71l9q1N8k1Or7Q1j3J8jLk6N1oJ0o1K2kK1n6K8pj7K0
$$ -32 -36 48 85 91 5 7 2 -51 -25 -87 84 45 -36 22 1 7 -90 -9 -22 -4 -5 -2 -28 23 17 27 -34 -12 -14 7 -49 -21 -28 -45 -25
9498b5M0k4m6N4j2M3m1On8J04p3m3O6j07J03m5J67j56L1R2o2m0J1N1m6k0j9j1
$$ -25 15 -9 -55 -1 -13 30 -11 -5 -63 41 -32 -75 -9 -116 -13 -58 109 -47 -16 76 14 -26 -15 36 -10 -30 -49 -60
9526f0J53k31R8J37j48O0Qj37N2M2JM1J1o3K1rL9p0Q4Lk4nm3l9O5M2p6J2N4N2
$$ -60 93 -138 -40 97 -51 9 17 -120 -68 -26 -25 16 27 -36 -15 -24 15 -55 29 32 8 3 -40 -79 -14 28 -48 -36 18 70
9556G0p6q8J87j80K0J17j39P8p4pM1O2N9k9j53J32l5j7M0p4R1p4M4N4n0l5L9O7
$$ 70 -6 -94 93 -87 -67 50 -89 -11 -85 -92 -51 11 70 41 -112 20 -15 -32 8 -66 25 -49 -5 49 -1 -36 3 70
9584G0k6k5n3K4J9mo2Q6n7k5Rl0J5J15r2Oj9J9Q6q0P7j05L0J33l0k6m9j04Q6j5
$$ 70 44 19 -34 -10 9 5 -57 29 -28 -53 -44 -74 -59 56 -36 -30 -49 -30 56 -24 53 -52 -22 111 81 55 6 -98 -12 -27
9614b7Oj5M6m1m2O9j22R7K6o7J9N2o9qM3l8l7J25n7L3rQ9j16O4J0K7r2l1P3m9
$$ -27 -21 -36 10 -31 -73 -4 -126 -29 -3 -70 -51 1 -68 -76 -33 -71 -108 17 -40 -7 -16 73 -43 21 31 58 -34 -65 8 -41
9644d1N8k9k1j8MlJ15j39O9K5l9L3m3J7L2M8j25N7j7L9J1j6j3L2m8m3J29j19O0
$$ -41 17 -12 -33 -51 -47 -50 65 -74 -5 20 -19 14 -29 -12 20 68 -57 0 -17 22 33 17 4 36 -12 -55 74 -45 15
9673A5J1n3N7o6lP3k3rk6mqL6kp8P9M2r8K5K9QL5r1N7k4O3p6N3l6j7J49n7p8K2
$$ 15 26 -27 30 -36 -39 34 11 2 -24 -28 -36 0 -2 -80 -1 41 -57 -32 -3 5 40 -51 6 -18 45 -31 22 -14 -31 118 61 -17 5
9706EL5n3JK7k3J25j35O9j44Q9l2J81k09O4N2n5kr6J0kJ05j17J62p2qk6kJ8J11
$$ 5 40 -13 -12 15 -8 117 -18 51 -93 -4 -36 145 -64 0 52 -3 -5 -101 -91 -93 12 -105 57 -15 -23 -49 -51 -33 78
9735G8o1m1L0k0k7Q1%k7j8o4R0O2r5J04j04M3Mj7%k0J2m5Mm1O3P0q9J4J3J1n3
$$ 78 17 -24 6 -14 -41 40 40 13 -5 -69 21 83 -12 92 -12 31 35 18 18 -2 10 -35 -31 -72 -9 61 -28 -14 -1 10 -43
9766d3J29j04j3M8k5j1lM4l5o5J70j15n9M1l5R4j70J34J03p5lRMm8J51j37j3O8
$$ -43 86 -18 -31 17 -8 -19 -22 22 -13 -78 92 -23 -82 -41 -76 18 -152 -18 85 10 7 16 20 -28 123 -14 -27 41
9794D1k9m5q2J89k6l6rp2Q5j8k2k9Q3m5rL7O8l0p7O4j6j3l3J8j2K0M6o7M1pL3
$$ 41 12 -33 -115 74 48 12 3 -69 16 -2 -24 -53 30 -15 -24 13 81 51 -26 38 22 9 -24 -6 -18 2 48 -19 22 15 48
9825D8o7O5Qj39J08nm5P1m8k4m2R9j4kp6P2Q9j00n3P4m0O3j0q6N8l2M3o2J0P4
$$ 48 -19 46 54 -85 23 18 -27 44 -4 -28 -70 29 15 13 -63 9 98 -2 -55 19 -21 42 32 -54 4 -28 15 -47 -37 37
9855C7p9P2K0j02J7j7Q3k9M4m6j3rM5k2J3On7P3p4O2j4n6N5K2l5L8m1k7N6O6p1
$$ 37 -42 30 50 -52 -35 -52 31 2 46 0 -13 -22 23 1 14 20 -37 36 -38 24 10 -46 9 31 -4 34 -7 -34 22 88 17
9886A7j7Po0K9P1j6j8K1k5l8P1P2j11Qk8M6k6l9J4N1o0J8n2Q1LK3o7J1nq0J14
$$ 17 0 7 -53 -24 47 31 13 34 9 -29 42 114 3 11 -17 29 3 -36 -22 29 -31 -13 -65 16 19 42 -25 -14 -19 -99 15
9917A5L6q8K6MJ9m6j5L0l7k7J16l9j4J08j39K8Qq9J34n0K9N6p0O2r0K7m1J33j71
$$ 15 51 -37 -11 -7 12 -34 -49 -19 -56 -83 33 -6 -20 88 -51 -23 -15 -104 30 -20 9 65 -5 57 -33 -6 -47 86 -85
9946h5K6P9m0J7jL1rJ7j5J9l6P5k4j25Q1R8j63N9m9M0ON8j48O4O7K8k9j33N1L8
$$ -85 -59 20 -20 -3 -4 27 18 35 20 39 3 78 54 -71 10 108 -55 4 -45 -5 1 59 -89 -25 42 70 41 -92 -41 -3
9976cK5l6j7kL6O2j17k5M5k1J00j09Q9Jm1o3J42o5q9Q3Q3j00o4N7Kl5J4P6m7J9
$$ -3 22 -14 -31 -33 3 65 -52 -77 -32 -53 47 -62 27 28 -13 -76 66 1 -88 -5 78 -22 -86 -29 -27 -62 -48 28 -19 0
10006@j9o2O0LM0L6j20J19l8o2j3Q6m0M2j2o3J2QK2q6L8Q5k1o2K3N0m0k9RN0K6
$$ 0 -19 -81 -21 -18 22 58 -62 57 19 -43 -56 30 -10 32 20 -43 -31 -23 -1 -87 -49 36 15 -47 -24 26 -14 -43 -34 16 42
10037D2j5k3j02K2M5J79k11Q0lk4M9j8o4jQ5m1r6L5N6m2m8Q8l4J5J02p9LK4Ok4
$$ 42 27 4 -98 -76 -31 148 -63 17 14 -10 39 21 -43 -44 41 0 -96 -61 -5 -47 -95 -7 -41 -26 76 -3 0 24 30 6
10067Fok1P8Pj18l5O9N3Jj14O5N7l2m3RM5m8M3Nom3mn0P9M5j03O5l3j7N7N5l1
$$ 6 0 -21 57 64 -54 -89 -20 33 34 -80 -15 42 10 -33 -24 21 -27 16 21 15 -28 -32 -82 -3 42 -61 4 -29 -46 11 66 35
10099C5m4J7q9K2J13k2Jq7KO5K6m7l1R8p5J6nj9n8J82n2p5N0k1l2m6J37j42O8
$$ 35 -9 8 -81 -59 54 32 33 -54 -52 13 39 -8 -39 59 -16 0 -5 -24 -82 100 48 -27 23 2 -30 -76 61 -81 -13
10128a3k3R5n9M8j03N5O8qo4k8Q1p0k3O0m5k0J4j9Q1rm4%K7N0q2l9Q1k6K0k0P0
$$ -13 -36 59 0 48 -55 0 68 60 -4 -32 49 -21 -44 16 -29 -49 -35 -54 27 18 -26 -26 1 51 -31 -70 11 -15 5 -15 55
10159E5j03J6o8Q2M2m0l2QP5n7MOK8R9k17J06JP5p8L9n2k9QK8N1j66J37m4J25
$$ 55 -48 -32 -100 -18 24 -16 -48 -40 35 -22 -18 -12 16 115 -102 4 5 80 2 41 -11 -40 -32 -4 47 -119 18 -26 99
10188I9j19L8j6l7M7J4n0Q7o3k6k8P7m6L7L1p9LJ3M5l4j3L9l2k7N2nm9Q4j9q8
$$ 99 -20 18 2 -35 12 26 -24 63 0 -26 -54 23 -23 14 45 -34 -31 -18 27 -7 -20 19 -13 -40 12 7 -42 42 23 -65
10218f5P3L7j4m6Jk0N0o5J18j4j07O9K2m0o6J16m4o6Q3k9J8M8r1P2j04K3J4J01
$$ -65 8 45 31 -15 -14 -34 16 -49 69 55 -52 17 39 -1 -67 49 5 -61 22 -7 11 59 -32 40 -64 -41 -27 74
10246G4p7L2m8K4qk9P6o1L1o0L6m3Q1j37J51p8L4l0J01j03N7J7o1K8l9L8JK0J3
$$ 74 -3 29 -19 5 -3 -32 44 -17 14 -46 -10 -53 28 -109 42 -36 -2 -32 69 -34 23 40 -21 7 -32 6 7 27 40
10275D0o4R0j31Q2o4J4j0P3mJ2o8K3r4R0qr3Q3NQ7m2p2j4J61j50L2rkJ3N4q2Q8
$$ 40 -24 66 -65 17 -47 -33 -43 30 26 38 -30 -7 -101 -11 -19 -112 -29 -24 63 21 -51 -65 96 -54 -22 -31 -33 -20 34 -48 40
10306D0j10J09q7J19q2L0M2o7k8Q5O2o6n0J6L5p0lj2Q3nm4j8j3P6k9KJ4O5j4q3
$$ 40 -70 39 -48 71 -11 19 61 -6 -34 51 113 47 -3 13 48 -22 -25 -37 46 41 -3 -21 -34 42 13 15 29 94 80 -3
10336cJ5j3J9qM1n9Qk6L1Rl4J1N2n4L6J0j2N8r0K9J9j00P1l1j12K25j73J08k9
$$ -3 12 -1 18 10 51 -8 0 -26 5 14 -20 -9 43 -11 25 35 23 81 -9 20 39 -61 10 -21 -133 92 -81 27 -2
10365bJ5J2J1n1j5M7K1k4n3J11j21J20r6N1k6O4o0k8K8m7J08j01O4m5P9o5l6K7
$$ -2 13 25 36 -15 -30 17 38 14 -39 72 -49 71 -25 26 0 64 4 -24 4 -43 65 -36 28 -17 62 -3 -39 -12
10393a2M8Kp2P6J5j20J24j12O2J0j7%n0L8JN0k5L6m7o5J19k8Jj30J50n6o0J5O5
$$ -12 36 38 -34 42 57 -63 61 -51 11 21 4 4 -46 -8 -7 43 18 54 7 -58 61 33 34 -96 54 -2 -62 -47 18
10422A8Nm4J0P4l0L4k9n0L2o1l1Q7n7L6k9l8R0rJ8l6p3N7%M2Qq7O6l0n5R2l1L3
$$ 18 23 -21 -11 63 33 67 38 -12 20 -41 -72 15 -42 -6 -35 -73 17 8 26 -10 -83 -26 -26 16 24 -63 3 -27 -82 10 -21 12
10454A2J1J0k2N5j2j00L9k1J00j18J4J08j34N7q1J14N6j39O4j5k5N5Kp5K2R4j03
$$ 12 23 33 11 66 54 -46 -7 -28 72 -46 -32 76 -58 -1 -82 32 88 -51 13 -2 -27 28 30 -45 -23 71 -32
10481c2k2R4r9K2K7r3J3J06j9j4R1q6Ol8N5n5Q4k3o8R2n2l5O2J7pj4j0Mr8J21
$$ -32 -54 40 -59 -37 -10 -103 -90 16 -3 -17 74 -12 -6 -44 11 -44 40 17 -51 41 -11 -46 16 33 26 12 2 6 -92 29
10511B9j2j6m7N6q9J15Ko8p0R1J3q1J08L8n4k0J0j5N6p7J5j7K1m4L1p0N3J37r5
$$ 29 17 1 -46 10 -79 36 38 -30 -100 -9 4 -77 31 69 15 -5 5 -10 46 -31 -16 -33 -12 -56 -25 -95 -42 95 0
10540@MK4j16l4O9L7L6o4J09m4k9O7m3rOj19O1kNJ18l5q3N5Pn4L1p6L0N9J5M7
$$ 0 4 28 -88 -122 -53 -16 20 -44 65 21 -8 59 16 7 13 -106 -45 -47 -42 76 41 -42 13 20 -34 -3 -79 -49 10 25 72
10571G2j40R2nl9K3l3QJ8PjR2L0j29mL0M0k7o4M9m8M8pO9m7q9M8J4j4m7J11j53
$$ 72 -68 24 19 -20 3 -30 -22 -4 3 2 94 124 -5 -9 21 61 34 -30 19 -29 19 12 81 34 -55 -7 7 -7 -54 57 -96
10602i6R3J5p5O1K0PJ6k1j02O9o6L5O1M1j30kR0qj4L4o4L8L4on8QM0r2P2rQP2
$$ -96 -3 12 -63 -2 18 25 41 20 -82 -13 -79 -44 17 58 -72 -74 16 8 -6 28 -36 2 36 30 -28 -20 20 -72 0 -9 -1 71
10634G1o3l4L1p3O7rRl3M7o9L7Lj7J04j18NL0m4M7p3Q6om0l1N9L8m8j1Q7K1o2
$$ 71 8 -26 5 -68 -1 -10 -1 -34 13 -56 -19 -16 -33 71 -47 -42 -12 -56 -9 -82 4 -2 -42 -73 -14 24 -24 -35 52 73 11
10665A1M0p6n9J14L2r5Q4m3L8q4O4m9P8M7j86QN2N2o6k1M5PMk2P5o4J3j4J7n0
$$ 11 51 -25 -84 30 62 -33 51 8 46 -38 26 -23 55 102 -84 -76 -24 28 -38 -59 -14 -7 -3 -25 50 -14 -1 -15 2 -48
10695d8J1O9o4O1j8j9K1M3j12N5l0N2n0N7n0M4ko1K1K5J6n1P9j9o3O0Kj2Jk4J8
$$ -48 -37 32 -32 29 11 -8 13 56 -56 -1 -31 21 -29 28 -22 22 20 -41 -20 5 21 -30 49 30 -33 27 29 17 18 -6 12
10726A2o0lR0j04J5L2k3K9j2L2k2L3ok2K3J5n4J7jl1L3J4l0m5R6l3L3N4j20M0
$$ 12 -48 -51 39 -65 -50 -18 -41 -12 -24 8 -14 19 13 -9 14 29 -25 -8 -9 -40 -7 7 -23 -68 28 -5 28 82 -38 2
10756BM7j01O1k0r1J35m5j3K4L7k1n1j0L7P9j04NL4QM4n1q4J9M0N1m7M2k0j1K
$$ 2 49 -52 9 -11 -102 33 -12 -25 -1 36 15 -36 -46 -9 70 -34 -29 5 13 57 6 -78 -59 -19 32 -15 27 7 -4 -2
10786bj07J32kN3m4j10Q2pL3l2M9p1k2R5j16P5j9o3J08l7NJ32j10k8m6N2K9m4
$$ -2 -109 23 21 74 30 -80 2 -5 28 -4 45 -26 -48 47 -69 6 -13 -76 32 -5 0 132 22 -6 -52 0 29 -15
10814a5O9m7k0n2L9O6J1j3%j6m4M8k6l9N8l2N1n0N6L2p8L0m2jp9P4O0k3J9j0j26
$$ -15 54 7 -13 -65 -26 40 51 38 38 22 -22 26 0 -39 19 -13 38 -12 44 76 -2 28 -14 -15 -94 -20 40 17 36 26 -100
10845a00J24n4M9k1K2k2j4QRL2m6L2Jn5q5J04j6J4Q1Np8PNml1J07r1J2MrL6k5
$$ -100 24 -30 19 -2 20 -2 -16 -8 1 33 -13 19 20 -35 -120 -16 -32 -18 63 68 -10 -3 2 -2 -33 74 -17 -5 -1 -10 26 1
10877AK7j23M1J38q4nl4N4j63J30l2N6j6J8j5l2P5k1m4qL0oj3L7p5R8n0K2k1M4
$$ 1 28 -95 -54 84 0 -5 -39 15 -148 -18 -50 6 -10 8 -7 -39 36 15 -29 -37 -7 -13 -26 11 -64 34 -16 6 -15 29
10907B9k1m3K3j2QL7K1J2q5L2J4m9O8n0J60j45m3O8m0J0L2k8q8J4O4L9Mp7L1L2
$$ 29 8 -35 -12 -24 -16 21 42 54 -31 1 15 -34 34 -16 144 -1 -44 24 -16 -6 26 -2 -90 -76 -12 27 31 -46 -15 17
10937A7q4O3K1j0M4j2o2k8J09k1rn2k1P1j24Q9m3l7Q5n4jJ05r1k6L3L7J1L7j04
$$ 17 -67 -4 17 7 51 39 -23 -51 58 37 28 -24 -45 26 -98 -9 -52 -89 -4 -58 -59 46 -45 -71 -38 -1 10 47 -57
10966e7P5k6N8r3L9J3l6O9q1L2O0l7j7k1L6q2L7N4j03O1N4r8N2N4L0k2q8J30j28
$$ -57 18 -8 50 -43 -4 9 -27 42 -39 -7 53 16 -1 -22 14 -68 -31 23 -80 -19 35 -63 -11 43 73 51 -37 93 -35
10995c5l1o0J01N5m9qmP8J3j08P6rN1k8o2Kl9l6J20j15M7Q6j7M8j17R0Lj26M1
$$ -35 -66 -126 -25 30 -19 -27 -31 47 60 -48 28 19 70 42 -20 -18 -57 -93 27 -88 -41 45 28 76 -41 49 52 -74 -33
11024c3o2K2K5N9%lj1k9LK7j6OK7o9J36m5k7LL3l4o6J11k0n7M1l7R2r7MM9J6q5
$$ -33 -95 -73 -48 11 11 8 -3 -32 -29 -2 -18 -12 15 -54 82 37 10 13 46 12 -54 57 37 -20 21 -16 76 -21 -17 32 48 -37
11056c7N0Qk9K5K8p9nK1J2K3m2M4krK9o2J2N1o4R3j19Q4j2j09R0M5j31J36j18
$$ -37 13 21 -8 17 45 -34 -39 -18 -6 17 -25 19 17 8 37 -25 -13 38 -26 67 -52 32 20 -89 1 46 -85 51 -67
11085f7J13j2j0j1L1l1j9j1Po3J3L0k5KJ5J8L6M2k5lp3P5j8N8l1k5p2N3k5j10
$$ -67 46 34 24 13 44 13 -6 -17 -10 -73 -60 -30 -55 -53 -38 -20 16 58 33 30 -43 32 14 72 41 16 -56 -3 -28 -138
11115a38P0J04r7N8o5Q7k5K8N8J8o2j08Q0ll8QJ16o2j1k0Ok6R1r0m3o4J11j4M4
$$ -138 -68 36 -61 -3 -68 19 -6 22 80 98 36 -72 8 5 -33 -25 91 29 18 -2 4 -22 69 -21 -64 -128 -17 -31 13
11144A3K1l9O2r4L2j0n9L0M6K5M3k5L0j61N8O8j2M7m2Jr4Q2K4j7j9j4j9N5k5M3
$$ 13 34 -5 57 -37 -5 -15 -74 -44 2 27 70 45 75 -86 -28 40 28 75 33 34 -60 22 46 29 10 -4 -23 32 7 50
11174E0j31J61j1j04N9j1J2k1Qn1K8j2J6O6j23J36j27l7J56n0L7p1j5O6j50J31
$$ 50 -81 80 69 -35 24 13 25 4 12 -39 -11 -23 -7 59 -64 72 -55 -92 64 14 51 -20 -35 31 -119 12
11200A2nK8j30N9N2K6k5j34J75o1NM6m7l1orN0mJ8jj34K18n9J3j15O5%N3m8K4
$$ 12 7 35 -95 -36 16 42 17 -117 58 -3 2 48 1 -30 -36 -45 5 1 19 18 -116 102 43 56 -59 6 6 59 11 35
11230C5m2M5j6J8rj09J08m2J63j24q0J26m2r2K8kK4K4Rj12Q2l1O1m8J7J6ml9K
$$ 35 -7 38 22 40 31 -78 30 -12 151 27 -53 73 31 -61 -33 -35 -11 13 22 -90 -8 -39 22 -26 -9 7 3 -36 -34
11259c4n6R5J9K1m9J9j7L7n5R4J0q7K9k8K8o1Q3N2j77J03k0J5lN3k1p9o0J35q9
$$ -34 -90 5 24 45 -4 15 -2 35 -20 74 84 -3 26 -2 26 -35 48 100 -77 26 6 21 18 71 50 -29 -89 46 -43
11288d3J04q2kQ4m4j5r6M5P2j32rJ48o3kQ1r1K8n2K2Q0k6l3O1m8pK4%k3M6M6%
$$ -43 61 -21 -23 61 17 2 -94 -49 23 -109 -118 30 -33 -35 46 -45 -17 -69 -47 33 7 -26 35 -13 -20 4 4 -19 27 73 73
11319G3o0O1j10Nl4J14k0L3n4j1M1P6j51o3J52j0m3r2K25j50jR0p6Mj5R1o1k8
$$ 73 13 74 -36 -31 -65 49 29 62 8 -3 38 114 -37 -100 52 42 -1 -93 132 -18 -19 71 -5 -1 -16 75 14 -14
11347a4p2J28M7j37N2K4n5m1J26k5n6M5j4M6Ln1M3q5O0n3n4J03J3m5K9j0%K1J7
$$ -14 -86 42 89 -48 4 28 -27 -68 58 33 -23 22 8 54 57 6 49 -36 24 -29 -83 20 33 -12 17 7 7 28 45
11376D5j07m3J32ql7j1k2O6L9j9n5j5k3K8k2J6QK4J4n0L7K8q3J19lo4j9M2m6J
$$ 45 -62 -105 27 19 -18 -29 -51 15 54 35 -20 -35 -58 -30 -52 -36 -28 -4 10 -40 -3 25 -58 61 58 -6 -25 17 -29 -28
11406b8K3J6L0J1n8n0N2N1l2l9L3j4pj5L2j9N1p7L1j5M6l5Ll5O7o1P9J1l6p6K0
$$ -28 -5 11 41 52 -6 -56 -4 47 15 -24 9 -5 -12 -27 5 -14 37 -40 -9 -24 22 -13 -10 -45 22 -39 40 51 15 -61 -41
11437d1J01r9N0K7l8K8o0O9r6L9KP3m5j6K7M0o3n4J33k7k8j4m1o7K4O5L5qJ8J4
$$ -41 60 -39 11 38 0 28 -32 37 -59 -20 -18 55 10 -6 21 61 -2 -56 77 50 22 8 -33 -100 -76 -11 24 16 34 48
11467D8k8m7M8O6j56M4J3o0R1k0K6J9k4L0r3nmR8o0M8j1m2J2r5N4KJ52r8j5ML7
$$ 48 20 -27 21 87 -69 -25 -12 -72 19 -1 25 44 20 50 -43 -48 -52 46 -14 34 23 -19 -7 -102 -48 -46 106 8 -7 -3 34
11498C4l1K4NJ4m2J00j39N8k6L6L8m6Po0%K2l2K5m2J06q0K5k3P3Lk5r6Q1m6L5
$$ 34 3 27 32 46 4 104 -35 23 -3 33 71 25 32 -28 -28 -6 -38 -13 -55 51 -29 -4 -27 46 49 24 -72 9 -37 -2
11528bk8k9J36l0n7NK2nm4K8OMj1K5r7J31N6j00r3L5P2j12J46j07R7j02K6j5Q7
$$ -2 -30 -59 77 47 -10 -5 17 12 -32 -4 2 6 -5 20 -77 54 110 10 -83 -48 24 -88 58 -49 48 -54 -28 -43 44
11557D4k4L0jL1j04M3M3l9Q9p5m9m8K4L4J7K8N5j27K3M1n0l7R1Pp3N8m3N9m0j
$$ 44 20 50 49 80 -24 19 62 23 112 37 -12 -60 -36 -2 15 43 98 -29 -6 35 -15 -52 39 46 -27 31 -12 47 7 6
11587FJ9n4m9J07r7J9OJ2j2M9p7P7k4nO7n1q3P8lmp1J13P8j16J32j60N8k9m3M1
$$ 6 25 -29 -78 29 -68 -49 -43 -31 -43 6 -71 6 -18 -23 44 -7 -90 -12 -15 -19 -90 23 101 -15 117 -43 15 -14 -57 -16
11617a6J7L4j1J0n2PM5M1p8o2J0P0q5L7J5J04o2l6n5J18n3K7j3k9K9jK0q9J27
$$ -16 1 35 24 34 -18 -11 34 75 -3 -65 -55 15 -70 -33 -18 86 24 -12 -67 51 -2 25 12 -17 12 11 31 -58 69
11646F9j12N3m0J6j2oJ6N3l3m6J45j14k6NOn0J05Nq6P7n7J20j30N9o5N7M8j6m0
$$ 69 -43 10 -30 -14 -26 -32 -16 37 4 -42 103 -11 -37 -32 -26 -76 29 34 -52 25 -32 88 -42 17 -48 9 57 41 1
11675AL9o6Mk0Q5Ln4k6qOn6J00L5O2r3m0L7k4k3l3N4N4p0o5Q4K1Nk3m0JJ52j47
$$ 1 40 -26 -22 -42 43 46 -8 -34 -42 -36 -92 8 43 105 12 -28 9 -15 -38 -71 -17 37 -33 -98 -14 7 12 -11 -51 -50 102 -45
11707d5l0Q1m5L2l1O7o0lL6L1l0q2P2q3J5R2l1QJ28j72O8o6j2O6l2J1k0k1Q8l1
$$ -45 -75 6 -39 -7 -38 29 -31 -34 2 33 3 -79 -7 -90 -75 17 -14 -6 122 -50 18 -48 -60 6 -26 -15 -35 -56 32 1
11737AN0r2L4M0j5K4K9n8M1j51N9j6P4m1J05p8nj5J8J3p0J8J6lrM7mK1r8J06o1
$$ 1 51 -41 -7 33 18 42 71 13 54 -97 -38 -54 20 -21 84 6 1 -14 4 17 -53 -35 -19 -22 -31 16 12 33 -65 41 -20
11768b0K8n3Q0o3M3p0O5K2Oj9j8l9K9j8j6N2M5n6k3P9j03M4m5O7o6J34j01N6n5
$$ -20 8 -45 35 -28 15 -55 10 32 38 19 1 -38 -9 -27 -43 9 54 -2 -25 54 -49 -5 -50 17 -49 85 -16 40 -15
11797a5L0j32J51j0qk6P5r7Q0n2Q1q5O3j02j4L0K3J7J4N7j33J04L5j38nJ8L4l2
$$ -15 15 -117 34 24 16 -10 65 -32 48 -4 77 -8 55 -47 -61 -31 -8 9 23 80 -53 51 86 -52 -57 -39 -5 -37
11825c7J2M9J6L5k8q8K0k9M8krL1k1jn6P3j11J34o7O1j7n0M5M4m0lN0n3J2j3n
$$ -37 -25 24 40 75 47 -41 -21 -50 -2 -4 -13 18 -3 -4 -60 13 -98 36 -31 30 13 -37 8 52 12 9 59 6 18 5 0
11856@l4J2J8k9K4Q6m7k9Pl2l0K2J41j13m5L7n1P8m6L8jm6K1K6K7r2J08M3j10
$$ 0 -34 -22 -4 -33 -9 77 30 1 8 -24 -54 -32 109 -4 -49 -12 -63 15 -31 7 6 -40 -19 7 34 -58 50 93 -17
11885a7L7n9J3l7J00q2K6R5o6J6J4l3M3o6j11O6P6n6pKk6P1P2o2j06P4Jp7O0j0
$$ -17 20 -39 -26 -63 37 -45 -19 76 10 26 40 7 50 -16 -127 -61 15 -41 -48 -46 -72 -1 71 9 -97 -23 -22 -99 -39 -49
11915d9O0J8Qq9M7L0n4l7J9L6j8J02o9k3j8Q1j1q5lPK6L9K8j1N7m5l3k1P9j49
$$ -49 11 29 37 -52 -5 25 -29 -66 -47 -11 -29 73 4 -19 -37 44 33 -52 -55 -48 -22 17 45 34 91 46 13 -8 71 -78
11945g8J30m3o9O9m8Nm8N8J6OP8o9j2l5J2O3j0n3k5O2K6J6n8k5qJ2JK4J5j1J2
$$ -78 52 9 -60 9 -39 -34 -82 -24 -8 -2 76 7 -5 -40 -28 35 25 -28 -53 9 35 51 -7 -32 -40 -28 -27 -3 12 1 13
11976A3M5l0pk7Qn0P2j4P0j56J0O8LJ2N1q0l4jK7J0m7J1N5n9M7K0o3Nq2P6R7p8
$$ 13 58 28 21 -6 2 -48 24 10 80 -76 -66 2 5 17 68 -12 -46 -47 -20 -10 -57 -46 9 -50 -3 17 -46 -41 -123 -47 50 -28
12008b8JO6m1J8n1K5J04p8o0M9Kl9KPk0Q8K5q9P7o3j6M9k0On7K9PK1L5j11O2J
$$ -28 -27 39 -2 16 -35 -10 94 16 -44 5 7 -32 -30 -23 -43 45 70 -19 58 -5 -21 28 8 14 -43 -14 -7 14 49 -62 0 1
12040Ak1lM8o8k4P7Op3O9J9l2Pk7N6jj0LJ2q7J9O4J4n6K0J9k6L0m0q3R6jj7J9
$$ 1 -20 -23 25 -43 -67 10 16 -57 12 31 -1 6 -21 35 34 24 27 39 -48 -29 35 49 -7 13 32 6 36 -4 -87 9 8 -9 10
12073A0p7R9j9m2J9O1k9j3j8L8l8R6j47P0Mj6J8N4p3Jk1M7K8o8LR8j39M8J1J9
$$ 10 -67 32 13 -29 -10 51 22 9 -9 29 -9 87 -60 10 14 -2 16 70 -3 -2 -23 24 52 -16 -13 85 -54 -6 5 24
12103B4r8R3p2O0r3P6M7r4NM9Nl6K6j10J94m4m8rn0M5J9p7M1n6L2K3j4L5k2k8
$$ 24 -74 19 -53 7 -86 -10 37 -57 -52 -3 2 -34 -8 -118 76 32 -16 -25 -75 -30 -11 -88 -47 -103 -71 -48 -62 -27 -49 -77
12133g7R8J08j50k7o2J29km8j7L6N6l5Ll3mJ6q6J17l8N6p1Pl3J1P9j6r2O6K8q
$$ -77 21 129 -21 -48 -110 19 17 -31 -48 -12 44 9 12 -21 -25 -9 -95 22 -16 40 -31 -24 -57 -46 33 17 -75 -9 19 11
12163A1m4R0p0O5n5M4j8j29J34q1R2%o2O6l8J8K1l3Nj38O5J01j3m9J9K7k0lJ08
$$ 11 -33 57 -13 52 -3 41 23 -106 28 -53 39 39 -23 43 5 23 44 11 16 -122 -57 44 31 -18 1 28 8 5 113
12192A13r8opp8J22m8J0o8M4O4m5l7J17j97J93o6m8N4L7j37j4P2p3J18m6j4m9
$$ 113 15 9 2 -76 46 -2 8 -60 -16 48 3 -34 83 -114 79 13 -35 19 56 -81 -95 -23 -96 22 -24 -38 -87
12219h7R0j4k6N8j9mJ04j21n5J03K3M2j32Q2p2N8q2j9P3l1O5k0j5J0l3K7J1PJ4
$$ -87 3 -11 -37 21 2 -2 102 -19 -74 29 52 94 -38 44 -28 30 -52 -71 2 -29 36 16 1 11 -22 5 16 23 37
12248C7l9qk9P9kNm5j16J21Qn2O4o8M7J9o3m1J21j16O1L5q8L3LM4Rp0j7J02QJ9
$$ 37 -2 -10 -39 40 38 43 -2 -118 3 11 -41 23 -45 2 21 -42 -83 38 -78 -17 18 -70 -37 -34 10 19 -51 -68 34 42 61
12279F1j45J73j09O7l0mK4rk2J2M5j46J32j4j36Q1M7j42N9k6J11o4O7j09N8R4
$$ 61 -84 89 -20 47 17 13 37 28 6 18 63 -83 49 35 -101 -20 27 -115 -56 -82 29 -35 32 -77 -19 75
12305G5j03k4J02j15J81j73N2j24J40M2p3Kl4M4N6l6p1J7N9m6J15j3q0L5j2p1
$$ 75 -28 -52 50 -65 116 -57 -5 -129 11 53 -20 -18 -52 -8 48 12 -59 -42 17 -29 86 73 -7 28 16 -55
12331e5Q0o6N7oo1L0KjK8q8J30j1q6N5m0O9%j27J39Pj58J80p7l4K7J5L8%j38J12
$$ -55 25 -41 16 10 -51 -21 -19 -20 8 -80 50 39 -47 8 -32 37 37 -90 49 56 -102 78 1 -33 -6 9 47 47 -91 21
12361B1o4mj2J00p9K3JN9l6Pj5j0m3M4O1o4j2L7J7m8R9j15P6l8KM6n8QK8M1n5
$$ 21 -43 -47 -59 41 -38 -15 -14 45 9 16 1 -9 -52 -8 53 -11 -23 14 31 -17 82 -33 43 5 7 53 -5 3 31 72 17
12392A7kK5J2l9l8O2j6k1j1l3J2P4%k0j1k3j1j9J26m6j2k9N0p6J7k2qN1R2k19
$$ 17 15 40 52 13 -25 37 21 0 -11 -44 -32 42 42 22 11 -12 -23 -42 84 38 26 -3 47 -29 -12 -34 -42 9 101 -118
12422a18J34k4jK5p6PQ9J5k3n8L5K2q3Q5j3j5k6l4J9L0J0MR8q0mJ2m0Nn5J00j0
$$ -118 16 -8 -9 16 -60 -53 36 51 28 -30 5 27 -56 29 16 1 -25 -59 -40 -10 0 4 102 22 18 30 -10 -5 -60 40 30
12453C0ro0pK3L5m8J02j19J21j21R3o7K1P5q6O7l9j2Q8n1j5o0O6n1pP9k1nr6J75
$$ 30 21 -39 -46 -23 12 -36 66 -53 68 -53 40 -27 -6 69 -17 50 11 -1 87 36 21 -39 27 -24 -31 48 27 22 -74 101
12483A01j77J20r9J20o7N2p7l0J17k6l1m6P9J2q8P5l2qn8O8kQ0p8o6N0J6K0n1
$$ 101 -76 44 -55 65 -2 50 -27 -57 60 34 3 -43 36 48 -40 35 3 -5 -63 5 3 83 5 -61 -11 5 25 -26
12511b6M9l3M8o7L7l7Q3j0jo8N4j9J6r4J3Q1mk2j4j3J5q5P7r4Q2J0M2J5o4j2Q7
$$ -26 23 -10 38 -29 8 -29 54 44 43 -25 29 10 26 -68 -55 26 22 0 -14 -27 -12 -97 -20 -114 -32 -22 20 35 -29 -41 46
12542D6j05J36j00j4M8j9J35j79J9O2J5r7kO0J8m1M6o7J5j8K5L2l3m6L1J16r1
$$ 46 -59 77 -23 -37 11 -8 127 -52 -33 29 44 -53 -55 5 23 -18 28 -39 -24 -42 -17 15 -18 -64 -33 83 -8
12569hl2J25k8j04j4l0R2K6n0l9J29j11K8O1q8j3R3j7k5l6J08r6P2p2K6Jl5K5
$$ -8 -40 85 57 -47 -61 -91 1 27 -23 -62 67 -44 -16 45 -43 -56 37 20 -5 -41 67 -29 43 -29 -3 -2 -37 -12
12597a2NL8p0O8n2KJ3j3J8Jjj01J41m4n6J0j5N4R5K1j36P5q5J4N2n2M2l5N9l5
$$ -12 -7 31 -39 29 -23 -21 -8 -21 -3 -2 -3 -104 37 -7 -63 -53 -68 -14 81 102 -34 41 -44 -30 22 -30 12 -23 36 1
12627Al0l5J04q0N4NLk7j4r0J29m9q0L0J01k3M9l1m7k2Q0n6Rj2J3k8Q4m1LN5q3
$$ 1 -29 -64 40 -40 14 19 22 -5 -19 -109 20 -29 -109 -79 22 -1 48 17 -30 -52 28 -28 -19 -31 -18 -46 38 -3 0 55 -28
12658b8L9o9J07l9m9J1JnK3L8o9JR2r0K9P9q1m5mN0QLL6o4K8m5jL6J7k7L2j4j7
$$ -28 11 -58 49 10 -39 -28 -27 -32 -9 29 -40 -39 53 -37 -8 71 -10 -55 -59 -9 -1 2 38 -26 2 -43 -44 -8 9 -18 14 0 -17
12691a7o1N0J8L5p6P3l1K6m8P9q6kJ02q0j8k0R7j08J16k5Kk1J3l7l3L4l4K1L7
$$ -17 -78 -28 -10 25 -51 22 -9 17 -31 48 -38 -40 62 -18 -36 -56 41 -67 49 24 26 5 18 -19 -52 -18 -52 -31 6
12720Fk6j0K4M0j2qp4L6Km1N0NL4j8q8M1L5j16o4J97q5J15m3J2O6r0j8L0l9Jo7
$$ 6 -20 -30 -6 34 22 14 -60 -24 -22 -63 -13 -8 26 8 -80 -39 -4 -120 -184 13 -72 43 0 12 78 -12 -30 0 -39 -38 -105
12751a05J10k6MK4L6n5K%J6r0R8N8l8q5Q8r9l8N6K4k5O6n2l8P8n6L2j0j6l2R9
$$ -105 5 -21 -17 7 43 -12 -10 -10 6 -84 14 72 34 -51 37 -62 -100 -44 -20 -45 21 -31 -69 9 -47 -15 -25 -41 -73 26
12781B6l4K5km4Lmo9J67l4L4q0J3l4L3m4J8O6r3Q7pk8oK1J9on8J8QL0L6q2Q2r7
$$ 26 -8 17 15 -29 -26 -30 -99 68 34 68 -12 1 -33 0 -44 -26 40 -53 34 27 -1 -7 14 33 27 -31 -13 -5 25 61 -21 61 -36
12814c6P6k9jr9Q9k3Q9q9N2j01N2jQJ4m4K5Q1j53J13jm0L0J7Nl0j34J14J7pM1
$$ -36 40 11 10 -89 0 -23 66 -23 29 -72 -20 -21 -13 1 -43 -18 63 -90 23 22 -18 12 29 34 4 -130 -16 1 -6 35
12844C5p6M5o6J41j24J12j11Q7p0O1K8n7Qj09M8M8o3N7NL8K3lp5QP9j5m5p3L4
$$ 35 -41 4 -62 79 -45 67 -44 43 -27 34 62 5 13 -96 -48 0 -63 -6 -1 37 60 57 -18 -10 69 54 9 -64 -30
12873c0j5M6Kon2j8J68j28j1N2L3p8N2p4J11k5Mm3o8J75j46J36o5n2L7L3l6M1
$$ -30 -45 1 3 -3 -55 -73 95 -33 -44 8 41 -37 15 -59 52 27 31 -12 -80 95 -51 85 20 -32 5 38 2 43
12901D3rL0l1m6Q1q4J5MJ7j20J53j24O5L3O7j10L2%j8KQnl5K2L5jn4M4lK1j18
$$ 43 34 64 33 -13 68 -16 -1 3 20 -100 53 -71 -6 27 94 -16 16 16 -2 0 8 3 -32 -10 25 24 -30 14 11 32 -86
12932h6P2m4j8J9M4J19p7O3l5o7L0km5oQ3n6J9L4n5ll9j4J5P1P3j04P1j10J6J05
$$ -86 -14 -58 -76 -57 -13 106 29 92 57 -10 20 18 -27 -33 50 -6 13 47 -8 -11 -50 -64 -49 22 95 -9 62 -48 -32 73
12962G3n3m2l1P0p3J1O0m2MN2m4NQ9n6m3P2j04J42j40N7j7L1o6L8MpK6PQ2p9m7
$$ 73 20 -22 -53 17 -56 -45 15 -27 -23 29 -15 -10 79 23 -20 52 -52 90 -50 7 -10 21 -45 -7 -3 -10 16 23 105 26 -21
12993b1KN3jrn1L9k9K3K6Llk5m4P4n2M6Qj16J23l0r5J24r5J08j07LL5Nk0Q3j3
$$ -21 -19 34 33 24 -27 12 -17 6 32 35 32 7 -37 37 -15 31 39 -77 46 16 -79 45 -50 58 -49 -46 -11 -6 -26 57 44
13024D4j10R6l4p9K1l4L8P3L3j3n3Jj6r5J57pj2l1JO3j3j4PM6j1j40R5l3M3n0
$$ 44 -66 30 -4 -83 -62 -96 -58 15 48 35 -18 -17 -33 -128 29 22 10 -21 -20 43 30 16 23 69 58 -82 13 -20 23 -27
13054b7J4j4O5Lk7m1kL1nJ7M1j00J25j37N0lrP3k5o4K5L6q0Q7lj06qj0J00QM4
$$ -27 -13 -27 38 41 14 -27 -29 2 -3 14 55 -45 80 -57 -7 -10 -19 54 29 -35 -10 26 -54 33 30 -76 -84 -94 6 14 58
13085E8j26J06m1L1l9L1l5mLM8j3k9N1j76J50J6p3N7J7n0m2M1NL1k5qj1RN9j18
$$ 58 -68 38 -3 28 -11 20 -15 -19 -16 32 19 -10 41 -135 15 31 -42 15 32 -18 -60 -19 -14 17 -8 -16 -27 -18 41 -77
13115g7J44J7lo8j6M5p2J01j40Q7k3J9j04J01J7jK6m7k9n4J31q3JKjP2m3j5O4
$$ -77 67 84 81 13 -3 42 -30 71 -69 18 -5 14 -90 11 28 27 53 6 -23 -77 54 -29 -28 -26 -27 45 2 -13 51
13144E1p5l8R2j25J17M3r2o4J44m2J4L3j76L0N4O5r3J38j16M6L2Mlo7J9K4NK9
$$ 51 -24 -62 30 -95 22 65 -27 -91 53 11 25 58 -118 -88 -34 31 -62 76 -40 6 38 42 39 -28 -9 15 20 49
13172D9j7K5n3N3m4J5p0M6l8P5m5KJ7j9J1l7L6m7O3l6J07n8n0K0J7Q7n9k7l6p7
$$ 49 32 57 4 57 13 28 -42 4 -34 41 -4 -2 15 -4 7 -30 6 -41 22 -14 93 35 -15 5 22 109 50 23 -13 -90
13202i0J73j35P7k0L1j01O3R0n4n0R1j50N9R1p3o8N4L7o9LN8N6j6o8M7oj5L8n8
$$ -90 83 -52 25 5 36 -65 -2 88 34 -16 75 -75 -16 75 2 -66 -12 25 -44 -41 17 73 57 -11 36 30 15 53 -5
13231eO3k9N4J3j52K2L5Njp3J29m0j1m9LP0q7P0m8LK9L3l7l0L7M0k4n1R3j8r4
$$ -5 58 29 83 96 -56 -34 1 6 5 -68 61 21 10 -39 -36 34 -53 17 -31 -28 1 34 -3 -33 4 44 20 -31 62 44 -50
13262e0j1PL1J08o0j57J48OOL4r7L4Q5o7r9Q3K1LpJL3k5Ko4k2P3n1j5J05n5Mj0
$$ -50 -61 -54 -23 85 25 -132 16 22 28 62 -35 -1 84 17 -82 1 22 25 18 19 52 27 29 -35 -57 16 -35 -50 55 0 4 -6
13294fM8m2k7L0K9Ql5o6n1J2O0J27r4QNJ8O9j81J05m7K7ok6M7J00j12P9j11N3
$$ -6 42 0 -27 3 32 40 5 -61 -112 -100 -40 87 -7 1 6 24 93 -88 17 -30 -3 -9 -35 12 112 0 79 -32 21
13323B1N0o4m8O5k1M0kj42R4l2O9k2L7m3q8M3O0k8L9o0J26j00n6k9J7K3K7MP3
$$ 21 71 7 -41 24 3 43 41 -101 -7 -39 30 8 45 2 -86 -43 17 -11 28 -32 94 -6 -62 -91 -74 -51 -24 -20 53
13352E3j07JP8L0l3l2N4j09K9K1L4nn4N3K2q4N9O4p4J2NO3j39P9j3J7o5J31l2
$$ 53 -54 -53 25 55 22 -10 44 -65 -36 -15 19 14 -40 13 35 -49 10 74 0 12 17 80 -59 20 7 24 -41 90 58
13381E8q7J2N7jj4%n7J1j3J12m6j1n5P5J2l1Mp7m4P6n4Q4M5j9n3j0M6J8p1j0N2
$$ 58 -29 -17 40 39 25 25 -32 -21 -34 78 32 21 -34 41 53 22 26 -51 -95 -19 -73 11 56 37 -16 -26 20 38 -33 -43 9
13412IJ9K9m0L8j12R3J6j35N6M0m4R2Mj05M7n2P7kn9Q8j3o5j0J8PJ8k3L9q6N4
$$ 9 28 57 17 55 -57 36 52 -83 -27 13 -31 61 65 -40 7 -45 32 30 -29 59 46 -19 -29 -11 -4 14 -9 30 -56 -2
13442bp4M2PO6n1mR3q6q2O9P3o4K1k7RoK6RK2K8o3rn4J14j1K5J2n7r2J12j06J07
$$ -2 -76 -34 -27 39 -12 -16 77 -9 -91 -22 51 -13 8 -19 -10 -16 10 19 41 69 6 -3 -57 57 46 71 83 26 -66 46 -60 47
13474D7r2Q0j5M9j04k2Q2q%P1j64O0M5k2J2l0M5J1o8N8n5o9J22p0O8Ll6O8N8j68
$$ 47 -45 35 20 69 -35 -57 25 17 17 88 -76 -16 29 7 19 -11 34 45 -23 35 -20 -89 33 -37 31 34 -2 66 124 -44
13504d4O2L7r3oJ11j5n6kp0M4l2N3QJ0O3j23NOk5K7O2k4lK2k6M0k0J2J4q3M4L8
$$ -44 18 55 -38 -44 67 52 -4 -6 -76 -32 -64 -11 -3 7 70 -53 -48 -42 -67 -40 22 -2 -5 17 -9 31 11 23 37 -46 -2 36
13536C6j05M8L0L8n6m0Q0Loj1j1l6N9q9O3J6q9N8N5p9L9o3N2L5P5l2r8PN2j9j1
$$ 36 -69 -21 9 47 -9 -49 31 34 28 17 6 -30 29 -60 3 19 -70 -12 43 -36 3 -60 -8 27 102 70 -28 -21 31 12 1
13567Am2L2P5q5O2k8J7p7J7J67j53j4Q2q9J1n6O3j48J62mJ6n3M7j7l0N4%l7O9
$$ 1 -41 -9 66 -19 43 15 32 -45 -28 139 -14 -28 54 -35 -24 -80 -17 -165 -3 -7 9 -44 3 -14 -44 10 10 -27 42
13596D2m8kMK9r2J07j11N7J02r8K8o4K2K5L7m6K0nm7L1L7J2n3K9K8r9Q0k0m3j7
$$ 42 -6 -8 -4 25 -67 40 -71 -14 88 -10 18 -46 -24 1 38 -8 12 7 -40 -9 28 40 -13 16 44 -55 25 5 -38 -55
13626e5oj5J24n8J15j40J59j15o8KK9J7r5J09j8P8p4O0o2m2L2L8N5r4M3Rj6n7
$$ -55 -61 -76 48 -10 105 -35 124 9 -59 -57 -28 -11 -106 3 -15 63 -11 49 -13 -55 -23 15 70 -24 19 28 12 -45
13654d5N5K3K8r0rQ9p3k8M2J7K7m0qJ3J0j4n2n4J01k1Q6m2O4p6k5L2L6p0KJ7l7
$$ -45 10 33 61 -29 -38 51 -22 -50 -8 9 36 -4 -12 1 11 -3 -55 -109 -8 -29 57 15 79 3 -22 10 46 -24 -22 -5 -42
13685d2L4k1N8L6j06N7o4Q1q6N0j0lN3j10O6L8k5O9KK8o7k5O2p9J13q3n9P0nq5
$$ -42 -8 -29 29 65 -41 16 -48 33 -53 -3 -13 -16 37 -73 -7 31 6 75 77 105 38 13 75 -4 109 26 -33 37 32 -53
13715e3O4M8l1m9N9Q8j48Qo2J76q9M4L5j45o8J02k1P7qm0L6K0k5m7L1l0J6O3m6
$$ -53 11 59 28 -21 38 126 -22 -14 -76 100 11 55 90 -55 -123 -21 -42 35 27 -13 23 43 18 -29 2 -28 -12 51 5
13744Ej7Lo1P9jN1o0P1p6K1j0J8l0j2J0N6l3oK9l2J0k7J7L5J0m8L5n7L9M3op1
$$ 5 -12 -9 -70 9 8 59 -1 70 -6 15 5 23 -7 -19 -9 47 14 8 37 5 15 -12 5 40 50 2 37 -20 19 62 56 -15
13776a5M1j5RL8r0J15j28J17j16l8Q3k0l9J8M0q8J58r2L0K8J4p0LR3p6o6J40j14
$$ -15 26 11 20 58 -32 83 -45 72 -44 -82 1 -19 -58 -40 0 -88 70 -22 8 36 50 -20 -17 76 0 -66 74 -40
13804d0J12k8J3J3p8rK5k3jJ8k7M4l6L3QJJ9p6O6qM6q5Mm7M5Ol1L4J2Mk7P5j9
$$ -40 72 44 57 70 -8 -17 8 -15 -16 2 -25 19 -17 16 24 25 44 -32 34 26 72 -13 -9 -56 -11 -5 -36 -2 10 14 -13 62 43
13837D3k0K9pj25J67n9o4L1M4n0O3qo5O0K2l6n2L3j1M7n7J0J24j33k8j1K6R3o3
$$ 43 23 52 45 -80 87 28 -36 -5 39 -11 52 44 -21 39 61 25 -27 6 -5 42 -15 -5 119 -14 -42 -53 -27 66 3
13866Cp3PO9n6K2R7n8l6P6m6M1p8J47j48J06j04J5n5j6N0K1PkL2pN7j15N2J4K0
$$ 3 -70 -63 6 -50 -28 69 11 -25 51 5 46 -32 115 -33 73 -31 -16 -71 -87 -37 -16 -9 -11 21 14 71 -44 8 22 42
13896D2K0n5l4j7j2J39%m6n8l7O9M9j32J64r9R8j53P0m3jL7M1rj19J21m6m5J24
$$ 42 62 7 -27 -44 -56 83 83 37 -21 -58 11 60 -72 92 -7 91 -62 8 -35 -36 1 42 33 -86 35 -11 -56 68
13924F8%l4k9k9M3n6P7j74J02K2J8p8P5k8J5l5K5J7L8p6K5j0Q3p8Ll3K6Q2p6k6
$$ 68 68 34 5 -24 19 -37 40 -134 -32 -10 8 -70 5 -23 -8 -43 -18 -1 37 -39 -14 -24 59 -19 -16 -49 -23 59 -17 -43
13954d3L8M8l7qK0km4K8m9N8J3n1RJ7N2r1J21q9j9KJ1N1j54J72N7r3m8q2P8L9
$$ -43 -5 43 6 -2 18 16 -28 0 -49 9 22 -29 -20 -3 49 -42 79 -10 -29 -27 -16 35 -119 53 110 17 -31 -113 -35 4
13984Drl0j5N6m8k2O9O4k7n3m7P1l6N5r8MK2P4q0P7j9k2L0m3l1J23j30pQ4m9R
$$ 4 -5 -35 -50 6 -42 -64 5 69 42 -11 -58 13 -23 32 -66 -62 -40 34 -46 31 12 -10 20 -23 -54 69 -61 -68 16 -33 -24
14015b4kJ6l4J12r9J6K0p4J22q6K6N9J5o0NM5j35N7P9m2j3l5O4j8N3j34J06m3
$$ -24 -26 -10 -44 68 -31 -15 5 -69 53 -33 -7 52 67 7 12 57 -78 -21 58 16 3 -32 32 14 67 -67 39 -4
14043dN2r1P5lr4Q7o1M9l2L1j4RpLj7N6q3n5J19k2p4J13k9mPm2J03o2NJOj1J4
$$ -4 48 -43 32 29 -65 22 -39 10 -22 9 -5 4 -3 0 -17 39 -44 -99 20 -2 -76 37 8 4 11 -31 72 10 15 16 22 11 25
14076B5j30J22m6P0k9rm9N2j7J22j08Kl2L2OK8n2n1L9R0l1l5O7j00J02m8q0K9
$$ 25 -105 17 -29 41 12 3 -46 6 -11 111 3 5 -27 5 11 39 -13 -64 -25 65 34 -1 66 -34 68 20 -60 -31
14104c1R8j9r3O1N0m8m5nK1J09j24m9P8j47J84k0l9n6l9O7J9j8j8L4N7q1O9J1
$$ -31 67 48 -45 16 66 18 -27 -32 -11 98 -26 -75 3 -144 40 20 -19 -75 -114 -47 -28 -46 -64 -30 27 -54 15 26
14132B6N2j39O7j5n3O1j6Q6n7J4o6N0j00Q7n7%Q3Rn2P9l2K4k8n8L6p2J30j13K2
$$ 26 78 -61 6 -9 -62 -1 -17 69 12 26 -40 10 -90 -3 -60 -60 23 32 -20 59 27 51 23 -35 1 -71 59 -54 -32
14161c2N8o1K3k6J28j04K7M8j17J05r4K4m7M3J8N5j8n2K0j8J5m7L8l1O8j9J11
$$ -32 26 -35 -12 -38 90 -14 13 61 -56 49 -45 -21 -68 -25 -7 48 30 -22 -2 -20 -5 -52 -14 -45 23 4 115
14188A15p8j25R2R0j41RJ05o7K0m9j1M2k5N9j19R0Ml4J04o8k7N3k8pj0N4n2n2
$$ 115 37 -88 4 94 -47 -38 67 0 20 -29 -40 2 -23 36 -83 7 11 -23 81 13 -14 39 11 4 -6 48 -4 -56
14216e6J28o2L3m7O7n7m8P9m4m3P2n9%N5j6j0mqQ3p7k4K8j5n7J20o7N0j2n8P1
$$ -56 72 10 43 -4 63 6 -42 37 -7 -50 22 -37 -37 18 2 -8 -12 -20 63 -14 -38 -10 -25 -82 38 -29 21 9 -49 22
14246B2%o2J48j38M8Rn2KN5l8M7j1l3K7n8K3M3k4K0q6O6n2P5o3M0k5RJ5j5N5r8
$$ 22 22 -40 108 -30 18 27 -25 -23 32 -6 41 30 -3 24 -34 -11 32 8 28 -58 8 -44 31 -32 8 -17 -8 7 -8 47 -51
14277e1N6M0l7k9N2j7K4J4Lm6L0o8j2N8o7Q8k1k2J08j4q2lr7J66o7j8K7j4k5Q3
$$ -51 5 45 8 -21 31 14 38 52 55 9 39 -29 -41 17 -50 38 17 -5 103 89 7 4 -93 73 6 -12 15 1 -24 59
14307E9p2J7l1k8Q6m2l3NQJ0Q2j17Q4m2j1OM9l4n1J05l9k2l6K3J6l4K4K5rn3Q0
$$ 59 -13 4 -27 -55 31 -11 -44 -39 -31 -21 61 -56 28 -14 -25 -19 30 -4 -55 50 11 -11 -47 -24 -8 -42 -18 7 -2 -55 25
14338B5l3J2L6lq0Q3N4o0o0L3q4O5k1M1J1k1L3J7r9Q0n4oJ3J1lP4M3q0p6L1k9
$$ 25 -8 4 40 37 -43 40 94 34 -26 7 -77 -12 -33 8 19 -2 31 48 -51 29 -25 -31 -18 -7 -10 64 107 27 -49 -18 -47
14369d7L3J3l1O7ml6N1rJ9l1l5J7j08J28j4L8j11mqM3R1o0J5l9J9j9k8k0R3r9
$$ -47 -14 -1 -32 35 31 -5 46 37 56 25 -10 7 -101 27 13 51 -60 -64 -72 -29 62 2 17 -22 -3 -22 -50 -70 23 -76
14399g6J26n1j7kn0M7p9M8L5j5K2m7p1J27n2k0Pk7P2Q0r1K6L2rk2R3J5m8p0o4
$$ -76 50 -1 -18 -20 -70 -23 -102 -54 -19 -34 -12 -59 -130 -3 -55 -75 -68 -95 -23 57 -34 -8 24 15 -7 86 101 53 -17 -81
14429h1J09j1N3r1N5J5l3o3m2J13q2J06l2p5O9P4j41P0o6PJ05n6J5o3K4nN1l9
$$ -81 28 17 70 -21 34 49 16 -47 -89 24 -58 48 16 -59 10 84 -57 13 -53 -46 59 3 18 -45 -21 -26 25 -14
14457a4L0j2m9J8O4j01M7N3l0o5J14k1o0l4O1K6n1M6k2OO4o0L2j4r8P3l2N0m4
$$ -14 16 4 -45 -27 37 -64 -17 36 6 -59 55 34 -26 -60 1 27 -24 22 0 6 70 10 42 28 -70 3 -29 21 -23
14486b3O4l6q9N3K7L8n6n9P2L5o3M4n5n3K3P7P1k8p1n0J11m5l7ML0j2l9J40o3
$$ -23 41 5 -84 -31 -4 34 -22 -81 -9 26 -37 7 -48 -101 -78 -1 70 42 -29 -79 32 -13 -50 -46 -16 -28 -67 73 10
14515A0J9qj23R5P9n9M8q6O4m0k6Q0j22R2k1k9J1j3J00j36J21p1N3Kp9M7rl2j3
$$ 10 29 21 -102 -7 72 13 61 -25 39 -1 -27 53 -69 23 2 -27 -16 -29 71 -65 56 -15 38 40 -39 8 -1 -33 -46
14544d6J8L1o0L3m2j2j7O1P3l9nl2J6mN7nNj27J3M0j3N1jpM7K7j0o4j9N0L7l4
$$ -46 -28 3 -57 -24 -66 -78 -95 -34 39 0 -5 -37 -21 -25 32 27 32 -95 -82 -42 -55 -4 -5 -12 35 62 52 -12 -31 19 56 22
14576B2j7mok9L3l2j3N4K6Mo7l3P4K3P1r9J5n6M9m5K2M6j6j6Rl3n4K1l4Q1j2L3
$$ 22 5 1 -5 -34 -1 -33 -46 8 34 38 -29 -62 12 35 106 7 22 -34 15 -30 -8 38 22 6 15 -18 -72 -51 -85 -4 -16 17
14608A7n3k9Q0n6KL4O0k7n8j6J37o0n4O7j03J36o3r5L4ON5j5LN5l0L7r3pJ27j46
$$ 17 -36 -65 15 -41 -39 -5 55 28 -30 -46 91 31 -23 44 -59 77 14 -81 -47 -41 14 -1 2 57 27 64 -29 -36 91 -55
14638e5J30q4j0J4JM1k0k4l8L4J5N7o9%m0P6r5P3o1L3JmP3l4l1J8J3m2J0L9n6
$$ -55 75 -9 -19 -5 -4 37 17 -7 -45 -11 4 61 -8 -8 -48 28 -67 6 -55 -22 -21 -25 48 14 -17 1 14 -28 -18 21 -35
14669c5R5n0n6r9J19M8M3o8j5Rk1j4J5M3npr3K3L6L3l4Rk7krm6Q3J28j51Q3q4
$$ -35 60 10 -46 -145 -26 22 65 -3 -18 -9 -30 -44 -29 14 9 2 -91 -68 -32 1 -33 -24 -51 -53 -62 -108 -25 103 -48 35 -49
14700d9J20r2kNN7m3p6Q5O3l1l2k1l7j7J64j71J18r3L1k4L4j04P2O3LJ01p2o0
$$ -49 71 -21 -23 -18 39 -4 -80 5 68 37 5 -16 -53 -70 94 -77 41 -52 -21 -45 -11 -115 -43 20 23 124 52 -8
14728hO0p2m8J06j01O8N2m7l1M3m2mo4R3l3K9l2lP4n8j6l9O9nl3NQ9o4L1m2kR4
$$ -8 52 -20 -68 38 -63 5 57 10 -21 22 -20 -24 -88 5 -28 1 -31 -34 40 -18 -34 -73 -4 -9 -42 -37 52 -12 19 -23 -25 69
14760F9m7O2m3l5n0l9L8QpR9m2M7N2j54L2l3Q8j17R7j6j5Qm8J08o6pj8j0p5M7
$$ 69 22 84 41 6 -44 -83 -45 -37 -44 55 13 60 112 -42 -10 -43 45 -72 25 9 -6 2 -46 62 -4 -11 -29 -39 -114 -67
14790f7j1Q3l9m8l2J39k0p4Q5m9qJP8r2O6o7P6k8k0n9J8J1Q1l6j6Q7l5p5O8M3
$$ -67 -78 5 -34 -82 -114 25 5 -69 16 -33 -41 -40 38 -54 12 -55 21 -7 -27 -86 -68 -57 24 -12 -28 59 24 -51 17 60
14820F0q1J3Nkj9K3o1O9kJ2l8L3j07J01K3l0m8P6p7L4o3J1K5N5n3N7M1n3m3O3
$$ 60 -21 -8 -3 -5 -24 -1 -62 7 5 17 -21 12 -95 6 29 -1 -49 27 -50 -16 -79 -68 -43 12 -41 16 57 4 -39 24
14850B4K0m4P7m6p9j1K4R9n6K9j8q9J02m0k0J01Kj03J9m2N6j0m6O9l3n0Q9J6q0
$$ 24 44 0 77 31 -48 -59 -35 64 8 37 19 -70 32 -8 -28 73 75 -28 -9 -51 5 -5 -51 18 -15 -65 24 40 -40
14879d0M7%rm3L3j4K8O6l3o4nk1M5N2o0P5q6QK5j7N9l8k3q5R5M5n9k8M2oj2qJ3
$$ -40 7 7 -2 -45 -12 -26 2 68 35 -29 -34 -55 -10 42 -18 57 -29 -21 4 -13 46 8 -15 -100 -5 40 -19 -47 -5 -11 -23 -31 -18
14912a8j0L2P3j17pL1N1p1P8m7j3L9l0mO1p1j0K9QQJl4j5k2J7k5K3K6jn1J7Mj7
$$ -18 -28 4 77 -40 -47 -16 35 -36 42 -5 -18 21 -9 -13 48 -23 -33 -4 4 12 13 -21 -36 -58 -41 -66 -43 -17 -18 -69 -52 -48 -65
14945f5Q4J6r0O1n9M0K1M6q6K0L7OKnq5M2J1L4k9rl7M7j05J42o8k8K3L4q4Q4K
$$ -65 19 35 -55 6 -53 -13 8 54 -32 -12 25 31 33 28 -57 -15 -4 30 1 -8 -45 2 -103 39 -29 -57 -34 0 -84 0 2
14976BLO9j28N1k8K4l4m4N7N5J7j12N4O2n1l5k0O4Q4j28L8k7N0o7L2M9p0O7k7
$$ 2 5 74 -54 -3 -31 -7 -41 -85 -28 27 44 -68 -14 48 -3 -38 -58 6 90 -38 0 -27 23 -44 -12 37 -33 34 7
15005GL0l2j4o1R4n4Rk3M9l4M8k9NK4q0l5Q0j2L5q7Q7m2N7k2l6M6L7r7J7M9N1
$$ 7 37 5 -9 -70 24 -30 -21 -44 5 -29 19 -10 -5 19 -61 -96 -16 -28 7 -80 7 -35 22 0 -36 10 47 -50 -33 16 67
15036F7j4k7j1J5K8m2M6K4o2l4m6mK3L6k9J9mK3k4O7o2k5K1P2n0n2L6Q9m5k4K6
$$ 67 53 26 15 30 58 16 62 86 24 -10 -56 -60 -37 -1 -30 -11 -15 8 -16 51 -11 -36 -15 57 7 -45 -9 80 35 11 37
15067C7j7M2n1N1p1ml0J2O9m6R8j10k7Q4L7m6m2KJ5j25J45l7q1N3MJ3J6l6L4K2
$$ 37 20 62 11 62 -9 -13 -43 -31 38 -8 90 -20 -47 37 74 28 -14 -12 3 -122 23 -14 -95 -42 -38 -25 -9 -45 -11 11
15097A1L8o2L0m7pm2J59j39nO7r9J01K0L3m0K5q0N0J0k8m5j4R4K9n4K4k1l0J0
$$ 11 49 -13 17 -30 -37 -79 80 -59 -64 3 -96 5 25 58 18 43 -37 13 23 -5 -50 -64 30 59 5 29 8 -22 -12
15126a2M3o1K2J6Rr3M2k4LLJ6j6L1L8k2Ml5KJ20q2n0K6K7n9kO0q5J01l3nN5j33
$$ -12 31 -30 -8 8 17 -76 -34 -58 -55 -52 -36 -52 -21 17 -5 -1 -36 -34 86 4 -46 -20 7 -52 -54 6 -79 22 -11 -16 39 -94
15158i4P6p8P4O7j8p1Q1N0j52K8k7J3MJ09j3q4R4l3j4Pk4O3k9m1l2J14r2J8l0
$$ -94 -18 -96 -22 45 27 -44 37 87 -65 -37 -64 -51 -47 62 49 -35 59 26 12 19 -5 58 29 -12 -44 70 -22 -4 -34
15187c4J0P0q5M4R2q5j1r8P1l6N7j0RqkjP6m4nj6M9n7K7K4j12M4M0qnk3Q7j71
$$ -34 -24 46 -39 5 97 12 1 -97 -26 -62 -5 -15 -6 -14 -16 -17 59 15 10 -6 43 -14 13 37 -75 -31 9 1 -4 -27 60 -111
15219a11J37K2j11Q6n3J31o1q7M3k5L4m3l4J15Lm4nk4M7j22J43K4j41M6Q1r5N0
$$ -111 26 48 -63 23 -30 101 40 -47 -4 -29 5 -38 -72 43 46 2 -3 -27 20 -102 41 65 -76 -30 51 -44 6
15246Fm7n0J18Q3j34k8kL8J9p9J20J8q0P6j5j06Q4n7n3P1N1j18kK5P3l9O9m3M9
$$ 6 -41 -91 27 110 -24 -52 -54 -16 3 -76 44 62 -18 58 43 -63 21 -36 -89 -18 33 -85 -87 -62 11 -28 41 -2 47
15275D7k1ok9N0j1p6%J4j6P9k2j1j9N6n8J9M4r3R0k4n2j6P7J9%m8L1n5L5O1q1
$$ 47 26 20 -9 41 30 -46 -46 -32 -48 31 9 -2 -21 35 -23 -4 40 -53 37 13 -39 -55 22 41 41 -7 24 -31 4 65 -16
15306a6q8L7J10o7no1R8n4N3r0J20m0M5r4K0K0l5K6o6J43n8j1O0j58L4O0M0j6
$$ -16 -104 -67 43 -24 -29 -90 8 -46 7 -83 37 -3 42 -52 -32 -12 -47 -21 -87 56 -2 -13 47 -111 -77 -17 23 7
15334GRmro5J08j50L2P4M2o9K5k6o3P8J9r6O2J7m5P6J1o5M1Nj1k0N8j28P3K8k7
$$ 7 16 12 3 -62 46 -104 -72 2 44 -25 0 -26 -89 -11 8 -88 -26 -9 -54 22 33 -32 9 14 3 -17 41 -87 -14 14 -13
15365a3m5oK2m9Q8K0j4k6R5n8m7P6o9K3l7K7m7j3J53j28P1l2j4l1J0J3jP8j8p1
$$ -13 -58 -64 -42 -91 -3 17 3 -23 72 14 -33 43 -26 -3 -40 -13 -60 -73 80 -48 23 -9 -23 -54 -44 -31 -32 46 28 -43
15395d3Q7k3pp6M2j8l5J3K0ok4J46j05k9Q2j08M6m6K7J09rl6o3P6l4l5P3m0J5
$$ -43 44 21 14 -62 -20 -38 -73 -60 -40 -46 -70 76 -29 -58 24 -84 -38 -84 -57 52 43 7 -56 20 -14 -49 24 -16 -1
15424aRM5l8l8Q6r4R0j15O0j9QM0q6J32m6r5M8L0J3Mo3K7lr3J22mj11J00Ll0J3
$$ -1 8 53 15 -23 63 -31 59 -56 4 -15 -7 33 -53 79 33 -62 -14 16 29 33 -30 -3 -6 -99 23 19 -92 8 11 -19 -6
15455fK1k3J9Q0m9o7j6J72j59P5l6k2Oj9Rj1p6J13Jn6L1j8M7K6ol3k3O5n5kk3
$$ -6 15 -8 11 91 42 -25 -41 131 -28 47 11 -11 -5 -24 -15 -26 -102 11 12 -44 -13 -31 16 42 36 3 -20 45 -10 -12 -35
15486c5M9K9K9o8jp0R9M9j27M2k6R9o3k3qP1p9M5k5J8l7L6K1p4O8L4L4q1mol8
$$ -35 14 43 72 4 3 -67 32 81 -46 -4 -30 69 6 -17 -25 46 -33 12 -13 5 -32 4 25 -49 19 53 87 6 2 -4 -42
15517d2O2m8J2J4kl1k0M4q5O4n9O2qjN0n7O2n1O0L8j57J03j0p5K1O5o4O5l3rl5
$$ -42 20 -28 -16 -2 -4 -35 -55 -11 -96 -32 -91 -29 -37 -38 12 -45 17 -34 26 64 -93 10 0 -75 -54 11 -53 12 -21 -30 -65
15548f5mJ47q7p0L6J5O2r4R5J5j2p8J7R9j08K5J8o6P6O8j02p1J32j8n7oM3N2o6
$$ -65 -69 78 -9 -79 -43 -28 34 -60 35 50 38 -40 -23 76 -32 -7 11 -55 21 89 -13 -84 48 30 -27 -33 10 62 -4
15577dJ05j01m7K6m8J21j9r3L4L8o8P6j52J75k1N7q1J15p9K9P4j45l1O6k4J6K3
$$ -4 101 0 -47 -21 -69 52 33 -60 -26 12 -56 20 -132 43 22 79 -2 113 34 63 137 -8 -39 27 3 19 42
15604D2n9M8k8j5J9J1l4L8L1q8M9j8J6M8o5L3m0K1M2n6M8j24J07j0m6Q6m8l2n2
$$ 42 -17 31 3 -12 7 18 -16 22 53 -35 14 -4 12 60 -5 28 -12 9 51 -5 43 -81 26 16 -30 56 8 -24 -76
15633g6R8n9M1n5M8k2o2J18Pq0K0P9n3N3j10J33q9l0l0Q2o6j4L4L5lO0j05P8J3
$$ -76 22 -37 4 -51 -3 -25 -87 31 38 -42 -22 57 4 57 -53 80 -9 -39 -69 13 -53 -67 -33 2 -1 59 -46 32 45
15662D5K6l5n7L2k6J4J0k3j6n2R0q7P6N5j3n5j3J0M2o9L5O3n1kLK0L9o8P1j47
$$ 45 71 36 -21 11 -15 -1 9 -14 -30 -82 8 -79 -3 52 39 -16 -29 -19 23 -46 -11 52 1 -1 2 22 61 -7 64 -83
15692h3O0kJ2q8P9mn4J45q3K4J3M4j13P6r3L3O1n7MK7l8R4r5mL8n7L9N0o9N8j0
$$ -83 -23 -25 -13 -101 -22 -26 -80 65 -18 6 19 63 -50 26 -67 -34 27 -30 -26 1 -37 57 -38 -42 -4 -61 -22 28 -41 17 7
15723Gn4M1j5J3k8N3k4k6J10j13K4L1q0M1l3J37j26M7j11M1L3P7Pj11O7m2kKN9
$$ 7 -47 -6 -21 -8 -36 17 -7 -33 77 -36 -12 19 -61 -20 -53 84 -42 5 -106 -65 -32 45 52 -59 8 -34 -36 -34 25
15752B5N5m5jo5jo2L1N0J0mn3n9J28j8J7k2N3l6j8pk0ON6O4l9m9P1j87Q3J6K9
$$ 25 80 35 34 -31 -32 -94 -63 -13 -3 -7 -60 -119 9 -9 8 -14 39 3 -15 -22 -42 -36 20 84 45 -4 67 -120 -37 -21 8
15783HK5m2O7o8J4j5lk4l4j2R7J4qo2N8n0P7l2J3p6P5j1o4R0k2J2p8J21r8J9L
$$ 8 33 -9 58 -10 4 -11 -14 -38 -72 -84 13 27 19 -43 15 -35 42 10 23 -53 22 11 -53 37 15 27 -51 70 -28 -9 -6
15814fl%n6M4n2J27j04K4K1nl4O9%k1p0K6L4K5J8l9k5O0j11N7O0l5l0Q5p7J5k0
$$ -6 -9 -9 -65 -21 -73 54 -50 -26 -5 -10 -44 25 25 4 -66 -40 -6 19 37 -2 -27 33 -78 -21 39 4 -26 59 -18 -3 -23
15845b3J1Q1p2j0J0O4p9L0Q6j05J6k0P0o0l1j6J01j68R0L9Jj26M5J25m1P0j39
$$ -23 -12 69 -3 -13 -3 61 -18 12 98 -7 9 -11 59 -1 -32 -48 53 -115 -25 14 15 -111 -66 59 18 88 -51
15872e1P9o7K5N0j5l5m1K0K1m3J1j5P1j30K08q6J01o3J2r6k3P8l6N3J9k8m1j2
$$ -51 28 -39 -14 36 21 -14 -55 -35 -14 -57 -46 -61 10 -120 88 2 103 40 52 -44 -67 11 -25 28 47 19 -22 -34
15900c4R9p1j2l2JM8j3l6%KO3o7J46q8k4L9ro1K6M3m4K3L9q2J04o0pN0r2J10o6
$$ -34 65 -6 -18 -50 -49 -1 -14 -50 -50 -48 15 -52 94 6 -18 21 12 -49 -23 20 -24 -1 38 -44 60 0 -7 43 -49 61 -5
15931eRk4oL1lJ00j2l3j25M8O9l2nN1j2q4P7n1o2O9j9n1O7P1p7k0j6l0J30jl5
$$ -5 4 -20 -26 5 2 102 90 57 -68 -20 49 17 12 63 51 -33 44 -7 -69 0 -19 -70 -3 68 -9 -29 -45 -75 55 54 19
15962A9p6P9KkJP2l1j22P9K7rk2k7PM6K5n7j5m2J09p9L7l8K4p0P1k6q0J29j32
$$ 19 -57 22 24 22 23 95 64 -58 21 48 39 17 -10 -3 43 68 11 -4 -46 63 -16 21 -17 7 -63 8 -18 -98 31 -101
15992a01J21Nn8M1o3N0Q4k6l6N5m7o6J37k6q8j9J18p5kP3Pm4n2J0M0m4M6j36Q8
$$ -101 20 25 -33 8 -55 -5 79 53 17 72 25 -41 96 70 -18 -37 81 6 4 77 84 40 -12 -2 38 -6 40 -96 -8
16021hJ0l5L7M4j8nj4LM3l7l5jJ7K2q4mM5r4Q3P5j03Q2M7o0l7KK2L1o3n1J21n
$$ -8 2 -33 4 48 30 25 11 14 57 20 -15 -16 1 23 -61 -65 -20 -114 -31 44 -59 23 70 10 -27 -25 -3 28 -35 -86 35 30
16053C0ql7nj9j6M9o5K4J9RL3op7J17k9J0l9l1NP1p1j1J27k8n2JJ9q5J43k3j76
$$ 30 22 -15 -20 -39 -55 -6 -71 -47 -28 -19 14 8 -69 48 19 29 -10 -41 -36 35 -36 -47 80 52 0 1 20 -65 78 55 -121
16084a21J15J34j45l1O4J1pm7Q2p7J3n6Q8k0o4ONK1O6rK6n8n3J04K4l6q9P0j8
$$ -121 -6 128 -17 -48 16 27 20 -27 55 -22 -9 -65 23 3 -61 -55 -50 -29 37 28 54 -4 -57 47 71 35 -54 16 -2
16113bJ4N7r2K8K6o8N3n3K8q4L5k1N5L8j5K7n7O6q1K3J8K8qQk1j0K0n1R8j08J26
$$ -2 12 69 -23 5 31 -37 16 -37 -9 -93 -58 -79 -24 14 -1 26 -31 35 -46 -23 -5 23 15 23 2 -8 12 -39 59 -49 77
16144G7j25O0k6j6M3m5R9l4o7M3k9K6J1m2Rk5J56j71kOpN4l0k0Q4k1L8n6nL3K7
$$ 77 -48 12 -14 -30 13 -32 67 33 -34 9 -20 6 17 -25 -16 -41 115 -56 -58 -52 -59 -5 -35 -55 29 8 46 -10 -15 18 45
16175D5q5R4j7m5J8p2R3J5p6j5P1n6k4P0nJ2jm8J2Rk0k0J30r3qKpl4O9p7M4p8
$$ 45 -40 54 37 -8 10 -62 31 46 -30 -45 26 -30 -54 16 11 23 22 -26 -14 -5 -25 -45 85 -8 -16 -14 -21 -55 14 -63 -19 -97
16207i7M2K3m0P2j9K6m3qNJ05j27Q0mL4p8K6k5M2K0K0k2k9o4m3J49n5j8P7k3N7
$$ -97 -55 -32 -72 0 -19 7 -36 -44 -39 66 -61 19 15 49 -29 -3 -28 14 34 54 32 3 -61 -104 45 -10 -28 49 26 83
16237H3r3M8L3j32P7Qj2J2m0L0q7J20n5O1p1K1n2P0lj15Q6%N9o3N1Kk1k3jk0L3
$$ 83 -10 38 71 -61 16 24 12 24 -16 14 -73 47 -8 53 -18 3 -49 21 18 -97 -11 -11 48 -15 36 38 17 -6 -7 -27 6
16268FR8m7Lj8k7M8j16j1K9M5J00p7n9O2j16J05J3l2p4P5Pq8K6l5P4j6L5jK8M5
$$ 6 104 57 60 42 15 63 -53 -64 -35 10 110 33 -26 36 -80 25 38 6 -68 7 14 -74 -48 -83 -9 -25 10 9 37 82
16298H2o1rK0J0j1k3J1N6j00j9J39l1j2m9K6N1m3n1K0j6J2j2j1K5k9L9K3k1o0
$$ 82 21 12 32 42 31 8 19 75 -25 -44 95 64 52 3 29 80 37 -14 6 -10 2 -10 -21 4 -25 14 37 16 -44
16327d4J9K3PN2l8k3NL2m8R2o0j5M2l1p9J14o3K2k4K8m5L3M0j02J2J20n6j9qL8
$$ -44 -25 -2 5 57 19 -4 1 33 -15 77 17 2 44 13 -66 48 -15 7 -17 11 -34 -1 39 -63 -51 69 13 -6 -14 24
16357B4r7O0o9M4L3r4jR0K8k1J06j39O7o9KL8O6n0q6O8plQ7o0J9l1
$$ 24 -73 -13 -82 -38 -5 -99 -100 -10 18 -3 103 -36 31 -38 -36 2 68 18 -68 0 -7 -10 77 17 36 5
16383E
$$ Imaginary data points
##PAGE= N=2
##DATA TABLE= (X++(I..I)), XYDATA
0@%%%%%%%%%%%%%J6l2L2l2L2m8O4o4Q0r6J12j43J59j76K08k40K73l21L69m17M80
$$ 0 0 0 0 0 0 0 0 0 0 0 0 0 0 16 -16 16 -16 16 -32 32 -32 48 -48 64 -79 80 -96 112 -128 145 -176 193 -224 256
34B56n44O08o74P55q50R46j058J182j310J448j599J770j956K156k376K617k881
$$ 256 -288 320 -354 401 -449 497 -561 621 -689 759 -840 930 -1026 1130 -1246 1371 -1510
51a510L177l504L863m263M715n229N817o497P289q237R392j0827J2673j5154J8678
$$ -1510 1667 -1837 2026 -2237 2478 -2751 3066 -3431 3858 -4379 5013 -5814 6859 -8295 10383
66A0383k4121L3725n5677J98362K8416l77607l5022J65532K34245j3123j32350
$$ 10383 -13738 19987 -35690 162672 191088 -186519 -221541 -56009 178236 165113 32763
77C2763j12747K2092N1379q6J607R1748J7499q6005j15514m306J22361J26252
$$ 32763 -79984 -57892 -6513 -6599 -4992 86756 104255 18250 -97264 -101570 20791 147043
89A47043k1630j47453j00611P3694R9044J1087m1062l0930q276L84j0848O359
$$ 147043 125413 -22040 -122651 -48957 50087 61174 20112 -10818 -19094 -18710 -29558 -23199
101b3199M6079N0512m3660r8748l420R3229N4810l8913p4097j9375M8055M1446
$$ -23199 22880 73392 29732 -69016 -72436 20793 75603 36690 -37407 -56782 -8727 32719
113C2719l2136n0256K9174N4369l0077o7095N035P5034N0692m0028r2451k6360
$$ 32719 583 -49673 -20499 33870 3793 -63302 -58267 16767 67459 27431 -65020 -91380
125i1380R3588Q9911m8300j11286j8976P7676N9871l0845p7224j3490P7250N0087
$$ -91380 2208 92119 43819 -67467 -86443 -8767 51104 20259 -56965 -70455 6795 56882
137E6882o4209p6519L6152R2570K2708o4718o9260P571P4819M2277m4405n3865
$$ 56882 -7327 -83846 -47694 44876 67584 2866 -66394 -58823 15996 58273 13868 -39997
149c9997J0107K6699q431j0496J8799K5042k329l8028l5785K6663P2632J9755
$$ -39997 -29890 -3191 -11622 -22118 -3319 21723 19394 -18634 -54419 -27756 44876 64631
161F4631n9390n0113J5795M3213J8657j9369k9599L075K6277o694l4113O107M6077
$$ 64631 5241 -44872 -29077 14136 32793 13424 -16175 -13100 13177 6483 -27630 -21523 24554
174B4554J6027l2435l2365N266L5896K3204k1856k9898J4830K7465j9629l9008
$$ 24554 40581 8146 -24219 -18953 16943 40147 18291 -11607 3223 30688 11059 -27949
186b7949O161M4492K5775k6545n6314j8370N3820N9519j2290n4926k0977K2322
$$ -27949 -21788 22704 48479 21934 -34380 -52750 1070 60589 48299 -6627 -27604 -5282
198e282K6530N472j4062q822J0065j606l1007j2143L7349L6142j5422m4148k3072
$$ -5282 21248 26720 12658 3836 13901 12295 -18712 -30855 6494 42636 27214 -16934 -40006
211d0006K2039M6095J6105l1806k8735Q778J3791l567J181J1729L8j7625k3612
$$ -40006 -17967 28128 44233 12427 -16308 -7530 6261 2694 3875 15604 15642 -1983 -25595
224b5595p067K9480L8616q851m9125k2098K8299L8560J2324k1693l3442m735K5903
$$ -25595 -32662 -3182 35434 26583 -22542 -44640 -16341 22219 34543 12850 -20592 -25327 576
237E76J3715j0039m716Q59j2731j2982P209J9586J4208o306l0148j7620K8109
$$ 576 14291 4252 -464 395 -12336 -25318 -18109 1477 15685 9379 -20769 -38389 -10280
250a0280L7463m364l0268j3261Q615J5501P345j1798j3860P322R467j2779j0532
$$ -10280 27183 22819 -7449 -20710 -12095 3406 10751 -1047 -14907 -7585 1882 -10897 -21429
263b1429J3527J4366k297r376q831J578J9124J1598j6494j4387J0313R562p368
$$ -21429 -7902 6464 4167 -5209 -14040 -12462 6662 18260 1766 -12621 -2308 7254 -114
276a14o897L68L314O742k720j6503k87K3243P972j6951p989R260Q471L268m040
$$ -114 -7011 -6643 -3329 3413 693 -15810 -16097 7146 15118 -1833 -9822 -562 7909 11177 7137
291G137j1644L52J5209r04j8167k211J2556K680m176k765m266L560J3651l11j3396
$$ 7137 -4507 -4155 11054 10150 -8017 -10228 2328 5008 832 -1933 -6199 -2639 11012 10701 -2695
306b695K558J3240k522r120L94J983J188K725p517j1438Q682J4732p839j3618
$$ -2695 -137 13103 10581 1461 1855 3838 5026 7751 234 -11204 -2522 12210 4371 -9247
320i247N458J0263K017l38n292o321Q866J1216r726j2652N680N539n167j097P85
$$ -9247 -3789 6474 8491 8153 2861 -3460 5406 16622 6896 -5756 -76 5463 296 -801 -16
335a6m667K044N797n809l452J2267N040j1404m436O970L521K293q41j2759o877
$$ -16 -4683 -2639 3158 -2651 -6103 6164 11204 -200 -4636 2334 5855 8148 7307 -5452 -12329
350a2329J3029P399j1581o079N483O38m38M416j120j962O848L16j0368J963J1820
$$ -12329 700 8099 -3482 -9561 -4078 -3440 -3878 538 -582 -2544 4304 4620 -5748 -3785 8035
365H035k247r760j161j00p87O105P44j0331q64R875M99m866M055K861k970K086
$$ 8035 5788 -3972 -5133 -5233 -6020 85 829 -9502 -10366 -491 8 -4858 -803 2058 -912 1174
381A174J409n942J926Q001n592j0801L164O400k033j036J25m438K085Q742j046
$$ 1174 2583 -3359 -1433 6568 976 -9825 -6661 -261 -2294 -3330 -3205 -7643 -5558 3184 2138
396B138n393N103L676o222j006N597j217k970J481m202n003O062N578n834k926
$$ 2138 -3255 1848 5524 -698 -1704 3893 2676 -294 1187 -3015 -8018 -1956 3622 -2212 -5138
411e138M008n1M29N725m42m848L533L537n949j827N843r73n477j6l47j811M401
$$ -5138 -1130 -1181 -752 4973 4531 -317 3216 6753 804 -1023 4820 3847 -1630 -1646 -1993 -3804 597
428E97K949o073j063O766Q81k726L378J439m353J18K781k944q92L192l427o120
$$ 597 3546 -2527 -3590 3176 4057 1331 4709 6148 1795 1913 4694 1750 858 4050 623 -5497
444e497K501L860r95J385J440n022j284P100L254k180N11j460o140n4O133R66
$$ -5497 -2996 864 -131 1254 2694 -2328 -3612 3488 6742 4562 5073 3613 -2527 -2581 3552 4518
460D518k327k406o330l537Q230Q043l036m620m31j129J436O789J969l665j283
$$ 4518 2191 -215 -6545 -10082 -1852 6191 3155 -1465 -1896 -3025 -1589 5200 7169 3504 2221
475B221k288n944J128P480J582m172l519n212j706R178Q886l093o269j613k72
$$ 2221 -67 -6011 -4883 2597 4179 7 -3512 -8724 -10430 -1252 7634 4541 -1728 -3341 -3613
490c613K890O695L86n822j907o09l951N90O162O37l626j215k349k008O380P757
$$ -3613 -723 5972 6358 536 -1371 -1980 -5931 -5341 821 1458 -2168 -3383 -5732 -7740 -1360 6397
506F397j455m606j944j608K101O767K43p799k748K365p13l64K500j034j238L432
$$ 6397 4942 336 -1608 -3216 -1115 5652 5895 -1904 -4652 -2287 -3000 -3364 -864 -1898 -3136 296
522B96K28m481J767O779J210k460k378m188J77Q139K474r358o324L143L940K994
$$ 296 524 -3957 -2190 4589 5799 3339 961 -3227 -3050 5089 7563 -1795 -8119 -4976 -1036 1958
538A958J172n399m208N910N870k298j095K409j753k635J309p71r99M858P32r530
$$ 1958 3130 -2269 -6477 -567 5303 3005 1910 4319 2566 -69 1240 469 -530 4328 5060 -4470
554d470n459N373O804M026L88q406q260O333J1618J844l352l403o672k968O804
$$ -4470 -9929 -4556 2248 6274 6662 -1744 -10004 -3671 7947 9791 6439 3036 -3636 -6604 200
569B00N287j737r92l011q483j847R407P733J262j638q631r031O119J5194M513
$$ 200 5487 3750 2758 -253 -8736 -10583 -1176 6557 7819 6181 -2450 -11481 -5362 9832 14345
584A4345o843r087q721N5J2286Q228o219p918k467j677K764Q900L072l592j074
$$ 14345 7502 -1585 -10306 -10251 2035 10263 4044 -3874 -6341 -8018 -5254 3646 6718 3126 2052
599B052k572o139L104J1084K582o818p018n672J95J0964P239p545q550O43K158
$$ 2052 -520 -6659 -3555 7529 10111 3293 -3725 -9397 -9202 1762 9001 1456 -7094 -6451 -4293
614d293L159O379M54n946r61J996k572P47O490m04p527l196k29J095O879L978
$$ -4293 -1134 5245 5699 -247 -1208 788 -1784 -1037 5453 5049 -2478 -5674 -5903 -4808 2071 6049
630F049p962p010M751O267J727J663k550o949M75O723M44k795P48k599n194J804
$$ 6049 -1913 -8923 -4172 2095 3822 5485 2935 -4014 -3539 3184 3628 833 1581 -1018 -6212 -4408
646d408M019n41J496K842m898n536M660P094J674r3l977q540m8R692M046m400
$$ -4408 -389 -930 566 3408 -1490 -7026 -2366 4728 6402 6309 2332 -6208 -6256 3436 7482 3082
662C082m133m204l219N354P817j088l882J59j796j793N122N543j147k258l018
$$ 3082 -1051 -5255 -8474 -3120 4697 3609 -273 -114 -1910 -3703 1419 6962 5815 3557 539
677E39o173J48Q974L510o108m819j298j11M946N723k678m394K177J474k105J454
$$ 539 -5634 -5486 3488 6998 890 -3929 -5227 -5338 -392 5331 2653 -1741 436 1910 -195 1259
693A259K839j321p50J57n150l543N519M852k427l175j629j557L320O455n09m619
$$ 1259 4098 2777 2027 2184 -2966 -6509 -990 3862 1435 -1740 -3369 -4926 -1606 4849 4340 -279
709b79L41J503j499J104K016k372j744J525k141l507K538L782q14j015m82k138
$$ -279 62 1565 66 1170 3186 814 -930 595 -1546 -5053 -2515 1267 453 -562 -1044 -3182
725c182J304N873J032m196j116M86j055J498K438k803l640P05L68n39K393J852
$$ -3182 -1878 3995 5027 831 -285 201 -854 644 3082 279 -3361 -2656 -2288 -2827 -434 1418
741A418k467j064J832m6J018L873o35n052j484K437J112R73l0m757l520L221L819
$$ 1418 -1049 -2113 -281 -327 691 4564 3929 -1123 -2607 -170 942 1915 1885 -2872 -6392 -3171 648
758F48Q0q8p52k699J163M515O50k359M05j29k354J08J286j055n7J315k691k821
$$ 648 728 640 -112 -2811 -1648 2867 3517 1158 1563 1434 -920 -812 474 -581 -638 677 -2014 -4835
776d835K758L160l04K87M35k263jL399N90j809K92p31l019P9K197o13m87R09j902
$$ -4835 -2077 1083 779 1066 1501 -762 -763 2636 3226 1417 1709 978 -2041 -1962 235 -378 -865 44 -1858
795a858j910L056L275j210m77J026j412l58K389j01k202M88k36l133J22K856n42
$$ -1858 -3768 -712 2563 1353 876 1902 490 132 2521 2420 218 706 470 -2663 -2541 315 -227
812b27j335J330n09j587K622K854j440o80J083j755j091K817M50l039o17Rk167
$$ -227 -1562 -232 -741 -2328 294 3148 1708 1028 2111 356 -735 2082 2532 -507 -1124 -1115 -3282
829c282J227L674j038l215J125J844j96K053J339l152r73K313o50j755J759j64
$$ -3282 -2055 1619 581 -2634 -1509 335 139 2192 3531 379 -594 1719 1069 -686 1073 909
845I09l748k4K621r61l55K051r97j809K930K156k142o4J651j539j055K095j093
$$ 909 -2839 -2863 -242 -1203 -1558 493 -504 -2313 617 2773 631 567 2218 679 -376 1719 626
862F26k959J435J351k760m76K561n95q76K407J31j821K059J979k624p26K503j217
$$ 626 -2333 -898 453 -2307 -2783 -222 -817 -1693 714 845 -976 1083 3062 438 -288 2215 998
879I98k304J503Pk666P73J879k062l46K846l33j902K556J474k148N98J911k527
$$ 998 -1306 197 204 -2462 -1689 190 -1872 -2218 628 295 -1607 949 2423 275 873 2784 257
896B57j273K894o37l352O97J213j984O53K323j747j145L014O41k070J979J678
$$ 257 -1016 1878 1241 -2111 -1414 -201 -2185 -1532 791 -956 -2101 913 1554 -516 1463 3141
912C141k813o11K463j312k029J640k80k795J067J923j996k83K817m44j657K473
$$ 3141 328 -283 2180 868 -1161 479 199 -2596 -1529 394 -1602 -1885 932 488 -1169 1304
928A304J068k312Q77K042k339j560J931o24k313J529N70k757M53K557j022m98
$$ 1304 2372 60 937 2979 640 -920 1011 387 -1926 -397 173 -2584 -2131 426 -596 -1094
944a094K708k03k331J801K079j941o82J323j747j633J996L6k431P89J303k061
$$ -1094 1614 1411 -920 881 2960 1019 337 1660 -87 -1720 276 312 -2119 -1330 -27 -2088
960b088L48L138m98j699J760P59j635J171J498k414j437J633q48j704J741L77
$$ -2088 -1740 1398 900 -799 961 1720 85 1256 2754 340 -1097 536 -312 -2016 -275 102
976A02k490L68J974r25J48K659l62k244J218J429j255K30J104k361j659J622J3
$$ 102 -2388 -2020 -46 -971 -823 1836 1474 -770 448 1877 622 852 1956 -405 -2064 -442 -429
993d29j415J443P95k490k49K773N52l71J188q05j718J401J599j794r13J195j218
$$ -429 -1844 -401 394 -2096 -2345 428 980 609 1797 992 -726 675 2274 480 -433 762 -456
1010d56j660J009M17j046J521J186k228n02K698J039q04M61n98j562J158J106
$$ -456 -2116 -1107 -690 -1736 -215 971 -1257 -1759 939 1978 1174 1635 1037 -525 633 1739
1026A739k185j047J770m44k021O36Q93j69J335Q51j868m23K610N96j318J15p6
$$ 1739 -446 -1493 277 -167 -2188 -1552 -659 -828 507 1358 -510 -933 1677 2273 955 1070 994
1043I94j588M59J097j536j150J388m34j257J475J163j045K82J500p44k85J594
$$ 994 -594 -135 962 -574 -1724 -336 -770 -2027 -552 611 -434 -152 1348 604 319 1913
1059A913k52j561P27P0k121o1J771n86j489J86k09M32K612Q01k827q30K550R31
$$ 1913 1661 100 827 897 -1224 -1285 486 -100 -1589 -1403 -1612 -1180 1432 2233 -594 -1424 1126 2057
1077B057o93k0j083j161J243K53k542k15K868j43k226m30N80J433L020K10m175
$$ 2057 1364 1344 261 -900 343 596 -1946 -2161 707 564 -1662 -2092 -1512 -79 2941 3151 -1024
1094a024j185L372J457j154p38j230j364J265Q73k023k16K682k97k160M88J280
$$ -1024 -2209 1163 2620 1466 728 -502 -1866 -601 272 -1751 -1967 715 418 -1742 -1254 26
1110B6M06J881P22l239j607K423Q69r70L53j027k749O32K796n15j093J051m62
$$ 26 432 2313 3035 -204 -1811 612 1481 511 864 -163 -2912 -2280 516 1 -1092 -41 -503
1127e03q29K473J038k247K6K427q98k076K39o5l11J865n80l971o1M377J196k321
$$ -503 -1332 1141 2179 -68 -42 2385 1487 -589 -350 -415 -726 1139 559 -3412 -3473 904 2100 -221
1145b21q60J4J004L124M45m475j267L923J029k699j351j74j5K162L29l596n71
$$ -221 -1081 -1067 -63 3061 3506 -969 -2236 1687 2716 17 -1334 -1508 -1523 639 968 -2628 -3199
1162c199M523J242k703q44Q53P45J983O23l895j845L229J108k348m23J35j249
$$ -3199 1324 2566 -137 -981 -128 617 2600 3223 -672 -2517 712 1820 -528 -951 -816 -2065
1178b065J017K043j428j085K405P42j827P96J050j552QK071j339k355O01L99q15
$$ -2065 -1048 995 -433 -1518 887 1629 -198 598 1648 96 104 2175 836 -1519 -918 -519 -1334
1195a334J571O18l017o98L646J123j788J08L59l94J676M94l428r70L499P05l368
$$ -1334 237 855 -2162 -2860 786 1909 121 229 588 194 1870 2364 -1064 -2034 1465 2170 -1198
1212a198j425Q70P61K112M78l560j304M330K142k473r62O93P4P29L62k887j111
$$ -1198 -2623 -1753 -992 1120 1598 -1962 -3266 1064 3206 733 -229 464 538 1267 1629 -1258 -2369
1229b369L142Q93l383r47J828P22N23P19j825q39K969J273k407m72J385p86q48
$$ -2369 773 1666 -1717 -2664 -836 -114 409 1128 -697 -1536 1433 2706 299 -173 1212 426 -422
1246d22P86o88j208J281J07j869P43K357q53j208J571N05q62Q92K51j610N33J186
$$ -422 364 -324 -1532 -251 -144 -2013 -1270 1087 234 -974 597 1102 240 1132 1383 -227 306 1492
1264A492j915j523J935P32j809m39N60r6J454J359j966j212K481J432j881p12
$$ 1492 -423 -1946 -11 721 -1088 -1527 -967 -1063 391 1750 -216 -1428 1053 2485 604 -108
1280a08O01k06J25Q7j763q60K273Q78k415p03J815P37L53M18j347m49K177N94
$$ -108 493 287 412 499 -1264 -2124 149 1027 -1388 -2091 -276 461 814 1232 -115 -564 1613 2207
1298B207k462n08J547l32j020k44n28K51J673k71k075M88K509J20j142J73K26
$$ 2207 -255 -763 784 452 -568 -812 -1340 -1089 584 313 -1762 -1274 1235 1355 213 386 612
1315F12n5Q55m98j927M04J584j099j793Q60P85j07L73k64q76J257J888j033j413
$$ 612 557 1412 914 -1013 -609 975 -124 -1917 -1057 -272 -379 -6 -270 -1146 111 1999 966 -447
1333d47J152O92r93k60j90p68M89P51j564r99J921Q74j085k31P82K04O68O03j413
$$ -447 705 1397 404 144 -46 -814 -325 426 -1138 -2137 -216 658 -427 -658 124 328 996 1599 186
1352A86o70J678J16j993l62J063l26m09J25q52J77J971J83j807L97J855p5q03
$$ 186 -484 1194 1310 -683 -1045 18 -308 -717 -592 -1444 -1267 704 887 -920 -523 1332 1257 454
1370D54J90m47p5R99p41k119N81J761q04j234M99N44J73R82r0j464J045J927j233
$$ 454 644 197 122 1121 380 -1739 -1158 603 -201 -1435 -936 -392 -219 763 673 -791 254 2181 948
1389I48j595J008M10q62O7m07j222R61J497j472j163J774J019p92J13M77o41P30
$$ 948 -647 361 771 -91 -24 -431 -1653 -692 805 -667 -1830 -56 963 171 284 761 120 850
1407H50J010j696j317J687M75j990l76R56l13P7R17j075m31K090P64j859%J595
$$ 850 1860 164 -1153 534 1009 -981 -1357 -401 -714 -637 280 -795 -1226 864 1628 -231 -231 1364
1425A364m53p63N21p47p63J249j13k063K82J859l28r84P91K49k18J297J86j765
$$ 1364 911 148 669 -78 -841 408 295 -1768 -1486 373 45 -939 -148 101 -117 1180 1366 -399
1443c99K61J831q92j629P68K19q97L55J50j421N89K073q82j348J558R15q23N9
$$ -399 -138 1693 801 -828 -60 159 -738 -383 -233 -1654 -1065 1008 126 -1222 336 1251 428 487
1461D87M57r38K23J183j351j623J348P61j502j17Q88m60P0J332m74j006J627R20
$$ 487 944 6 229 1412 61 -1562 -214 547 -955 -1072 -184 -644 -574 758 284 -722 905 1825
1479A825j655m68J299o02o49O43q11j146J223Q35j692j03J708j69q03J015L28
$$ 1825 170 -298 1001 399 -250 393 -418 -1564 -341 494 -1198 -1301 407 238 -565 450 778
1496G78p18Q36L73j632n7J466n33j681N66M17q50M25P99r93OJ762k90j144R31
$$ 778 60 896 1269 -363 -420 1046 513 -1168 -602 -185 -1035 -610 189 -804 -798 964 674 -470 461
1515D61R41r05j69L08r34k16J240o96j700P91J107q81l8Q65k70j82J280k41j014
$$ 461 1402 497 328 636 -298 -514 726 30 -1670 -879 228 -653 -691 174 -96 -278 1002 761 -253
1534b53Q35Q46j178n93O53n06n85P57k57j070O42R90o76j53J279k00o55Q43L77
$$ -253 582 1428 250 -343 310 -196 -781 -24 -281 -1351 -709 281 -395 -548 731 531 -124 719 1096
1553A096j025M28M40j122n97J038l19j080N44M63o26L14Q38n63K2J130j72r58
$$ 1096 71 499 939 -183 -780 258 -61 -1141 -597 -134 -760 -446 392 -171 -149 981 809 -149
1571a49O70M40q21k11M27q25n19R88j83r77N28O60m60K58Q98l65l57R48J8j089
$$ -149 521 961 140 -71 356 -469 -988 0 -183 -1160 -632 28 -432 -174 724 359 2 950 968 -121
1591a21L90M25q72k47M33o34n48Q50K40o07M11N73o80M20J112l15q09M45J50o49
$$ -121 269 694 -178 -425 8 -626 -1174 -324 -84 -691 -280 293 -387 33 1145 830 21 466 616 -33
1611c3K43J21r58k05O95k86o95Q69M28n06L15O69o69J84R37r9r60J35l0n72L84
$$ -33 210 331 -627 -832 -137 -423 -1118 -249 179 -327 -12 657 -12 172 1109 1010 50 185 155 -417 -33
1632c3K58q97n60J097J6n70P02L54m57M15O45o29l97Q36M3q49r1J4q40N90P57
$$ -33 225 -672 -1232 -135 -119 -689 13 367 -90 325 970 341 -56 780 823 -26 -117 -103 -943 -353 404
1653D04j035p89J192M71l43M08J16n82N22R85p95r43N41J85n14n8Nq65M48J125
$$ 404 -631 -1420 -228 243 -100 308 424 -158 364 1349 554 -389 152 337 -177 -235 -230 -1095 -647 478
1673D78o68q94Q74Q34l13J80J42p59K92J110n72j263L80J60o37L04M10r41j09
$$ 478 -190 -1084 -210 624 311 491 633 -126 166 1276 704 -559 -179 -19 -656 -352 58 -883 -992
1692i92J223K6p44N90O06m72M17M59j159m58J138Q9j248o7K54n77M22J025r31
$$ -992 231 257 -487 103 709 237 654 1113 -46 -504 634 723 -525 -592 -338 -915 -493 532 -399
1711c99p13J316N65o72L27K21n22L65O91j071j130Q87O72r32k58J97m83N22J195
$$ -399 -1112 204 769 97 424 645 123 488 1179 108 -1022 -135 537 -395 -653 -456 -939 -417 778
1730G78o74j001J064Q76o09j5K48p79P2Q56p39j269P68Q08q99k70N07l17J80J292
$$ 778 104 -897 167 1043 434 419 667 -112 -40 816 77 -1192 -424 384 -515 -785 -278 -595 -415 877
1750H77k95j111P83P92p16k14M88p12n49P71m3j072L56P47o55NR03l32m10J014
$$ 877 582 -529 254 1046 330 116 604 -108 -657 114 71 -1001 -645 102 -553 -548 355 23 -387 627
1770F27L86r61J30P23p36j83N34n68j018P66M63o94p2N21k89Q2J075k40q86P40
$$ 627 1013 52 182 905 169 -14 520 -48 -1066 -300 163 -531 -603 -82 -371 -289 786 546 -340 400
1790D00P33q31m19M60l06j64M64p27r39P40J026q47l01P29J23j00P10l3q63L96
$$ 400 1133 302 -117 343 37 -127 337 -390 -1329 -589 437 -410 -711 18 141 41 751 718 -145 251
1810B51Q46q78o40N33j44n15M10k13o51N67J066p99l95Q68J99l41L81J58o43J19
$$ 251 1097 219 -421 112 -32 -547 -137 -350 -1001 -434 632 -167 -562 306 505 164 545 703 60 179
1830A79L73p19m62O73r6q26L40M77l98J40N97k27k04Q58L5p06L79L71p06j87J40
$$ 179 552 -167 -629 44 -52 -878 -538 -61 -459 -319 278 51 -153 705 740 34 413 784 78 -109 31
1851C1m25k24O19j96q37N21Q53k36l21N13Q6l9M51l20o95L33O73q96o11M55K3
$$ 31 -394 -618 1 -195 -1032 -511 342 106 -215 298 384 345 796 476 -219 114 787 -109 -720 -265 -242
1872b42k56K16J9m97O83O71l95l31N91J70m74M06k02n81K19L93q30m82O46K41
$$ -242 -498 -282 -263 -760 -77 594 199 -132 459 629 155 561 359 -222 -3 390 -440 -922 -276 -35
1892c5m70L15M6m8L96N05m72k24O75j00o95J30K58m84j0P1m90m1P36j70n01N20
$$ -35 -505 -190 -144 -192 204 709 237 13 688 588 -107 23 281 -203 -213 -142 -632 -673 63 -107 -608 -88
1914h8O38m27j8M63k42j26M36l82o98K60M79o77l31K90oJ9M86p6n30P14P10o66
$$ -88 550 123 105 568 326 200 636 254 -444 -184 295 -382 -713 -423 -429 -410 76 0 -530 184 894 228
1936B28j90M57J8l40J19k41o94N30L18q12k07P31J4l03N48Q2m43O16N91p34n20
$$ 228 38 495 513 173 292 51 -643 -113 205 -607 -814 -83 -69 -372 176 258 -185 431 1022 288 -232
1957b32P85j47o35M7J53n78K67L10o50j8R26N5n63L79N42m44L1M50n41k78N72
$$ -232 553 406 -229 -182 -29 -607 -340 -30 -680 -698 228 283 -280 99 641 197 228 678 137 -141 431
1978D31j81j040K89O29o33m4M57n9j92O92P4n80M61N71n75l19M61l23l91L64j21
$$ 431 250 -790 -501 128 -505 -549 -92 -151 -343 349 423 -157 304 875 300 -19 442 119 -272 92 -29
1999b9p90L23O63n59k53Q24J26n15N34J87m83K08O74q21n45P05j4p98J48L32o64
$$ -29 -819 -496 167 -392 -645 179 305 -210 324 511 28 236 910 89 -456 249 235 -563 -415 -83 -747
2020g47K74P45n48l10R94K67p41K43N40m42n9K29o29m17P51j2j024K54O95l16
$$ -747 -473 272 -276 -586 408 675 -66 177 717 275 216 445 -184 -601 150 138 -886 -632 63 -253
2040b53j04N50j12k44P91J04q39K13P37n55o01M35k35o02O48R0p94J97Q44k58
$$ -253 -357 193 81 -163 628 732 -107 106 843 288 -313 122 -113 -715 -67 23 -771 -574 270 12
2060A2l75P15K07n56M12K05o35L0M86m02p95N51J59o20K12L60l44Q6P60l72l51
$$ 12 -363 352 559 3 415 620 -15 15 501 99 -696 -145 14 -606 -394 -34 -378 -292 468 96 -255
2081b55Q38K76q31K1M52m57j20L20n20n38O51K33o91K8P34r9j41N16j62k62O64
$$ -255 583 859 28 49 501 44 -76 244 -276 -814 -163 70 -621 -593 141 42 -99 417 255 -7 657
2102F57P0q53k5N12k78m18J71j10l35L57L35n26N4Q78k38l03M27J38k81J35R2
$$ 657 727 -126 -151 361 83 -335 -164 -274 -609 -252 83 -443 -389 489 251 -52 375 513 232 367 459
2123D59o09p7M50l46m86K76K37k98J41M24l16J60O05k84m60N57K22n34k13J81
$$ 459 -150 -227 223 -123 -609 -333 -96 -394 -253 171 -145 15 620 336 -124 433 655 121 -92 89
2143H9l44q5M95m49n25O25M03n21O7M85p0%M52l68k66L32J86o63k32L93l14j44
$$ 89 -255 -340 155 -294 -819 -194 209 -312 -245 240 170 170 622 254 -12 320 506 -157 -389 4 -310 -454
2165d54L45p7l84M44L55k56QN71j70k51K74n6m06J57P9n00OL16l41k08N03J33
$$ -454 -109 -186 -570 -126 229 -27 -19 552 382 131 405 349 -57 100 179 -321 -315 1 -340 -548 -45 88
2187H8l27J86L28k11J31N40l93n34N25P8n55q2J51l49M6L95k62l32N80L62m29
$$ 88 -239 -53 275 64 195 735 342 -192 333 411 -144 -226 -75 -424 -378 17 -245 -577 3 365 -64
2208f4J47L08j80l0L76m43m48M28J95n61k01K43j31l8M59k07k50N48L62l83j1
$$ -64 83 391 211 181 557 114 -334 94 289 -272 -473 -230 -361 -399 60 -147 -397 151 513 130 119
2229A19M54l98j12M13k98n97K14K97n20L7K92k00j81P25P3n78M12M01l08j22L82
$$ 119 573 175 63 476 178 -419 -205 92 -428 -391 -99 -299 -480 245 318 -260 152 553 245 123 505
2250E05l75l21M82p2o82L1M14l17o3M17k01k21P92K10o42J25M34l69n4K57l43
$$ 505 130 -191 291 219 -463 -432 -18 -335 -398 19 -182 -403 389 599 -43 82 516 147 93 350 7
2271Gm05L92J21o00K5M14k40k2N67k1n37O12L70n60j59N30m46k82N68l06o83L20
$$ 7 -398 -6 115 -485 -460 -46 -286 -308 259 238 -299 313 683 123 -36 494 48 -234 334 28 -655 -335
2293c35M28n55O6N06j59k50P64L1p61L59N67l77k91K32l56l81O41j13p38J78P55
$$ -335 93 -462 -396 110 -49 -299 465 496 -265 94 661 284 -7 225 -131 -512 129 16 -722 -544 211
2314B11l96j29M02J4j97N75J63p63J32M10k21m08K90j47m90N03R3p20J75P82k10
$$ 211 -185 -314 88 102 -95 480 643 -120 12 422 201 -207 83 -64 -554 -51 42 -678 -503 279 69
2335F9k36M70O0m92M60K67n94j89N12l44m10L76K3n25J92M41l32o5N83p8j76M47
$$ 69 -167 303 363 -129 331 598 4 -185 327 -17 -427 -51 -28 -553 -361 80 -252 -317 266 188 12 459
2357D59J25o28k6N41m07l42L17k17l83M31K39o61O1P56p2l06M06m8k04M29N1p49
$$ 459 584 -44 -70 471 64 -278 39 -178 -561 -130 109 -552 -491 265 193 -113 293 245 41 470 521 -228
2379b28n0O25k41n36J65J04l66M21K46n34J39P19j90l86L88P9k26R3J46n56j12
$$ -228 -278 347 106 -430 -265 -161 -527 -106 140 -394 -255 464 274 -112 276 355 129 222 368 -188 -300
2400c00L84r7n41K30K88k58K19K77k73k8N03o9l06K94J39m57j01K16k44k72K72
$$ -300 84 -13 -554 -324 -36 -294 -75 202 -71 -99 404 335 29 323 462 5 -96 120 -124 -396 -124
2421a24q2l61M47K52l90j5N83Ok83L40q9k35J88O3o07j43N49j55l89J73Q5j13
$$ -124 -206 -567 -120 132 -258 -273 310 316 33 373 284 49 237 300 -307 -450 99 -56 -445 -272 -187 -300
2443c00L72J38m77J77N62r4m56L11q2j33J18q5m61N3M88k31m52L94J87j41J33
$$ -300 72 210 -267 -90 472 378 -78 233 151 18 136 51 -410 -357 131 -100 -552 -158 29 -112 21
2464B1L29l56J60L49k32k77J55j1l42lJ44k34j01L83j36l01M44L59m07J21M13
$$ 21 350 -6 154 503 271 -6 149 138 -204 -207 -63 -297 -398 -15 -151 -452 -8 351 -56 65 478
2485D78k29j39K03k34l04L63P3o13j02M16l6j93K31L4j29M85J05m78P8N21k11
$$ 478 249 110 313 79 -225 138 211 -402 -504 -88 -124 -317 -86 -52 -181 304 409 -69 9 530 319
2506C19l39J41p3k83K22qm92m9O41j12l68M63J99k15K34J09m30R8N01k99n46K48
$$ 319 -20 121 48 -235 -13 -21 -513 -562 79 -33 -401 62 261 46 280 389 -41 57 558 259 -287 -39
2528c9J56m37M6J02j89L3M95q1l24M05L34n09K14J85k08k22M76n08l92L86J77
$$ -39 117 -320 -274 -172 -361 -328 167 86 -238 167 501 -8 206 391 183 -39 437 -71 -463 -77 100
2549A00n37N9M15j91%K76J3k20M47K10o10q5N03j01l67J26j21l73K76K84m18p5
$$ 100 -437 -378 37 -154 -154 122 135 -85 362 572 -38 -123 380 279 -88 38 -83 -456 -180 104 -314 -389
2571c89N80j09k18L65J06l36K98J71m53j49M44k01n91L28J42k78N5L09k35p5N32
$$ -389 191 82 -136 229 335 -1 297 468 15 -134 310 109 -482 -154 -12 -290 -235 74 -161 -236 296
2592B96n9m02L33L60m40j23L52l38j91L65k01n02K84L34l34j55N88j56j10M17
$$ 296 237 -165 168 528 88 -35 317 -21 -212 153 -48 -550 -266 68 -266 -421 167 11 -99 318
2612C18l9l39K96L16n85j80K99Jl91R6J41m07L01K47k20j47N96ll20K97J01l11
$$ 318 279 -60 236 552 -33 -213 86 87 -304 -208 -67 -474 -173 74 -146 -293 303 300 -20 277 378 67
2634F7L9K79m85k43M20j00m49K35L11l35J12L84j58j84N29l6m14R7L92m18k24
$$ 67 106 385 -100 -343 77 -23 -472 -237 74 -261 -149 235 77 -107 422 386 -28 69 461 43 -181
2655a81K29j95j80L27%m65K68L80k28m5L30lj63K48N3m57J24K56l56k88L01m3
$$ -181 48 -147 -327 0 0 -465 -197 183 -45 -90 240 237 74 322 375 -82 42 298 -58 -346 -45 -88
2677h8k54K82K1k81K22L84k63j47L75M8k43J24J32m55J4L12l72k10L69m6k36J43
$$ -88 -342 -60 -39 -320 -98 286 23 -124 251 299 56 180 312 -143 -129 183 -189 -399 -30 -76 -312 -169
2699a69K27j07O4L23k14j1K17j01l26K23J69l48k46K71j82q7K52R9l73J79M13
$$ -169 58 -49 15 338 124 113 330 229 -97 126 295 -53 -299 -28 -210 -297 -45 54 -319 -140 273
2720B73j27j46L05j10j17J79l1l84R7K65l86k09K36K8r2K25J04l05J52L73o1j76
$$ 273 146 0 305 195 78 257 226 -158 -61 204 -182 -391 -155 -127 -219 6 110 -195 -43 330 269 93
2742I3K69j53k95J56N8k68r2K68k15k97L94O2j77J59J79j03J1L08j81k04K74m2
$$ 93 362 209 -86 70 128 -140 -232 36 -179 -476 -82 -20 -197 -38 141 38 49 357 176 -28 246 204
2764B04n00K30J55j91p9Q4j32O2K98Ol19K25L01k50q5K12j08j61K11m4m36M6K53
$$ 204 -296 -66 89 -102 -181 -97 -229 -167 131 137 -182 43 344 94 9 221 113 -48 163 119 -317 -271 -18
2787a8j75n4K01l6q4L19J53m16K01K42j71j77L28l03j81J65J9l03j5L41r9j66
$$ -18 -193 -247 -46 -82 -166 153 306 -110 91 333 162 -15 313 10 -171 -6 13 -290 -305 36 -63 -229
2809b29L25p7j21L15J30k54p4K40j97n9P1j01l18J63K61l30j6L08j59l7K98M8
$$ -229 96 19 -102 213 343 89 15 255 58 -1 70 -31 -349 -186 75 -255 -271 37 -122 -159 139 187
2831A87k03J67K58k53k12J56n6j92J40p4l05J00K98p1j63L98o2l04L66K37m75
$$ 187 -16 151 409 156 -56 100 44 -148 -8 -82 -387 -287 11 -60 -223 175 113 -191 175 412 -63
2852f3J57K54j76m08M21k16l01K38O5l54J18M41j59j76L74j39r2K79J36l41j66
$$ -63 94 348 172 -236 185 -31 -332 -94 -29 -383 -265 176 17 -159 215 76 -16 263 399 58 -108
2873a08K64q7k79J78m8k66J58K43k15k09N83o9j55J69J45l17J33K47l05k23J32
$$ -108 156 69 -210 -32 -80 -346 -188 55 -160 -369 214 145 -10 159 304 -13 120 367 62 -161 -29
2894b9K4k96J77R7l07K05L31k88k8L22L9j63N4J61k48m6L10k77l89L34m8k49J31
$$ -29 -5 -301 -124 -27 -334 -129 202 -86 -114 208 247 84 138 299 51 5 315 38 -351 -17 -65 -314 -183
2917a83J56j61Q9L55j74j53K64Q3k42K2J73k60p4K11k40k63K81J4j98K01K23k20
$$ -183 -27 -188 -99 256 82 -71 193 276 34 56 229 -31 -105 106 -134 -397 -116 -102 -300 -99 124 -96
2939i6o2L27j1j23J76jk62LK71k88k42K50M1j94Q4J40k10J72L04k14j02K22J54
$$ -96 -158 169 158 35 211 210 -52 -49 222 -66 -308 -58 -17 -211 -127 13 -197 -25 279 65 -37 185 339
2962C39k31Q8Lk64rK26k76k16K24J10j93Q4K75j81J2L37k02j16L11j41k05p3J75
$$ 339 108 196 199 -65 -74 152 -124 -340 -116 -6 -199 -115 160 -21 -9 328 126 10 321 180 -25 -98 77
2985G7k08j48K35m0k11K95J00l06J81K92k46M1J35L2j69J32r0k90R2J48j31l04
$$ 77 -131 -279 -44 -84 -295 0 100 -206 -25 267 21 62 197 229 60 192 102 -188 -96 52 -79 -383
3007c83K58J7RM2J69j71J50K13j67j64J76O7j81Nok09P1J78k30k21L69N6j68J21
$$ -383 -125 -108 -99 -57 112 -59 91 304 137 -27 149 216 35 40 34 -175 -104 74 -156 -377 -8 48 -120 1
3031AJ56j14J48J10k19k09K87J1l70O6J45k36k0K47j04j62L04N1j09Q5K12j49
$$ 1 157 43 191 301 82 -127 160 171 -199 -133 12 -224 -244 3 -101 -263 41 92 -17 68 280 131
3053A31j20J63l4k04J33p1k98Q8K94l17n7M00j38l3J92Lj74J68K33k41k15J73
$$ 131 11 174 140 -64 69 -2 -300 -212 82 -235 -292 108 -30 -63 129 132 -42 126 359 118 -97 76
3075G6kj96J50ok00m4L04k31l7K35J63k27N8J27j54R0P1r7k43K00J19l05l1J37
$$ 76 74 -122 28 22 -178 -222 82 -149 -186 49 212 -15 43 170 16 106 177 80 -163 37 156 -149 -180 -43
3099d3j11L1K39o7k60L25R1k14J59Q7j12j33J14p5k31K29l1k43QK57J8j86J26
$$ -43 -154 -123 116 49 -211 114 205 -9 150 237 125 -8 106 31 -200 29 -2 -245 -237 20 38 -148 -22
3122b2J92k52K92J4l08J54R8k08j40J70N6k31K06n3k11J55K79k34q7K03J58k61
$$ -22 170 -82 210 224 -84 70 168 -40 -180 -10 46 -185 21 -32 -243 -88 191 -43 -130 73 231 -30
3144c0J57O9j36k5J51j73k92J49J03o9j31K64j21O6K12j20j37K37J53l16j1J64
$$ -30 127 196 60 35 186 13 -279 -130 -27 -96 -227 37 -84 -18 194 74 -63 174 327 11 0 164
3166A64j71j44J59j51k11K55J36k04j7L08n4j23J97m3j3O8K2k41r8L23p0l42J40
$$ 164 -7 -151 8 -143 -354 -99 37 -167 -184 124 70 -53 144 101 88 156 178 -63 -161 162 92 -250 -110
3189a10N5j86K20N9k41J12L42k6k08R9R6j61O3k9k91M9K06q4l55K29K81l38Q3
$$ -110 -55 -241 -21 38 -203 -91 251 225 17 116 212 51 114 85 -206 -157 49 -35 -390 -161 120 -218 -135
3212a35K73r2m9K57o5k11J26J73k60j46K26o9j87R7q5j14K01K53l08o9K62O6j55
$$ -135 138 46 -3 254 189 -22 104 277 17 -129 97 28 -159 -62 -147 -261 -60 193 -115 -184 78 144 -11
3235a1K05l2k14J10J13l01j07K95k2k62J46R9k11L05N8j60k0K62n2j93L9J06j19
$$ -11 194 162 -52 58 171 -130 -237 58 36 -226 -80 19 -192 113 171 11 -9 253 201 8 47 153 34
3258C4p6Q4k72KK71n3j72M0J99j44J28J09j26n4K39k5k16J33P3l17j3P1l8q6K24
$$ 34 -42 42 -230 -228 43 -10 -182 -142 57 -87 41 150 24 -30 209 184 -32 101 174 -143 -156 -85 -123 -209 15
3283A5m9k25K69K12j65p3J81n5l3k9J5j35J35r2q0j88K52J0l7P8M3j72J65J17
$$ 15 -34 -259 10 222 57 -16 165 110 77 48 63 -72 63 -29 -109 -297 -45 -35 -72 6 49 -123 42 159
3307A59p9p4J32lj71R1n1j44R8P6l10N1J71Nq5J77J11j38j0K34j49p2J76j11j67
$$ 159 80 6 138 135 -36 55 4 -140 -42 34 -276 -225 -54 -49 -134 43 154 16 6 240 91 19 195 84 -83
3332h3P4J29l48O3P6m0o3K48O6k08J50J08m5j62J53K9j32N9o9k74J62J74k49p7
$$ -83 -9 120 -228 -165 -89 -129 -192 56 122 -86 64 172 127 -35 118 147 15 74 5 -269 -107 67 -182 -259
3356b59K14J1l3J92K3j99J72J20j63j08J46k0k00J00j07o0P9J19j93r3L45j3j15
$$ -259 -45 -34 -67 125 148 -51 121 241 78 -30 116 96 -104 -4 -111 -171 -92 27 -166 -259 86 73 -42
3379d2J23J68j68j7J58j85j27J55m6k42J22M9p7oJ66l3j93L19m8o7J01O2j03j55
$$ -42 81 249 81 64 222 37 -90 65 19 -223 -101 -52 -129 -135 31 -2 -195 124 76 9 110 172 69 -86
3403h6J84p1k32J61K0k61K09J03j65l0K98p0j42K07M0j41rJ23j47q5J08N5k70
$$ -86 98 27 -205 -44 -24 -285 -76 27 -138 -168 130 60 -82 125 165 24 15 138 -9 -94 14 69 -201
3426b01M7J33k02Q7J65r7j07K67J09k26J33Q2j16j08K15j13k43K01j9j79L5J75
$$ -201 -154 -21 -223 -136 29 -68 -175 92 201 -25 108 190 74 -34 181 68 -175 26 7 -172 -137 38
3448C8j75l6L17lk02K30M2j84Q1J10j82m5P9Ok71J29O8k05Q1J98j36M5J30J42
$$ 38 -137 -173 144 141 -61 169 211 27 108 218 36 -9 70 76 -195 -66 2 -203 -122 76 -60 -15 115 257
3472B57j83N8M5j53n0J14j09k58K58n8j64J55M4l4j3K36jj97K24J36l04L0J15
$$ 257 74 132 177 24 -26 88 -21 -279 -21 -79 -243 -88 -44 -78 -91 145 144 -53 171 307 3 33 148
3495A48j89j13J98j00k40K56Q9k15J49J33q5j75J98J11k08J33N7k00J6J60k48
$$ 148 -41 -154 44 -56 -296 -40 49 -166 -17 116 31 -144 54 165 -43 90 147 -53 -37 123 -125
3516a25o7J74Oj89N6J57j33P0K33j25m3O8K03k99N1J11k29j4K02k90NK10M2k46
$$ -125 -192 -18 -12 -201 -145 12 -121 -51 182 57 14 82 285 -14 37 148 -81 -95 107 -183 -178 32 74 -172
3540a72R6J16o3l7L38j84j6M3J9j95J6Q5j35l6Q9j32j20K43P9j48J29L5j3r1J68
$$ -172 -76 40 -23 -60 278 94 78 121 140 -55 -39 46 -89 -125 -36 -168 -288 -45 34 -114 15 50 37 -54 114
3565A14Jj48P3Qj09KJ59k55J1J53Rk03J52J04kK8mj9n9J40k3j36J8Pj17oP0j32
$$ 114 115 -33 40 48 -61 -59 100 -155 -144 9 18 -185 -33 71 69 97 93 74 15 155 132 -4 14 21 -96 -102 -32 -164
3593a64L1J26J66k24J21M8q3Q4Q8j27j30J68m0k33M5J26j09q3K05l0j65K23J10
$$ -164 -133 -7 159 -65 56 104 21 105 193 66 -64 104 64 -169 -124 2 -107 -190 15 -15 -180 43 153
3616A53k30J54P3o9n2J61j05j26O7m4o2NM5o7p4J48J09j50J02P1l3%O6j04l5O2
$$ 153 -77 77 150 81 29 190 85 -41 26 -18 -80 -75 -30 -97 -171 -23 86 -64 38 109 76 76 142 38 3 65
3642F5Nk42J64M6k32J35J03n0j54K48J0j79J83N6r6q6J76j42q2J13J0k65K19J7
$$ 65 70 -172 -8 38 -194 -59 44 -6 -160 88 98 -81 102 158 62 -24 152 10 -72 41 51 -214 5 22
3666B2j33j2J48nk6J41k2l4m7P9q8j68K33j14j01J03N9k41J66M7j12LJ57M9j16
$$ 22 -111 -123 25 20 -6 135 113 79 32 111 23 -145 88 -26 -127 -24 35 -206 -40 7 -105 -102 55 104 -12
3691a2J90k1j04j7J46j62k25J80pj20J14l6o7n4L01j96K9K01N3j37j0L3j09j01
$$ -12 178 157 53 36 182 20 -205 -25 -32 -152 -38 -74 -141 -195 106 -90 -61 140 193 56 46 79 -30 -131
3715a31K50k09j45K30L7j47O8J01j35L4K08p0j67K32O2j86k9O5r4q5J43m8j67
$$ -131 119 -90 -235 -5 32 -115 -47 54 -81 -47 161 91 -76 156 218 32 3 68 -26 -111 32 -16 -183
3738a83O0J22k06J06K44j96lJ15K9j31J66K5k14q6K87j22k03J33P7j59P4M7L7
$$ -183 -123 -1 -207 -101 143 -53 -56 59 88 -43 123 148 -66 -152 135 13 -190 -57 20 -139 -65 -18 19
3761A9o3J28qq7J66J2k12P9M6j14q7R2l3j80J29J17r0k0J64qo4J07M9j42R2K9
$$ 19 -44 84 76 -11 155 167 -45 34 80 -34 -121 -29 -62 -242 -113 4 -86 -106 58 50 -14 93 142 0 92 121
3787A21k26L6J26j35p1J20M6p3j9J20j20L9J29n6j21J63R4j13O0m1p6j47K43m9
$$ 121 -105 -69 57 -78 -149 -29 17 -56 -75 45 -75 -36 93 37 -84 79 173 60 120 79 3 -144 99 50
3811E0j62J19J7q6J47M6j72Q3J17l9j66J31k6p4m8J09j39m1P6qo2O8J36j01l1
$$ 50 -112 7 24 -62 85 131 -41 42 159 120 -46 85 59 -15 -63 46 -93 -134 -58 -66 -128 -60 76 -25 -56
3836e6J85m1o7N1lj26J53j1k18N2O8l1r5N0J12q0l0K34j90O4J02m4j02J22l5j27
$$ -56 129 88 21 72 69 -57 96 85 -133 -81 -13 -44 -139 -89 23 -57 -87 147 -43 21 123 79 -23 99 64 -63
3862f3J24Oj22q5J98p8j59K28n5r5J17J16j22l6K13j27j14M7k3ql4J6o4k8J53
$$ -63 61 67 -55 -140 58 -20 -179 49 -6 -101 16 132 10 -26 187 60 -54 -7 -30 -38 -72 -56 -120 -148 5
3887Ek8q6J50j3k7j01L65j98n6N1m9p9N8O2r2p6J67j66L3M3J14j50J64R5j72K1
$$ 5 -23 -109 41 28 1 -100 265 67 11 62 13 -66 -8 54 -38 -114 53 -113 -80 -37 77 -73 91 186 14 35
3913C5K35j65j81J69o9j60J29N6j25p2K06j53k4P7R5n6K7J34r9q8J16j27m8M5
$$ 35 270 105 -76 93 24 -136 -7 49 -76 -148 58 -95 -119 -42 53 -3 24 158 59 -29 87 -40 -88 -43
3937d3Nk02J39Q3j45K5J55K6q8Q6J06q6M5P1j47j45K33j10k27J69K9j72J23J76
$$ -43 -38 -240 -101 -18 -163 -138 17 43 -45 41 147 61 106 177 30 -115 118 8 -219 -50 -21 -193 -70 106
3961A06n6j76K35J8j86J06Q4j75J2K23j86r6R9K4j86K0K65k54M5J03pr8J43Q6
$$ 106 50 -126 109 127 -59 47 131 -44 -32 191 5 -91 8 32 -154 -134 131 -123 -78 25 18 -80 63 149
3985A49j27Q3J03j75j35Q9L5j90P7L3n2L8J37j26o8K93pj06K1N8j62L6J00j24
$$ 149 22 105 208 33 -102 -13 22 -168 -91 -58 -110 -72 65 -61 -129 164 157 51 72 130 -32 4 104 -20
4009b0n3J87p8j96J6J28j69R6J81p6m8K20j3j69k9J02j13j07J78j95J3J00K1j11
$$ -20 -73 114 36 -160 -144 -16 -185 -89 92 16 -32 188 175 6 -23 79 -34 -141 37 -158 -145 -45 -24 -135
4033a35j7J62j3p0J55n5n1J43N9j91j7J00j78j09K86j70n0J65p2J3MR9r9pJ46
$$ -135 -152 10 -3 -73 82 27 -24 119 178 -13 -30 70 -108 -217 69 -101 -151 14 -58 -45 -41 58 -41 -48 98
4058I8Rj31N6P5r0jN1j52r7J47O5j87J11O9m6j2J02K3j60J24M2j16l7Q5r6k0%
$$ 98 107 -24 32 107 17 16 67 -85 -182 -35 30 -157 -46 23 -23 -35 67 90 -70 54 96 -20 -57 28 -68 -88 -88
4085h8Jo3N7N9m4L9J65j85JO5O0j7n8M9r5M6M9j14q3J41J5j26P7K06j01p7J79
$$ -88 -87 -150 -93 -34 -78 -39 126 -59 -58 7 67 50 -8 41 -54 -8 41 -73 -156 -15 0 -126 -49 157 56 -21 158
4112A58n9o0N7K2j56JJ05m6o3j5kj14J33j7LL6Q6q7R2J01q8j11J28j13l1o5J09
$$ 158 99 39 96 118 -38 -37 68 22 -41 -56 -58 -172 -39 -56 -53 -17 69 -18 74 175 87 -24 104 -9 -40 -105 4
4139Do1j8Q0k2n7Q1N1j09J22J10j20j9K7p1o4RJ11j07q9J66j33N2J20q6n0P7O1
$$ 4 -57 -75 5 -17 -74 7 58 -51 71 181 61 42 69 -2 -66 -57 54 -53 -142 24 -109 -57 63 -23 -73 4 65
4166F5l4%J58j42o9P3m7j11P7NK6k9n3l0j6K04n4j57J34R6o4L5J07j67p9J74m6
$$ 65 31 31 189 47 -22 51 4 -107 -30 -25 1 -28 -81 -111 -127 77 23 -134 0 96 32 67 174 7 -72 102 56
4193E6j46J11rj08k3J12jn4J17O4n0p6O6k1j8R9j63p7J39%o5m4R8j14J20mN5j19
$$ 56 -90 21 12 -96 -119 -7 -8 -62 55 119 69 -7 59 38 20 119 -44 -121 18 18 -47 -91 7 -107 13 9 64 -55
4221e5J24J31j83J0P8q7j26R8N0j04mJ66j84O3k7%N0J45m1j94J88O6r0j38J71
$$ -55 69 200 17 27 105 18 -108 -10 40 -64 -68 98 -86 -23 -50 -50 0 145 104 -90 98 164 74 -64 107
4246A07j09j08Q5L6k05N5J76j64J6J34J5r2J63J8j33M4P0k33J1J39m9n3l9J62
$$ 107 -2 -110 -25 11 -194 -139 37 -127 -111 23 38 -54 109 127 -6 38 108 -125 -114 25 -24 -77 -116 46
4270D6j64j8J52m5m6J48k4o6L4J59p3j39J33j60jO4p1m4J18qo0Q5J19m9j91K06
$$ 46 -118 -136 16 -29 -75 73 49 -17 17 176 103 -36 97 -63 -64 0 -71 -115 3 -5 -65 20 139 90 -101 105
4296A05p3m0O4J42j60o8K5l4p1RL5qQK07k41j4K28n4r8K11p6r2M0Jj00r6J35n8
$$ 105 32 -8 56 198 38 -30 -5 -39 -110 -101 -66 -74 -66 141 -100 -114 114 60 -38 173 97 5 45 46 -54 -150 -15 -73
4324g3r2J74J0j80J46J42j51M3Q9j1j22O0J03j82o9J43j26lR9P2j43O3Q0o0j04
$$ -73 -165 9 19 -161 -15 127 -24 19 108 97 -25 35 138 -44 -113 30 -96 -99 0 72 -71 -8 72 12 -92
4349i2K20k8j27R6m1q4k3R6r0q5J96n3j72K15j4j17R5J09j83J03P7l2p0L0Kl0
$$ -92 128 100 -27 69 28 -56 -79 17 -73 -158 38 -15 -187 28 14 -103 -8 101 -82 21 98 66 -4 26 28 -2
4375bq8J94j27q7J21j8j23J50J06j20L5O4m8m3O4l6j5j19Q3j16R1K4rj52J91m5
$$ -2 -90 104 -23 -110 11 -7 -130 20 126 6 41 105 57 14 78 42 27 -92 -9 -125 -34 -10 -19 -171 20 -25
4401b5m6J54j6rm8N4nj16J75m0j43L1L9r2j9J45j41M6J12J9r1N1P7M8j55J02n0
$$ -25 -71 83 67 58 10 64 59 -57 118 78 -65 -34 5 -87 -106 39 -102 -56 56 75 -16 35 112 160 5 107 57
4428E7n7JR5j93j7R5j7o0J01K7o8M3J18q6m2J47j11m4L1J7r5J7O6j30j2Q0jj9
$$ 57 0 1 96 -97 -114 -19 -36 -96 5 32 -36 7 125 39 -3 144 33 -11 20 37 -58 -41 25 -105 -117 -37 -38 -57
4456e7J10p7J2O1K9j1l1O4r9P0n8J7j22M0Q1j24RJ14j29Q2P3k1O3n5J00j13rO1
$$ -57 53 -24 -12 49 78 67 36 100 1 71 13 30 -92 -52 29 -95 -86 28 -101 -19 54 33 96 41 141 28 19 80
4484H0l7p8M2J7j05J6R6q9JR3j2qJ5Q6j15Q3Nj47pJ34n5q8M3j6K5n2P9q3N3J44
$$ 80 43 -35 7 24 -81 -65 31 -58 -57 36 24 16 31 117 2 85 90 -57 -64 70 15 -73 -30 -46 -21 -73 6 -77 -24 120
4514A20l2r5l2J23j50L4P0n1j9KN6j18kJ39j15O7M1m6O4M5j2l0K9M6j51jN6rj09
$$ 120 88 -7 -39 84 -66 -32 38 -13 -32 -30 26 -92 -94 45 -70 -3 38 -8 56 101 89 59 88 134 -17 -18 38 29 -80
4543h0OJ14j12L1J22r7n7J72j0n2J9o2L2l9M4n6q8O3J00k17O1J26q9%J45j08j8
$$ -80 -74 40 -72 -41 81 -16 -73 99 89 37 56 -6 26 -13 31 -25 -113 -50 50 -167 -106 20 -69 -69 76 -32 -50
4570e0J41M3j22J9J19j55o8J39j6j88J66k2j01L3J53j34M2J31o4Nk2J2o4NJ07
$$ -50 91 134 12 31 150 -5 -73 66 50 -138 28 6 -95 -62 91 -43 -1 130 66 71 49 61 -3 2 109
4595A09j29o9M3jM1j37K02n1m1O4R4j24K7J40j49qK3J1j22J71j34o5J21O6j24
$$ 109 -20 -89 -46 -47 -6 -143 59 8 -33 31 125 1 28 168 19 11 34 45 -77 94 -40 -105 16 82 -42
4620d2l5J59l5J7P4p2l9K0L3j26PJ08r1j23J14K8j21O2Q9k3j09J72o4K8N9j3j02
$$ -42 -77 82 47 64 138 66 27 47 80 -46 -39 69 -22 -145 -31 -3 -124 -62 27 4 -105 67 3 31 90 77 -25
4647b5JJ43j52m2J60k15J17L6%j22N4O6L8o4J02n5K2k9n2K6j11J01kl7om8N7m2
$$ -25 -24 119 -33 -75 85 -130 -13 23 23 -99 -45 21 59 -5 97 42 64 35 -17 9 -102 -1 -3 -40 -46 -94 -37 -79
4675g9J26rl8R9j19J47J4o1j01N8Lj32kK1L2j2J41r2r2J36m1K8m7J15r7jN3Q8
$$ -79 47 38 0 99 -20 127 141 80 -21 37 40 -92 -94 -73 -41 -53 88 -4 -96 40 -1 27 -20 95 -2 -3 50 138
4703A38j80J00n4j13Q8M1j02m4J89o8P6j03J00q2j4J74j10r6J03k7k9J8J5j30
$$ 138 -42 58 4 -109 -21 20 -82 -126 63 -5 71 -32 68 -14 -28 146 36 -60 43 16 -13 5 20 -110
4727a10J31j1p5k1R1m9K7K9Q7k8o3L6opp6Jk3l8N9j1k9Q4o9%J05M3l4l4J05j12
$$ -110 21 10 -65 -86 5 -44 -17 12 99 71 8 44 38 31 -45 -44 -67 -105 -46 -57 -86 -2 -71 -71 34 77 43 9 114 2
4757BjP6m0p6R4j59M8j6P3Nn9O2l5qK3J26j83M3J26m1j00J69j61p7Q1J05j97M6
$$ 2 1 77 37 -39 55 -104 -56 -72 1 6 -53 9 -26 -34 -11 115 -68 -25 101 60 -40 129 -32 -109 -28 77 -120 -74
4785g4J06Nj75J72J3l8NO0p8M1Qr0q7L8J11j03K0O1p2n2K13l5q0N3O1j29J07R
$$ -74 32 37 -138 34 47 9 14 74 -4 37 45 -45 -132 -94 17 -86 -66 -5 -77 -129 84 49 -31 22 83 -46 61 70
4813G0j7j38M7M3p2k1J07j15o3J42J8P0j6L8j51J15N8j39L1O5n1o6k8j9M6M7j2
$$ 70 53 -85 -38 5 -67 -88 19 -96 -159 -17 1 71 55 93 -58 57 115 -24 7 72 21 -45 -73 -92 -46 1 -11
4840a1Q7j05J37k6j32J74n8p4O4L1p2m7K3P4j13L1O3j43QJ36j04P5M4K5q5J30
$$ -11 76 -29 108 82 -50 124 66 -8 56 87 15 -32 -9 65 -48 -17 46 -97 -89 47 -57 18 62 87 2 132
4866A32j17L4p0J2o5J7J26p3q4R1k2Ll5J38k6j12J23j10N7l0J11j46L2N1j04l4
$$ 132 15 49 -21 -9 -74 -57 69 -4 -88 3 -19 -16 -51 87 61 -51 72 -38 19 -11 100 -46 -14 37 -67 -101
4892a01J4J40j85J25N4r6O1J13q4j40J51Qp6J5N9l6j09J07j31Q2k2O7j40O9J30
$$ -101 -87 53 -132 -7 47 -49 12 125 41 -99 52 60 -16 -1 58 22 -87 20 -111 -29 -51 16 -124 -55 75
4917G5k6PN6k4j70R0J1m7N5l1j11L3M1K1rN8N3p7K3nL8p1M7j6n8J45q0q2m2M4
$$ 75 49 56 112 88 -82 8 19 -28 27 -4 -115 -82 -41 -20 -29 29 82 5 28 23 61 -10 37 21 -37 108 28 -54 -96 -52
4947e2RJ5J9N8j46L9J77m5n1P2p1m3L8J0l2q8J38l2j21J13qm0N2j5P7p3J57m7
$$ -52 -43 -28 -9 49 -97 -58 119 74 23 95 24 -19 19 29 -3 -91 47 15 -106 7 -1 -41 11 -4 73 0 157 110
4975A10k9J4K4j77P6n7m2O6On2P3K8p4j7J01k0j7O0q4M6l5N7j21J6P7R3k05K4
$$ 110 81 95 119 -58 18 -39 -81 -15 -9 -61 12 40 -34 -51 50 30 13 73 -11 35 0 57 -64 -48 29 122 -83 -59
5003e9O0m8k1J06Q1O5j33M7k8o4J04j95J6J9J32j20n1O9lQN6o3J6O2K7M8n2J3
$$ -59 1 -47 -68 38 119 184 51 98 70 6 110 -85 -69 -50 82 -38 -89 -20 -23 -15 41 -22 -6 56 83 131 79 92
5031I2j09j6J24j20M9rM8j52RJ05N9j47J06j1q6J15k2L5j14Q0l6k5J41o8r0J0
$$ 92 -17 -33 91 -29 20 11 59 -93 -84 21 80 -67 39 28 -58 57 35 70 -44 36 0 -25 116 48 -42 -32
5057c2R5j58O3L2J5k5J0Q5n8jO1q8O2p7kj8J7R7j52M3J03j28k4J59n4k8N6M4m6
$$ -32 63 -95 -32 0 15 -10 0 85 27 26 87 -1 61 -16 -18 -36 -19 78 -74 -31 72 -56 -80 79 25 -3 53 97 51
5086E1j9R2j01mn4K7j40J42k2m4PJ02j56J20P2Nj6j4N0j17o7R1j8k3J21j16k1
$$ 51 32 124 23 19 -35 -8 -148 -6 -28 -72 -65 37 -119 1 73 78 62 48 98 -19 -86 5 -13 -36 85 -31 -52
5113e2j8O5n2kJ03o7M9Q2q8J1r9L6l3O5Jm7j7j0R7o6m3O0N6q9J11Qq9O5J5j00
$$ -52 -70 -5 -57 -59 44 -23 26 108 20 31 -68 -32 -65 0 1 -46 -63 -73 24 -42 -85 -25 31 -58 53 61 -28 37 52 -48
5143d8R7j09Q3l8N5j14J8M4J9k4l9m0J16j%N3p6J04o5l1r6J09l3n0L8J16j34M3
$$ -48 49 -60 23 -15 40 -74 -56 -12 7 -17 -56 -96 20 19 19 72 -4 100 35 4 -92 17 -16 -66 -28 88 -46 -3
5171cJ4K0J4k0R5q6m3M6m2qJ11j42J2J01r8L0Jj1N7r8J08j6K6J0o0r5J54n9q2
$$ -3 11 31 45 25 120 34 -9 37 -5 -13 98 -44 -32 69 -29 1 2 -9 48 -50 58 42 68 78 18 -77 77 18 -64
5200f4M4K7n0j08J23L4j32J22J5M4oL2j8j2Pn1k6J1J09j78L6O2j3n4N2K6m9L1
$$ -64 -20 7 -43 -151 -28 6 -126 -4 11 55 49 81 63 51 58 7 -19 -8 101 -77 -41 21 8 -46 6 32 -17 14
5228A4Q2q0l8R6jj78J79n5j06K2M5m9R8o4J5n0R2m3oK2N9j0m0KL4j00J9Q2r9N0
$$ 14 96 16 -22 74 73 -105 74 19 -87 -65 -20 -69 29 -35 -20 -70 22 -21 -27 -5 54 44 4 6 40 -60 -41 41 -58 -8
5258hM1j02qN4l4K2P4N8j82L4J20n2p0J6kp2N9K4Oq7J11Nl9J49o5r7j6J53j27
$$ -8 33 -69 -77 -23 -57 -35 39 97 -85 -51 69 17 -53 -37 -39 -111 -52 -28 -22 -109 2 7 -32 117 52 -45 -61 92 -35
5287c5K0J08m8o1l4N4o3N3k6l2JJ9M5P9L1q2n1L3P1j26O1K0rj42P5L5j07O2l3
$$ -35 -15 93 45 -16 -50 4 -59 -6 -32 -64 -63 -44 1 80 111 29 -22 11 82 -44 17 37 28 -114 -39 -4 -111 -49 -82
5316h2J52j75R1l9N6Rq0J02j17J23%m0l1j7n4J02N6j06q5K06r9k8J57r3RJ28o6
$$ -82 70 -105 -14 -53 3 12 -68 34 -83 40 40 0 -31 -48 -102 0 56 -50 -135 71 -28 -56 101 8 17 145 79
5343G9L2r4r2MK8qJ20j22J0Q6p3mP6m5N0LM0j20Q4jk8Pn5L7j15N5K8k5N8L2J0
$$ 79 111 17 -75 -71 -43 -51 69 -53 -43 43 -30 -34 42 -3 47 50 90 -30 54 53 25 32 -23 14 -101 -46 -18 -43 15 47 57
5374E7J0K0k8j43J07L4q5j7M1j16P9QO0p9N4Q1j01k3Q8Kr2P4Or0N9P3j01j41J44
$$ 57 67 87 59 -84 23 57 -28 -45 -4 -120 -41 -33 27 -52 2 83 -18 -41 47 49 -43 31 37 -53 6 79 -22 -163 -19
5403a9M1j37J39J2n5k1O0r0M4J14j9j4l5l0m9k8J37j07N2jQ2k34P9R0k5O2P7j10
$$ -19 22 -115 24 36 -19 -40 20 -70 -26 88 69 55 20 -10 -59 -87 50 -57 -5 -6 76 -158 -79 11 -14 48 125 15
5431A5M1o4N9l9Q9n0m2m7P4j04jO6p2k7J02J42k05L9R9n2m1j1J06q7j1J5J3o4
$$ 15 56 -8 51 12 101 51 9 -38 36 -68 -69 -3 -75 -102 0 142 -63 -24 75 23 -18 -29 77 -10 -21 -6 7 -57
5459e7k2J10q9N3j7N6m%Ol0j6p9Q3J7lp4o1J19n7o4J28m5J9L2jp8J41r3J04j01
$$ -57 -79 31 -58 -5 -22 34 30 30 36 6 -10 -89 -6 11 8 -66 -127 -8 -65 -129 -1 -46 -27 5 4 -74 67 -26 78 -23
5489b3L4J02j49R3Lj39R4q4j7J03J7l3k7K0n1MJ07Oj10L0K8K5n3J7j5n6j0RN7
$$ -23 11 113 -36 57 60 -79 15 -69 -86 17 34 1 -26 -6 -57 -53 54 60 -50 -20 8 33 -20 -3 -18 -74 -84 -75 -18
5518a8j8j5K11j43%j1j7L1m2K6m5J09j7j53R6N6n6p9J72j13K1J7M7r3N3L0p5j3
$$ -18 -36 -51 160 17 17 6 -11 20 -22 4 -41 68 51 -102 -6 50 -6 -85 87 -26 -5 12 59 -34 19 49 -26 -39
5546c9J25j97K6J9m4J00l2N8l3nL3qN7o0K3k9kK5q8J1O5qPPk4q1R5O0j1m5L8M2
$$ -39 86 -111 -85 -66 -110 -10 -42 16 -17 -22 11 3 60 0 23 -6 -8 17 -71 -60 5 -3 4 11 -13 -94 1 61 50 5 43 85
5578H5n1l2Oor3J51o8l8M7M1j20J6M7j4K8L8mj24J49j4j7K7l0k2l9J14j1j43J63
$$ 85 34 2 8 2 -91 60 -8 -46 1 42 -78 -62 -15 -29 -1 37 33 -91 58 44 27 54 24 2 -37 77 66 -77 86
5607H6j42m7M7R4j14N9J06n5j8k9N4K7j20J5M0l0pM6j26P0J2N1p6M7mM9N2j28
$$ 86 -56 -103 -56 38 -76 -17 89 34 16 -13 41 68 -52 -37 3 -27 -34 12 -114 -44 -32 19 -57 -10 -14 35 87 -41
5635d1N2L7j0p7j5P4K5p0p9O4K8ML7o7k0P0J4j20J57j12P4r8Q7k4m8O0k3j5j5
$$ -41 11 48 38 -39 -54 20 45 -25 -104 -40 -12 -8 29 -38 -58 12 26 -94 63 -49 25 -73 14 -10 -58 2 -21 -36 -51
5664e1P4pn0J07J3o1J03q2n3J7k8O1l2J3n6r7J64N9j47J00M1j00k6J15j9q4L3
$$ -51 23 16 -34 73 86 25 128 46 -7 10 -18 43 11 24 -32 -129 35 94 -53 47 88 -12 -38 77 58 -26 7
5691GL4o4j9P4r5J5M4Jn1J5Ql1pJ43q6P5Pk2k4J0j07M2k6M9j5j20K01m7o2L3J19
$$ 7 41 -23 -42 32 -63 -48 -4 -3 -54 -39 -31 -62 -69 74 -12 63 70 48 24 34 -73 -31 -57 -8 -23 -143 58 11 -51 -18 101
5722A01j01j3j6K5J3M0N8j37M0j0p3L1j1J7j5Q7QO2r2P4j00k5Q2j8M5j15J19o
$$ 101 0 -13 -29 -4 9 49 107 -30 10 0 -73 -42 -53 -36 -51 36 44 106 14 88 -12 -37 45 27 72 -43 76 70
5750G0j69P5p1K4L0L7l0KN4o2n8J58q8Q8K4l9n4NN2j22O8J19j41m5K7R1o2P3J8
$$ 70 -99 -24 -95 -71 -41 -4 -34 -32 22 -40 -98 60 -28 60 84 45 -9 -4 48 -74 -6 113 -28 -73 -46 45 -17 56 74
5779G4o9%q%J7o1R9j44J3J52j01l9N5k5M1n6J71j30N1rk0M8j8J8q3k2Lj9K4P5
$$ 74 5 5 -3 -3 14 -47 52 -92 -79 73 -28 -67 -12 -37 4 -52 119 -11 40 31 11 59 41 59 -24 -46 -43 -62 -38 37
5809C7q0L5L9p6kN1kK7o0MOK0M0L2m6j9p0O7j9qL8k8K5l0l9P9KK6p0J09j7o0l3
$$ 37 -43 -8 31 -45 -47 4 2 29 -31 -27 -21 -1 39 71 25 6 -64 3 -16 -24 14 -14 11 -19 -58 21 23 49 -21 88 71 11 -22
5842b2O6q1L5o0O6j8K8N5m4p4J14m9Q6j4j92L8M7qJ1N1k3k4P3l1Oq0J68j11J4
$$ -22 44 -37 -2 -62 4 -14 14 69 25 -49 65 16 102 88 -104 -66 -19 -27 -16 35 12 -12 61 30 36 -44 124 13 27
5871B7N0k4j05N9N0qj46J37r6R3r6M0l7O1O3m2q3R6l1ON3mo2L9m1k4k3k2K3O3
$$ 27 77 53 -52 7 57 49 -97 40 -56 37 -59 -19 -56 5 68 26 -57 39 8 14 67 63 1 40 -1 -25 -48 -70 -47 16
5901A6J9k3j4j6L9m1m6M5O3o0N5Lo8N5p1%RpJ01p9L6N1j08O8qO3o9j3P1m5l7K5
$$ 16 35 12 -2 -18 21 -20 -66 -21 42 -18 37 40 -28 27 -44 -44 -35 -42 59 -20 16 67 -41 27 19 82 13 0 71 26 -11 14
5933A4rK3m6r4J0N2J06j33J06k9K5q1P2O4m3p8J32j57M1L6l6M1J6q8j5L1M7L5
$$ 14 5 28 -18 -112 -102 -50 56 -77 29 0 25 -56 16 80 37 -41 91 -66 -25 11 -25 16 32 -56 -71 -40 7 42
5961D2N3k5Ko5M4j5K1n4M2p6J7m4K3R9j45O5J4J2O0n7jJ04j56N5K6N1j16K9k8
$$ 42 95 70 72 7 51 36 57 3 45 -31 -14 -58 -35 64 -81 -16 -2 10 70 13 12 116 -40 15 41 92 -24 5 -23
5990b3O7r5M6k1RlL4l2j3J07n7kM2k9j30O3P5o1QO4j05J12j17k6L9K0O9N9j02
$$ -23 44 -51 -5 -26 -17 -20 14 -18 -31 76 19 17 59 30 -100 -37 38 -23 -15 49 -56 56 -61 -87 -48 -28 41 100 -2
6019bQ4%j05Q9k5Or9J10r0J9L8m8o0L7L2oL0nQ9j47J19l9q4O7Q3j49rO5n9LQ6
$$ -2 82 82 -23 66 41 47 -52 58 -32 -13 25 -23 -83 -46 -14 -20 10 5 94 -53 66 27 -57 10 93 -56 -65 0 -59 -56 30
$$ [...]
16383D9
##END NTUPLES=NMR FID
##END=
