##TITLE=abcd
##JCAMPDX= 6.0         $$ Bruker NMR JCAMP-DX V2.0
##DATA TYPE= NMR FID
##DATA CLASS= NTUPLES
##ORIGIN= UXNMR, Bruker Analytische Messtechnik GmbH
##OWNER= root
$$ XWIN-NMR		Version 3.5
$$ Thu Jul 24 11:14:43 2025 Russian Standard Time (UT+4h)  servis@DPX200
##.OBSERVE FREQUENCY= 200.131235884673
##.OBSERVE NUCLEUS= ^1H
##.DELAY= (6, 6)
##.ACQUISITION MODE= SIMULTANEOUS
##.ACQUISITION SCHEME= undefined
##.AVERAGES= 32
##.DIGITISER RES= 18
##SPECTROMETER/DATA SYSTEM= spect
##.PULSE SEQUENCE= zg
##.SOLVENT NAME= CDCl3
##.SHIFT REFERENCE= (INTERNAL, CDCl3, 0, 16.5164)
##AUDIT TRAIL= $$ (NUMBER, WHEN, WHO, WHERE, WHAT)
$$ ##TITLE= Audit trail, XWIN-NMR		Version 3.5
$$ ##JCAMPDX= 5.01
$$ ##ORIGIN= Bruker BioSpin GmbH
$$ ##OWNER= servis
$$ F:\spectra/data/av/nmr/H1/1/audita.txt
$$ ##AUDIT TRAIL=  $$ (NUMBER, WHEN, WHO, WHERE, WHAT)
(   1,<2025-07-24 11:14:16.59 +0400>,<servis>,<DPX200>,
      <created by zg, POWCHK disabled, PULCHK disabled
       configuration hash MD5:
       00 E9 B6 7A A2 85 ED C7 34 08 36 98 17 FE 4E 26
       data hash MD5: 32K
       29 55 4D 86 70 73 C6 71 AE 83 FD 0C A9 D6 56 2E>)
$$ ##END=
$$ 
$$ hash MD5
$$ C7 AC FD AA D9 99 55 69 11 A5 B4 45 01 30 B1 ED
##$RELAX= 
##$RELAX= 
##$RELAX= 
##$RELAX= 
##$RELAX= 
##$RELAX= 
##$RELAX= 
##$RELAX= 
$$ Bruker specific parameters
$$ --------------------------
##$DU= <F:\spectra>
##$EXPNO= 1
##$NAME= <H1>
##$PROCNO= 1
##$TYPE= <nmr>
##$USER= <av>
##$AMP= (0..31)
100 100 100 100 100 100 100 100 100 100 100 100 100 100 100 100 100 100 
100 100 100 100 100 100 100 100 100 100 100 100 100 100 
##$AQSEQ= 0
##$AQ_mod= 1
##$AUNM= <au_zg>
##$AUTOPOS= <>
##$BF1= 200.13
##$BF2= 200.13
##$BF3= 200.13
##$BF4= 200.13
##$BF5= 500.13
##$BF6= 500.13
##$BF7= 500.13
##$BF8= 500.13
##$BYTORDA= 1
##$CFDGTYP= 0
##$CFRGTYP= 5
##$CHEMSTR= <none>
##$CNST= (0..31)
1 1 145 1 1 1 1 1 1 1 1 1 1 1 1 1 1 1 1 1 1 1 1 1 1 1 1 1 1 1 1 1 
##$CPDPRG= <>
##$CPDPRG1= <>
##$CPDPRG2= <>
##$CPDPRG3= <>
##$CPDPRG4= <mlev>
##$CPDPRG5= <mlev>
##$CPDPRG6= <mlev>
##$CPDPRG7= <mlev>
##$CPDPRG8= <mlev>
##$CPDPRGB= <>
##$CPDPRGT= <>
##$D= (0..31)
0 2 0 0 0 0 0 0 0 0.06 0 0 0 0 0 0 0.0002 0 0 0 0 0 0 0 0 0 0 0 0 0 0 
0 
##$DATE= 1753341256
##$DBL= (0..7)
120 120 120 120 120 120 120 120 
##$DBP= (0..7)
150 150 150 150 150 150 150 150 
##$DBP07= 0
##$DBPNAM0= <>
##$DBPNAM1= <>
##$DBPNAM2= <>
##$DBPNAM3= <>
##$DBPNAM4= <>
##$DBPNAM5= <>
##$DBPNAM6= <>
##$DBPNAM7= <>
##$DBPOAL= (0..7)
0.5 0.5 0.5 0.5 0.5 0.5 0.5 0.5 
##$DBPOFFS= (0..7)
0 0 0 0 0 0 0 0 
##$DE= 6
##$DECBNUC= <off>
##$DECIM= 32
##$DECNUC= <off>
##$DECSTAT= 4
##$DIGMOD= 1
##$DIGTYP= 9
##$DL= (0..7)
0 120 120 120 120 120 120 120 
##$DP= (0..7)
150 150 150 150 150 150 150 150 
##$DP07= 0
##$DPNAME0= <>
##$DPNAME1= <>
##$DPNAME2= <>
##$DPNAME3= <>
##$DPNAME4= <>
##$DPNAME5= <>
##$DPNAME6= <>
##$DPNAME7= <>
##$DPOAL= (0..7)
0.5 0.5 0.5 0.5 0.5 0.5 0.5 0.5 
##$DPOFFS= (0..7)
0 0 0 0 0 0 0 0 
##$DQDMODE= 0
##$DR= 18
##$DS= 0
##$DSLIST= <SSSSSSSSSSSSSSS>
##$DSPFIRM= 0
$$ [...]
##$SUBNAM0= <"">
##$SUBNAM1= <"">
##$SUBNAM2= <"">
##$SUBNAM3= <"">
##$SUBNAM4= <"">
##$SUBNAM5= <"">
##$SUBNAM6= <"">
##$SUBNAM7= <"">
##$SUBNAM8= <"">
##$SUBNAM9= <"">
##$SW= 20.6817932712277
##$SWIBOX= (0..15)
0 0 3 0 0 0 0 0 0 0 0 0 0 0 0 0 
##$SW_h= 4139.07284768212
##$TD= 32768
##$TD0= 1
##$TE= 0
##$TE2= 300
##$TE3= 300
##$TEG= 300
##$TL= (0..7)
0 120 120 120 120 120 120 120 
##$TP= (0..7)
150 150 150 150 150 150 150 150 
##$TP07= 0
##$TPNAME0= <>
##$TPNAME1= <>
##$TPNAME2= <>
##$TPNAME3= <>
##$TPNAME4= <>
##$TPNAME5= <>
##$TPNAME6= <>
##$TPNAME7= <>
##$TPOAL= (0..7)
0.5 0.5 0.5 0.5 0.5 0.5 0.5 0.5 
##$TPOFFS= (0..7)
0 0 0 0 0 0 0 0 
##$TUNHIN= 0
##$TUNHOUT= 0
##$TUNXOUT= 0
##$USERA1= <user>
##$USERA2= <user>
##$USERA3= <user>
##$USERA4= <user>
##$USERA5= <user>
##$V9= 5
##$VALIST= <valist>
##$VCLIST= <CCCCCCCCCCCCCCC>
##$VD= 0
##$VDLIST= <DDDDDDDDDDDDDDD>
##$VPLIST= <PPPPPPPPPPPPPPP>
##$VTLIST= <TTTTTTTTTTTTTTT>
##$WBST= 1024
##$WBSW= 30
##$XGAIN= (0..3)
0 0 0 0 
##$XL= 0
##$YL= 0
##$YMAX_a= 1730515
##$YMIN_a= -1550420
##$ZGOPTNS= <>
##$ZL1= 120
##$ZL2= 120
##$ZL3= 120
##$ZL4= 120
##$ABSF1= 10
##$ABSF2= 0
##$ABSG= 5
##$ABSL= 3
##$ALPHA= 0
##$AQORDER= 0
##$ASSFAC= 0
##$ASSFACI= 0
##$ASSFACX= 0
##$ASSWID= 0
##$AUNMP= <proc_1d>
##$AZFE= 0.1
##$AZFW= 0.1
##$BCFW= 1
##$BC_mod= 2
##$BYTORDP= 0
##$COROFFS= 0
##$CY= 19
##$DATMOD= 1
##$DC= 2
##$DFILT= <>
##$DTYPP= 0
##$F1P= 11.0000007629395
##$F2P= -0.999999237060547
##$FCOR= 0.5
##$FTSIZE= 0
##$FT_mod= 4
##$GAMMA= 1
##$GB= 1
##$INTBC= 1
##$INTSCL= 1
##$ISEN= 128
##$LB= 0.05
##$LEV0= 0
##$LPBIN= 0
##$MAXI= 10000
##$MC2= 0
##$MEAN= 0
##$ME_mod= 0
##$MI= 0
##$NCOEF= 0
##$NC_proc= 0
##$NLEV= 6
##$NOISF1= 0
##$NOISF2= 0
##$NSP= 1
##$NTH_PI= 0
##$NZP= 0
##$OFFSET= 16.51637
##$PC= 1
##$PHC0= -275.1915
##$PHC1= 4.101552
##$PH_mod= 0
##$PKNL= yes
##$PPARMOD= 0
##$PSCAL= 4
##$PSIGN= 0
##$REVERSE= no
##$SF= 200.13
##$SI= 16384
##$SIGF1= 0
##$SIGF2= 0
##$SINO= 400
##$SIOLD= 16384
##$SREGLST= <1H.CDCl3>
##$SSB= 0
##$STSI= 0
##$STSR= 0
##$SW_p= 4139.07284768211
##$SYMM= 0
##$S_DEV= 0
##$TDeff= 0
##$TDoff= 0
##$TI= <>
##$TILT= no
##$TM1= 0
##$TM2= 0
##$TOPLEV= 0
##$USERP1= <user>
##$USERP2= <user>
##$USERP3= <user>
##$USERP4= <user>
##$USERP5= <user>
##$WDW= 1
##$XDIM= 8192
##$YMAX_p= 0
##$YMIN_p= 0
$$ End of Bruker specific parameters
$$ ---------------------------------
##NTUPLES= NMR FID
##VAR_NAME=  TIME,          FID/REAL,        FID/IMAG
##SYMBOL=    X,             R,               I
##VAR_TYPE=  INDEPENDENT,   DEPENDENT,       DEPENDENT
##VAR_FORM=  AFFN,          ASDF,            ASDF
##VAR_DIM=   16384,         16384,           16384
##UNITS=     SECONDS,       ARBITRARY UNITS, ARBITRARY UNITS
##FACTOR=    0.0002416,     1,               1
##FIRST=     0,             0,               0
##LAST=      3.9581328,     0,               0
##MIN=       0,             -1550420,        0
##MAX=       3.9581328,     1730515,         0
$$ Real data points
##PAGE= N=1
##DATA TABLE= (X++(R..R)), XYDATA
$$ [...]
$$ plain form
9929 -2 91 133 26 -115 -137 74 66 -136 34 39 136 223 -48 -108 -54 84 5 -214 -170 -45 -176 -100 -154 66 229 -16
9955 -16 -154 -43 -74 23 147 49 -85 -132 169 -38 -57 -26 146 112 -86 9 -56 52 -113 5 -93 -192 119 98
9979 98 127 89 -82 69 -235 -174 18 90 10 -64 28 -129 -54 -49 -81 -233 -116 -19 -102 -69 214 -72 145 -70 -125
10004 -125 89 -118 -53 -113 -315 71 -134 140 -35 21 -94 300 133 -82 1 -139 108 -158 -9 -103 -6 107
10026 107 96 11 -139 -56 -73 40 122 158 -61 187 187 40 76 -13 -81 9 -50 -131 14 -214 145 -42 -34 25 -35 -74
10052 -74 67 56 204 -28 58 -133 -89 159 45 -10 67 -235 16 132 -37 -178 -102 -114 259 120 -78 136
10074 136 -10 -54 -78 -122 162 -53 63 -150 -220 -102 118 -46 -354 39 -106 12 -54 -10 324 61 -281 -224
10096 -224 -107 -126 -61 37 33 -20 -202 18 4 85 -1 -184 52 -176 -37 -88 -305 -121 -200 -132 -274 -44 -52 10 56
$$ packed form
9929bR3M2j07j41k2K11qk02J70NR7Q7k71o0N4J38p9k19M4J25j31P6n4K20J63k45
9955a6j38J11l1R7J24r8j34m7L01k07j9L1J72l4j98R5o5J08j65J18r8r9L11k1
9979I8K9l8j71J51l04O1J92P2q0p4R2j57P5Nl2j52J17R7q3L3K83k86K17k15n5
10004a25K14k07O5o0k02L86k05K74j75N6j15L94j67k15Q3j40K47k66J49r4R7J13
10026A07j1q5j50Q3j7J13Q2L6k19K48%j47L6q9o8R0n9q1J45k28L59j87QN9o0l9
10052g4J41j1J48k32Q6j91M4K48j14n5P7l02K51J16j69j41P6j2L73j39j98K14
10074A36j46m4k4m4K84k15J16k13p0J18K20j64l08L93j45J18o6M4L34k63l42N7
10096b24J17j9O5R8mn3j82K20j4Q1q6j83K36k28J39n1k17J84p9O8j42K30qO2M6
$$ plain form
10121 56 147 -27 -18 133 -194 -214 164 -12 -181 167 20 -210 34 7 -181 68 -18 -124 6 76 142 -39 0
10144 0 96 -27 -108 -39 135 -134 50 -42 -342 -45 110 34 -140 -219 -183 257 -88 135 62 -30 15 -162 -68 -63 -139
10169 -139 188 92 -10 -55 40 65 -199 -185 -52 -109 1 64 -52 -35 6 159 11 65 86 -126 -18 -189 -51
10192 -51 -72 251 -32 -65 314 67 41 -48 -43 191 -418 -86 107 37 -87 -308 -122 15 0 -54 -17 -97 -54 -40
10216 -40 20 -52 -154 169 78 60 -81 3 -176 39 -122 122 -75 -241 361 -55 -159 100 -67 125 33 102
10238 102 52 -114 80 -210 58 -199 -138 -107 -16 14 -120 -181 -125 172 83 -10 -136 292 -41 -185 20 -10 -78
10261 -78 -73 53 -35 108 -30 8 57 19 55 -36 -37 -4 -34 -15 -49 -109 115 -155 -17 -61 -323 234 -195 24 -17 -37
10287 -37 183 75 -13 -6 -140 220 -189 -157 -141 -128 -243 -50 -94 -115 -37 48 409 -128 245 67 117 -147 79 74
$$ packed form
10121E6R1j74RJ51l27k0L78j76j69L48j47k30K44k7j88K49q6j06J30P0O6j81L9
10144@R6j23q1O9J74k69J84r2l00K97J55p6j74p9L6M40l45K23p3r2M5j77R4Np6
10169a39L27r6j02m5R5K5k64J4J33n7J10O3j16J7M1J53j48N4K1k12J08j71J38
10192e1k1L23k83l3L79k47k6q9NK34o09L32J93p0j24k21J86J37j5n4L7q0M3J4
10216d0O0p2j02L23r1j8j41Q4j79K15j61K44j97j66O02m16j04K59j67J92r2O9
10238A02n0j66J94k90K68k57O1L1R1L0j34o1N6K97q9r3j26M28l33j44K05l0o8
10261g8NJ26q8J43j38L8M9l8L6r1jL3l0J9l4o0K24k70J38m4k62N57m29K19m1k0
10287c7K20j08q8Pj34L60m09L2J6J3j15J93m4k1P8Q5L61n37L73j78N0k64K26n
$$ plain form
10311 74 -88 97 44 9 51 110 -71 -34 -298 72 -115 3 130 284 -90 103 -10 15 70 -68 -206 42
10333 42 -133 -124 -14 -26 186 -111 98 47 -72 -16 100 21 89 -191 172 -216 -10 -39 101 -203 -86 -189 -39
10356 -39 86 -142 166 -41 -90 4 68 20 60 -87 -89 -13 76 52 -113 181 22 -174 -98 -105 47 92 -36 -157 -89
10381 -89 150 -54 -225 31 -68 127 -167 -34 -186 100 -172 -113 118 101 251 23 259 -38 -85 239 34
10402 34 -104 -74 -9 53 -87 -152 171 -213 -23 181 -190 -103 -144 58 -116 26 93 -183 42 212 57 -21 -83
10425 -83 18 -132 121 -219 147 -204 -76 54 -87 66 80 -97 -148 -12 117 -42 -15 -215 -83 41 -203
10446 -203 -54 -160 -96 -200 -19 138 53 228 -108 -95 64 105 -113 2 -305 -109 52 -231 -114 -144 -136 16
10468 16 -154 29 204 128 -49 -35 -28 0 92 69 374 -46 -106 89 -75 -143 -31 -349 114 -129 -251 11 -31
$$ packed form
10311G4j62J85n3l5M2N9j81L7k64L70j87J18J27J54l74J93j13K5N5j38j38K48
10333D2j75RJ10j2K12k97K09n1j19N6J16p9O8k80L63l88K06k9J40l04J17j03J50
10356c9J25k28L08k07m9R4O4m8M0j47kP6Q9k4j65K94j59j96P6pJ52M5j28j21O8
10381h9K39k04j71K56r9J95k94J33j52K86k72N9K31j7J50k28K36k97m7L24k05
10402C4j38L0O5O2j40o5L23l84J90K04l71Q7m1K02j74J42O7k76K25J70j55p8o2
10425h3J01j50K53l40L66l51J28J30j41J53J4j77n1J36J29j59K7k00J32J24k44
10446b03J49j06O4j04J81J57q5J75l36J3J59M1k18J15l07J96J61k83J17l0QJ52
10468A6j70J83J75p6j77J4PK8R2k3L05m20o0J95j64o8J12l18M63k43j22K62m2
$$ plain form
10491 -31 -82 -145 118 138 -171 -57 -77 -98 127 -142 -135 36 64 176 -178 134 -45 -254 5 104 -69 -112 142
10514 142 142 56 33 68 -204 -37 -242 -40 104 50 129 -207 291 85 60 263 -101 130 95 312 51 -182 69
10537 69 -21 28 -18 45 -107 -13 -8 101 49 60 131 -95 179 -95 -47 24 -33 -20 61 -129 -65 -8 57 -20 37 -82 -40
10564 -40 -384 195 80 -98 -12 104 -63 -9 -8 57 -368 141 67 -62 -37 56 -162 -56 182 -74 193 22 75
10587 75 128 -240 140 68 111 -53 -254 -85 59 117 -158 -34 -174 19 -54 145 42 231 311 69 -37 24
10609 24 -17 38 101 115 -72 -9 -91 194 122 -3 205 -263 -42 -202 34 59 161 144 -60 150 -179 144 -91
10632 -91 -30 -79 126 82 64 -52 -195 -1 78 -129 38 -35 -149 -38 -35 55 -153 -156 67 179 -100 210 339 167
10656 167 -75 162 276 -127 -46 -3 -46 -37 78 -170 -109 124 -40 125 168 62 -248 -203 142 30 -95 -99 -69
$$ packed form
10491c1n1o3K63K0l09J14k0k1K25k69PJ71K8J12l54L12j79k09K59R9j73m3K54
10514A42%q6k3L5k72J67k05K02J44n4P9l36M98k06k5K03l64K31l5K17k61k33K51
10537F9r0M9m6O3j52R4NJ09n2J1P1k26K74k74M8P1n7J3Q1j90O4N7O5p7N7j19M2
10564d0l44N79j15j78Q6J16j67N4JO5m25N09p4j29K5R3k18J06K38k56K67j71N3
10587G5N3l68L80p2M3j64k01J69J44N8k75J24j40J93p3J99j03J89Q0k42j06O1
10609B4m1N5O3J4j87O3q2K85p2j25K08m68K21j60K36K5J02j7k04K10l29L23k35
10632i1O1m9K05m4j8j16j43J94P9k07J67p3j14J11LR0k08lK23J12k79L10J29j72
10656A67k42K37J14m03Q1M3m3RJ15k48O1K33j64J65M3j06l10M5L45j12j25mL0
$$ plain form
10679 -69 -14 367 202 26 -36 20 -35 -109 100 90 82 -31 106 -126 -131 318 -79 -16 -76 109 -130 26 46 -6 353
10704 353 201 166 6 -166 204 -76 34 -165 -87 161 -186 -229 173 196 -139 -149 19 -181 63 173 17
10725 17 52 -84 89 -27 -222 108 18 98 -25 -74 -39 42 -154 85 -9 -14 -59 78 14 -71 116 -113 242 93
10749 93 95 263 145 12 -138 -24 110 -103 -114 -273 59 91 27 81 107 -53 218 160 -7 212 -95 -14 -83
10772 -83 -109 -285 -60 116 -76 31 -214 -12 -147 -236 41 -9 -56 124 84 -6 -232 -255 52 21 16 27 -96 -56
10796 -56 -267 -123 -82 -180 -140 232 246 -55 -71 -115 111 82 -85 -170 425 99 -51 56 362 -173 62 18 -154
10819 -154 81 35 172 155 -61 107 207 -26 -31 103 -149 -133 -66 -152 -8 122 144 -58 92 91 -14 -280 -89
10842 -89 85 36 -203 72 -190 36 45 -35 131 -29 97 -71 -3 196 64 373 -1 62 -19 2 103 111 143 184
$$ packed form
10679f9N5L81j65j76o2N6n5p4K09j0qj13J37k32nM49l97O3o0J85k39J56K0n2L59
10704C53j52l5j60j72L70k80J10j99P8K48l47m3M02K3l35j0J68k00K44J10j56
10725A7L5j36J73j16j95L30r0Q0j23m9L5Q1j96K39r4nm5J37o4q5J87k29L55j49
10749I3KJ68j18j33j50J14J34k13j1j59L32L2o4N4K6j60K71n8j67K19l07Q1o9
10772h3k6j76K25J76j92J07k45K02j35q9K77n0m7J80m0r0k26k3L07l1nJ1j23M0
10796e6k11J44M1r8M0L72J4l01j6m4K26k9j67q5N95l26j50J07L06n35K35m4j72
10819a54K35m6J37j7k16J68J00k33nJ34k52J6O7q6J44J30K2k02J50jj05k66J91
10842h9J74m9k39K75k62K26Rq0J66j60J26j68O8J99j32L09l74O3q1K1J01QL2M1
$$ plain form
10866 184 -214 3 -19 -80 -176 -121 -50 127 118 -19 -18 -48 90 -115 -48 -74 -97 -168 162 20 14 -13 25 -189 -59 7
10892 7 24 120 122 77 -89 107 28 266 42 -121 -115 -19 -46 -27 -65 -57 -122 -7 49 -7 110 -64 16 -37 171 -67 15
10919 15 -131 112 33 62 -144 35 189 -18 115 -15 -3 111 123 -23 -291 2 -114 -134 -134 16 -169 -62
10941 -62 82 -246 50 -163 58 -55 -51 -116 45 2 -58 -75 -140 -170 -130 -129 156 91 -28 53 41 -150 4 75 129
10966 129 5 -3 -184 91 195 -45 11 74 45 -8 -5 121 82 -123 -218 155 -62 -124 215 -31 -232 -285 17 165
10990 165 -13 112 97 99 -95 -19 -54 41 152 71 198 108 16 -128 19 -45 -175 -54 35 -86 -138 156 -63 129
11014 129 -35 -250 -171 -188 -164 -124 38 168 36 67 -136 26 129 -113 -248 -141 -88 -45 -29 -146 -45 -146
11036 -146 -21 -78 61 11 -69 150 296 233 117 164 25 190 -51 88 13 -93 46 21 -35 -332 49 222
$$ packed form
10866A84l98K17k2o1r6N5P1J77rj37Jl0J38k05O7k6k3p1L30j42ok7L8k14J30O6
10892GJ7R6Km5j66J96p9K38k24j63OR6k7J9l8Qo5J15N6n6J17j74Q0n3K08k38Q2
10919A5j46K43p9K9k06J79J54k07J33j30J2J14J2j46k68K93j16k0%J50j85J07
10941f2J44l28K96k13K21j13Mo5J61m3o0j7o5l0M0JK85o5j19Q1j2j91J54P1N4
10966A29j24qj81K75J04k40N6O3k9n3LJ26l9k05r5L73k17o2L39k46k01n3L02J48
10990A65j78J25j5Kj94P6l5R5J11q1J27r0r2j44J47o4j30J21Q9j21n2K94k19J92
11014A29j64k15P9j7K4M0J62J30j32L1k03J62J03k42j35J07N3M3J6j17J01j01
11036a46J25n7J39n0q0K19J46o3j16M7j39J65k41J39p5j06J39k5n6k97L81J73
$$ plain form
11058 222 -38 50 101 100 -107 71 -19 -148 49 90 169 102 -182 -86 -162 33 -82 178 -10 -52 92 36 -126 46
11082 46 67 -106 -74 -111 23 0 29 105 32 95 -120 356 -130 21 104 19 49 134 -48 -168 -302 -49 98 -118
11106 -118 -13 -14 20 -135 -34 110 2 25 109 -121 -16 -23 168 -358 92 -115 18 80 -88 -32 -87 48 -183
11129 -183 67 125 71 58 -104 147 -76 134 166 149 -125 -73 47 36 -118 154 -27 -40 -26 -25 119 -57 -151 -228
11153 -228 -69 64 89 -225 -68 -73 -176 126 -186 4 -14 191 -28 -51 94 -26 33 156 -77 -36 77 -137
11175 -137 -54 97 23 28 34 -152 105 -169 -3 -167 -33 -285 -68 -75 -132 150 6 -13 27 -122 54 313 -29
11198 -29 131 -145 192 -122 -30 145 -169 -65 -109 154 -91 -64 -228 79 98 157 12 243 200 84 74 42 3
11221 3 89 20 -105 49 -108 54 55 253 -110 -7 1 29 207 -76 -54 -40 37 -138 -42 -109 261 -22 23 -139 19
$$ packed form
11058B22k60Q8N1jk07J78r0j29J97M1P9o7k84R6p6J95j15K60j88m2J44n6j62J72
11082D6K1j73L2l7J34k3K9P6p3O3k15M76m86J51Q3q5L0Q5j82j20j34K53J47k16
11106a18J05jL4j55J01J44j08K3Q4k30J05pJ91n26M50k07J33O2j68N6n5J35k31
11129a83K50N8n4j3j62K51k23K10L2j7k74N2J20j1j54K72j81j3J4JJ44j76r4p7
11153b28J59J33K5l14J57nj03L02l12J90j8K05k19k3J45j20N9J23k33M1J13k14
11175a37Q3J51p4NOj86K57k74J66j64J34k52K17pn7K82j44j9M0j49J76K59l42
11198b9J60k76L37l14R2J75l14J04m4K63k45K7j64L07J9N9j45K31m3j16j0l2l9
11221CQ6o9j25J54j57J62JJ98l63J03QK8J78k83K2J4P7j75R6o7L70k83M5j62J58
$$ plain form
11246 19 29 157 -46 -119 -21 -28 48 -59 -8 -296 -54 23 -19 -98 23 122 -32 135 43 156 21 52 214 -37
11270 -37 5 139 -63 157 249 -116 330 204 65 -91 38 -138 5 -7 102 392 283 106 138 -50 147
11291 147 -134 -266 -270 -218 -176 -106 19 -1 48 13 -66 94 5 85 -374 23 216 -495 195 2 -17 69 51 26 46
11316 46 47 144 -242 -245 71 -6 -62 145 44 -9 -31 20 47 -57 -223 273 -25 80 336 97 74 55 -10 -80 27
11341 27 10 121 25 60 -116 -66 -240 -146 -23 73 -155 8 169 -205 213 162 99 -108 -129 204 -183 28 9
11364 9 -155 45 -161 79 41 -57 80 269 -103 -38 -177 -68 -16 34 95 196 49 82 -167 -88 -189 -33 68
11387 68 -52 -17 19 47 24 137 108 -144 -235 21 92 16 242 120 -103 113 -84 -150 -265 45 22 -41 -9 -90
11411 -90 -67 -109 198 103 193 -8 108 -171 -137 110 130 255 121 57 -151 -118 114 -44 36 4 160 -36 50 23
$$ packed form
11246A9J0J28k03p3R8pP6j07N1k88K42P7m2p9J21R9j54J67r2J13j35L1J62k51
11270c7M2J34k02K20R2l65M46j26j39j56J29j76J43j2J09K90j09j77L2j88J97
11291A47k81j32mN2M2P0J25k0M9l5p9J60q9Q0m59L97J93p11O90j93j9Q6j8k5K0
11316D6JR7l86lL16p7n6K07j01n3k2N1K7j04j66M96k98J05K56k39k3j9o5p0J07
11341B7j7J11r6L5j76N0j74R4J23R6k28J63J61l74M18n1o3k07k1L33l87K11j9
11364Ij64K00k06K40l8r8J37J89l72O5j39J09N2N0O1J01j47L3k49P9j01J56J01
11387F8j20L5L6K8k3J13k9k52r1K56P1p6K26j22k23K16j97o6j15L10k3o3L2q1
11411i0K3m2L07r5R0k01J16k79L4K47K0J25j34o4k08L3K32j58Q0l2J56j96Q6k7
$$ plain form
11435 23 -20 62 145 -43 -103 -87 183 280 -130 91 99 -74 -29 -62 13 78 38 -25 -168 133 87 239 65 129 173 26
11461 26 48 -19 -205 53 170 0 -3 -235 136 -65 -3 -106 -26 329 -136 83 178 -87 11 119 99 -12 267
11484 267 -98 123 83 -6 -74 -48 -227 94 26 -121 114 -104 -151 11 50 89 29 125 161 103 -17 -86 89 -53
11508 -53 -53 -39 -160 103 -83 -48 -83 -82 161 210 174 1 73 -116 1 -75 161 -26 1 -93 34 327 152 134 228
11533 228 100 99 163 75 87 148 49 70 -109 152 -106 -235 235 90 20 113 194 -86 -50 -50 138 11 8 -125 -64
11558 -64 -102 23 137 -173 -161 6 -62 -17 -134 -198 75 -214 71 -337 -37 125 126 5 64 51 -6 -27 -98 127
11582 127 -214 79 111 -131 51 4 92 -185 -166 147 -124 330 156 -9 119 17 -192 125 185 -127 -113 27
11604 27 -20 -92 -122 -8 -122 142 -80 213 -138 -3 -84 124 -38 -33 -200 -212 -25 -75 -4 -216 -94 -62 176
$$ packed form
11435B3m3Q2Q3j88o0J6K70R7m10K21Qj73M5l3P5O5m0o3j43L01m6J52j74O4M4j47
11461B6K2o7j86K58J17j70lk32L71k01O2j03Q0L55m65K19R5k65R8J08k0j11K79
11484B67l65K21m0q9o8K6j79L21o8j47K35k18m7J62L9L9o0R6L6n8j20o9J75j42
11508e3%J4j21K63j86L5l5JK43M9l6j73P2j89J17p6K36j87K7r4J27K93j75j8R4
11533B28j28jO4q8J2O1r9K1j79K61k58j29M70j45p0R3Q1k80L6%J88j27lj33O1
11558f4l8J25J14l10J2J67o8M5j17o4K73k89K85m08L00J62Jj21N9j3n7k1p1K25
11582A27l41K93L2k42J82m7Q8k77J9L13k71M54j74j65J28j02k09L17O0l12J4J40
11604B7m7p2l0J14j14K64k22K93l51J35q1K08j62Nj67j2J87n0P1k12J22L2K38
$$ plain form
11627 176 -55 45 -57 -190 189 52 -96 147 25 72 48 255 80 -153 167 20 9 38 113 -180 143
11648 143 59 245 62 -36 118 93 -128 39 17 -113 136 187 9 36 -50 128 -55 51 99 27 -20 -161 164
11671 164 -14 74 230 158 4 -148 3 -95 -27 -67 -67 265 17 74 -212 31 -191 50 227 1 132 -135
11693 -135 -127 -87 -42 -144 64 -4 39 -11 94 -96 114 53 133 -171 -126 146 -1 10 137 84 -78 24 -263 57
11717 57 92 114 -43 -82 100 -96 35 85 252 203 -12 -9 125 117 20 -95 17 128 -171 84 95 59 188 124
11741 124 109 -103 99 309 115 178 -169 -94 -144 86 -145 -191 -134 39 63 -18 77 -54 16 -162 81 -3 -145
11764 -145 66 -206 80 254 194 187 73 -88 -26 39 82 54 175 -101 4 34 -90 46 127 79 -125 -7 86
11787 86 175 -52 174 72 10 -207 44 169 -45 -142 -164 66 -29 -148 117 6 153 -6 -8 90 -29 30 66
$$ packed form
11627A76k31J00j02j33L79j37j48K43j22M7k4K07j75k33L20j47j1K9P5k93L23
11648A43q4J86j83r8J54k5k21J67k2j30K49N1j78K7q6J78j83J06M8p2m7j41L25
11671A64j78Q8J56p2j54j52J51r8O8m0%L32k48N7k86K43k22K41J77k26J31k67
11693a35QM0M5j02K08o8M3n0J05j90K10o1Q0l04M5K72j47J1J27n3j62J02k87L20
11717E7L5K2j57l9J82j96J31N0J67m9k15LJ34qr7j15J12J11k99K55J1l6J29o4
11741A24j5k12K02K10j94O3l47P5n0K30k31m6N7J73K4q1R5j31P0j78K43q4j42
11764a45K11k72K86J74o0pj14j61O2O5M3k8J21k76J05L0j24J36Q1m8k04J18R3
11787H6Q9k27K26j02o2k17K51J25k14r7k2K30r5j19K65j11J47j59kR8j19N9L6
$$ plain form
11810 66 -5 185 45 -37 -107 -18 141 -167 130 -67 -44 -264 293 27 -58 143 47 31 -106 80 -205 239 -83
11833 -83 125 -370 -111 30 142 -115 67 93 215 90 62 -38 327 -208 -105 52 87 -79 174 50 33
11854 33 65 168 226 108 -121 170 -56 -239 -79 -147 41 118 143 184 -87 -83 110 35 29 -163 -123 64 -45 43
11878 43 93 -123 -116 270 14 15 21 13 -75 -61 -214 -234 153 98 -11 -50 81 -206 -212 -94 60 220 26 17 20 -231 -60
11905 -60 -75 -48 -65 -10 -90 -75 70 -77 -27 243 213 -133 -37 104 39 83 246 19 137 -14 -146 9 33 28 -140
11930 -140 148 -142 -12 112 -85 57 365 -140 43 -74 -51 -35 -184 302 -63 -32 -14 -16 75 114 -17 -63 -128
11953 -128 -68 -91 -177 -22 -189 -171 -14 -83 63 -12 71 -9 109 -73 -6 108 176 76 71 -196 -46 217 -55 -177
11977 -177 -127 43 -199 -102 166 38 -7 -113 44 -70 148 31 -145 137 -10 -1 53 114 31 201 -9 37 -151
$$ packed form
11810F6p1J90j40q2p0Q9J59l08K97j97K3k20N57k66q5K01r6j6j37J86k85M44l22
11833h3K08m95K59J41J12k57J82K6J22j25k8j00L65n35J03J57L5j66K53j24j7
11854C3L2J03N8j18k29K91k26j83J60o8J88P7K5M1k71MJ93p5oj92M0J87j09Q8
11878D3N0k16PL86k56JOqq8J4j53k0L87n5j09l9J31k87oJ18J54J60j94rLk51J71
11905f0j5K7j7N5q0J5J45j47N0K70l0l46R6J41o5M4J63k27J18j51j32J55K4nj68
11930a40K88k90J30J24j97J42L08n05J83j17K3J6j49M86l65L1J8kR1L9j31m6o5
11953a28O0k3q6J55j67J8J57o9J46p5Q3q0J18j82O7J14O8j00nk67J50K63k72j22
11977a77N0J70k42R7K68j28m5j06J57j14K18j17j76K82j47RN4O1q3J70k10M6j88
$$ plain form
12000 -151 -112 -64 24 38 121 21 -115 50 -22 75 -5 14 22 -135 170 -57 -5 96 -84 148 137 137 -79 121 104
12025 104 199 -223 -21 -106 -29 59 191 -126 72 279 13 -4 60 -39 110 113 -139 -5 36 -99 155 15 134
12048 134 -24 -45 16 18 76 -138 5 -135 -6 191 172 -169 -68 -24 -209 168 373 -82 -38 141 -18 195
12070 195 -244 123 64 -12 -55 188 -12 38 190 -234 -173 -17 -9 103 -144 -56 239 169 -4 -76 114 -162 -27
12093 -27 28 -267 74 -33 -120 -97 6 145 -161 239 228 239 -56 -38 50 88 -31 -124 206 -55 -191 94 -18
12116 -18 15 -199 -91 35 -65 -201 186 147 -32 136 -125 154 -76 12 72 -255 -62 -117 -194 -109 216 54
12138 54 -224 -111 -35 150 26 58 126 -49 -234 106 93 82 -73 35 66 -162 66 -97 -250 70 12 27 -21
12161 -21 92 49 -3 -58 51 -16 -289 -15 88 -157 -100 -18 142 -16 20 204 337 -132 62 194 44 -2 -5
$$ packed form
12000a51L9M8Q8J4Q3j00j36J65p2R7q0J9Qj57L05k27N2J01j80K32j1%k16K00j7
12025A04R5m22K02q5P7Q8J32l17J98K07k66j7O4r9J49Lk52J34M1j35K54j40J19
12048A34j58k1O1KN8k14J43j40J29J97j9l41J01M4j85L77K05m55M4J79j59K13
12070A95m39L67n9p6m3K43k00N0J52m24O1J56QJ12k47Q8K95p0j73p2J90k76J35
12093b7N5k95L41j07q7K3J03J39l06M00j1J1k95J8Q8L8j19r3L30k61j36K85j12
12116a8L3k14J08J26j00j36L87l9j79J68k61K79k30Q8O0l27J93n5p7Q5L25j62
12138E4k78J13P6J85j24L2O8j75j85L40j3j1j55J08L1k28K28j63j53L20n8J5m8
12161b1J13m3n2n5J09o7k73K74J03k45N7Q2J60j58L6J84J33m69J94J32j50m6l
$$ plain form
12184 -5 -62 55 85 179 22 -124 -146 -142 60 -28 -134 -24 -183 -76 -94 -94 -3 -140 -14 -35 262 261 84 -130 -170
12209 -170 -53 166 99 68 -61 -37 86 -34 -196 153 -27 31 -202 -95 -70 -20 95 96 184 -68 62 -43 193
12232 193 13 -32 -82 6 108 148 131 -19 -50 -14 -82 -139 58 21 -7 -91 32 97 -64 -63 103 -170 -41 55 -83
12257 -83 -70 152 -43 -115 -12 322 -105 -86 -37 -77 218 87 46 80 -184 69 179 81 -189 -123 309 -206 222
12280 222 -79 -69 -85 110 124 130 92 -15 89 22 -37 -135 190 70 50 189 -66 46 -17 -116 157 -186 -132 44
12304 44 53 229 298 -60 246 -6 -50 65 -1 -6 -51 -129 -90 75 226 42 125 122 -95 75 118 46 81 -104 255
12329 255 -77 -96 342 -140 224 259 -112 19 -103 -44 57 31 99 -177 102 47 135 114 -64 2 65 -25 -88 375
12353 375 -73 3 -293 263 52 95 149 73 -7 -52 136 -96 -257 -50 -227 134 -57 98 158 -103 172 -192
$$ packed form
12184en7J17L0R4j57j46k2MK02q8j06J10j59J07j8%R1j37J26k1K97jj77k14m0
12209a70J17K19o7l1j29K4J23j20j62L49j80N8k33J07K5N0J15JQ8k52J30j05K36
12232A93j80m5n0Q8J02M0j7j50l1L6o8n7J97l7k8q4J23O5j61JJ66k73J29R6j38
12257h3J3K22j95p2J03L34m27J9M9m0K95j31m1L4k64K53J10r8k70O6M32n15M28
12280B22l01J0j6J95J4Ol8j07J04o7n9r8L25j20k0J39k55J12o3r9K73l43N4J76
12304D4RJ76O9l58L06k52m4J15o6nm5p8L9J65J51j84Q3lk17J70M3p2L5j85L59
12329B55l32j9M38m82L64L5l71J31j22N9J01k6O8k76K79n5Q8k1j78O6O3r0o3M63
12353C75m48P6k96N56k11M3N4p6q0m5J88k32j61K07j77L61j91J55O0k61K75l64
$$ plain form
12375 -192 12 -107 311 -19 -94 -238 -58 49 129 -199 155 -125 -178 28 -209 97 273 -146 -85 67 -45
12396 -45 -25 8 -129 -86 145 204 159 128 66 34 -72 -118 108 114 -30 48 -162 58 -39 -174 -38 76 -115 -17 25
12421 25 0 294 29 -57 -177 60 80 24 260 -179 -106 23 143 21 -127 -78 224 70 172 42 -96 103
12443 103 176 76 -137 27 -4 -216 -62 41 -42 -82 184 -89 184 -129 -11 -126 40 -41 167 118 -37 -248
12465 -248 -69 -212 -5 -205 -166 165 141 -100 -31 6 82 106 -129 -92 -159 -90 -51 121 162 10 -181 89 -147
12488 -147 183 199 -68 -59 64 -59 176 -133 32 -7 108 115 -123 -170 61 -7 -204 -134 -149 -13 -75 -122 128 14
12512 14 56 39 185 -53 -19 2 -106 -25 -15 164 -114 -112 -64 11 -130 39 38 -61 120 -60 130 179 210 -100 91
12537 91 -164 -114 -159 269 -113 -64 -90 -147 -260 75 -129 54 62 108 160 170 93 101 -259 -155 -89 -218 -179 93 201
$$ packed form
12375a92K04j19M18l30p5j44J80J07Q0l28L54k80n3K06k37L06J76m19O1J52j12
12396d5K0L3j37M3K31N9m5l1o2l2j06m6K26Oj44P8k10K20r7j35J36J14j91R8M2
12421B5k5K94k65q6j20K37K0n6K36m39P3J29J20j22j48M9L02j54J02j30j38J99
12443A03P3j00k13J64l1k12J54J03q3m0K66k73K73l13J18j15J66q1K08m9j55k11
12465b48J79j43K07k00L9L31k4k41O9L7P6K4k35L7o7O9L9J72M1j52j91K70k36
12488a47L30J6k67RJ23j23K35l09J65l9J15Pk38m7K31o8j97P0j5J36o2m7K50j14
12512A4M2j7J46k38L4K1j08Q1J0J79k78KM8P5j41J69jr9J81j80J90M9L1l10J91
12537I1k55N0m5M28l82M9k6n7j13L35k04J83QM6N2J0p7Ql60J04O6j29L9K72J08
$$ plain form
12562 201 -157 -38 48 -63 38 234 99 39 31 149 -148 -144 -156 -109 40 26 0 62 93 -42 -134 52 87 -229
12586 -229 -46 15 15 82 101 -227 81 -115 -80 -132 -184 -213 -131 -117 186 77 -131 -124 57 -113 82 -149 -297 -266
12610 -266 29 115 -57 40 80 55 -76 -70 67 131 -10 -69 -208 -71 61 -166 -59 215 -165 111 -58 -131 -140
12633 -140 -5 49 -34 119 -18 -128 -103 161 -25 -36 -51 96 117 -143 -66 -170 -19 144 185 -78 -12 239 -102
12656 -102 93 -56 94 51 -325 190 -97 166 91 175 -111 102 132 -10 53 -140 -134 -72 178 1 138 109 9
12679 9 -18 -38 204 109 -35 71 102 -150 -78 -80 -259 108 -22 -137 -43 -33 92 285 -101 51 -113 -143 231 -266
12703 -266 -193 -43 -100 153 84 -251 92 173 -43 -11 -43 70 -41 182 -121 181 -3 107 -110 -21 240 0
12725 0 -175 193 20 10 -77 -54 -114 -104 273 11 -6 -113 -165 38 -96 118 0 -275 -107 182 -108 -40 -69
$$ packed form
12562B01l58J19Q6j11J01J96j35o0qJ18k97Mj2M7J49j4k6O2L1j35r2J86L5l16
12586b29J83O1%O7J9l28L08j96L5n2n2k9Q2J4L03j09k08PJ81j70J95k31j48L1
12610b66K95Q6j72R7M0k5j31OJ37O4j41n9j39J37J32k27J07K74l80K76j69p3r
12633a40J35N4q3J53j37j10K5K64j86j1j5J47K1k60P7j04J51J63M1k63O6K51l41
12656a02J95j49J50m3l76N15k87K63p5Q4k86K13L0j42O3j93OO2K50j77J37k9j00
12679Ik7k0K42r5j44J06L1k52P2kj79L67j30j15R4J0J25J93l86J52j64l0L74m97
12703b66P3J50n7K53o9l35L43Q1k16L2l2J13j11K23l03L02j84J10k17Q9K61k40
12725@j75L68j73j0q7K3o0J0L77k62j7j07n2K03j34K14j18k75J68K89k90O8k9
$$ plain form
12748 -69 202 149 260 65 -144 -3 126 -6 130 -93 -145 -132 147 -29 26 71 141 115 175 -102 9 14 201
12771 201 6 -149 -141 -19 -180 105 -285 -37 -120 43 33 -46 -153 -80 3 8 -13 -167 25 -3 -4 159 147 145 274
12796 274 77 -50 -129 87 36 36 51 -137 45 2 29 -4 -64 -74 1 81 37 70 294 226 -93 -9 -84 -37 -42 -67 -6
12823 -6 70 -138 -106 3 -131 41 10 72 280 -21 -50 116 50 50 -189 -18 134 -74 -80 39 -2 288 23 122
12847 122 61 89 176 77 150 -26 33 -80 44 -107 118 110 90 48 -35 177 120 -133 116 181 92 -175 -41 141
12871 141 -201 -148 -131 9 163 -147 103 11 -113 54 54 -39 -251 96 204 -50 105 -186 -340 -169 -217 121
12893 121 125 -18 -132 121 -100 -39 45 -67 237 208 45 78 18 -104 130 93 42 266 97 -116 -29 24 177
12916 177 -123 -95 -231 -6 -55 -364 184 -137 -89 -5 55 -148 -9 31 99 -66 7 -129 28 -50 -54 -23 58 -207
$$ packed form
12748f9K71n3J11j95k09J41J29j32J36k23n2J3K79j76N5M5P0k6O0k77J11NJ87
12771B01j95j55QJ22j61K85l90K48q3J63j0p9j07P3Q3Nk1j54J92k8jJ63j2kJ29
12796B74j97j27p9K16n1%J5j88J82m3K7l3o0j0P5Q0m4L3K24o8l19Q4p5M7nk5O1
12823fP6k08L2J09j34J72l1O2K08l01k9J66o6%k39J71J52k08oJ19m1K90k65R9
12847A22o1K8Q7r9P3j76N9j13J24j51K25qk0m2q3K12n7k53K49O5q9k67J34J82
12871A41l42N3J7J40J54l10K50r2j24J67%r3k12L47J08k54J55k91j54J71m8L38
12893A21Mj43j14K53k21O1Q4j12L04k9j63L3o0j22K34l7n1K24j69k13Q7N3J53
12916A77l00K8j36K25m9l09N48l21M8Q4O0k03J39M0O8j65P3j36J57p8mL1Q1k65
$$ plain form
12940 -207 0 -34 -44 4 196 -73 -53 31 3 -86 149 -178 -199 -88 -113 4 61 -98 -90 74 -68 42 -72 34
12964 34 80 -99 49 3 27 196 140 -416 172 -122 223 -75 292 -13 -93 -68 -19 -16 89 -243 53 -69 49
12987 49 -122 -45 261 -253 132 104 2 106 -137 186 152 -182 23 69 -50 41 378 -94 103 118 -143 -176
13009 -176 -20 44 196 9 -14 67 -177 -43 -3 -80 15 254 5 -16 -103 128 -93 -11 -118 -232 115 11 -237
13032 -237 -80 -59 -13 -20 175 -32 -64 -29 -25 118 -24 -225 17 -28 -44 44 71 -33 172 -121 -130 -7 -6 -226 184
13057 184 -176 76 10 18 84 -210 -51 -102 145 -157 71 98 309 33 -149 -333 -71 209 208 166 182 -169 193
13080 193 39 88 -71 -96 -75 37 23 -148 -179 10 -136 90 52 -33 -114 295 127 196 37 118 -109 -186 95
13103 95 114 4 -151 -60 208 90 -119 -85 215 -197 -83 -354 171 -24 44 -150 -8 80 208 212 36 111 -49
$$ packed form
12940b07K07l4j0M8J92k69K0Q4k8q9K35l27k1J11k5J17N7j59QJ64j42J10j14J06
12964C4M6j79J48m6K4J69n6n56N88k94L45k98L67l05q0K5M9LJ05l32K96j22J18
12987D9j71P7L06n14L85k8j02J04k43L23l4l34K05M6j19R1L37m72J97J5k61l3
13009a76J56O4J52j87k3Q1k44J34M0p7R5K39k49k1q7K31k21Q2j07j14L47j04k48
13032b37J57K1M6pJ95k07l2L5MJ43j42k01K42m5j6Q8K7j04K05k93rJ23Jk20M10
13057A84l60K52o6QO6k94J59n1K47l02K28K7K11k76j82j84K62K80jm2J6l51L62
13080A93j54M9j59k5K1J12j4j71l1J89j46K26l8q5q1M09j68O9j59Q1k27p7K81
13103I5J9j10j55R1K68j18k09L4L00m12J14k71N25j95O8j94J42Q8J28Mj76P5j60
$$ plain form
13126 -49 56 -103 -57 174 73 80 61 -12 43 -49 31 193 144 93 -10 115 162 52 111 10 185 -56 37 1 -43
13151 -43 -160 90 -16 -140 -34 173 34 -177 -87 -65 -44 -184 -70 55 -36 -14 -18 -114 30 213 -1 -180 -138
13174 -138 -43 258 -476 -252 12 -139 -76 94 84 -28 -42 8 37 -112 -68 24 63 -92 -35 -63 103 -144 -95 -26
13198 -26 57 -5 -36 -70 -16 63 68 44 -78 -210 196 -75 -30 132 -14 -197 101 12 -114 205 14 -108 111 8
13222 8 -102 4 118 25 -90 -208 -6 56 20 -65 154 -53 -136 61 221 55 -23 97 2 -141 -63 158 204
13245 204 132 3 -97 -89 9 105 112 337 6 171 197 -8 251 -52 -10 -83 -139 -52 -32 201 182 -294 56 -180
13269 -180 88 62 -190 68 -39 -209 132 -72 -125 24 -202 8 37 33 -69 -170 8 30 -64 29 49 151 -11
13292 -11 166 -10 43 -47 -132 10 -71 3 -45 156 240 92 -83 -158 -17 9 -208 -103 258 -123 71 -99 28
$$ packed form
13126d9J05j59M6K31j01Pj9p3N5r2Q0J62m9n1j03J25M7j10N9j01J75k41R3l6m4
13151d3j17K50j06j24J06K07j39k11R0K2K1j40J14J25r1K2mr6J44J83k14j79M2
13174a38R5L01p34K24K64j51O3J70j0j12j4N0K9j49M4R2L9j55N7k8J66k47M9O9
13198b6Q3o2l1l4N4P9Nk4j22j32M06k71M5J62j46j83K98q9j26L19j91j22K19j03
13222Hj10J06J14r3j15j18K02O2l6q5K19k07q3J97J60j66p8J20r5j43P8K21M6
13245B04p2j29j00QR8R6PK25l31J65K6k05K59l03M2p3n6Q7K0K33j9m76L50k36
13269a80K68k6k52K58j07j70L41k04n3J49k26K10K9mj02j01J78K2r4R3K0J02j62
13292a1J77j76N3r0q5J42q1P4m8K01Q4j48j75p5J41K6k17J05L61l81J94j70J27
$$ plain form
13315 28 99 48 157 101 131 -85 153 59 76 130 -41 184 -146 93 -156 130 -14 -89 61 -242 -226 -132 122
13338 122 3 2 29 -26 167 -13 -118 82 30 -275 -178 164 110 -21 -1 -43 45 -174 34 -63 110 -217 -193 -75
13362 -75 208 36 86 117 35 -24 -131 189 5 6 84 -78 134 53 -107 179 60 182 -169 -87 -49 -30 -22 66 -258
13387 -258 -122 283 26 101 230 -144 80 6 -97 -207 -161 -113 -26 -123 -100 183 -40 -16 50 -146 -233 -43 112
13410 112 141 197 -202 43 308 -165 5 -44 68 87 72 -3 115 0 13 -51 162 162 -15 7 248 1 65 -252
13434 -252 21 -135 123 126 -48 89 -138 63 129 8 -59 -121 -100 40 -64 292 172 -203 -110 172 -179 12
13456 12 -20 13 56 61 103 34 74 5 -2 59 87 88 -16 137 10 -49 -228 260 63 86 53 58 12 16 117 131 89 46 -18
13485 -18 -1 156 -197 134 -128 -153 -66 -67 -24 -38 -48 -106 141 -122 -293 15 -20 36 268 64 -103 -203 -183 186
$$ packed form
13315B8P1n1J09n6L0k16K38r4J7N4j71K25l30K39k49K86j44p5J50l03J6R4K54
13338A22j19jK7n5J93j80j05K00n2l05R7L42n4j31K0m2Q8k19K08r7J73l27K4J18
13362g5K83j72N0L1q2n9j07L20j84JP8j62K12q1j60K86j19J22l51Q2L8J9QQ8l24
13387b58J36M05k57P5J29l74K24p4j03j10M6M8Q7r7K3K83k23K4O6j96q7J90J55
13410A12K9N6l99K45K65m73J70m9J12J9j5p5J18j15J3o4K13%j77K2K41k47O4l17
13434b52K73j56K58Lj74J37k27K01O6j21o7o2K1J40j04L56j20l75R3K82l51J91
13456A2l2L3M3NM2o9M0o9pO1K8Jj04J53j27n9j79M88j97K3l3Nm6MJ01J4m2m3o4
13485a8J7J57l53L31k62k5Q7jM3j4j0n8K47k63j71L08l5N6K32k04j67j00K0L69
$$ plain form
13509 186 2 -43 224 -105 2 147 -55 24 157 -119 133 -222 45 27 45 20 -105 -114 -57 -177 68 -177
13531 -177 161 4 -25 122 101 339 -14 32 52 15 -254 10 8 -199 36 193 -188 -15 -35 58 122 -15 9
13554 9 -350 140 292 349 32 13 -35 -42 -81 58 -23 -161 -39 -19 -47 67 -92 26 117 12 -192 -50 45 -66
13578 -66 -91 31 -12 -28 122 -117 -159 -1 -132 -151 221 -231 -67 75 89 63 75 64 113 120 248 40 -190 172
13602 172 -45 -17 25 61 -119 -145 -160 83 -299 135 33 46 230 -58 -92 72 188 -62 99 56 -93 167
13624 167 10 -211 -14 -179 79 -72 46 -117 2 195 -32 64 -9 -149 30 5 -122 -52 -96 51 -61
13645 -61 -72 -11 -211 181 46 6 -153 150 183 36 -49 123 -51 -48 -2 -242 -127 -53 123 -3 -23 7 -106 -10
13669 -10 65 -226 -6 104 14 116 17 -74 -209 -193 34 21 -126 -2 40 -98 -70 -3 144 -41 -24 -63 -94 -43
$$ packed form
13509A86j84m5K67l29J07J45k02P9J33k76K52l55K67j8J8k5j25rN7j20K45k45
13531a77L38j57k9J47k1K38l53M6K0l7k69K64kk07K35J57l81J73k0R3O4j37K4
13554Il59M90J52N7l17j9m8pl9J39q1j38J22K0k8J14j59J18R1j05k04J42R5j11
13578f6k5J22m3j6J50k39m2J58j31j9L72m52J64J42J4k6J2j1M9PJ28k08k30L62
13602A72k17K8M2L6j80k6j5K43l82M34j02J3J84k88l4J64J16k50J61m3j49K60
13624A67j57k21J97j65K58j51J18j63J19J93k27R6p3j40J79k5j27P0m4J47j12
13645f1j1O1k00L92j35m0j59L03L3j47q5J72j74LM6k40J15P4J76j26k0L0j13R6
13669a0P5k91K20J10r0J02r9r1j35J6K27j3j47J24M2j38K8O7J47j85J7l9l1N1
$$ plain form
13693 -43 -62 -81 274 39 160 -102 -16 -136 53 -92 249 57 -10 -27 -236 -65 -127 -33 -122 11 -37 -18 14 70
13717 70 51 105 -15 101 79 263 58 -22 -97 220 -75 -94 166 85 211 -117 -385 98 -44 6 138 -121 105
13740 105 -93 88 108 248 104 -119 -141 -37 -45 -14 24 248 -120 137 -50 28 -275 10 -92 -246 358 -168
13762 -168 209 111 225 -179 238 -33 -40 207 -22 110 -29 14 -76 -103 19 57 -68 -43 -35 -143 162 -215 -91
13785 -91 -6 -140 102 68 -37 195 100 121 -6 224 -62 -9 -72 -42 49 -23 -160 -145 -49 78 -143 -110 33 -161
13809 -161 109 -52 104 -115 -134 25 60 92 -15 0 59 183 -97 -1 33 -42 -25 -104 -2 11 178 -41 319
13832 319 137 -168 30 126 -61 -237 -117 -42 176 10 -223 -440 -46 -139 207 118 -179 -29 97 14 -10 -313
13854 -313 13 92 -91 -73 96 -24 169 -210 57 76 -91 6 -201 75 98 -31 7 225 30 49 7 166
$$ packed form
13693d3j9j9L55k35J21k62Q6j20J89j45L41j92o7j7k09J71o2R4q9J33m8J9L2N6
13717G0j9N4j20J16k2J84k05q0p5L17k95j9K60q1J26l28k68M83j42N0J32k59K26
13740A05j98J81K0J40j44k23k2J04qL1L8K24l68K57j87P8l03K85j02j54O04n26
13762a68L77r8J14m04M17k71pK47k29J32j39M3r0k7J22L8j25K5Qj08L05l77J24
13785i1Q5j34K42l4j05K32r5K1j27K30k86N3o3L0R1p2j37J5R6J27k21L3J43j94
13809a61K70j61J56k19j9J59L5L2j07J5N9J24k80R6L4p5J7p9J02J3J67k19L60
13832C19j82l05J98R6j87j76J20P5K18j66k33k17L94r3L46q9k97J50J26q3k4l03
13854c13L26P9j83J8J69j20J93l79K67J9j67R7k07K76K3j29L8K18j95J9m2J59
$$ plain form
13876 166 27 139 109 -37 20 -110 -183 -68 34 -11 252 -17 55 33 138 9 166 -214 -52 -124 126 -41
13898 -41 -168 296 53 -187 -153 91 28 -267 47 80 -58 294 -149 -64 -52 -118 -52 7 111 18 182 75 29
13921 29 225 66 45 67 -139 65 -170 -143 -64 155 -107 115 -339 -108 81 -81 -371 -43 136 -173 -132 175
13943 175 63 47 82 -70 -14 -176 8 109 -157 -125 30 -97 -163 -61 46 182 -102 -123 70 41 -20 61 -159
13966 -159 -133 -29 -228 -294 28 63 142 138 31 254 -185 127 25 269 -103 64 -230 134 271 33 153 53
13988 53 124 -22 -23 -56 89 -15 -66 54 -39 39 256 10 163 -287 54 67 -14 102 55 -131 -99 60 91 -169
14012 -169 -30 117 35 79 -44 51 -145 -52 -209 124 4 -127 60 156 26 217 152 54 -71 97 67 246
14034 246 106 11 -88 45 26 -107 -132 -106 38 141 -2 183 -143 -32 5 38 104 -140 56 41 -213 171 -114
$$ packed form
13876A66j39J12l0j46N7j30p3J15J02m5K63k69P2k2J05j29J57l80J62p2K50j67
13898d1j27M64k43k40L4K44o3k95L14L3j38L52m43Q5J2o6O6N9J04r3J64j07m6
13921B9J96j59k1K2k06K04k35K7P9K19k62K22m54K31J89j62k90L28J79l09M1L07
13943A75j12j6L5j52N6j62J84J01k66L2J55j27o6J02J07J36k84k1J93k9o1Q1k20
13966a59K6J04j99o6L22L5P9mj07K23m39L12j02K44l72J67k94L64J37k38J20j00
13988E3P1j46jl3J45j04n1J20r3P8K17k46J53m50L41J3q1J16m7j86L2J59L1k60
14012a69J39J47q2M4j23R5j96R3j57L33j20j31J87R6j30J91o5r8j25J68l0J79
14034B46j40r5r9J33j9j33k5K6J44J03j43J85l26J11L7L3O6k44J96j5k54L84k85
$$ plain form
14057 -114 -121 82 -21 93 -91 -170 40 162 205 120 -20 -89 196 41 110 -2 -50 353 140 146 142 -82 173 42
14081 42 34 106 40 -184 127 -130 97 16 -61 151 267 34 142 47 -37 -100 -14 20 -37 88 -22 9 -88 279 64
14106 64 -74 -14 -218 -52 -103 279 -205 47 -28 146 84 -105 -33 -90 205 134 34 -152 -139 173 101 43 34 -35
14130 -35 -3 -100 -14 19 95 88 10 180 20 17 275 -50 71 83 38 -12 73 140 193 -92 89 49 73 184 41 115
14156 115 -161 -123 -157 146 172 -134 151 122 33 121 11 -41 31 278 110 9 99 29 98 224 111 74 -126 -98
14180 -98 47 -178 -227 122 187 -87 217 18 29 -181 -109 140 -186 77 -216 92 94 -55 168 -149 36 -221
14202 -221 23 73 41 -17 95 -25 -33 -115 -70 140 110 -57 36 -20 -35 194 235 161 18 4 186 126 267 -50 -240
14227 -240 -127 -18 69 5 -74 -90 -30 -111 211 125 -191 -132 161 -1 151 -83 38 -178 -100 -140 -53 204 28
$$ packed form
14057a14pK03j03J14j84p9K10J22M3q5j40o9K85j55O9j12m8M03k13Omk24K55j31
14081D2qP2o6k24L11k57K27q1p7K12J16k33J08r5q4o3Q6L4n7J25j10L1r7L67k15
14106F4j38O0k04J66n1L82m84K52p5J74o2j89P2n7K95p1j00j86J3L12p2n8ro9
14130c5L2r7Q6L3P6pp8J70j60lK58l25J21J2m5n0Q5O7N3k85J81m0K4J11j43P4
14156A15k76L8l4L03K6l06K85k9q9Q8j10n2P2K47j68j01R0p0O9J26j13l7k00K8
14180i8J45k25m9L49O5k74L04j99J1k10P2K49l26K63k93L08Kj49K23l17J85k57
14202b21K44N0l2n8J12j20qq2M5K10l0j67R3n6j5K29M1p4j43j4J82o0J41l17j90
14227b40J13J09Q7o4p9j6O0q1L22q6l16N9K93j62J52k34J21k16P8m0Q7K57j76
$$ plain form
14250 28 150 195 -64 -135 27 -5 19 9 -24 -124 -123 -48 -135 -71 57 -114 208 126 74 135 -76 103 -47 -115 -84
14275 -84 -38 1 87 -277 -2 237 -115 31 13 53 -2 20 -207 -6 -185 -91 -34 75 -69 19 -151 -177 117 175
14299 175 81 -78 155 -46 -36 59 185 -104 3 -29 -179 74 -193 -86 51 91 -64 -45 -116 75 196 220
14321 220 -32 -45 9 192 -127 134 -34 -2 -121 -135 -143 10 -49 -54 -82 186 107 41 270 -43 29 36 -184 -103 31
14346 31 79 265 287 -5 109 -140 84 176 -21 -126 62 162 64 15 29 257 -35 -42 70 -267 -161 -145 99
14369 99 73 110 192 75 -37 94 -243 201 -197 -94 30 157 23 -5 -270 -161 56 22 -31 -59 -3 -11 -114
14392 -114 134 143 -152 -30 -191 -239 117 47 -34 -245 101 -147 154 -10 -63 -91 -74 215 88 8 -194 26 131
14415 131 195 8 -63 53 2 -7 -341 -11 -218 29 12 74 136 -87 37 -181 -56 116 28 32 175 -56 -49 -125
$$ packed form
14250B8J22M5k59p1J62l2K4j0l3j00JP5q7O4J28j71L22q2n2O1k11J79j50o8L1
14275h4M6L9Q6l64K75K39l52J46j8M0n5K2k27K01j79R4N7J09j44Q8j70k6K94N8
14299A75r4j59K33k01J0R5J26k89J07l2j50K53k67J07J37M0j55J9p1J91J21K4
14321B20k52j3N4J83l19K61j68L2j19j4qJ53n9nk8K68p9o6K29l13P2Pk20Q1J34
14346C1M8J86K2k92J14k49K24R2j97j05J88J00r8m9J4K28k92pJ12l37J06J6K44
14369I9k6L7Q2j17j12J31l37M44l98J03J24J27j34k8k65J09K17l4n3k8N6qj03
14392a14K48Rk95J22j61m8L56p0q1k11L46k48L01j64n3k8J7K89j27q0k02K20J05
14415A31O4j87p1J16n1rl34L30k07K47j7O2O2k23J24k18J25J72q8MJ43k31Pp6
$$ plain form
14439 -125 33 -281 -96 -109 103 -316 117 26 -76 144 -277 46 -226 137 117 138 -164 -145 -63 118 49 -135
14461 -135 -104 172 -146 -105 -67 -125 109 58 -162 59 -51 222 -355 -6 257 66 -176 -51 130 27 59 -40
14483 -40 30 -164 -169 144 73 -101 -59 -166 -27 -37 147 -23 -127 -42 -290 50 16 107 -98 238 -149 72 47
14506 47 159 48 -120 64 -32 -88 -52 113 -47 -27 27 50 225 77 178 -48 65 -44 97 179 -200 -88
14528 -88 -44 9 65 -64 -60 83 127 -100 2 -92 117 -18 132 46 -52 184 31 -83 10 8 -61 -16 155 126 -6
14553 -6 78 -21 50 -41 133 49 18 -174 6 175 74 238 98 32 -26 19 -76 178 94 17 -54 60 121 40 116 -138
14579 -138 -107 -8 20 165 -17 36 -76 -256 47 -70 49 96 56 125 114 155 60 -178 150 -89 -51 -164 18
14602 18 25 5 22 11 -65 108 37 24 346 -76 171 -37 -79 65 -127 -12 -11 158 168 -72 130 117 -98 49
$$ packed form
14439a25J58l14J85j3K12m19M33r1j02K20m21L23k72L63k0K1l02J9Q2J81o9j84
14461a35L1K76l18M1L8n8K34n1k20K21j10K73n77L49K63j91k42J25J81j03L2r9
14483d0P0j94nL13p1j74M2j07J39j0J84j70j04Q5k48L40l4R1k05L36l87K21k5
14506D7J12j11j68J84r6n6L6J65j60K0N4K3J75j48J01k26J13j09J41Q2l79J12
14528h8M4N3N6j29MJ43M4k27J02r4K09j35J50q6r8K36j53j14R3ko9M5J71k9j32
14553fQ4r9P1r1J74q4l1j92J80J69j01J64j40o6n8M5r5K54q4p7p1J14O1q1P6k54
14579a38L1R9K8J45j82N3j12j80L03j17J19M7m0O9j1M1r5k38L28k39L8j13J82
14602A8Pk0J7j1p6J73p1j3L22m22K47k08m2J44j92J15JJ69J0k40K02j3k15J47
$$ plain form
14626 49 86 -1 32 37 96 52 222 34 -59 -23 37 82 248 56 -192 19 45 -129 -128 -200 -71 -112 -49 -249 -39 249
14652 249 250 -51 148 111 -35 -58 -230 101 24 196 217 18 -100 166 -214 1 -100 174 96 -22 -174 72
14674 72 169 97 -22 -201 24 140 -54 -126 -5 101 97 114 139 -28 15 63 -9 -120 -36 -299 -234 -59 146 51
14698 51 -105 -104 -216 -13 101 -3 27 -159 61 102 36 45 0 145 -187 -180 -4 -115 80 -204 -67 14 250 112
14722 112 230 152 -2 -139 -3 -87 -261 86 53 -76 40 -89 -119 -206 135 13 151 69 -219 -59 108 -146
14744 -146 203 -29 -262 32 -94 37 109 58 97 157 1 -35 39 44 -6 -130 132 -108 134 -237 -165 89 -123
14767 -123 147 129 95 -48 296 -15 67 110 -203 68 244 0 139 103 -85 -57 51 -103 89 -26 34 -65
14789 -65 -88 247 142 -152 -78 -101 112 204 131 -88 152 38 33 217 234 86 52 -3 -85 97 171 -237 -109 -7
$$ packed form
14626D9L7q7L3NN9m4J70j88r3L6O0M5J66j92k48K11K6j74Jp2J29m1O3k00K10K88
14652B49Jl01J99l7j46k3j72L31p7J72K1j99j18K66l80K15j01K74p8j18j52K46
14674G2R7p2j19j79K25J16j94p2J21J06mJ7K5j67M3M8p2j11Q4k63O5J75K05r5
14698E1j56Jj12K03J14j04L0j86K20M1o6Rm5J45l32PJ76j11J95k84J37Q1K36j38
14722A12J18p8j54j37J36q4j74L47l3j29J16j29l0q7L41j22J38q2k88J60J67k54
14744a46L49k32k33K94j26J31P2n1L9O0j56l6P4Nn0j24K62k40K42l71P2K54k12
14767a23K70j8l4j43L44l11Q2M3l13K71J76k44J39l6j88K8J08j54J92j15O0r9
14789f5k3L35j05k94P4k3K13R2p3k19K40j14nJ84J7j48l4n5q2J82P4m08J28J02
$$ plain form
14813 -7 -116 -107 -74 71 -107 -17 131 -90 -236 -108 152 192 -46 -45 -216 -206 43 114 -92 -252 -143 -16 106
14836 106 -41 28 5 353 -67 89 149 -197 138 -63 219 -95 86 131 -48 246 77 179 -17 -19 87 -76
14858 -76 142 218 107 50 -67 64 103 -25 117 271 -149 -8 157 -122 119 -60 142 103 -91 -54 -20 226
14880 226 -115 -145 -151 -73 108 68 -143 -140 -92 91 207 2 -100 -246 188 -17 3 -10 56 113 -138 82 230 -266
14904 -266 -103 -99 103 89 -88 -51 -256 -24 13 274 -66 263 -24 -120 -116 72 173 54 -72 209 -158 -260
14926 -260 -49 290 115 177 -16 60 223 -81 -74 -188 60 -174 -108 -92 -132 103 -61 -24 255 211 -165 -208 204
14949 204 27 99 75 209 -63 88 285 112 64 -58 19 17 258 23 70 78 110 -102 160 225 -297 9 164
14972 164 -31 -53 43 -230 294 -140 -43 42 17 12 -130 -191 -26 98 -165 -29 -98 189 125 -17 -45 137 -308
$$ packed form
14813gj09RL3J45j78R0J48k21j46J28K60M0k38Jj71J0K49P1k06j60J09J27J22
14836A06j47O9k3L48m20J56O0l46L35k01K82l14J81M5j79K94j69J02j96kJ06j63
14858g6K18P6j11n7j17J31L9j28J42J54m20J41J65k79K41j79K02l9j94L7L4K46
14880B26l41l0oP8J81m0k11LM8J83J16k05j02j46M34k05K0j3O6N7k51K20J48m96
14904b66J63MK02j4j77L7k05K32L7K61l40L29k87r6MJ88J01j19j26K81l67j02
14926b60K11L39j75O2j93P6J63l04Pj14K48k34O6J6m0K35j64L7K79m4l76m3M12
14949B04j77P2k4J34k72J51J97j73m8j22P7kK41k35M7QL2k12K62O5n22L06J55
14972A64j95k2R6k73N24m34R7Q5k5nj42o1J65J24k63J36o9K87o4j42k8J82m45
$$ plain form
14995 -308 53 -8 -172 -73 -61 -93 -177 -93 -84 70 1 39 279 167 -65 91 248 -122 200 221 -87 287 69
15018 69 -40 -4 -5 224 -163 -187 34 3 -80 -1 -106 95 -227 5 -21 163 76 102 -1 115 -65 95 326
15041 326 40 30 53 -6 18 12 -44 25 -311 -14 -74 225 80 68 -25 -12 19 -8 -129 120 5 153 119 8 -67
15066 -67 -33 163 -89 96 -174 -61 -26 61 -113 -127 -214 -87 124 -155 -141 55 -274 -74 -20 221 -66 -7 69
15089 69 -163 118 -178 85 -152 25 -104 -35 -16 72 -48 88 -122 325 -19 -167 -134 -9 384 -44 152
15110 152 34 88 139 -138 -193 -26 48 42 -94 16 -97 -30 -6 -98 249 -25 11 54 189 -261 37 100 48 -43
15134 -43 117 -143 196 -2 272 -229 145 -23 128 378 -203 86 173 44 184 157 176 -51 -187 -191 -63 143
15156 143 81 128 212 -134 -111 -71 -60 34 -41 50 -43 -102 -131 -1 54 -5 62 -22 125 -117 88 34 -38 15 -48 -132 -41
$$ packed form
14995c08L61o1j64R9J2l2q4Q4RJ54o9L8K40j12k32J56J57l70L22K1l08L74k18
15018F9j09L6jK29l87k4K21l1q3P9j05K01l22K32k6J84q7K6j03J16j80J60K31
15041C26k86j0K3n9K4on6O9l36K97o0K99j45j2r3J3L1k7j21K49j15J48l4j11p5
15066f7L4J96k52J85k70J13L5Q7j74j4q7J27K11k79J4J96l29K00N4K41k87N9P6
15089F9k32K81k96K63k37J77j29O9J9Q8j20J36k10M47l44j48L3J25L93m28J96
15110A52j18N4N1k77n5J67P4oj36J10j13O7K4r2L47k74L6M3J35m50K98O3n2r1
15134d3J60k60L39j98K74n01L74j68J51K50n81K89Q7j29J40k7J9k27j36mJ28K06
15156A43o2M7Q4l46K3M0J1R4p5R1r3n9k9J30N5n9O7q4J47k42K05n4p2N3o3q4R1
$$ plain form
15183 -41 -69 -65 -190 -121 53 -209 122 25 84 56 156 -114 -179 116 21 -15 124 69 58 184 -55 14 -202 146
15207 146 -149 -173 85 -175 -20 133 57 8 20 -178 -24 -1 125 -119 80 -101 -99 -327 27 157 -152 -196
15229 -196 -50 84 -234 77 -145 -167 299 65 -212 -47 9 -102 -1 -168 163 -21 17 67 37 -59 40 9
15251 9 -68 100 184 84 22 -20 37 -103 -9 -1 152 50 -117 -13 280 76 -41 -3 -197 150 -1 300 258 -128
15275 -128 14 45 177 -6 42 177 -91 -44 -34 97 -83 -165 1 -54 -12 77 6 -122 66 151 -3 13 119
15298 119 -130 282 -28 -32 -88 -186 32 93 9 -35 62 -13 125 33 -85 -15 -52 -11 -179 -14 229 61 -138 43
15322 43 229 -167 37 35 156 289 -124 -147 82 -292 -63 5 83 102 12 -157 111 31 121 101 -158 340 -56
15345 -56 166 54 -152 -168 61 -76 -11 -151 -175 -14 68 -95 141 -46 -41 -38 211 150 -313 130 92 -112 -150 -68
$$ packed form
15183d1k8Mj25O9J74k62L31r7N9k8J00k70o5K95r5l6J39n5j1J26k39O9k16L48
15207A46k95k4K58k60J55J53p6m9J2j98J54K3J26k44J99j81Kk28L54J30l09m4
15229a96J46J34l18L11k22k2M66k34k77J65N6j11J01j67L31j84L8N0l0r6R9l1
15251Ip7J68Q4j00o2m2N7j40R4QJ53j02j67J04K93k04j17L8j94L47j51L01m2l86
15275a28J42L1J32j83M8J35k68M7J0J31j80q2J66n5M2Q9p1j28J88Q5j54J6J06
15298A19k49M12l10mn6r8K18O1q4m4R7p5J38r2j18P0l7M1j68J65K43j68j99J81
15322D3J86l96K04kJ21J33m13k3K29l74K29O8P8J9r0j69K68q0R0k0k59M98l96
15345e6K22j12k06j6K29j37O5j40k4J61Q2j63K36j87NLK49o1m63M43l8k04l8Q2
$$ plain form
15369 -68 12 70 -207 175 -176 58 -278 102 95 -121 -182 337 -68 55 175 231 -113 -75 301 123 62 -268 -221
15392 -221 93 165 174 -5 -176 58 123 146 -256 110 115 128 100 223 7 231 -23 -109 -145 181 132 -227 109 19
15416 19 73 -105 62 -39 21 -23 -13 125 25 -246 -165 222 -13 116 107 -20 90 -62 71 -82 220 -63
15438 -63 267 184 60 -67 -272 68 -127 -25 -33 56 83 174 85 145 -182 103 -39 89 204 -39 -136 -48 374
15461 374 -123 114 -106 248 82 -180 61 -101 -114 -158 -123 -35 163 -29 -134 88 -214 -153 100 -97 -199
15482 -199 -33 -20 -253 67 -33 -91 197 -260 -59 19 -141 -230 9 146 193 82 -24 45 151 66 107 -151
15504 -151 176 5 8 -112 -106 59 92 94 -110 -3 -177 103 23 -185 -197 102 33 -75 37 5 -68 17 185 -69
15528 -69 28 58 3 208 -297 -187 139 -11 -129 -35 237 175 -89 1 196 -220 -84 54 9 72 36 39 -40 -45 260
$$ packed form
15369f8Q0N8k77L82l51K34l36L80pk16o1N19m05J23J20N6l44L8L76j78o1l30M7
15392b21L14P2Rj79j71K34O5K3m02L66NJ3k8J23k16K24k54q6l6L26m9l59L36r0
15416A9N4j78J67j01O0m4J0J38j00k71Q1L87k35J29rj27J10j52J33j53L02k83
15438f3L30q3j24j27k05L40j95J02qQ9K7R1q9O0l27K85j42J28J15k43r7Q8M22
15461C74m97K37k20L54j66k62K41j62j3m4L5Q8J98j92j05K22l02O1K53j97j02
15482a99J66J3k33L20j00n8K88m57K01P8j60q9K39J37M7j11j06O9J06q5M1k58
15504a51L27j71Lj20OJ65L3Kk04J07j74K80q0k08j2K99o9j08J12l2p3Q5J68k54
15528f9R7L0n5K05n05J10L26j50j18R4K72o2k64R0J95m16J36J38m5O3l6Lp9nL05
$$ plain form
15553 260 16 -34 -117 -16 256 120 100 155 14 125 18 -81 -44 5 68 198 -66 -158 -145 -241 -74 37 257
15576 257 26 37 85 557 -124 6 12 146 101 163 12 24 75 107 38 -123 -55 -96 -44 79 -40 133 95 100 220
15601 220 -90 25 522 -84 4 -8 68 -159 180 7 -40 25 -320 -122 152 163 15 126 -60 36 -29 -180
15623 -180 -203 -14 -121 -278 39 -69 138 104 -44 60 -30 -46 63 87 -6 -229 -220 28 258 -20 62 254 -38
15646 -38 -46 110 107 225 -99 175 93 103 41 -76 -52 -83 313 122 -60 -172 62 -268 -161 -127 20 21 -219 159
15670 159 258 163 -127 158 85 -80 -113 -83 224 -164 -175 59 65 133 336 71 82 100 203 122 -44 235 13 -23
15694 -23 25 -104 79 18 -148 14 -36 -46 32 -120 116 -82 125 -114 11 58 54 82 191 106 -51 218 190 5
15718 5 4 -85 211 143 175 34 215 12 21 167 19 189 134 154 137 -64 2 -70 75 -57 73 29 -152 162 149
$$ packed form
15553B60k44n0q3J01K72j36k0N5j41J11j07r9L7M9O3J30k64r2J3r6J67J11K20
15576B57k31J1M8M72o81J30OJ34m5O2j51J2N1L2o9j61O8m1N2J23j19J73l8NJ20
15601B20l10J15M97o06Q8j2P6k27L39j73m7O5l45J98K74J1j48J11j86R6o5j51
15623a80k3J89j07j57L17j08K07l4j48J04r0j6J09K4r3k23RK48K30k78Q2J92k92
15646c8qJ56lJ18l24K74q2J0o2j17K4l1L96j91j82j12K34l30J07L4J47Jk40L78
15670A59R9r5k90K85p3j65l3L0L07l88j1K34OO8K03k65J1J8J03q1j66K79k22l6
15694b3M8j29J83o1j66J62n0j0P8j52K36j98K07k39J25M7mK8J09q5j57K69k8j85
15718Ejq9K96o8L2j41J81k03RJ46j48J70n5K0j7k01O6p2J45j32J30m4j81L14j3
$$ plain form
15743 149 -150 -17 139 99 -63 -24 11 -83 -23 21 -185 -45 144 113 46 -97 -34 -92 -130 -97 200 -114 21 -27
15767 -27 101 96 8 -112 -160 169 114 -17 326 134 -44 -32 205 -40 127 -37 -186 214 219 67 -95 197 -7
15790 -7 2 78 23 51 60 -36 30 28 -5 90 133 104 -85 45 -253 -136 15 -12 217 108 64 54 -6 214 66 113 70
15817 70 8 216 79 -28 165 -7 244 -118 -193 -73 72 -156 -268 -23 -9 -125 230 229 181 -175 -72 37
15839 37 -111 55 50 -175 108 120 117 -44 -112 83 -44 -3 -95 16 -238 224 -88 -51 -185 -156 117 -36 -180
15862 -180 -50 -105 -3 -215 -281 143 117 -81 -105 91 -209 -190 62 61 189 141 -67 25 35 44 -103 -144 80 -3
15886 -3 -10 71 27 34 -21 138 232 220 102 100 -50 20 -146 -288 -131 115 -89 -146 -128 -61 37 203 -33 -40 -29 121 -13
15913 -13 149 59 -167 -85 4 112 148 61 175 19 -61 121 231 90 126 -86 -33 -114 92 398 -48 -27 -155
$$ packed form
15743A49k99J33J56m0j62L9L5r4O0M4k06J40J89l1o7j43O3n8l8L3K97l14J35m8
15767b7J28nq8j20m8L29n5j31L43j92j78J2K37k45J67j64j49M00Nj52j62K92k04
15790gRP6n5K8Rr6O6kl3R5M3k9j89J30k98J17J51k7K29j09m4j0o0K20j48M7m3
15817G0o2K08j37j07J93j72K51l62p5J20J45k28j12K45J4j16L55jm8l56J03J09
15839C7j48J66nk25K83J2lj61o8J95j27M1r2J11k54M62l12L7j34K9K73j53j44
15862a80J30n5J02k12o6M24k6j98k4J96l00J9K52jJ28m8k08R2J0Rj47m1K24q3
15886cpQ1m4Pn5J59R4j2j18kj50P0j66j42J57K46k04n7J8O7R8J66k36pJ1J50j34
15913a3J62r0k26Q2Q9J08L6q7J14j56q0J82J10j41L6k12N3q1K06L06m46K1j28
$$ plain form
15936 -155 92 -68 -24 -94 283 90 189 193 -73 92 77 -27 -171 77 -260 -72 -147 -255 -122 -197 -253 -265 56
15959 56 53 -24 -115 -111 -97 -15 10 -34 231 71 30 -177 166 -40 61 40 -124 46 -206 -174 70 151 151 149 -58 110
15985 110 -154 113 144 -233 -4 -132 -93 -75 -284 42 4 -9 2 68 -157 139 159 184 31 170 -57 -20 63
16008 63 134 -6 49 -19 38 -68 170 -124 -34 -72 34 5 -105 -81 -17 121 -241 248 -217 -22 197 18 4
16031 4 157 -155 -96 217 -46 -258 122 177 161 129 -323 -151 95 -111 -166 148 -73 106 45 242 -215 108
16053 108 5 275 -192 62 -288 -45 -15 87 -128 30 32 -355 56 237 76 -156 114 181 92 -126 84
16074 84 -104 160 -63 44 -4 -9 194 -275 38 88 39 132 12 94 -163 159 -218 -253 -102 -111 96 172 109 113 -92
16099 -92 -221 -80 31 34 126 -37 49 -125 -44 2 77 256 -207 -19 123 193 203 -162 46 68 135 20 100 -148
$$ packed form
15936a55K47j60M4p0L77j93R9Mk66J65j5j04j44K48l37J88p5j08J33p5n6j2L21
15959E6lp7r1MJ4Q2K5m4K65j60m1k07L43k06J01k1j64J70k52L2K44Q1%kk07J68
15985A10k64K67L1l77K29j28L9J8k09L26l8j3J1O6k25K96K0K5j53J39k27L7Q3
16008F3P1j40N5o8N7j06K38k94R0l8J06k9j10K4O4J38l62M89m65J95K19j79j4
16031DJ53l12N9L13k63k12L80N5j6l2m52J72K46k06n5L14k21J79o1J97m57L23
16053A08j03K70m67K54l50K43L0J02k15J58Kl87M11J81j61k32K70O7q9k18K10
16074H4j88K64k23J07m8nK03m69L13N0m9R3j20Q2k57L22l77l5J51rK07P6o3Mk05
16099i2j29J41J11LR2j63Q6j74Q1M6P5J79m63J88J42P0J0l65K08K2O7j15Q0k48
$$ plain form
16123 -148 127 64 -292 -133 60 131 41 -71 54 -78 226 -288 -177 213 -147 25 -206 232 159 16 -32
16144 -32 164 -21 101 -126 -229 4 -116 117 138 279 -169 -12 247 84 -153 -34 137 29 94 -99 174
16165 174 39 202 -46 -86 150 -297 -105 253 82 -16 -42 -78 -4 100 32 -105 -23 176 -3 19 131 114 51
16188 51 -132 -28 308 -129 40 -43 84 -114 -51 25 66 -66 -48 114 123 220 30 -305 -178 83 -133 266 115
16211 115 81 37 72 -76 181 -160 -8 -51 124 -39 50 -139 61 111 9 -8 52 125 228 -36 -26 129 135 -2
16235 -2 -346 1 -146 -38 16 -122 5 17 156 89 -113 16 -174 -152 38 -43 -17 26 19 163 -116 6 46 52
16259 52 150 -24 -49 -93 -139 -120 -250 -39 -220 201 35 294 -24 -193 -163 101 -175 95 254 127 -132 53
16281 53 -25 -155 -105 29 -30 -13 30 -136 33 153 116 -165 300 35 26 -79 -113 42 -346 -104 -37 130 40 83
$$ packed form
16123a48K75o3l56J59J93P1r0j12J25j32L04n14J11L90l60J72k31M38p3j43m8
16144c2J96j85J22k27j03K33j20K33K1J41m48J57K59j63k37J19J71j08O5j93K73
16165A74j35J63k48m0K36m47J92L58j71r8k6l6P4J04o8j37Q2J99j79K2J12j7o3
16188E1j83J04L36m37J69q3J27j98O3P6M1j32J8J62RR7j90l35J27K61k16L99j51
16211A15l4m4L5j48K57l41J52m3J75j63Q9j89K00N0j02j7O0P3J03k64J0J55Oj37
16235bl44L47j47J08N4j38J27J2J39o7k02J29j90K2J90q1K6M3pJ44k79J22M0O
16259E2R8j74k5m4m6J9j30K11j81M21j66K59l18j69L0K64k76K70J59j27k59J85
16281E3p8j30N0J34n9J7M3j66J69J20l7k81M65k65rj05l4J55l88K42O7J67r0M3
$$ plain form
16305 83 -129 36 -81 139 9 259 184 25 13 -47 245 -55 50 73 100 162 -49 -180 -30 -191 -61 -37
16327 -37 -23 23 151 -49 48 180 -209 0 -203 89 277 -97 -182 -49 -94 -25 78 90 -129 11 -17 17 59
16350 59 -79 -84 78 -81 52 11 -168 -15 -39 -118 -23 -32 167 -47 -12 133 69 -214 72 -188 70 -6 -45 14
16374 14 214 57 24 -13 -94 23 272 106 22
$$ packed form
16305H3k12J65j17K20j30K50p5j59j2o0K92l00J05K3K7O2k11j31J50j61J30K4
16327c7J4M6J28k00R7J32l89K09k03K92J88l74q5J33m5O9J03J2k19J40k8L4M2
16350E9j38nJ62j59J33m1j79J53k4p9R5rJ99k14L5J45o4k83K86k60K58p6l9N9
16374A4K00j57l3l7q1J17K49j66q4
16383B2
$$ Imaginary data points
##PAGE= N=2
##DATA TABLE= (X++(I..I)), XYDATA
$$ plain form
0 0 0 0 0 0 0 0 0 0 0 32 -32 32 -32 64 -64 76 -96 128 -160 187 -224 256 -289 352 -416 481 -576 672 -768
29 -768 865 -993 1122 -1281 1468 -1640 1857 -2082 2338 -2610 2914 -3235 3601 -3995 4420 -4893
45 -4893 5399 -5959 6572 -7242 7975 -8791 9686 -10677 11780 -13016 14419 -16002
57 -16002 17827 -19964 22468 -25485 29186 -33870 39989 -48383 60659 -80388 117353 -210727
69 -210727 963405 1214869 -1190308 -1550420 -422119 1063363 1018197 153681 -584634 -442552
79 -442552 -201493 -124859 14374 557628 664954 8372 -854653 -803960 176286 1109357
89 1109357 837519 -317631 -1013340 -471952 417238 662633 240940 -189579 -319637 -214285
99 -214285 -101731 47700 298921 420219 40680 -493755 -445187 195797 598890 310142
$$ packed form
0@%%%%%%%%%L2o4O4o4R6j28J40j72K24k88L47m11M80n45O41p68Q97j057J248j440
29g68J633j858K115k403K749l108L497l939M420m948N524o149O836p596Q415r313
45d893J0292j1358J2531j3814J5217j6766J8477k0363K2457k4796K7435l0421
57a6002L3829l7791M2432m7953N4671o3056P3859q8372J09042j41047J97741l28080
69b10727J174132K51464k405177l60112J128301J485482m5166q64516p38315J42082
79d42552K41059P6634J39233N43254J07326o56582q63025N0693R80246R33071
89A109357k71838j155150o95709N41388Q89190K45395m21693m30519j30058J05352
99b14285J12554J49431K51221J21298l79539n34435M8568O40984M03093k88748
$$ plain form
109 310142 -243039 -385588 -46173 235383 71485 -162092 8966 278354 68124 -394156
119 -394156 -393974 161138 598078 351019 -328903 -597882 -83079 527471 422102 -157840
129 -157840 -368730 -36498 234351 37841 -283783 -154325 334049 421524 -173185 -653767
139 -653767 -273515 509684 680386 54452 -568516 -463144 173778 518540 211946 -218351
149 -218351 -228289 -10689 16652 -82254 -13439 187072 197263 -101858 -374948 -200551 283064
160 283064 457036 89228 -328977 -299081 58578 277416 147965 -98140 -137755 -7082
170 -7082 6087 -105108 -61230 145867 182094 -58385 -250435 -115109 185067 256060 3036
181 3036 -209222 -78936 161767 119707 -129455 -189378 34513 217880 86037 -212866 -276000
$$ packed form
109C10142n53181j42549L39415K81556j63898k33577J71058K69388k10230m62280
119c94156J82N55112M36940k47059o79922k68979N14803O10550j05369n79942
129a57840k10890L32232K70849j96510l21624J29458M88374Q7475n94709m80582
139f53767L80252P83199J70702o25934o22968J05372O36922L44762l06594m30297
149b18351r938K17600K7341r8906O8815K00511J0191k99121k73090J74397M83615
160B83064J73972l67808m18205K9896L57659K18838j29451k46105l9615J30673
170g082J3169j11195M3878K07097L6227k40479j92050J35326L00176P0993k53024
181C036k12258J30286K40703m2060k49162n9923K23891J83367j31843k98903o3134
$$ plain form
192 -276000 9985 273418 173092 -113445 -192549 -20606 120723 67176 -41698 -4963
202 -4963 112395 54201 -182287 -248491 22799 301088 202014 -176069 -375504 -147432 237481
213 237481 319858 43760 -202532 -160586 9876 85976 76091 66224 40909 -57500 -181051
224 -181051 -163554 59493 253899 141018 -173921 -305775 -101373 197720 268228 54521
234 54521 -181978 -172463 15948 116947 71187 19740 -368 -59935 -127860 -96869 47377
245 47377 168007 93196 -139161 -237561 -45724 190388 179691 -16194 -139286 -84095 45869
256 45869 88358 12521 -43278 -2285 13868 -64355 -98818 -7593 86283 63345 -45535 -120579
268 -120579 -57433 91653 126014 -2905 -92508 -28419 54499 37303 -29428 -54129 -7010
$$ packed form
192b76000K85985K63433j00326k86537p9104J71943J41329n3547j08874L6735
202d963J17358n8194k36488o6204K71290K78289r9074l78083j99435K28072L84913
213B37481Q2377k76098k46292M1946J70462P6100r885r867k5315r8409j23551
224a81051J7497K23047J94406j12881l14939j31854K04402K99093P0508k13707
234E4521k36499R515J88411J00999m5760n1447k0108n9567o7925L0991J44246
245D7377J20630p4811k32357r8400J91837K36112j0697j95885j23092N5191J29964
256D5869M2489p5837n5799M0993J6153p8223l4463R1225R3876k2938j08880p5044
268a20579O3146J49086L4361j28919q9603O4089Q2918j7196o6731k4701M7119
$$ plain form
279 -7010 46380 1386 -96955 -76405 50040 83286 -11404 -72387 -32191 35643 60626 18034
291 18034 -38369 -16738 41636 13942 -59619 -43842 27829 37469 -16465 -68911 -69242 8827 85216
304 85216 39965 -63436 -60347 26640 61326 28657 -9847 -26703 -7646 15468 -14689 -45025
316 -45025 3014 42927 -20803 -84256 -38740 44581 64767 16879 -52061 -59280 28313 90149
328 90149 30091 -46698 -35814 1761 6200 3332 -6227 -23022 -14168 -6826 -33743 -26243 40994
341 40994 56696 -10628 -51495 -18459 36091 66337 33949 -46756 -66190 6997 44881 -2345
353 -2345 -34342 -17265 -10365 -15544 -7473 870 16491 34072 4875 -40904 -12150 52751 47650
366 47650 -6835 -32069 -27766 -6160 23900 13291 -34197 -37717 1556 8622 -6327 3185 13483
$$ packed form
279g010N3390m4994r8341K0550J26445L3246r4690o0983M0196O7834K4983m2592
291A8034n6403K1631N8374k7694p3561J5777P1671R640n3934n2446l31P8069P6389
304H5216m5251j03401L089Q6987L4686l2669l8504j6856J9057K3114l0157l0336
316d5025M8039L9913o3730o3453M5516Q3321K0186m7888o8940p219Q7593O1836
328I0149o0058p6789J0884L7575M439k868r559j6795Q854P342k6917P500O7237
341D0994J5702o7324m0867L3036N4550L0246l2388q0705j9434P3187L7884m7226
353b345l1997J7077O900n179Q071Q343J5621J7581k9197m5779K8754O4901n101
366D7650n4485k5234M303K1606L0060j0609m7488l520L9273P066j4949R512J0298
$$ plain form
379 13483 7697 8709 5151 -4989 15932 38719 2903 -41155 -21256 16286 12119 -10010 -24863
392 -24863 -28119 -3914 22728 8058 -12266 7050 22272 4358 70 16038 15047 5043 1408
405 1408 -14357 -24108 -216 14973 -7632 -23583 -13321 -2477 7121 16807 6873 -3177 14884
418 14884 22851 -1622 -8386 16714 22358 -1731 -21376 -25347 -12345 12989 14642 -13435 -23468
431 -23468 -4927 5171 8762 23348 25477 4674 -8432 -5121 3101 19015 26461 1108 -31126
444 -31126 -32771 -13182 7464 22703 14942 -16380 -30498 -10314 16411 34471 40847 17854 -23380
457 -23380 -34686 -4133 31868 40691 9608 -39792 -54053 -16649 21657 25496 12910 -2941
469 -2941 -20587 -20029 5256 31764 42654 30512 -8798 -42293 -28497 16510 42302 28011 -16599
$$ packed form
379A3483n786J012l558j0140K0921K2787l5816m4058J9899L7542m167k2129j4853
392b4863l256K4205K6642j4670k0324J9316J5222j7914m288J5968r91j0004l635
405A408j5765r751K3892J5189k2605j5951J0262J0844R598R686r934j0050J8061
418A4884P967k4473o764K5100N644k4089j9645l971J3002K5334J653k8077j0033
431b3468J8541J0098L591J4586K129k0803j3106L311Q222J5914P446k5353l2234
444c1126j645J9589K0646J5239p761l1322j4118K0184K6725J8060O376k2993m1234
457b3380j1306L0553L6001Q823l1083m9400j4261L7404L8306L839j2586j5851
469b941j7646N58K5285K6508J0890j2142l9310l3495J3796M5007K5792j4291m4610
$$ plain form
482 -16599 -59390 -50270 9896 51532 34063 -7530 -30476 -22102 11049 38158 32524 12888 -459
495 -459 -17507 -29503 -9775 21696 27008 6016 -25007 -49360 -33185 22763 57297 33866 -14195
508 -14195 -41435 -25213 27808 62387 32864 -19634 -33905 -18692 -2067 12369 13530 -3272
520 -3272 -13270 -12042 -19504 -17308 16553 45869 33594 -4827 -37558 -33707 22474 72857 40054
533 40054 -40877 -68092 -25400 25583 40778 9524 -35153 -34744 3895 16376 1309 8303 28319
546 28319 22397 -3405 -26141 -27358 13894 62463 37608 -45004 -80942 -33648 35166 63573
558 63573 24686 -48423 -64823 -2617 49549 38592 10493 -3239 -11700 -6965 3509 -1909 -496
571 -496 23497 19815 -28764 -57593 -31219 19240 55749 41209 -29560 -72815 -21384 57023 66850
$$ packed form
482a6599m2791R120O0166M1636j7469m1593k2946Q374L3151K7109n634j9636j3347
495d59j7048j1996J9728L1471N312k0992l1023k4353J6175N5948L4534k3431m8061
508a4195k7240J6222N3021L4579k9523n2498j4271J5213J6625J4436J161j6802
520c272r998J228p462K196L3861K9316j2275l8421l2731L851N6181N0383l2803
533D0054q0931k7215M2692N0983J5195l1254m4677M09L8639J2481j5067O994K0016
546B8319n922k5802k2736j217M1252M8569k4855q2612l5938M7294O8814K8407
558F3573l8887p3109j6400O2206N2166j0957k8099j3732q461M735J0474n418J413
571d96K3993l682m8579k8829K6374N0459L6509j4540p0769m3255N1431P8407R827
$$ plain form
584 66850 18757 -30130 -45365 -10420 34934 24653 -20567 -24998 2411 3983 -16133 -25144 -10916
597 -10916 29054 54666 8732 -60732 -45347 38931 78653 34157 -39006 -71134 -24870 49590
609 49590 49958 -20165 -53519 -19740 13049 12604 -1219 -10078 6300 34333 17252 -36254 -36193 27956
623 27956 63781 27302 -39088 -74701 -35733 46915 68551 -1207 -64242 -50979 269 39779
635 39779 46889 12235 -28498 -23398 6477 14277 11692 15202 6317 -12144 -22015 -29200 -20365 21784
649 21784 47690 6053 -53051 -52690 1975 57590 65427 6172 -60595 -48864 23499 59180 28014
662 28014 -22681 -47672 -27476 15159 22832 -10746 -21558 4679 14247 -7842 -18907 -175
674 -175 31181 41462 4328 -45366 -34996 24851 48065 8327 -37656 -45166 -12956 26851 27280
$$ packed form
584F6850m8093m8887j5235L4945M5354j0281m5220m431K7409J572k0116r011J4228
597a0916L9970K5612m5934o9464J5385Q4278L9722m4496p3163l2128M6264P4460
609D9590L68p0123l3354L3779L2789m45j3823q859J6378K8033j7081n3506O1O4149
623B7956L5825l6479o6390l5613L8968Q2648K1636o9758o3035J3263N1248L9510
635C9779P110l4654m0733N100K9875P800k585L510q885j8461r871p185Q835M2149
649B1784K5906m1637n9104L61N4665N5615P837n9255o6767J1731P2363L5681l1166
662B8014n0695k4991K0196M2635P673l3578j0812K6237R568k2089j1065J8732
674a75L1356J0281l7134m9694J0370N9847K3214l9738m5983p510L2210L9807M29
$$ plain form
687 27280 -12547 -31228 -5037 20658 16037 767 -6108 1448 16743 14239 -11666 -21161 -555
700 -555 12997 1028 -13046 -18182 -13468 2934 13639 4267 -6694 -2251 5060 9269 12894 6261
714 6261 -6814 -4415 7296 2587 -11602 -14142 -5771 2641 3257 -8544 -18809 -4112 19698 19189
728 19189 -835 -12008 -4907 12750 23949 8612 -19004 -21514 1239 12706 840 -14628
740 -14628 -17329 -4758 9075 4473 -7453 -993 14081 11298 -1752 -3490 4140 10618 9154 -4937
754 -4937 -17695 -9951 5395 3943 -7321 -11868 -8992 15 11194 9594 -2736 -3604 7078 10147
768 10147 7121 4853 -2160 -7880 -4272 -228 -2911 -2460 -3764 -12768 -11978 4108 10906 4385 742
783 742 363 -356 5955 13035 7942 -877 -3286 -8381 -10524 1768 8100 -4250 -14189 -10855 -4905
$$ packed form
687B7280l9827j8681K6191K5695m621j5270o875P556J5295k504k5905r495K0606
700e55J3552j1969j4074n136M714J6402J0705r372j0961M443P311M209L625o633
714F261j3075K399J1711m709j4189k540Q371Q412O16j1801j0265J4697K3810n09
728A9189k0024j1173P101J7657J1199j5337k7616k510K2753J1467j1866j5468
740a4628k701J2571J3833m602j1926O460J5074k783j3050j738P630O478j464j4091
754d937j2758P744J5346j452j1264m547K876R007J1179j600j2330q68J0682L069
768A0147l026k268p013n720L608M044k683M51j304r004P90J6086O798o521l643
783G42l79p19O311P080n093q819k409n095k143J2292O332j2350r939L334N950
$$ plain form
798 -4905 4764 15543 8903 -7966 -6272 7846 12415 10443 5617 -7362 -12602 -1623 2964 -3274
812 -3274 -2910 -2298 -12126 -11856 4273 11550 6619 3748 -1338 -5174 6585 17680 7040 -5462 -4668
827 -4668 -6286 -7984 1972 5112 -7572 -11645 -3642 -1951 373 10741 8420 -1977 548 6241
841 6241 3007 6272 10533 -2480 -12966 -3960 1628 -4682 -3995 -967 -7961 -7189 4527 5294 1119
856 1119 6758 6960 -1248 3321 10785 1987 -4309 1773 -1504 -9231 -3828 190 -7627 -6108 2600
871 2600 -207 -2763 5798 5785 -165 6914 11286 -53 -3166 4690 862 -6037 -589 -776 -10067 -6931
887 -6931 10 -2773 -1449 6052 1155 -4566 6170 11657 3149 2379 6567 -1375 -4719 3215 750
902 750 -8184 -5319 -1890 -7554 -3918 4119 136 -2881 5030 5537 153 6576 10313 -130 -3892
$$ packed form
798d905R669J0779o640j6869J694J4118M569j972m826j2979n240J0979M587o238
812c274L64O12r828K70J6129P277m931k871n086l836J1759J1095j0640j2502P94
827d668j618j698R956L140j2684m073Q003J691K324J0368k321j0397K525N693
841F241l234L265M261j3013j0486R006N588o310O87L028o994P72J1716P67m175
856A119N639K02q208M569P464q798o296O082l277p727N403M018p817J519Q708
871B600k807k556Q561j3n950P079M372j1339l113P856l828o899N448j87r291L136
887f931O941k783J324P501m897n721J0736N487q508p70M188p942l344P934k465
902G50q934K865L429n664L636Q037l983l017P911N07n384O423L737j0443l762
$$ plain form
917 -3892 3811 1772 -4262 -2498 -4286 -9459 -3279 3306 -3193 -3902 3709 2427 -802 7018 10392
932 10392 2257 730 3724 -1027 -1856 3694 -1011 -9648 -6793 -2890 -4512 117 4240 -2317 -4972
947 -4972 4405 7860 3929 6184 7392 -1085 -3745 968 1237 -291 -256 -7005 -13188 -4174 4961 1379
963 1379 -2728 962 1137 1116 6545 7383 2802 3788 3690 -3521 -5132 742 510 -3970 -4832 -6661 -7844
980 -7844 -384 5159 596 -1263 4536 5386 1666 3156 4807 4312 3706 -717 -8649 -6146 2104 614
996 614 -7126 -6329 -1800 -694 129 1176 1832 6969 9307 1383 -5245 861 8825 6093 -1425 -9547
1012 -9547 -11469 -3006 5571 -288 -9043 -5734 2036 3053 1421 1621 3804 8874 8307 -3334 -8320
1027 -8320 2458 10130 2292 -7868 -11694 -8872 -231 5730 -227 -6057 -2017 1990 1588 5801 8706
$$ packed form
917c892P703k039o034J764j788n173O180O585o499p09P611j282l229P820L374
932A0392q135j527K994m751q29N550m705q637K855L903j622M629M123o557k655
947d972R377L455l931K255J208q477k660M713K69j528L5o749o183R014R135l582
963A379m107L690J75k1N429Q38m581R86r8p211j611N874k32m480q62j829j183
980g844P460N543m563j859N799Q50l720J490J651m95o06m423p932K503Q250j490
996F14p740P97M529J106Q23J047O56N137K338p924o628O106P964k732p518q122
1012i547j922Q463Q577n859q755L309P770J017j632K00K183N070n67j1641m986
1027h320J0778P672p838j0160l826K822Q641N961n957n830M040M007m02M213K905
$$ plain form
1042 8706 3896 770 1618 -988 -2474 1601 447 -5429 -5386 -3713 -7633 -6292 3185 7188 3275 -947
1058 -947 -5184 -2053 13165 18376 889 -14202 -6634 5884 6868 -1229 -11492 -11580 2312 7478
1072 7478 -7275 -13664 3973 17891 9157 -6294 -12114 -1469 19593 21873 -6039 -25628 -10388
1085 -10388 11239 11218 -2707 -14923 -13628 2955 12010 -1681 -10321 4836 16350 6563 -5681
1098 -5681 -6435 1054 13083 14076 -6388 -21793 -10249 5434 6010 1689 -4352 -13238 -8045 9249
1112 9249 12450 3848 1118 624 -1499 4178 8165 -2454 -7518 2613 4215 -7856 -13227 -8529
1126 -8529 919 13611 10679 -13528 -22184 5159 28318 17359 -6909 -17518 -7304 15384 19294
1139 19294 -7809 -24914 -5219 14703 3204 -15603 -15181 2101 19770 15061 -13633 -24602
$$ packed form
1042H706m810l126Q48k606j486M075j154n876M3J673l920J341R477M003l913m222
1058i47m237L131J5218N211j7487j5091P568J2518R84q097j0263q8J3892N166
1072G478j4753o389J7637J3918q734j5451n820J0645K1062K280k7912j9589J5240
1085a0388K1627k1j3925j2216J295J6583R055j3691q640J5157J1514r787j2244
1098e681p54P489J2029R93k0464j5405J1544J5683N76m321o041q886N193J7294
1112I249L201q602k730m94k123N677L987j0619n064J0131J602j2071n371M698
1126h529R448J2692k932k4207q656K7343K3159j0959k4268j0609J0214K2688L910
1139A9294k7103j7105J9695J9922j1499j8807M22J7282J7669m709k8694j0969
$$ plain form
1151 -24602 6245 33298 17789 -12798 -22449 -7665 14767 19084 -6426 -25224 -9640 10663
1163 10663 4806 -7804 -4973 2911 8992 8180 -3866 -9543 6623 18408 5962 -9295 -10007 -6973
1177 -6973 -395 8961 4382 -11234 -13798 -4434 3273 10237 11105 -2812 -11559 1589 14648 8318
1191 8318 -2377 -4838 -2510 3426 3586 -10736 -16728 2463 17250 1709 -18930 -15036 6436
1204 6436 23724 17013 -10632 -22277 2677 25469 11912 -13413 -16447 -1303 10054 4439 -14054
1217 -14054 -17699 4528 18929 1413 -17893 -9256 12070 20799 9741 -10693 -14904 4628 17701
1230 17701 3926 -13155 -9782 -43 1391 -2368 -6543 -3288 5694 6473 -4323 -6085 6083 11321
1244 11321 4615 -884 -1178 -1227 454 -55 -3037 -1975 513 -6099 -11626 -2537 9121 7459 -2441
$$ packed form
1151b4602L0847K7053j5509l0587r651J4784K2432M317k5510j8798J5584K0303
1163A0663n857j2610K831P884O081q12j2046n677J6166J1785j2446j5257p12L034
1177f973O578R356m579j5616k564R364P707O964Q68j3917q747J3148J3059o330
1191H318j0695k461K328N936J60j4322n992J9191J4787j5541k0639L894K1472
1204F436J7288o711k7645j1645K4954K2792j3557k5325l034J5144J1357n615j8493
1217a4054l645K2227J4401j7516j9306Q637K1326Q729j1058k0434m211J9532J3073
1230A7701j3775j7081L373R739J434l759m175L255Q982P79j0796j762J2168N238
1244A1321o706n499k94m9J681n09k982J062K488o612n527R089J1658j662r900
$$ plain form
1259 -2441 -6827 -1184 10158 13755 874 -9705 -1559 9148 3156 -9295 -10079 -118 7162 1732
1273 1732 -13081 -13196 6592 17533 3968 -11232 -6602 9087 15645 5466 -9396 -8893 5786
1286 5786 8945 -5445 -13707 -4104 5875 4219 -5409 -10775 -1576 12826 10877 -4627 -8124 4815
1300 4815 11719 4873 -4834 -7118 1 6117 -1444 -12871 -7323 6241 5308 -5405 -7537 784
1314 784 8676 9086 -119 -6205 2677 11097 3012 -8142 -4804 2714 2277 -3365 -8541 -7205 3125
1329 3125 7814 -2866 -8756 1743 11059 6155 -1054 -2459 1678 7766 5262 -7524 -10159 2837
1343 2837 6894 -5268 -11127 -3776 4281 5252 -116 -7026 -1684 12168 10368 -4321 -6699 4802
1357 4802 7991 1347 -5848 -8761 -2566 6122 755 -12090 -7923 6802 7669 -1881 -4404 580 7241
$$ packed form
1259b441m386N643J1342L597j2881j0579Q146J0707n992j2451p84R961P280n430
1273A732j4813j15J9788J0941j3565j5200M630J5689O558j0179j4862N03J4679
1286E786L159j4390q262R603R979j656r628n366R199J4402j949j5504l497J2939
1300D815O904o846r707k284P119O116p561j1427N548J3564r33j0713k132Q321
1314G84P892M10r205o086Q882Q420q085j1154L338P518m37n642n176J336J0330
1329C125M689j0680n890J0499R316m904p209j405M137O088k504j2786k635J2996
1343B837M057j2162n859P351Q057R71n368o910N342J3852j800j4689k378J1501
1357D802L189o644p195k913O195Q688n367j2845M167J4725Q67r550k523M984O661
$$ plain form
1372 7241 10868 1785 -9339 -2709 10563 5001 -8924 -9227 -1492 1880 835 -4560 -8078 1089
1386 1089 10249 2243 -7129 1124 10347 6331 -677 -3511 -3314 3101 6372 -4113 -11897 -2681 5099
1401 5099 -1626 -5942 -1984 1750 4713 4394 -2339 -3231 8536 11126 -2418 -8210 -223 4382 940
1416 940 -3700 -7940 -5884 3707 4109 -6783 -6192 6465 8248 123 -2106 843 4245 7729 2677
1431 2677 -8034 -6015 5329 3660 -7021 -7577 -1783 699 2120 -599 -5050 229 10154 5931
1445 5931 -4727 -1809 6599 5433 219 -3757 -5732 -1120 4203 -2064 -10500 -3533 5182 1471 -3546
1460 -3546 -1001 2528 5263 6612 717 -4554 2096 7495 -163 -6657 -3395 -333 -1008 -1339 -4132
1475 -4132 -5061 1857 5431 -1607 -3896 3842 7409 3000 61 -576 150 3248 2115 -5233 -6095 956
$$ packed form
1372G241L627r083j1124O630J3272n562j3925l03P735L372j045n395l518R167
1386A089R160q006r372Q253R223m016p008k834J97O415L271j0485p784R216P780
1401E099o725m316L958L734K963l19o733q92J1767K590j3544n792P987M605l442
1416I40m640m240K056R591M02j0892N91J2657J783q125k229K949L402L484n052
1431B677j0711K019J1344j669j0681n56N794K482J421k719m451N279R925m223
1445E931j0658K918Q408j166n214l976j975M612N323o267q436O967Q715l711n017
1460c546K545L529K735J349n895n271O650N399p658o494L262L062o75l31k793
1475d132r29O918L574p038k289P738L567m409k939o37P26L098j133p348q62P051
$$ plain form
1491 956 1396 -4835 -5240 -290 1629 2254 1498 -1319 1339 7376 4886 -2479 -1826 2858 1770 -1221
1507 -1221 -3556 -5233 -2591 1921 -517 -5976 -2857 4036 4032 769 217 1201 3677 5731 1019 -4303
1523 -4303 -1036 3185 -887 -4917 -4055 -2339 -533 367 -1564 -2724 1401 5087 2277 369 2441
1538 2441 3026 1505 1210 -178 -2300 -676 -477 -3915 -4376 -773 -176 -1834 -1012 324 1364 3599
1554 3599 3435 324 977 4285 2219 -1836 -1606 -239 -1333 -1180 -2691 -4562 -2338 1574 326 -1577
1570 -1577 518 2319 2037 3296 3025 252 329 2692 470 -2903 -1866 -1419 -2788 -1424 -1200 -3442
1586 -3442 -2147 2088 2144 765 1940 2260 908 2795 4350 49 -2430 -646 -946 -1932 -806 -2297
1602 -2297 -4526 -1392 1971 -445 -2347 1649 3313 2283 3061 1718 -1146 1202 4139 87 -3796
$$ packed form
1491I56M40o231m05M950J919O25p56k817K658O037k490p365O53M684j088k991
1507a221k335j677K642M512k438n459L119O893ml263n52R84K476K054m712n322
1523d303L267M221m072m030Q62J716J806R00j931j160M125L686k810j908K072
1538B441N85j521k95j388k122J624J99l438m61L603N97j658Q22J336J040K235
1554C599j64l111O53L308k066m055K30J367j094J53j511j871K224L912j248j903
1570a577K095J801k82J259k71k773P7K363k222l373J037M47j369J364K24k242
1586c442J295M235N6j379J175L20j352J887J555m301k479J784l00r86J126j491
1602b297k229L134L363k416j902L996J664j030P78j343k864K348K937m052l883
$$ plain form
1617 -3796 -2744 -1952 -1916 343 -631 -5037 -2638 3694 3238 386 1042 1599 1995 4260 3114 -2949 -2857
1634 -2857 2276 1373 -3107 -3855 -3691 -2704 1980 2773 -3538 -4139 3263 6086 2844 746 -803 -549 4365
1651 4365 4934 -3551 -7066 -560 2202 -1258 -3358 -4241 -3230 2988 6035 -1016 -4650 1899 6342
1666 6342 4255 1258 -1888 -3385 1263 5150 -1767 -7638 -3356 1127 340 -632 -1751 -3797 888
1681 888 6864 3022 -2743 -166 3720 2798 2456 -82 -5403 -3639 3108 1754 -4977 -5436 -1929 391
1697 391 3419 2668 -3284 -2678 5758 7392 637 -2081 -1305 759 3588 2219 -5887 -7956 364 4634
1713 4634 -1003 -5010 -3912 371 5734 6003 -1952 -4792 3461 8481 2735 -3368 -3773 -1408 2567
1728 2567 3099 -4739 -8516 -1191 4716 1482 -2629 -2331 87 4679 6646 928 -4156 270 5214
$$ packed form
1617c796J052P92L6K259r74m406K399O332m56k852O56N57L96K265j146o063R2
1634b857N133r03m480p48J64R87M684P93o311o01P402K823l242k098j549K54M914
1651D365N69q485l515O506K762l460k100q83J011O218L047p051l634O549M443
1666F342k087k997l146j497M648L887o917n871M282M483p87r72j119k046M685
1681H88N976l842n765K577L886r22l42k538n321J764O747j354o731m59L507K320
1697C91L028p51n952O06Q436J634o755k718P76K064K829j369q106k069Q320M270
1713D634n637m007J098M283N363K69p955k840Q253N020n746o103m05K365L975
1728B567N32p838l777P325N907l234m111K98K418M592J967n718n084M426M944
$$ plain form
1743 5214 1942 -2243 -3356 -3555 -1108 1835 -1121 -5234 -2120 2317 1979 1376 1422 -260 812 4787
1759 4787 3912 -1433 -2488 -247 329 324 -1211 -4891 -4789 1138 3208 -1265 -3231 -288 2913 4963
1775 4963 3643 -1442 -2734 3270 5297 -289 -4909 -3689 -373 1576 143 -5388 -5432 1931 5294
1790 5294 749 -2873 -635 3549 5492 2961 -2350 -3162 2254 3848 -1340 -4917 -3213 -656 675
1805 675 -117 -3186 -2528 2348 3864 679 -413 2012 2552 2409 1046 -1235 -1653 232 -282 -2616 -2405
1822 -2405 -701 -1848 -1638 202 879 659 1202 1430 1003 2796 3064 -298 -1565 802 998 -1585 -3167
1839 -3167 -2604 -1812 346 198 -2788 -2213 2741 4322 1128 -766 651 2619 3981 1434 -3307 -2908
1855 -2908 2190 1651 -3569 -4968 -1591 1027 1413 -464 -3096 -83 5254 4152 -927 -738 2294 2656
$$ packed form
1743E214l272m185j113j99K447K943k956m113L114M437l38o03M6j682J072L975
1759D787q75n345j055K241N76nj535l680J02N927K070m473j966K943L201K050
1775D963j320n085j292O004K027n586m620J220L316J949j433n531m4P363L363
1790E294m545l622K238M184J943k531n311q12N416J594n188l577J704K557J331
1805F75p92l069O58M876J516l185j092K425N40j43j363k281m18J885n14k334K11
1822b405J704j147K10J840O77k20N43K28m27J793K68l362j267K367J96k583j582
1839c167N63P92K158j48k986N75M954J581l194j894J417J968J362k547m741L99
1855b908N098n39n220j399L377K618L86j877k632L013N337j102n079J89L032L62
$$ plain form
1871 2656 903 -1313 -3117 -1723 1457 -480 -4633 -2853 1238 1121 -302 -102 18 1893 4458 1968
1887 1968 -1794 532 3357 316 -2468 -1652 -907 -1458 -834 -2345 -3217 840 2746 -556 -1437 2466
1903 2466 3638 1255 775 615 -6 1518 1019 -3291 -4069 522 660 -3260 -3116 -525 763 1911 1475
1920 1475 -1481 -104 4762 3905 -1395 -1648 1804 1290 -435 -1644 -3866 -2436 1866 42 -4587 -2125
1936 -2125 2942 2488 505 732 495 1443 3936 1420 -2911 -1136 2441 -97 -3377 -2363 -1284 -1074
1952 -1074 138 -299 -2663 496 4119 1313 -1186 1329 3237 1421 668 -294 -1941 -157 1193 -2444
1968 -2444 -4473 -153 1067 -1464 -1614 348 891 2207 3056 118 -693 2896 3077 -999 -2187 57
1984 57 -31 -1217 -1332 -2952 -2473 1152 1414 -1980 -1517 2811 3057 1161 786 292 624 2491 793 -3232
$$ packed form
1871B656j753k216j804J394L180j937m153J780M091j17j423K00J20J875K565k490
1887A968l762K326K825l041k784Q16P45n51O24j511q72M057J906l302q81L903
1903B466J172k383m80j60o21J524m99m310p78M591J38l920J44K591J288J148m36
1920A475k956J377M866q57n300k53L452n14j725j209k222J430M302j824m629K462
1936b125N067m54j983K27k37R48K493k516m331J775L577k538l280J014J079K10
1952a074J212m37k364L159L623k806k499K515J908j816p53r62j647J784J350l637
1968b444k029M320J220k531j50J962N43J316Q49k938q11L589J81m076j188K244
1984E7q8j186j15j620M79L625K62l394M63M328K46j896l75m94L32J867j698m025
$$ plain form
2002 -3232 -2239 1241 -205 -3399 -2487 -570 -55 872 180 -1343 1073 4436 2001 -1294 201 1765
2018 1765 768 -207 -1564 -2929 -1118 1392 -1638 -4161 -991 2121 941 -142 278 853 2496 3268
2034 3268 410 -1655 1028 2400 -1025 -2756 -1636 -1057 -713 -347 -1963 -1951 1080 2493 -187 -214 1709
2051 1709 2171 1400 979 -64 -829 829 -291 -2941 -2615 64 -5 -1794 -1528 -137 1204 2095 1082
2068 1082 -736 1240 3768 1794 -1496 -683 431 517 -843 -2510 -3209 -470 1677 -1060 -2999 -459
2084 -459 2220 2180 814 -25 252 2625 3242 -182 -2535 -403 1029 -566 -2123 -2723 -1648 391 1001
2101 1001 -1184 -1566 1784 2899 957 563 1059 1487 1079 476 -1793 -1512 307 -572 -3142 -2163 101
2118 101 276 -439 -22 21 1532 2930 1536 -671 730 2463 651 -1282 -1503 -992 -273 14 -2058
$$ packed form
2002c232R93L480j446l194R12J917N15R27o92j523K416L363k435l295J495J564
2018A765r97r75j357j365J811K510l030k523L170L112j180j083M20N75J643P72
2034C268k858k065K683J372l425j731J120N79L44L66j616J2L031J413k680k7J923
2051A709M62p71m21j043p65J658j120k650L26K679o9j789K66J391J341Q91j013
2068A082j818J976K528j974l290Q13J114Q6j360j667o99K739K147k737j939K540
2084d59K679m0j366q39K77K373O17l424k353K132J432j595j557o00J075K039O10
2101A001k185l82L350J115j942l94M96M28m08o03k269K81J819q79k570R79K264
2118A01J75p15M17M3J511J398j394k207J401J733j812j933k21N11P19K87k072
$$ plain form
2135 -2058 -3557 -592 2543 443 -1400 92 1898 2481 2198 327 -1320 797 2153 -1165 -3206
2150 -3206 -1449 -451 -898 -990 -1560 -1960 650 2409 396 -626 1759 2182 1063 1303 695 -609 -485
2167 -485 433 -1544 -2144 -218 -914 -2648 -755 1221 243 77 1203 888 1438 2718 701 -1745 563
2184 563 2065 -823 -2843 -1731 -1529 -672 465 -1274 -3257 96 3677 1609 -660 575 1818 1841
2200 1841 2321 1 -2661 -306 2151 -324 -3279 -2493 -727 -198 903 -112 -1945 317 3795 2068
2216 2068 -200 358 1006 397 1315 247 -2726 -2287 554 -199 -2126 -1124 -568 -621 1462 2007 -593
2233 -593 -915 2350 2727 773 428 -570 -1859 645 1131 -2080 -3619 -856 308 -531 -312 -771 -1085
2250 -1085 1934 3584 714 -1435 869 2121 919 249 -887 -2740 -759 1552 -1186 -3349 -1283
$$ packed form
2135b058j499K965L135k100j843J492J806N83k83j871j647K117J356l318k041
2150c206J757R98m47r2n70m00K610J759k013j022K385M23j119K40o08j304J24
2167d85R18j977o00J926o96j734J893J976r78j66J126l15N50J280k017k446K308
2184E63J502k888k020J112K02Q57J137j739j983L353L581k068k269J235J243K3
2200A841M80k320k662K355K457k475k955P86J766N29J101j015j833K262L478j727
2216B068k268N58O48o09R18j068k973M39K841p53j927J002N56n3K083N45k600
2233e93l22L265L77j954l45r98j289K504M86l211j539K763J164q39K19m59l14
2250a085L019J650k870k149K304J252j202o70j136j853J981K311k738k163K066
$$ plain form
2265 -1283 138 512 1141 757 -1067 716 3542 1963 -960 -298 412 263 623 -741 -3303 -2695 960
2282 960 929 -1949 -1665 -328 954 2433 1949 -965 -1091 2722 2558 -455 -1907 -1460 -447 596 -360
2299 -360 -3456 -2985 1207 2302 -370 -1387 -213 1326 2832 2252 -514 -1250 1504 2102 -534 -2145
2315 -2145 -1510 -984 163 -123 -2163 -2077 1036 1934 209 -68 954 1004 1564 1937 -179 -1187 -103 -58
2333 -58 -1119 -960 -954 -1703 -1431 464 390 -650 196 749 1309 2165 1279 -655 -224 2017 1288 -1475 -2045
2352 -2045 -1510 -352 643 -791 -3025 -1423 2030 2371 90 -837 430 2174 2684 770 -1846 -895
2368 -895 2020 859 -2393 -2841 -1052 309 893 -805 -2536 -724 2505 2078 -276 -37 1378 1631
2384 1631 1216 80 -1512 -737 909 -399 -2467 -1545 145 -365 -329 -115 36 368 1667 829 176 1767
$$ packed form
2265a283J421L74O29l84j824J783K826j579k923O62P10j49L60j364k562O08L655
2282I60l1k878K84J337J282J479m84k914j26L813j64l013j452M47J013J043r56
2299c60l096M71M192J095k672j017J174J539J506n80k766p36K754N98k636j611
2315b145O35N26J147k86k040Q6L113Q98j725k77J022N0N60L73k116j008J084M5
2333e8j061J59Op49K72J895p4j040Q46N53N60Q56q86j934M31K241p29k763n70
2352b045N35J158R95j434k234J602L453L41k281r27J267J744N10j914k616R51
2368h95K915j161l252m48J789J361N84j698j731J812L229m27k354K39J415K53
2384A631m15j136j592P75J646j308k068R22J690n10L6K14J51L32J299q38o53J591
$$ plain form
2402 1767 1575 -763 -729 457 89 -1206 -1707 -1785 -1303 967 294 -1735 -715 2402 1768 435 -17 682
2420 682 1541 1791 94 -2653 -1485 1263 188 -2285 -2464 -925 368 1379 61 -1899 413 3233
2436 3233 2105 -1014 -216 1277 1078 763 -1036 -2623 -1090 1300 -789 -3008 -1166 783 303 166
2452 166 595 54 1024 2337 815 -1120 682 1510 -1107 -1437 -306 -890 -969 -98 -1031 -1747 834 1547
2470 1547 -447 -298 1997 1931 361 225 -232 -99 1345 576 -2872 -2479 768 224 -1891 -1782 -357
2487 -357 486 1759 1093 -1072 91 3415 1906 -1338 -1126 169 387 176 -1189 -2752 -1728 1736
2503 1736 190 -2163 -1055 1710 1229 715 662 -145 1077 2526 574 -1993 -495 1217 -684 -1756
2519 -1756 -1038 -606 -521 615 -537 -1179 1345 2437 -12 -471 1660 1464 483 -150 -589 -1418 435 486
$$ packed form
2402A767j92k338L4J186l68j295n01p8M82K270o73k029J020L117o34j333m52O99
2420F82Q59K50j697k747J168K748j075k473j79J539J293J011j318j960K312K820
2436C233j128l119P98J493j99l15j799j587J533K390k089k219J842J949m80j37
2452A66M29n41R70J313j522j935J802Q28k617l30J131n84p9Q71r33p16K581P13
2470A547j994J49K295o6j570j36m57J33J444p69l448L93L247n44k115J09J425
2487c57Q43J273o66k165J163L324j509l244K12J295K18k11j365j563J024L464
2503A736j546k353J108K765m81n14n3q07J222J449j952k567J498J712j901j072
2519a756P18M32Q5J136j152o42K524J092k449m59K131j96r81o33m39q29J853N1
$$ plain form
2537 486 -2330 -2529 540 773 -807 -900 93 891 2231 1612 -841 -715 2288 1647 -1185 -1507 -309 -74
2555 -74 -86 -860 -2141 -1251 1741 1048 -1309 -446 1565 1829 1034 287 -403 156 1485 -63 -2189 -1148
2573 -1148 509 -542 -1598 -1011 -504 369 1088 246 -792 1026 2425 578 -677 167 620 262 -239
2590 -239 -1462 -1697 30 514 -1317 -2027 271 1258 625 416 137 446 1904 1869 -470 -844 707 804
2608 804 -870 -1491 -939 -872 88 -58 -1487 -605 1679 1312 -169 426 1352 1186 823 207 -961 -4 723
2627 723 -671 -2357 -1077 273 -540 -796 -370 -221 803 1689 423 -610 1172 1877 360 -831 -364
2644 -364 -240 172 -27 -1721 -2075 303 1156 -642 -1027 387 1255 1346 917 -49 -202 1439 1294 -905
2662 -905 -1124 -4 -10 -820 -793 -1191 -767 450 372 -688 -26 1472 1078 419 920 858 -23 489 -41 -1105
$$ packed form
2537D86k816j99L069K33j580r3R93P98J340o19k453J26L003o41k832l22J198K35
2555g4j2p74j281Q90K992o93k357Q63K011K64p95p47o90N59J329j548k126J041
2573a148J657j051j056N87N07Q73P19q42j038J818J399j847j255Q44M53l58n01
2590b39j223k35J727M84j831p10K298R87o33k09k79L09J458l5k339l74J551R7
2608H04j674o21N52O7R60j46j429Q82K284l67j481N95R26j66l63o16j168R57P27
2627G23j394j686J280J350q13k56M26J49J024Q86j266j033J782P05j517j191M67
2644c64J24M12j99j694l54K378Q53j798l85J414Q68R1m29r66j53J641j45k199
2662i05k19J120oq10K7l98M24J217p8j060O62J498l94o59N01o2q81N12n30j064
$$ plain form
2682 -1105 -716 292 -859 -1714 -462 370 -491 -216 466 341 1170 1910 294 -647 1101 1745 -364 -1171
2700 -1171 -931 -614 -264 256 -1303 -1778 551 1405 89 -132 984 841 1165 1291 -400 -813 738 1138
2718 1138 -864 -1600 -656 -566 -663 183 -659 -1149 734 1382 43 75 1498 633 82 912 389 -980 -361
2737 -361 286 -1097 -1510 -112 -902 -1172 585 642 -517 177 998 779 1010 1587 -32 -1145 402 1058
2755 1058 -1117 -1487 -739 -826 -262 83 -901 -1029 1303 1925 16 -325 828 1453 941 1072 -598 -1872
2773 -1872 96 816 -1007 -1728 -887 -316 127 902 -29 -928 725 1973 459 -458 557 543 320 761
2791 761 -367 -2010 -834 600 -259 -1114 -215 -422 -95 1274 1190 -325 132 1281 1069 159 428 -715
2809 -715 -875 328 58 -1776 -1543 48 152 -268 47 -592 -105 1537 2016 363 -446 681 679 144 139
$$ packed form
2682a105L89J008j151q55J252Q32q61K75O82j25Q29P40j616r41J748O44k109q07
2700a171K40L17L50N20j559m75K329Q54j316k21J116j43L24J26j691m13J551M00
2718A138k002p36R44R0r7Q46q42m90J883O48j339L2J423q65n51Q30n23j369O19
2737c61O47j383m13J398p90k70J757N7j159O94Q21k19K31N77j619j113J547O56
2755A058k175l70P48q7N64L45r84j28K332O22j909l41J153O25n12J31j670j274
2773a872J968P20j823p21Q41N71M43P75r31q99J653J248j514r17J015j4k23M41
2791G61j128j643J176J434q59q55Q99k07L27J369q4j515M57J149k12r10K69j143
2809g15j60J203k70j834K33J591J04m20L15o39M87J642M79j653q09J127kn35n
$$ plain form
2828 139 -900 -1756 -402 472 -857 -1503 0 431 194 479 157 23 1137 2109 495 -828 -74 86
2846 86 -92 319 -725 -1796 -694 523 -99 -883 -193 463 635 1296 920 -99 577 1343 535 -653
2864 -653 -537 -819 -430 235 -427 -1660 -956 608 764 211 -54 -68 551 1452 957 -380 -221 726 253
2883 253 -740 -631 -1061 -1013 278 -181 -1290 -703 746 953 437 754 511 -116 938 1092 -260 -667 -82
2902 -82 -698 -834 -239 -517 -1066 -353 203 129 137 372 841 791 1411 478 -563 210 780 152 -541 -1108 -1236
2923 -1236 -594 503 -97 -1492 -480 901 779 389 430 559 853 1668 71 -1227 -454 583 60 -1097
2941 -1097 -1252 -986 -387 888 23 -1127 -114 1246 924 316 635 473 430 690 -200 -988 -211 -222 -567
2960 -567 -1204 -259 -287 -337 289 350 220 639 1006 394 247 889 231 -869 -383 59 -453 -744 -662 -967 -422
$$ packed form
2828A39j039q56J354Q74j329o46J503M31k37K85l22j34J114R72j614j323P54J60
2846H6j78M11j044j071J102J217o22p84O90O56J72O61l76j019O76P66q08j188
2864f53J16k82L89O65o62j233P04J564J56n53k65j4O19R01m95j337J59R47m73
2883B53r93J09m30M8J291m59j109N87J449K07n16L17k43o27J054J54j352m07N85
2902h2o16j36N95k78n49P13N56p4QK35M69n0O20r33j041P73N70o28o93n67j28
2923a236O42J097o00j395J012J381j22l90M1J29K94Q15j597j298P73J037n23j157
2941a097j55K66N99J275q65j150J013J360l22o08L19j62m3K60q90p88P77j1l45
2960e67o37R45k8n0O26O1j30M19L67o12j47O42o58j100M86M42n12k91Q2l05N45
$$ plain form
2981 -422 756 285 -1069 151 1253 992 508 462 -178 0 1194 194 -1589 -756 502 -142 -1234
2998 -1234 -934 -497 52 1064 493 -593 391 1870 985 18 -114 -12 -54 625 -446 -1581 -785 501
3016 501 -522 -1034 -108 444 240 883 311 -389 549 1389 88 -498 169 166 -1094 -826 -647 -318 -508 74
3036 74 -884 -377 943 1010 -194 -10 1116 963 563 417 -242 -538 699 -305 -1889 -1253 497 -41
3054 -41 -739 -573 -525 331 1617 689 -720 133 1714 809 -464 -467 -204 -248 120 -605 -1882 -607 1101
3073 1101 76 -1089 -269 811 937 1187 628 -185 507 1019 193 -923 -205 101 -658 -775 -702 -467 132
3092 132 400 -438 -641 1051 1376 176 -118 927 395 174 -81 -636 -866 396 -96 -1697 -1355 398
3110 398 333 244 113 23 249 1432 953 -542 -259 814 542 -792 -800 -755 -352 22 -458 -1362 -353 1069
$$ packed form
2981d22J178m71j354J220J102k61m84m6o40J78J194j000j783Q33J258o44j092
2998a234L00M37N49J012n71j086R84J479q85r67j32J02m2O79j071j135P96J286
3016E01j023n12R26N52k04O43n72p00R38Q40j301n86O67lj260K68J79L29j90N82
3036G4r58N07J320O7j204J84J126j53m00j46o59k96J237j004j584O36J750n38
3054d1o98J66M8Q56J286r28j409Q53J581r05j273lK63m4L68p25j277J275J708
3073A101j025j165Q20J080J26K50n59q13O92N12q26j116P18L06p59j17P3K35N99
3092A32K68q38k03J692L25j200k94J045n32k21k55n55k30J262m92j601L42J753
3110C98o5q9j31r0K26J183m79j495K83J073k72j334qM5M03L74m80r04J009J422
$$ plain form
3130 1069 603 -165 -95 874 850 663 241 -561 273 342 -448 -1148 -598 168 -498 -701 -526 -457 565 1115 238
3151 238 -90 938 1212 -46 -150 -86 -55 101 -259 -1070 -1186 132 215 -835 -749 150 642 683 304 -80
3171 -80 263 1119 743 -499 -411 326 164 -548 -853 -979 -517 418 140 -913 -262 1071 877 126 405 548
3191 548 756 769 -59 -940 -283 279 -753 -1247 -659 -154 -154 295 -218 -206 1036 1224 88 -229 690 939
3211 939 256 -559 -722 -600 264 -103 -1102 -1033 461 603 -195 -265 156 559 1119 643 -276 -267 993 759 -1000
3232 -1000 -1161 -307 -192 -144 -490 -1039 -609 744 577 -341 361 1133 598 433 353 284 57 243 -204 -1270
3252 -1270 -398 161 -501 -934 -286 91 -12 387 63 -350 758 1237 31 -752 436 468 -347 -454 -593
3271 -593 -834 -120 222 -1006 -914 531 1138 175 3 483 724 1097 727 -664 -982 479 563 -891 -854
$$ packed form
3130A069m66p68P0R69k4j87m22q02Q34O9p90p00N50P66o66k03J75O9J022N50q77
3151B38l28J028K74j258j04O4L1J56l60q11j16J318Q3j050Q6Q99M92M1l79l84
3171h0L43Q56l76j242Q8P37j62p12l05j26M62R35k78j053O51J333j94p51K79J43
3191E48K08J3q28q81O57N62j032m94N88N05%M49n13J2J242J88j136l17R19K49
3211I39o83q15j63J22Q64l67r99O9J494J42p98p0M21M03N60m76r19RJ260k34j759
3232a000j61Q54J15M8l46n49M30J353j67r18P02P72n35j65q0o9k27J86m47j066
3252a270Q72N59o62m33O48L77j03L99l24m13J108M79j206p83J188L2q15j07j39
3271e93k41P14L42j228R2J445O07r63j72M80K41L73l70j391l18J461Q4j454L7
$$ plain form
3290 -854 -586 -360 -75 -132 -678 -663 919 1034 -255 -84 831 640 344 507 -589 -894 310 -7 -1146
3309 -1146 -621 -165 -352 -254 406 62 73 654 730 -31 470 941 -199 -506 17 -42 -800 -776 -378 -531 206
3330 206 213 -733 -543 747 1054 360 -33 525 295 990 692 -684 -856 208 317 -866 -931 -436 -163 420
3350 420 430 -436 -119 1182 1319 141 -149 112 343 371 49 -744 -1149 -104 54 -859 -555 143 16 242
3370 242 708 247 408 901 569 -105 83 -18 -20 -534 32 -237 -907 -759 -217 -204 244 599 61 -54 776
3391 776 1061 208 -238 470 -66 75 163 -959 -825 9 17 -845 -576 -149 421 491 706 -86 -173 914 972
3412 972 -32 -319 44 21 60 -273 -803 -967 -43 -148 -453 -324 315 215 537 735 243 -50 510 767
3432 767 91 -135 -284 -443 -424 -48 -202 -742 -234 -37 103 295 612 5 266 481 522 -181 27 29 -150
$$ packed form
3290h54K68K26K85n7n46J5J582J15j289J71R15j91k96J63j096l05J204l17j139
3309a146N25M56j87R8O60l44J1N81P6p61N01M71j140l07N23n9p58K4L98j53P37
3330B06Pr46J90J290L07o94l93N58k30O95k98j376j72J064J09j183o5M95K73N83
3350D20J0q66L17J301J37j178k90K61K31K8l22p93m05J045J58r13L04O98j27K26
3370B42M66m61J61M93l32o74J88j01kn14N66k69o70J48N42J3M48L55n38j15Q30
3391G76K85q53m46P08n36J41Q8j122J34Q34Qq62K69M27N70P0K15p92q7J087N8
3412I72j004k87L63k3L9l33n30j64R24j05l05J29O39j00L22J98m92k93N60K57
3432G67o76k26j49j59J9L76j54n40N08J97J40J92L17o07K61K15M1p03K08Kj79
$$ plain form
3453 -150 -492 -220 -973 -910 255 187 -693 -344 193 366 955 722 58 -277 444 640 -284 -313 -351 -545 -173
3474 -173 -126 -854 -770 257 539 260 289 464 463 664 958 158 -516 244 173 -297 -294 -391 -820 -394 280 -556 -382
3497 -382 367 610 327 295 456 53 372 773 -91 -859 -402 29 -270 -175 -450 -909 -323 445 369 -307 234
3518 234 567 270 698 732 -2 -185 464 336 -751 -264 -203 -728 -447 -33 -493 -481 742 751 47 409 560
3539 560 15 540 787 -225 -842 13 289 -474 -479 -336 -548 -74 699 141 -358 372 808 427 462 95 -300
3560 -300 138 694 -108 -1209 -538 -40 -222 -313 54 -622 47 853 399 -65 444 802 232 64 390 -360
3580 -360 -406 469 -207 -1065 -549 -5 -363 -213 238 -38 -178 648 730 116 308 351 47 9 281 -357 -754
3601 -754 -152 -242 -603 -266 -113 -634 -104 789 355 -281 400 816 388 176 96 -428 -14 301 -330 -1297 -518
$$ packed form
3453a50l42K72p53O3J165o8q80L49N37J73N89k33o64l35P21J96r24k9l8j94L72
3474a73M7p28Q4J027K82k79K9J75jK01K94q00o74P60p1m70Lr7m29M26O74q36J74
3497c82P49K43k83l2J61m03L19M01q64p68M57M31k99R5k75m59N86P68p6o76N41
3518B34L33k97M28L4p34j83O49j28j087M87O1n25K81M14m60J2J223Rp04L62J51
3539E60n45N25K47j012o17Q55K76p63nJ43k12M74P73n58m99P30M36l81L5l67l95
3560c00M38N56q02j101O71M98j82r1L67o76O69Q06m54m64N09L58n70j68L26p50
3580c60m6Q75o76q58N16N44l58J50M51k76j40Q26Q2o14J92M3l04l8K72o38l97
3601g54O02r0l61L37J53n21N30Q93m34o36O81M16m28k12q0n24M14L15o31r67P79
$$ plain form
3622 -518 100 79 -67 -126 -186 -15 939 514 -383 345 655 102 50 -239 -402 -506 2 -300 -1070 -409 482
3643 482 -123 -153 245 328 475 767 481 -122 -61 297 -366 -410 -105 -227 -712 -321 -176 -367 180 158 -146 153
3665 153 644 323 35 529 377 39 -279 -45 -629 -392 241 -469 -743 -456 285 307 177 152 -61 474 1005
3686 1005 506 -484 -144 663 -59 -287 -564 -713 -244 245 -503 -780 -86 528 91 -100 201 204 248 570 194
3707 194 -353 19 78 -553 -256 -227 -330 -502 -149 -106 -326 369 780 82 148 757 382 164 415 126 -49
3728 -49 -212 -299 -847 -614 53 -372 -620 -202 130 136 375 456 -79 -27 787 137 -336 -308 159 -233 -487 -494 -619
3751 -619 -123 436 -91 -481 159 564 108 225 379 32 -11 325 -226 -548 143 -9 -451 -470 -284 -541 -222
3772 -222 168 218 -143 561 719 254 -7 476 77 -105 54 -398 -573 0 -85 -697 -571 522 45 176
$$ packed form
3622e18O18k1j46n9o0J71R54m25q97P28L10n53n2k89j63j04N08l02p70O61Q91
3643D82o05l0L98Q3J47K92k86o03O1L58o63m4L05j22m85L91J45j91N47k2l04K99
3665A53M91l21k88M94j52l38l18K34n84K37O33p10k74K87P41K2j30k5k13N35N31
3686A005m99r90L40Q07p22k28k77j49M69M89p48k77O94O14m37j91L01LM4L22l76
3707A94n47L72N9o31K97K9j03j72L53M3k20O95M11o98O6O09l75k18K51k89j75
3728d9j63q7n48K33O67m25k48M18L32OK39Q1n35N2Q14o50m73K8M67l92k54pj25
3751f19M96N59n27l90O40M05m56J17J54l47m3L36n51l22O91j52m42j9J86k57L19
3772b22L90N0l61P04J58m65k61M83l99j82J59m52j75N73q5o12J26J093m77J31
$$ plain form
3792 176 155 308 232 774 524 -107 25 280 -105 -792 -135 -376 -571 -430 -356 -736 -19 906 357 -335 436
3813 436 797 334 613 226 -141 56 220 -394 -597 -84 -99 -529 -217 15 -80 129 581 548 78 666 873
3834 873 -36 144 332 -88 -394 1 -619 -555 247 -116 -497 -422 174 363 159 565 350 108 501 457 -357
3855 -357 -374 319 126 -600 -348 -380 -441 90 -54 -474 -70 501 442 130 318 376 143 73 34 -192 -275 284 -313
3878 -313 -706 -264 -110 -228 -1 492 -6 117 654 375 228 437 398 -184 -238 91 -236 -585 -324 -407 -489
3899 -489 70 531 -375 95 605 422 133 441 410 91 195 26 -449 -596 313 5 -466 -310 -235 -143 51
3920 51 322 -113 228 825 527 -48 151 114 -181 -99 100 -579 -545 17 -289 -520 -113 243 -88 201 591
3941 591 188 166 435 270 -128 115 107 -482 -325 -260 -314 -573 -270 36 -115 239 346 14 171 920 544 48
$$ packed form
3792A76k1J53p6N42k50o31J32K55l85o87O57k41j95J41P4l80P17R25n49o92P71
3813D36L61m63K79l87l67J97J64o14k03N13j5m30L12K32r5K09M52l3m70N88K07
3834H73r09J80J88m20l06L95o20O4Q02l63l81P5N96J89k04M06k15k42L93m4q14
3855c57j7O93j93p26K52l2o1N31j44m20M04N71n9l12J88N8k33p0l9k26q3N59n97
3878c13l93M42J54j18K27M93m98J23N37k79j47K09l9n82n4L29l27l49K61q3q2
3899d89N59M61r06M70N10j83k89L08l1l19J04j69m75j47R09l08m71J56P5R2J94
3920E1K71m35L41N97k98n75J99l7k95Q2J99o79L4N62l06k31M07L56l31K89L90
3941E91m03k2K69j65l98K43qn89J57O5n4k59L03L06j51L54J07l32J57P49l76m96
$$ plain form
3963 48 -25 -25 -239 279 -76 -927 -519 62 -49 -29 -238 39 -175 396 455 223 283 379 144 150 57 -210 -309 -264
3987 -264 -59 -833 -686 89 224 27 359 152 -10 545 539 201 143 384 286 -184 -129 -276 -484 -319 140 -399
4009 -399 -187 164 39 64 268 373 -121 262 598 186 -135 189 -172 -293 -380 -123 -694 -426 17 -11 -261
4030 -261 342 270 370 589 460 -254 201 544 165 -419 -272 -416 -404 -148 -236 -587 -335 375 200 105 474
4051 474 189 7 301 484 -291 -153 377 -229 59 -200 -132 -506 -174 364 -206 -190 177 292 292 562 243
4072 243 -32 116 372 -262 -422 -292 -274 -382 118 -299 -835 -250 377 297 -253 645 497 301 447 286 -346
4093 -346 -129 420 -218 -348 -323 -398 -284 -119 50 -300 -78 455 311 59 594 309 -130 301 356 -403 -315
4114 -315 -102 -419 -430 -9 -233 -380 170 325 56 -19 622 398 64 469 -1 -136 -35 185 -275 -576 -431
$$ packed form
3963D8p3%k14N18l55q51M08N81j11K0k09K77k14N71N9k32O0R6k35Or3k67r9M5
3987b64K05p74J47P75J35j97L32k07j62N55ol38n8K41r8m70N5j47k08J65M59n39
4009c99K12L51j25K5K04J05m94L83L36m12l21L24l61j21q7K57n71K68M43k8k50
4030b61O03p2J00K19j29p14M55L43l79n84J47j44J2K56q8l51K52P10j75r5L69
4051D74k85j82K94J83p75J38N30o06K88k59O8l74L32N38n70J6L67J15%K70l19
4072B43k75J48K56o34j60J30J8j08N00m17n36N85O27q0n50Q98j48j96J46j61o32
4093c46K17N49o38j30K5p5J14J65J69l50K22N33j44k52N35k85m39M31N5p59Q8
4114c15K13l17j1M21k24j47N50J55k69p5O41k24l34M05m70j35J01K20m60l01J45
$$ plain form
4135 -431 -162 -521 -60 -134 -320 2 522 145 -197 316 465 295 285 152 -405 -151 105 -260 -687 -23 -141
4156 -141 -186 165 431 -189 115 795 681 -3 150 208 -365 46 482 -448 -459 -52 176 -389 -380 -121 -385 93
4178 93 384 172 4 434 554 120 163 -108 -297 -187 186 -678 -581 7 -238 -193 100 -32 -223 475 779
4199 779 200 50 577 133 -147 -17 -138 -401 -108 -28 -208 -726 3 290 -164 78 422 65 228 522
4219 522 205 -134 355 -70 -443 -120 -102 -385 -342 113 -401 -464 128 387 77 449 525 86 116 342 299 -169
4241 -169 54 -162 -498 -103 236 -231 -397 97 -131 -100 421 571 291 515 773 76 16 8 -39 -233 -155 -132
4263 -132 -588 -114 88 -462 -415 283 150 17 340 358 23 516 386 31 -176 132 27 -538 -367 -342 -433
4284 -433 -132 223 104 -223 313 349 307 311 503 192 -31 228 -212 -252 123 16 -393 -217 18 -89 -9 506
$$ packed form
4135d31K69l59M61p4j86L22N20l77l42N13J49j70j0j33n57K54K56l65m27O64j18
4156a41m5L51K66o20L04O80j14o84J53N8n73M11M36r30j1M07K28n65RK59k64M78
4178I3K91k12j68M30J20m34M3k71j89J10L73q64R7N88k45M5K93j32j91O98L04
4199G79n79j50N27m44k80J30j21k63K93Q0j80n18P29K87m54K42L44l57J63K94
4219E22l17l39M89m25l73L23J8k83M3M55n14o3N92K59l10L72P6m39L0K26m3m68
4241a69K23k16l36L95L39m67j66M94k28L1N21J50k80K24K58o97o0qm7j94P8K3
4263a32m56M74K02n50M7O98j33j33L23J8l35M93j30l55k07L08j05n65J71K5r1
4284d33L01L55j19l27N36L6m2MJ92l11k23K59m40m0L75j07m09J76K35j07Q0N15
$$ plain form
4306 506 300 -81 478 338 182 257 544 81 -269 -60 -282 -68 -190 -187 -569 -192 296 77 31 550 240
4327 240 163 220 285 62 220 56 -324 -345 -187 -210 -456 -211 -137 -295 167 467 73 94 638 219 -68 335
4349 335 380 -60 -230 -125 -376 -321 55 -208 -692 -76 307 191 -181 351 -194 261 291 229 -273 106 507
4370 507 -141 -342 -207 -325 -315 265 -40 -314 -115 503 40 -105 615 194 65 64 54 -341 -277 184 -498 -597
4392 -597 -311 -228 -325 -242 26 199 66 259 -171 -36 439 232 -358 107 175 -318 -157 -234 -312 -293 2 26 -464
4415 -464 -156 467 210 -161 273 175 313 491 11 -458 79 21 -96 -433 -8 -276 -87 -10 41 -307 35
4436 35 392 20 -82 70 397 110 53 95 -422 -103 365 -460 -73 -106 -82 -145 -147 323 -40 304 663 177 22
4459 22 354 443 -272 -45 331 -263 -507 -49 -496 -364 -238 63 -50 -45 525 275 221 119 -28 -52 250 -42
$$ packed form
4306E06k06l81N59j40j56P5K87m63l50K09k22K14j22Ll82L77M88k19m6N19l10
4327B40p7N7O5k23J58j64l80k1J58k3k46K45P4j58M62L00l94K1N44m19k87M03
4349C35M5m40j70J05k51N5L76k63m84O16L83j16l72N32n45M55L0o2n02L79M01
4370E07o48k01J35j18J0N80l05k74J99O18m63j45P20m21j29jj0l95O4M61o82r9
4392e97K86Q3r7Q3K68J73j33J93m30J35M75k07n90M65O8m93J61p7p8J9K95K4m90
4415d64L08O23k57l71M34r8J38J78m80m69N37n8j17l37M25k68J89P7N1l48L42
4436C5L57l72j02J52L27k87n7M2n17L19M68q25L87l3K4o3kM70l63L44L59m86j55
4459B2L32Q9p15K27L76n94k44M58m47J32J26L01j13NN70k50n4j02j47k4L02k92
$$ plain form
4481 -42 -330 -346 -20 -224 -395 -121 -139 152 200 -3 -158 258 802 249 202 75 175 -242 -6 -109 -421 -343
4503 -343 -63 -133 -98 131 138 -278 318 449 171 204 396 -7 -3 85 54 -469 -216 37 -85 -124 -110 -311 -366 298
4527 298 335 78 21 253 238 61 27 -158 -269 68 -122 -456 -267 64 -193 -79 -131 168 208 588 372 -32
4549 -32 55 411 -92 -230 177 -274 -498 -289 56 -280 -102 78 -216 -24 18 229 69 521 325 41 248
4570 248 128 -19 -228 -14 -46 -552 -284 52 -108 308 39 -145 198 602 287 122 218 256 209 -230 -175 -298
4592 -298 -238 -89 -95 -385 -364 75 -82 -20 185 50 253 724 191 19 2 112 -26 -131 -193 -184 -283 254 8
4615 8 -432 -116 166 164 1 500 109 -111 441 189 -247 18 -25 -211 -339 74 -250 -461 -186 133 21 143
4637 143 396 82 202 480 186 14 315 143 -69 -359 -130 -257 -452 343 -175 -357 -89 276 -11 321
$$ packed form
4481d2k88j6L26k04j71K74j8K91M8k03j55M16N44n53m7j27J00m17K36j03l12P8
4503c43K80p0L5K29Pm16N96J31k78L3J92m03MQ8l1n23K53K53j22l9J4k01n5O64
4527B98L7k57n7K32j5j77l4j85j11L37j90l34J89L31k57J14n2K99M0L80k16m04
4549c2Q7L56n03j38M07m51k24K09L45l36J78J80k94J92M2K11j60M52j96k84K07
4570B48j20j47k09K14l2n06K68L36j60M16k69j84L43M04l15j65R6L8m7m39N5j23
4592b98O0J49ok90K1M39j57O2K05j35K03M71n33j72j7J10j38j05o2Rr9N37k46
4615Hm40L16K82kj63M99l91k20N52k52m36K65m3j86j28M13l24k11K75L19j12J22
4637A43K53l14J20K78k94j72L01j72k12k90K29j27j95P95n18j82K68L65k87L32
$$ plain form
4657 321 228 -50 261 395 311 -309 -227 132 -421 -550 -213 -292 -511 142 328 -79 -64 674 117 98 244 236 -28
4680 -28 352 95 -204 -239 -118 -202 -301 78 -107 -484 189 382 -350 -105 342 454 194 385 72 -448 -63
4701 -63 -76 -408 -172 -108 -188 70 62 396 -80 209 412 -183 437 53 42 -23 229 368 -502 -102 128 -292 -274
4724 -274 -4 9 -102 40 144 -301 3 420 -31 53 357 -22 -221 -23 -81 -193 -211 45 -258 -326 -98 -59
4746 -59 -80 375 505 -149 224 381 239 18 209 -109 -279 244 -143 -320 1 107 -243 -100 30 125 136
4767 136 473 -99 50 123 40 44 -118 154 -251 -278 -118 -224 -202 -315 42 59 306 17 191 57 536 376
4789 376 -18 -146 32 57 -291 -42 -400 -177 219 167 -81 -129 122 113 78 218 547 146 267 290 -33 -368
4811 -368 12 -84 -269 -131 -148 -225 -191 557 128 224 75 326 -12 218 152 41 21 -125 63 -303 -83 -410
$$ packed form
4657C21r3k78L11J34q4o20Q2L59n53j29L37p9k19O53J86m07J5P38n57j9J46qk64
4680b8L80k57k99l5J21q4r9L79j85l77O73J93p32K45M47J12k60J91l13n20L85
4701f3j3l32K36O4q0K58qL34m76K89K03n95O20l84j1o5K52J39q70M00K30m20J8
4724b74K70J3j11J42J04m45L04M17m51Q4L04l79j99J98n8j12j8K56l03o8K28L9
4746e9k1M55J30o54L73J57j42k21J91l18j70N23l87j77L21J06l50J43J30R5J1
4767A36L37n72J49P3q3Mj62K72m05k7J60j06K2j13L57J7K47k89J74j34M79j60
4789C76l94j28J78K5l48K49l58K23L96n2k48m8K51rl5J40L29m01J21K3l23l35
4811c68L80r6j85J38j7p7L4P48m29R6j49K51l38K30o6j11k0j46J88l66K20l27
$$ plain form
4833 -410 -372 -193 15 -369 -95 390 329 -28 291 123 -42 490 310 -253 -479 107 -294 -136 -226 -277 -219 34
4855 34 -129 37 -70 359 439 155 197 187 65 55 181 -394 -274 -87 -124 -359 -21 99 -195 80 186 30
4877 30 391 447 452 -197 -14 365 -188 -147 46 -311 -228 -29 15 -272 -105 229 13 306 252 94 73 199 186
4900 186 99 69 63 -286 -521 -15 -375 31 -228 -157 -98 263 212 -196 -73 609 268 -67 -25 -59 -31 -157 90
4923 90 -371 -357 -11 -29 -327 225 236 212 -44 397 324 229 389 136 -27 176 142 -363 -107 -49 -301 -127 -36
$$ packed form
4833d10L8J79K08l84K74M85o1l57L19j68j65N32j80n63k26N86m01J58r0n1N8K53
4855C4j63J66j07M29Q0k84M2j0j22j0J26n75J20J87l7k35L38J20k94K75J06j56
4877C0L61N6No49J83L79n53M1J93l57Q3J99M4k87J67L34k16K93n4j58k1J26j3
4900A86q7l0ol49k35N06l60M06k59P1N9L61n1m08J23O82l41l35M2l4K8j26K47
4923I0m61J4L46j8k98N52J1k4k56M41p3r5J60k53j63K03l4n05K56N8k52J74R1
$$ [...]
16383a85
##END NTUPLES=NMR FID
##END=
