##TITLE=abcd
##JCAMPDX= 6.0         $$ Bruker NMR JCAMP-DX V2.0
##DATA TYPE= NMR SPECTRUM
##DATA CLASS= NTUPLES
##ORIGIN= UXNMR, Bruker Analytische Messtechnik GmbH
##OWNER= root
$$ XWIN-NMR		Version 3.5
$$ Tue Aug 26 11:29:39 2025 Russian Standard Time (UT+4h)  servis@DPX200
##.OBSERVE FREQUENCY= 200.131235884673
##.OBSERVE NUCLEUS= ^1H
##.ACQUISITION MODE= SIMULTANEOUS
##.ACQUISITION SCHEME= undefined
##.AVERAGES= 32
##.DIGITISER RES= 18
##SPECTROMETER/DATA SYSTEM= spect
##.PULSE SEQUENCE= zg
##.SOLVENT NAME= CDCl3
##.SHIFT REFERENCE= (INTERNAL, CDCl3, 0, 16.4885)
##AUDIT TRAIL= $$ (NUMBER, WHEN, WHO, WHERE, WHAT)
$$ ##TITLE= Audit trail, XWIN-NMR		Version 3.5
$$ ##JCAMPDX= 5.01
$$ ##ORIGIN= Bruker BioSpin GmbH
$$ ##OWNER= servis
$$ F:\spectra/data/av/nmr/H1/1/pdata/1/auditp.txt
$$ ##AUDIT TRAIL=  $$ (NUMBER, WHEN, WHO, WHERE, WHAT)
(   1,<2025-08-26 11:28:17.40 +0400>,<servis>,<DPX200>,
      <created by zg, POWCHK disabled, PULCHK disabled
       configuration hash MD5:
       00 E9 B6 7A A2 85 ED C7 34 08 36 98 17 FE 4E 26
       data hash MD5: 32K
       AE 6D 18 5A 35 F5 9F 45 36 10 15 D6 6A C0 8D 29>)
(   2,<2025-08-26 11:28:37.85 +0400>,<servis>,<DPX200>,
      <Start of raw data processing
       efp BC_mod = 2 LB = 0.05 FT_mod = 6 PKNL = 1 PHC0 = -275.9419 PHC1 = 0.101552 SI = 16K 
       data hash MD5: 16K
       FB D1 5D 2A 65 EF 10 BF F1 05 AD EC 43 2E D6 97>)
(   3,<2025-08-26 11:28:49.71 +0400>,<servis>,<DPX200>,
      <pk PHC0 = 2 PHC1 = 0 
       data hash MD5: 16K
       2D 03 01 31 12 08 C5 37 E6 80 1B 96 51 76 1E 94>)
$$ ##END=
$$ 
$$ hash MD5
$$ 53 2D 03 A7 F3 E6 53 1C 1B CA 55 B5 97 B2 21 C0
##$RELAX= 
##$RELAX= 
##$RELAX= 
##$RELAX= 
##$RELAX= 
##$RELAX= 
##$RELAX= 
##$RELAX= 
$$ Bruker specific parameters
$$ --------------------------
##$DU= <F:\spectra>
##$EXPNO= 1
##$NAME= <H1>
##$PROCNO= 1
##$TYPE= <nmr>
##$USER= <av>
##$AMP= (0..31)
100 100 100 100 100 100 100 100 100 100 100 100 100 100 100 100 100 100 
100 100 100 100 100 100 100 100 100 100 100 100 100 100 
##$AQSEQ= 0
##$AQ_mod= 1
##$AUNM= <au_zg>
##$AUTOPOS= <>
##$BF1= 200.13
##$BF2= 200.13
##$BF3= 200.13
##$BF4= 200.13
##$BF5= 500.13
##$BF6= 500.13
##$BF7= 500.13
##$BF8= 500.13
##$BYTORDA= 1
##$CFDGTYP= 0
##$CFRGTYP= 5
##$CHEMSTR= <none>
##$CNST= (0..31)
1 1 145 1 1 1 1 1 1 1 1 1 1 1 1 1 1 1 1 1 1 1 1 1 1 1 1 1 1 1 1 1 
##$CPDPRG= <>
##$CPDPRG1= <>
##$CPDPRG2= <>
##$CPDPRG3= <>
##$CPDPRG4= <mlev>
##$CPDPRG5= <mlev>
##$CPDPRG6= <mlev>
##$CPDPRG7= <mlev>
##$CPDPRG8= <mlev>
##$CPDPRGB= <>
##$CPDPRGT= <>
##$D= (0..31)
0 2 0 0 0 0 0 0 0 0.06 0 0 0 0 0 0 0.0002 0 0 0 0 0 0 0 0 0 0 0 0 0 0 
0 
##$DATE= 1756193296
##$DBL= (0..7)
120 120 120 120 120 120 120 120 
##$DBP= (0..7)
150 150 150 150 150 150 150 150 
##$DBP07= 0
##$DBPNAM0= <>
##$DBPNAM1= <>
##$DBPNAM2= <>
##$DBPNAM3= <>
##$DBPNAM4= <>
##$DBPNAM5= <>
##$DBPNAM6= <>
##$DBPNAM7= <>
##$DBPOAL= (0..7)
0.5 0.5 0.5 0.5 0.5 0.5 0.5 0.5 
##$DBPOFFS= (0..7)
0 0 0 0 0 0 0 0 
##$DE= 6
##$DECBNUC= <off>
##$DECIM= 32
$$ [...]
##$SUBNAM4= <"">
##$SUBNAM5= <"">
##$SUBNAM6= <"">
##$SUBNAM7= <"">
##$SUBNAM8= <"">
##$SUBNAM9= <"">
##$SW= 20.6817932712277
##$SWIBOX= (0..15)
0 0 3 0 0 0 0 0 0 0 0 0 0 0 0 0 
##$SW_h= 4139.07284768212
##$TD= 32768
##$TD0= 1
##$TE= 0
##$TE2= 300
##$TE3= 300
##$TEG= 300
##$TL= (0..7)
0 120 120 120 120 120 120 120 
##$TP= (0..7)
150 150 150 150 150 150 150 150 
##$TP07= 0
##$TPNAME0= <>
##$TPNAME1= <>
##$TPNAME2= <>
##$TPNAME3= <>
##$TPNAME4= <>
##$TPNAME5= <>
##$TPNAME6= <>
##$TPNAME7= <>
##$TPOAL= (0..7)
0.5 0.5 0.5 0.5 0.5 0.5 0.5 0.5 
##$TPOFFS= (0..7)
0 0 0 0 0 0 0 0 
##$TUNHIN= 0
##$TUNHOUT= 0
##$TUNXOUT= 0
##$USERA1= <user>
##$USERA2= <user>
##$USERA3= <user>
##$USERA4= <user>
##$USERA5= <user>
##$V9= 5
##$VALIST= <valist>
##$VCLIST= <CCCCCCCCCCCCCCC>
##$VD= 0
##$VDLIST= <DDDDDDDDDDDDDDD>
##$VPLIST= <PPPPPPPPPPPPPPP>
##$VTLIST= <TTTTTTTTTTTTTTT>
##$WBST= 1024
##$WBSW= 30
##$XGAIN= (0..3)
0 0 0 0 
##$XL= 0
##$YL= 0
##$YMAX_a= 2340200
##$YMIN_a= -2159195
##$ZGOPTNS= <>
##$ZL1= 120
##$ZL2= 120
##$ZL3= 120
##$ZL4= 120
##$ABSF1= 0
##$ABSF2= 0
##$ABSG= 0
##$ABSL= 0
##$ALPHA= 0
##$AQORDER= 0
##$ASSFAC= 0
##$ASSFACI= 0
##$ASSFACX= 0
##$ASSWID= 0
##$AUNMP= <proc_1d>
##$AZFE= 0.1
##$AZFW= 0.1
##$BCFW= 0
##$BC_mod= 2
##$BYTORDP= 0
##$COROFFS= 0
##$CY= 18.4799938201904
##$DATMOD= 1
##$DC= 0
##$DFILT= <>
##$DTYPP= 0
##$F1P= 9.9274215381318
##$F2P= -0.165520771350173
##$FCOR= 1
##$FTSIZE= 16384
##$FT_mod= 6
##$GAMMA= 0
##$GB= 0
##$INTBC= 1
##$INTSCL= 4.127829e-11
##$ISEN= 128
##$LB= 0.05
##$LEV0= 0
##$LPBIN= 0
##$MAXI= 10000
##$MC2= 0
##$MEAN= 0
##$ME_mod= 0
##$MI= 50
##$NCOEF= 0
##$NC_proc= -5
##$NLEV= 6
##$NOISF1= 3.799351
##$NOISF2= 2.8
##$NSP= 0
##$NTH_PI= 0
##$NZP= 0
##$OFFSET= 16.48848
##$PC= 4
##$PHC0= -273.9419
##$PHC1= 0.101552
##$PH_mod= 1
##$PKNL= yes
##$PPARMOD= 0
##$PSCAL= 4
##$PSIGN= 0
##$REVERSE= no
##$SF= 200.130005582386
##$SI= 16384
##$SIGF1= 3
##$SIGF2= 2
##$SINO= 400
##$SIOLD= 16384
##$SREGLST= <1H.CDCl3>
##$SSB= 0
##$STSI= 16384
##$STSR= 0
##$SW_p= 4139.07284768211
##$SYMM= 0
##$S_DEV= 0
##$TDeff= 32768
##$TDoff= 0
##$TI= <>
##$TILT= no
##$TM1= 0
##$TM2= 0
##$TOPLEV= 0
##$USERP1= <user>
##$USERP2= <user>
##$USERP3= <user>
##$USERP4= <user>
##$USERP5= <user>
##$WDW= 1
##$XDIM= 16384
##$YMAX_p= 359601604
##$YMIN_p= -1951204
$$ End of Bruker specific parameters
$$ ---------------------------------
##NTUPLES= NMR SPECTRUM
##VAR_NAME=  FREQUENCY,     SPECTRUM/REAL,   SPECTRUM/IMAG
##SYMBOL=    X,             R,               I
##VAR_TYPE=  INDEPENDENT,   DEPENDENT,       DEPENDENT
##VAR_FORM=  AFFN,          ASDF,            ASDF
##VAR_DIM=   16384,         16384,           16384
##UNITS=     HZ,            ARBITRARY UNITS, ARBITRARY UNITS
##FACTOR=    0.252644378177508, 1,           1
##FIRST=     3299.83951724647, 0,            0
##LAST=      -839.233330435636, 0,           0
##MIN=       -839.233330435636, -1951204,    0
##MAX=       3299.83951724647, 359601604,    0
$$ Real data points
##PAGE= N=1
##DATA TABLE= (X++(R..R)), XYDATA
$$ [...]
6670c29462J23359o3147J17405p0555M9866j06565N0916o8171J7676N2256K7656
$$ -329462 -206103 -269250 -151845 -222400 -172534 -279099 -228183 -296354 -278678 -226422 -198766
6659a98766o0007J41987j44686J6813o2652O0096L4270l6098j4735n608m5660
$$ -198766 -258773 -116786 -261472 -244659 -307311 -247215 -212945 -249043 -263778 -269386 -315046
6648c15046L806j22728O7163O1045O993N139J6090l5164j5115M12j6158J27615
$$ -315046 -311240 -433968 -366805 -305760 -298767 -293628 -277538 -312702 -327817 -327405 -343563 -215948
6636b15948j07674m8189o8389P5266M8679L7946m4608j71877R2569K651O14J38921
$$ -215948 -323622 -371811 -440200 -364934 -316255 -278309 -322917 -494794 -402225 -399574 -398960 -260039
6624b60039j77516L6460K0669o708J01529r6927J9830m14Q3464r4883j2170M1534
$$ -260039 -437555 -401095 -380426 -387134 -285605 -382532 -362702 -363116 -279652 -374535 -386705 -345171
6612c45171q1271L130M5209N4933m8330n5641J06450r5047M9772n0783K3565p6623
$$ -345171 -426442 -423312 -378103 -323170 -371500 -427141 -320691 -415738 -365966 -416749 -393184 -469807
6600d69807n1857J59844r1175J21096j46151O6189Q0295r5259J5987O6721j2142
$$ -469807 -521664 -361820 -452995 -331899 -478050 -411861 -331566 -426825 -410838 -344117 -356259
6589c56259r3329J01259j03114O8442J6014M9694q2404n1688K4659k9819J11449
$$ -356259 -449588 -348329 -451443 -383001 -366987 -317293 -399697 -451385 -426726 -456545 -345096
6578c45096n4043K5580J2761k528k4372m6303L3000J1623q5959K4558r073M3545
$$ -345096 -399139 -373559 -360798 -363326 -387698 -434001 -401001 -389378 -475337 -450779 -459852 -416307
6566d16307O7903j10992M3685n9927l1763Q2630q1098J51362o6606j8594p5961
$$ -416307 -348404 -459396 -415711 -475638 -507401 -424771 -505869 -354507 -421113 -439707 -515668
6555e15668P1993l2549J3137N1500n9922M5167o5764N0026L0169M904n1818J30086
$$ -515668 -443675 -476224 -463087 -411587 -471509 -426342 -492106 -442080 -411911 -407007 -458825 -328739
6543c28739j73624m3133J06019r0458J72285p904J422k2721o3248K1430n6230
$$ -328739 -502363 -545496 -439477 -529935 -357650 -365554 -364132 -386853 -450101 -428671 -484901
6532d84901K8703R3979P533j42002J09727M5151q0802j4777o5097R3999k0678
$$ -484901 -456198 -362219 -354686 -496688 -386961 -341810 -422612 -437389 -502486 -408487 -429165
6521d29165j1887R1982j3943q5471L4609j1959j3988r178P3181r1638L5191P5769
$$ -429165 -441052 -349070 -363013 -448484 -413875 -425834 -439822 -449000 -375819 -467457 -432266 -356497
6509c56497o6573K4800J3172j4847N3114j6584r5741J2140J07443j32755N9116
$$ -356497 -423070 -398270 -385098 -399945 -346831 -363415 -459156 -447016 -339573 -472328 -413212
6498d13212J16046n0816r0400k0235Q584L6754Q740q7479J0243M2269K2573j9650
$$ -413212 -297166 -347982 -438382 -458617 -450033 -413279 -404539 -492018 -481775 -439506 -416933 -436583
6486d36583M0356o5193M7285l4168P6527n9991R976K1003Q1503j04890J12458
$$ -436583 -396227 -461420 -414135 -448303 -371776 -431767 -421791 -400788 -319285 -424175 -311717
6475c11717q1002l5688P087M5528j3690p3489O7589l5753O945Q3462j16065R314
$$ -311717 -392719 -428407 -421320 -375792 -389482 -462971 -395382 -431135 -424190 -340728 -456793 -447479
6463d47479P8721j08011N7113M0019L2923r6176R5064m2550o1210l047P2505o2488
$$ -447479 -368758 -476769 -419656 -379637 -346714 -442890 -347826 -390376 -451586 -454633 -382128 -444616
6451d44616m1509Q6408p3080R9201n7787J10880l8416n1680j3459K9218R6992
$$ -444616 -486125 -399717 -472797 -373596 -431383 -320503 -358919 -410599 -424058 -394840 -297848
6440b97848j8055j47282O7307P709j9500l0611R3218k5421O169l0477M7425o7334
$$ -297848 -315903 -463185 -395878 -388169 -407669 -438280 -345062 -370483 -364314 -394791 -347366 -414700
6428d14700J4893M3871r260n5723O6713r2708O3999n8132J58384r9628r429l3418
$$ -414700 -399807 -355936 -365196 -420919 -354206 -446914 -382915 -441047 -282663 -382291 -391720 -425138
6416d25138O9099p655q7167k0623Q311n6200J14780M1926l3371n0258Q6606K6208
$$ -425138 -356039 -363694 -450861 -471484 -463173 -519373 -404593 -362667 -396038 -446296 -359690 -333482
6404c33482p7911M1928P7976k04403J19560n4283O2445K3601o2712k7408k0947
$$ -333482 -411393 -369465 -291489 -495892 -376332 -430615 -368170 -344569 -407281 -434689 -455636
6393d55636N3892L9415l0918J4302j6637M2599l5753n5604O7211m4699R1645l1347
$$ -455636 -401744 -362329 -393247 -378945 -395582 -352983 -388736 -444340 -377129 -421828 -330183 -361530
6381c61530N0945o5519m291K8737o5252O8845k3401L7376M6584m6226j530O2931
$$ -361530 -310585 -376104 -380395 -351658 -416910 -348065 -371466 -334090 -287506 -333732 -335262 -272331
6369b72331r0343J5600Q5954m8192n0046O8486q1748M4775l0890l6383P2885M77
$$ -272331 -362674 -347074 -261120 -309312 -359358 -290872 -372620 -327845 -358735 -395118 -322233 -321756
6357c21756o700M6159m3002o1942J28541n8879O1714K179m9039n2189Q5527n9228
$$ -321756 -328456 -282297 -325299 -387241 -258700 -317579 -255865 -253686 -302725 -354914 -269387 -328615
6345c28615r538J5570o729J08804q3548r4609P530L743n7048J79972J4555n2516
$$ -328615 -338153 -322583 -329312 -220508 -304056 -398665 -391135 -387392 -444440 -264468 -249913 -302429
6333c02429K2152q2008R1494m7479O8576j32790J89214o91m7137k8844n5966J04808
$$ -302429 -280277 -362285 -270791 -318270 -249694 -382484 -193270 -193961 -241098 -269942 -325908 -221100
6321b21100j31207P2551M5585R290n9516K8588n2619N7210q7170M3569J7434k9558
$$ -221100 -352307 -279756 -234171 -224881 -284397 -255809 -308428 -251218 -338388 -294819 -277385 -306943
6309c06943J42001o3092k5577M4450l2610N8531q486n5214l5040J61881k8130
$$ -306943 -164942 -228034 -253611 -209161 -241771 -183240 -191726 -246940 -281980 -120099 -148229
6298a48229j16971P6689J3005O2927M1477j36725J10840o2845K8318j5270R846
$$ -148229 -265200 -188511 -175506 -112579 -71102 -207827 -96987 -159832 -131514 -146784 -136938
6287a36938k3597L2873m0133J5111O2104Q7630j15385o8278J44712l6164m9051
$$ -136938 -160535 -127662 -167795 -152684 -90580 -2950 -118335 -186613 -41901 -78065 -127116
6276a27116N4947L8305L4528q418l3598j9074J9045j1549k9415J40960o3501p4155
$$ -127116 -72169 -33864 664 -7754 -41352 -60426 -41381 -52930 -82345 58615 -4886 -79041
6264g9041P281Q8120l2605J36077M350j25948P7596n0933P7208M2307n4170Q554
$$ -79041 -71760 16360 -16245 119832 124182 -1766 75830 24897 102105 144412 90242 98796
6252I8796P9092o9177P1185n8914L9993L4611J796O6976q4392O0523m8343K8087
$$ 98796 177888 108711 179896 120982 160975 195586 197382 264358 179966 240489 192146 220233
6240B20233k6266J13938j01899Q6508Q5198l6744n3498J74747j43800J38215l0573
$$ 220233 193967 307905 206006 292514 377712 340968 287470 462217 318417 456632 426059
6229D26059k0642k9291J15502J05110q8202M5636Q8819K4978l7081N0710l861
$$ 426059 405417 376126 491628 596738 508536 554172 642991 667969 630888 681598 677737
6218F77737q213R2304M4145k2881P4391J574j0244M2825L8682m5913K2813L7703
$$ 677737 669524 761828 805973 783092 857483 859057 848813 891638 930320 884407 907220 944923
6206I44923N1580m132j5883p5453k2814N7033k0351p7758n7301J5905m3331k4013
$$ 944923 996503 992371 976488 901035 878221 935254 914903 837145 779844 795749 752418 728405
6194G28405L1530r1926o3064k1165K4267m1569p9195J8084O2130j58278m0734
$$ 728405 759935 668009 604945 583780 608047 566478 487283 505367 567497 409219 368485
6183C68485r5486J7336K3799o6225J7606O1105o6996j34896P7200l8545l3459
$$ 368485 272999 290335 314134 247909 265515 326620 259624 124728 201928 163383 129924
6172A29924J3316k2548N1605r1752K6463K6981l7518j2266j3528m5361n0117l9193
$$ 129924 143240 120692 172297 80545 107008 133989 96471 84205 70677 25316 -24801 -63994
6160f3994M5956k5537K4803P9971j26229K3737q091n4069K3698k5637J13590l6039
$$ -63994 -18038 -43575 -18772 61199 -65030 -41293 -49384 -103453 -79755 -105392 8198 -27841
6148b7841p1567K8527m3444J5125M8004o1598l7177l141L0517m1709k0010J03569
$$ -27841 -99408 -70881 -114325 -99200 -51196 -112794 -149971 -153112 -122595 -164304 -184314 -80745
6136h0745j40572N6863p6471L383L7294q1267K8281o993K17455j19027l4539J9135
$$ -80745 -221317 -164454 -240925 -237542 -200248 -281515 -253234 -260227 -42772 -161799 -196338 -177203
6124a77203Q5452k7928n4799Q111P3101j17495O5316n8062L128l7947L9527M7619
$$ -177203 -91751 -119679 -174478 -166367 -93266 -210761 -145445 -203507 -200379 -238326 -198799 -151180
6112a51180l3799m0805j7554R633P813O1571j14720M3995M9531O5936j11842K856
$$ -151180 -184979 -225784 -243338 -233705 -225892 -164321 -279041 -235046 -185515 -119579 -231421 -228565
6100b28565k6538K3049O5981r8888M2093j4924o5135O5783L7639N5316j16782
$$ -228565 -255103 -232054 -166073 -264961 -222868 -237792 -302927 -237144 -199505 -144189 -260971
6089b60971L5401P5856j9784k5026L995p7383L6808N927M8865r5191J24298j05455
$$ -260971 -225570 -149714 -169498 -194524 -190529 -267912 -231104 -225177 -176312 -271503 -147205 -252660
6077b52660R7820m7769M6264p0995j14348J43750j4871p0956R4132m0177J31L832
$$ -252660 -154840 -202609 -156345 -227340 -341688 -197938 -212809 -283765 -189633 -229810 -229679 -225847
6065b25847J0277j6768L8770o6339k236Q661Q243K7301p1271Q9147l3861n7360
$$ -225847 -215570 -232338 -193568 -259907 -262143 -253482 -245239 -217938 -289209 -200062 -233923 -291283
6053b91283Q5384n1159p1579J69880o5013m0017R7073r0481k1629k7730J45291
$$ -291283 -205899 -257058 -328637 -158757 -223770 -263787 -166714 -257195 -278824 -306554 -161263
6042a61263q4138L9123n5400K7808l0759O0303p6697J71155j49708Q4049p6088
$$ -161263 -245401 -206278 -261678 -233870 -264629 -204326 -281023 -109868 -259576 -175527 -251615
6031b51615M2744N2960p0176K2181o5893L0933K1900M9844k2034j19161J90446
$$ -251615 -208871 -155911 -226087 -203906 -269799 -238866 -216966 -167122 -189156 -308317 -117871
6020a17871j16463J17108j50097Q1251k2212j2465r3680J61118q2882O0649J6327
$$ -117871 -234334 -117226 -267323 -186072 -208284 -220749 -314429 -153311 -236193 -175544 -159217
6009a59217m6420j2030L2982M5555j33106N3096J970J13768m0865o9983R150K2485
$$ -159217 -205637 -217667 -184685 -139130 -272236 -219140 -217170 -103402 -144267 -214250 -205100 -182615
5997a82615m2010L3693p3615J7192q9047J98040l7664J8745N196l6072N2353j24391
$$ -182615 -224625 -190932 -264547 -247355 -336402 -138362 -176026 -157281 -152085 -188157 -135804 -260195
5985b60195P2326n2759J29784p7692J8167K4652p7905M028o202q0818P4283Q1737
$$ -260195 -187869 -240628 -110844 -188536 -170369 -145717 -223622 -219594 -225796 -306614 -232331 -150594
5973a50594K4012q3749k5888k6536N9486O9292k8942o2551j6102J6912O0788P467
$$ -150594 -126582 -210331 -236219 -262755 -203269 -133977 -162919 -225470 -241572 -224660 -163872 -156405
5961a56405Q760l7038j6877J637j2283J11300j49687N9313J296J76499j77495
$$ -156405 -147645 -184683 -201560 -199923 -212206 -100906 -250593 -191280 -189984 -13485 -190980
5950a90980J15779q9325M7235q7240J06469m5753m2309L3015K9191J8220J6195
$$ -190980 -75201 -164526 -117291 -204531 -98062 -143815 -186124 -153109 -123918 -105698 -89503
5939h9503p2263J09868mj08930J7390j8872M1979O977M1654q2067r99k2715N9821
$$ -89503 -161766 -51898 -51902 -160832 -143442 -162314 -120335 -113358 -71704 -153771 -154770 -177485 -117664
5926a17664l4890K6462n238l090m3295J35915n9663j07222N7793l7202P7160O2115
$$ -117664 -152554 -126092 -131330 -134420 -177715 -41800 -101463 -208685 -150892 -188094 -110934 -48819
5914d8819m9703N03j6969k9343L1864L3082r9497j5481K3350R6063J960N8960
$$ -48819 -98522 -98019 -114988 -144331 -112467 -79385 -178882 -194363 -171013 -74950 -72990 -14030
5902a4030k5432r0474R6025j05380K6774j2848N0388O618j059q2495Q2358p22
$$ -14030 -39462 -129936 -33911 -139291 -112517 -125365 -74977 -68359 -69418 -151913 -69555 -70277
5890g0277k823M0716o8925r574J3627N3821r6458P3499K4592l7727M3719q4433
$$ -70277 -73100 -32384 -101309 -110883 -97256 -43435 -139893 -66394 -41802 -79529 -35810 -120243
5878a20243Q5469r3946J09005m5488j0043M0516p1877J23206q2897N4110L7831
$$ -120243 -34774 -128720 -19715 -65203 -75246 -34730 -106607 16599 -66298 -12188 25643
5867B5643r5434N72r495J01161p3723P8982n119p2750k4623J00475l7226k6228
$$ 25643 -69791 -69219 -78714 22447 -51276 27706 22587 -50163 -74786 25689 -11537 -37765
5855c7765m9518Q3441O7423j37098k947R8573j2579q099P8964l9840j6290k2412
$$ -37765 -87283 -3842 63581 -73517 -76464 22109 9530 1431 80395 40555 24265 1853
5843A853j6707K3926Q6886p9794L1731p7073P0189l3499r6299R1637P6644m733
$$ 1853 -14854 9072 95958 16164 47895 -29178 41011 7512 -88787 2850 79494 74761
5831G4761J4839n4170n2481J4039N8833p0173K9459J279M1006N844l7363O2024
$$ 74761 89600 35430 -17051 -3012 55821 -14352 15107 16386 57392 63236 25873 87897
5819H7897k4236L1307q77j8072J4152l6921J05817r7004j8206L9998P546j00773
$$ 87897 63661 94968 94091 76019 90171 53250 159067 62063 43857 83855 91401 -9372
5807i372J34908o4758N3700K4441k4970J1391O7373j31591L8207P9632o0826N6089
$$ -9372 125536 60778 114478 138919 113949 125340 192713 61122 99329 178961 118135 174224
5795A74224J1848j35257J60651l9826k3903l4139M5370k1921o103N3684m696N970
$$ 174224 186072 50815 211466 171640 147737 113598 158968 137047 130944 184628 179932 185902
5783A85902K5226R084o9023M7573l7570k6146M8705K1980p755Q039K1916m2509
$$ 185902 211128 220212 151189 198762 161192 135046 183751 205731 197976 206015 227931 185422
5771A85422K7647J2526L1128k8834K2062N0910j26277J13191n5125K4947l1362
$$ 185422 213069 225595 256723 227889 249951 300861 174584 287775 232650 257597 226235
5760B26235J5364j1006o361n47K3526m6639R0840j45373R4567L5021l7882Q651
$$ 226235 241599 230593 224232 223685 247211 200572 291412 146039 240606 275627 237745 246396
5748B46396J0443M2152k9515J34809l9784p4679P7385n9582L663J69759k14700
$$ 246396 256839 298991 269476 404285 364501 289822 367207 307625 311288 481047 266347
5737B66347P1810j9554n4742M9811P5125p8085L8767o6125r907J52839j7823j02323
$$ 266347 338157 318603 263861 313672 388797 310712 349479 283354 273447 426286 408463 306140
5725C06140L9328R0456q9773M0928k9946P434Q4032j0573l4977j2441J2676M6827
$$ 306140 345468 435924 346151 387079 357133 364567 448599 438026 403049 390608 403284 450111
5713D50111j3090M917M1259p8037q5R4747j06337J25281r0265M5542o0663J29666
$$ 450111 437021 441938 483197 405160 405075 499822 393485 518766 428501 474043 413380 543046
5701E43046k2026m2199q279N9370J8844q9955J08272K7403M1757j14972R6010
$$ 543046 521020 478821 470542 529912 548756 458801 567073 594476 636233 521261 617271
5690F17271n3750n3233n129J41265j20356P6749m8294N5367j01773K85J43507
$$ 617271 563521 510288 505159 646424 526068 602817 554523 609890 508117 508402 651909
5679F51909o1004N8937n6987N6609p1503K5402L4289k0119O4346k6695N548P8319
$$ 651909 590905 649842 592855 649464 577961 603363 637652 617533 681879 655184 660732 739051
5667G39051q7233M6457Q6743j37499R0571M5474o472j50444J21740O3482j10769
$$ 739051 651818 698275 785018 647519 738090 783564 777092 626648 748388 811870 701101
5656G01101P7038L7802O841l4465k976k5593K4588J03206l6061J6414l1965n2426
$$ 701101 778139 815941 822782 788317 785341 759748 784336 887542 851481 867895 835930 783504
5644G83504P5066m16M0644K0095j05982o9761J71930K5274q480K4242J043p2573
$$ 783504 858570 858154 898798 918893 812911 743150 915080 940354 931874 956116 957159 884586
5632H84586r671J25689K1753N2785q5862l0338O8523r950Q3192j3323j24263Q4524
$$ 884586 874915 1000604 1022357 1075142 989280 958942 1027465 1017515 1100707 1087384 963121 1047645
5620A047645o128M602m1120J7429J67864j44561M8546j199j3114Q872q533P468
$$ 1047645 1041517 1046119 1004999 1022428 1190292 1045731 1094277 1093078 1079964 1088836 1080303 1087771
5608A087771K3354Q6598r3219M1244j01118J10119n7349Q5447M2537n0602Q282
$$ 1087771 1111125 1197723 1104504 1145748 1044630 1154749 1097400 1182847 1225384 1174782 1183064
5597A183064J35909j17829j3268L2808L6436J9567K1164N3273K598L6847p2239
$$ 1183064 1318973 1201144 1187876 1220684 1257120 1276687 1297851 1351124 1353722 1390569 1318330
5586A318330L7948J9848o6541R7523J232l1730R3660n795M3013k7518Q66M6414
$$ 1318330 1356278 1376126 1309585 1407108 1408340 1376610 1470270 1464475 1507488 1479970 1480836 1527250
5574A527250n6341J6598M3762k2429O2456p4205J38393j5388j06205J08803k9206
$$ 1527250 1470909 1487507 1531269 1508840 1571296 1497091 1635484 1620096 1513891 1622694 1593488
5563A593488L7659o736J37511l7683m8779P3659j24313j775J99449j16267k6127
$$ 1593488 1631147 1624411 1761922 1724239 1675460 1749119 1624806 1623031 1822480 1706213 1680086
5552A680086J26373n6907L1294R9866n1946k973N9686j0971L3920L9555M3944
$$ 1680086 1806459 1749552 1780846 1880712 1828766 1825793 1885479 1874508 1908428 1947983 1991927
5541A991927M0926m6610K917K9800Q7034n1480l8422Q8620M3333J38115m2665
$$ 1991927 2032853 1986243 1989160 2018960 2105994 2054514 2016092 2104712 2148045 2286160 2243495
5530B243495j52118L2826Q9885p8944J46858M2870M0732m545m9864Q2701j22757
$$ 2243495 2091377 2124203 2214088 2135144 2282002 2324872 2365604 2361059 2311195 2393896 2271139
5519B271139P8689J04353q8954L8200M5681J2372R6628l8846n0089J51870n640
$$ 2271139 2349828 2454181 2365227 2403427 2449108 2461480 2558108 2519262 2469173 2621043 2615403
5508B615403q269K6419L4948M0998O7313J4650k3830P4123l3292J0597R5410m3556
$$ 2615403 2607134 2633553 2668501 2709499 2776812 2791462 2767632 2841755 2808463 2819060 2914470 2870914
5496B870914P8449O2381m408P4867o4666p347R3633n0688Q9596o572J20441K5321
$$ 2870914 2949363 3011744 3007336 3082203 3017537 3010190 3103823 3053135 3142731 3136159 3256600 3281921
5484C281921l8776P6320J2158m0294R1428L4377M3652K4681J825Q2003j5550J48218
$$ 3281921 3243145 3319465 3331623 3291329 3382757 3417134 3460786 3485467 3487292 3569295 3553745 3701963
5472C701963n6489O312j1600Q3271J14959K7824K2529j2040j7983R747O8953J00170
$$ 3701963 3645474 3651786 3640186 3723457 3838416 3866240 3888769 3876729 3858746 3868493 3937446 4037616
5460D037616N170K1994P8390m6358J09096N4246m6806O7779P9915P1467k2724
$$ 4037616 4042786 4064780 4143170 4096812 4205908 4260154 4213348 4281127 4361042 4432509 4409785
5449D409785O2801K3085J02978J1679j1817P9488P2243K5359P4212M2674K4609
$$ 4409785 4472586 4495671 4598649 4610328 4598511 4677999 4750242 4775601 4849813 4892487 4917096
5438D917096j9621J56400N3988j6207J19935J8048P4913n2825J65935n85J12902
$$ 4917096 4897475 5053875 5107863 5091656 5211591 5229639 5304552 5251727 5417662 5417077 5529979
5427E529979M2113J1764K21377o7888l7957K36246O419M1886J03408j4776M8461
$$ 5529979 5572092 5583856 5805233 5737345 5699388 5935634 5942053 5983939 6087347 6072571 6121032
5416F121032P9868J95840l0827J30584J14865N1482n831J22824k6548R0982J69910
$$ 6121032 6200900 6396740 6365913 6496497 6611362 6662844 6657013 6779837 6753289 6844271 7014181
5405G014181Q7675M1462J12107J21081J73571K0965P1524Q7468J23049N2231N7293
$$ 7014181 7101856 7143318 7255425 7376506 7550077 7571042 7642566 7730034 7853083 7905314 7962607
5394G962607J28506O3854K21099K2916N3560K07334J3045J94624J7775J59631
$$ 7962607 8091113 8154967 8376066 8398982 8452542 8659876 8672921 8867545 8885320 9044951
5384I044951K45794Q5093J53164M3309J08922J66913K21107J30128k515K57034
$$ 9044951 9290745 9375838 9529002 9572311 9681233 9848146 10069253 10199381 10196866 10453900
5374A0453900K19309J6770K48217P3574L05627L1037K86594J52424J28570K47730
$$ 10453900 10673209 10689979 10938196 11011770 11317397 11348434 11635028 11787452 11916022 12163752
5364A2163752K16452J92370J56185K30143L02611J50006J65599J41878L29038
$$ 12163752 12380204 12572574 12728759 12958902 13261513 13411519 13577118 13718996 14048034
5355A4048034K92430J89544J88675K03657L05974K44699K39283L33470K18192
$$ 14048034 14340464 14530008 14718683 14922340 15228314 15473013 15712296 16045766 16263958
5346A6263958K01205M36797J93801K86815L43183K81960K95067L34290L06900
$$ 16263958 16465163 16901960 17095761 17382576 17725759 18007719 18302786 18637076 18943976
5337A8943976M12850K13712L09641L43404L23197M24546J38913N66660L20343
$$ 18943976 19356826 19570538 19880179 20223583 20546780 20971326 21110239 21676899 21997242
5328B1997242L36124L75619L41796L88936M11908M21153L66001L84237L10262
$$ 21997242 22333366 22708985 23050781 23439717 23851625 24272778 24638779 25023016 25333278
5319B5333278N35599M29160N10929L54245M73247L42323N68374M61667N08973
$$ 25333278 25868877 26298037 26808966 27163211 27636458 27978781 28547155 29008822 29517795
5310B9517795L62519O02353L97292O58664M54404M68375N87143M82300O64173
$$ 29517795 29880314 30482667 30879959 31538623 31993027 32461402 33048545 33530845 34195018
5301C4195018M53764N15852O03874N52591N70850O17644O02923M64830N47005
$$ 34195018 34648782 35164634 35768508 36321099 36891949 37509593 38112516 38577346 39124351
5292C9124351P23755O64445N40414O42903O25784P25569P03181N29807P07834
$$ 39124351 39848106 40512551 41052965 41695868 42321652 43047221 43750402 44280209 44988043
5283D4988043P09628Q70972O53168Q13178P67875O84570Q76543P98264Q88961
$$ 44988043 45697671 46568643 47221811 48034989 48802864 49487434 50363977 51162241 52051202
5274E2051202R01998R21522Q95934J000657Q46501R00649R09706R53562J008364
$$ 52051202 52953200 53874722 54770656 55771313 56617814 57518463 58428169 59381731 60390095
5265F0390095R01346P58843Q30384P36314R53531P07791O78911N52395O85334
$$ 60390095 61291441 62050284 62880668 63616982 64570513 65278304 65957215 66509610 67194944
5256F7194944L58871M76792M29611L21740J26847K77834O4024J9257Q999n1016
$$ 67194944 67553815 68030607 68460218 68781958 68908805 69186639 69250663 69269920 69278919 69227903
5246F9227903k99679k32935j98441m07544l59712l40272m92298o27034n29837
$$ 69227903 68928224 68695289 68496848 68089304 67729592 67389320 66897022 66269988 65740151
5237F5740151n06702o68894o10366o25190p25601o39861p92313p92098p93886
$$ 65740151 65233449 64564555 63954189 63328999 62603398 61963537 61171224 60379126 59585240
5228E9585240p52180p29786q02424p71737q01805q48942p09823r13649p31171
$$ 59585240 58833060 58103274 57300850 56529113 55727308 54878366 54168543 53254894 52523723
5219E2523723q25854p87627q37671p03997o96566p79476r28660o82051p35100
$$ 52523723 51697869 50910242 50072571 49368574 48672008 47892532 46963872 46281821 45546721
5210D5546721p51889o93910p71583o58858p13807p28542p09250n91999o54857
$$ 45546721 44794832 44100922 43329339 42670481 41956674 41228132 40518882 39926883 39272026
5201C9272026p08804o79024o15000n06930o52075o19967n58744n33512n62801
$$ 39272026 38563222 37884198 37269198 36762268 36110193 35490226 34931482 34397970 33835169
5192C3835169o33428n11800m40338m97314n60802n22185m46565m66242n27481
$$ 33835169 33201741 32689941 32249603 31752289 31191487 30669302 30222737 29756495 29229014
5183B9229014m10359m93719l58056n32156l64795l93488n02212m01542l75265
$$ 29229014 28818655 28324936 27966880 27434724 27069929 26676441 26174229 25772687 25397422
5174B5397422k60800l95059l83261m29454l63526l71113m24713j51166m23138
$$ 25397422 25136622 24741563 24358302 23928848 23565322 23194209 22769496 22618330 22195192
5165B2195192k29584l30594l03774l85926k49868l26304k01978k36611l88456
$$ 22195192 21965608 21635014 21331240 20945314 20695446 20369142 20167164 19930553 19542097
5156A9542097k69573k01129j91890l22632k73309j87952l06327k17527k64253
$$ 19542097 19272524 19071395 18879505 18556873 18283564 18095612 17789285 17571758 17307505
5147A7307505k30701j31564k76994j17371k45872j92979k71787j26781k77343
$$ 17307505 17076804 16945240 16668246 16550875 16305003 16112024 15840237 15713456 15436113
5138A5436113k26133j04137k82570j98700j61727j66865k60268j44896o8178k90950
$$ 15436113 15209980 15105843 14823273 14624573 14462846 14295981 14035713 13890817 13822639 13531689
5128A3531689j00003j24325j64666j19634j95327r9709k23067o2834j75751q7171
$$ 13531689 13431686 13307361 13142695 13023061 12827734 12728025 12504958 12442124 12266373 12179202
5118A2179202k67313p2426k08398n5621j58901j42576N568k68675l5733j08041
$$ 12179202 11911889 11839463 11631065 11575444 11416543 11273967 11279535 11010860 10975127 10867086
5108A0867086j65460j75541M2841j79976j95246p3316j44031n3599r5568m4968
$$ 10867086 10701626 10526085 10568926 10388950 10193704 10120388 9976357 9922758 9827190 9782222
5098I782222q5043j48239j12159l4287n6680j53639q9232q8689j50568q1064m5069
$$ 9782222 9697179 9548940 9436781 9402494 9345814 9192175 9102943 9014254 8863686 8782622 8737553
5087H737553j2065p3984j71354o0514j16705k8935j75915q2633k3469o3573j65062
$$ 8737553 8725488 8651504 8480150 8419636 8302931 8273996 8098081 8015448 7991979 7928406 7763344
5076G763344l53n5516m2432j83418o4642k4910l5488J0997j43512o0943l3756
$$ 7763344 7762991 7707475 7665043 7481625 7416983 7392073 7356585 7367582 7224070 7163127 7129371
5065G129371j19576r4035l1023k5787m6213j61623M3736r7956k5289k5726n1818
$$ 7129371 7009795 6915760 6884737 6858950 6812737 6651114 6694850 6596894 6571605 6545879 6494061
5054F494061j14763q842r5747j1655J7892j25149M098m9973j92029O4892J2259
$$ 6494061 6379298 6370456 6274709 6263054 6280946 6155797 6159895 6109922 5917893 5982785 5995044
5043E995044q1007j13163n860j414j3392n9849o4676J6568j71781l9611o3104
$$ 5995044 5914037 5800874 5795014 5793600 5780208 5720359 5655683 5672251 5500470 5460859 5397755
5032E397755k7585J3101o4555n5130J07244j83160Q50k952q3094M4278r8011o362
$$ 5397755 5370170 5383271 5318716 5263586 5370830 5187670 5188520 5185568 5102474 5146752 5048741 5042379
5020E042379j11442n7884m7449J07759p8603q523p5505O6364n4335o9102j05861
$$ 5042379 4930937 4873053 4825604 4933363 4854760 4846237 4770732 4837096 4782761 4713659 4607798
5009D607798J0412p593j5166k0581j40239M7481P921j17182P6322j15637M3161
$$ 4607798 4618210 4610617 4595451 4574870 4434631 4482112 4490033 4372851 4449173 4333536 4376697
4998D376697j24380Q4536r350j00538R481k7165m9993p392r9001O91m771L9972
$$ 4376697 4252317 4336853 4327503 4226965 4236446 4209281 4159288 4151896 4052895 4053586 4048815 4088787
4986D088787j24634J00371r2390n3523L1740j23455M1999l3535o061m0114l9061
$$ 4088787 3964153 4064524 3972134 3918611 3950351 3826896 3868895 3835360 3829299 3789185 3750124
4975C750124J4128j04216M4554K5765K8916n5305J6389q0451M8720r4019l6445
$$ 3750124 3764252 3660036 3704590 3730355 3759271 3703966 3720355 3639904 3688624 3594605 3558160
4964C558160r809m2586J6952K4687r1292J1975K8889j31919J42085j76724J31099
$$ 3558160 3548351 3505765 3522717 3547404 3456112 3468087 3496976 3365057 3507142 3330418 3461517
4953C461517l4248j11423j0373M2616m4239M969l6870K2985l1074j0335o5350
$$ 3461517 3427269 3315846 3305473 3348089 3303850 3308819 3271949 3294934 3263860 3253525 3188175
4942C188175J6659J0725L3911q1501m6887p2096O5975M6427p0782N8678o3231
$$ 3188175 3204834 3215559 3249470 3167969 3121082 3048986 3114961 3161388 3090606 3149284 3086053
4931C086053m1248J8032j0299p1534M431k3402O9515j24975P4145j538r5419L0369
$$ 3086053 3044805 3062837 3052538 2981004 2985435 2962033 3031548 2906573 2980718 2979180 2883761 2914130
4919B914130N0554j4050j27120L4956J03819j36468j06054P9122O2599q5878Q5324
$$ 2914130 2964684 2950634 2823514 2858470 2962289 2825821 2719767 2798889 2861488 2775610 2860934
4908B860934l2432l507l5035q326k3608J7830k3543k1232P3653m4240n4945m8090
$$ 2860934 2828502 2824995 2789960 2781634 2758026 2775856 2752313 2731081 2804734 2760494 2705549 2657459
4896B657459N2451L5090K4237j01875m1362Q3570L065L4466l8314k9223j3919
$$ 2657459 2709910 2745000 2769237 2667362 2626000 2709570 2712635 2747101 2708787 2679564 2665645
4885B665645L8030o1234l6211l5186N3351K8685m1642q0827Q4004J9856K448j04048
$$ 2665645 2703675 2642441 2606230 2571044 2624395 2653080 2611438 2530611 2614615 2634471 2636919 2532871
4873B532871J17732j11309M5587n6976L0784k6870l7500J70339r1463q1183n1497
$$ 2532871 2650603 2539294 2584881 2527905 2558689 2531819 2494319 2664658 2573195 2492012 2440515
4862B440515N6081Q7105o8881L607N8692k7544R986j04551N1310r8111M3789l4140
$$ 2440515 2496596 2583701 2514820 2518427 2577119 2549575 2559561 2455010 2506320 2408209 2451998 2417858
4850B417858N7936O9254o3136j7657J3819l030l8353L0401k118L0576n2752O6499
$$ 2417858 2475794 2545048 2481912 2464255 2478074 2475044 2436691 2467092 2464974 2495550 2442798 2509297
4838B509297O1631j01476r777J985N400j0112j2168q5222J58540O6527k8250j29651
$$ 2509297 2570928 2469452 2459675 2461660 2467060 2456948 2444780 2359558 2518098 2584625 2556375 2426724
4826B426724j3251J13716m6852q7300O2097O0870q5250R605J20221j73287N8271
$$ 2426724 2413473 2527189 2480337 2393037 2455134 2516004 2430754 2440359 2560580 2387293 2445564
4815B445564J3536M4075K4384K6803o2860L3598J8821R172q1832L1532p1354K9553
$$ 2445564 2459100 2503175 2527559 2554362 2491502 2525100 2543921 2553093 2471261 2502793 2431439 2460992
4803B460992m0268J49269r0997l999N2645k61J7056n4188m3617J12524o2467M0962
$$ 2460992 2420724 2569993 2478996 2474997 2527642 2527381 2544437 2490249 2446632 2559156 2496689 2537651
4791B537651o5523M4401M6679o0015m2293n6267Q3580P0666l0952M277o1019K9668
$$ 2537651 2472128 2516529 2563208 2503193 2460900 2404633 2488213 2558879 2527927 2532204 2471185 2500853
4779B500853l5126R2014p9517J5189o4615R3246O6082p4314Q7227j41172N710
$$ 2500853 2465727 2557741 2478224 2493413 2428798 2522044 2588126 2513812 2601039 2459867 2465577
4768B465577R482m5121N3303L7382K6375j43189M2808J46679j27591N0804M9763
$$ 2465577 2475059 2429938 2483241 2520623 2546998 2403809 2446617 2593296 2465705 2516509 2566272
4757B566272r7372J31089j5664M8614r1978J10397j25055n4616P1592r2036J16306
$$ 2566272 2468900 2599989 2584325 2632939 2540961 2651358 2526303 2471687 2543279 2451243 2567549
4746B567549O7290N6129j57798J01582q233j04464Q1044R495M9824p3472O9015
$$ 2567549 2634839 2690968 2533170 2634752 2626519 2522055 2603099 2612594 2662418 2588946 2657961
4735B657961J927M1309n6180L353J13658r7412l3526M6615L54Q3876j36347K2082
$$ 2657961 2659888 2701197 2645017 2648370 2762028 2664616 2631090 2677705 2678059 2761935 2625588 2647670
4723B647670J01097j00981L1482N1103L6796q8489M2907R1280m9824M3548N4767
$$ 2647670 2748767 2647786 2679268 2730371 2767167 2678678 2721585 2812865 2763041 2806589 2861356
4712B861356Q502M6769o2863m0118l4425Q8548r4557J52217K1453j03443J38499
$$ 2861356 2869858 2916627 2853764 2813646 2779221 2867769 2773212 2925429 2946882 2843439 2981938
4701B981938p5620k4692M5604q751M7971O0138k144j23162J30095M4947O0652
$$ 2981938 2906318 2881626 2927230 2918479 2966450 3026588 3024444 2901282 3031377 3076324 3136976
4690C136976p1676K7514j9405Q2997m7140Q6858o8081l679K7871j48099J06561
$$ 3136976 3065300 3092814 3073409 3156406 3109266 3196124 3128043 3124364 3152235 3004136 3110697
4679C110697P5099Q4992j65509J04005Q2337j6058n6644J19420K3458m7547J35567
$$ 3110697 3185796 3270788 3105279 3209284 3291621 3275563 3218919 3338339 3361797 3314250 3449817
4668C449817j19004N6363J6090P0284j8386M8691K8418P8196J7980l4159n516
$$ 3449817 3330813 3387176 3403266 3473550 3455164 3503855 3532273 3610469 3628449 3594290 3588774
4657C588774L2917K8459J29161L6933M9789j34376Q4265l3989q720R4650n0143
$$ 3588774 3621691 3650150 3779311 3816244 3866033 3731657 3815922 3781933 3773213 3867863 3817720
4646C817720J19163J3833l3689K9261L5034j4741R7247o5475K2456J06481j13268
$$ 3817720 3936883 3950716 3917027 3946288 3981322 3966581 4063828 3998353 4020809 4127290 4014022
4635D014022J23059j3533J1516Q7284K3907P6756R8909j3611J84473L0344L2883
$$ 4014022 4137081 4123548 4135064 4222348 4246255 4323011 4421920 4408309 4592782 4623126 4656009
4624D656009R388m9222L5103k1730J28152j1210M1552N3725q9573J4721p8237
$$ 4656009 4665397 4616175 4651278 4629548 4757700 4746490 4788042 4841767 4752194 4766915 4688678
4613D688678L8021M1123j9026j362o8196n5311P7201J43588n5436N8315j147J04423
$$ 4688678 4726699 4767822 4748796 4747434 4679238 4623927 4701128 4844716 4789280 4847595 4846448 4950871
4601D950871M9224N5454O4306J15352R17O0318l3988j549q1637P9562J16209q8830
$$ 4950871 5000095 5055549 5119855 5235207 5236124 5296442 5262454 5260905 5179268 5258830 5375039 5286209
4589E286209O21P3087R743q4328o9129q2230N7016p1018K6939j04543O9924R96
$$ 5286209 5286830 5359917 5369660 5285332 5216203 5133973 5190989 5119971 5146910 5042367 5112291 5113287
4577E113287M3732R901J3146N6867M2773L2980K0816L9849k1695J64734j5548
$$ 5113287 5157019 5166920 5180066 5236933 5279706 5312686 5333502 5373351 5351656 5516390 5500842
4566E500842m8329j9314J8193j2062Q6693K491O8723O454m5175K4756K7124R711
$$ 5500842 5452513 5433199 5451392 5439330 5526023 5528514 5597237 5603691 5558516 5583272 5610396 5620107
4554E620107Q519j95010K07149j8316K7642l1598q935P0645J66274o5029K3648
$$ 5620107 5628626 5433616 5640765 5622449 5650091 5618493 5609558 5680203 5846477 5781448 5805096
4543E805096J10110j8951J2767J16363m1121R968N5248N073J35664o1011J07097
$$ 5805096 5915206 5896255 5909022 6025385 5984264 5994232 6049480 6054553 6190217 6129206 6236303
4532F236303p4093J1061J17308O9055r3069J67852n1884J33352L9080K7645N9920
$$ 6236303 6162210 6173271 6290579 6359634 6266565 6434417 6382533 6515885 6554965 6582610 6642530
4521F642530M0903J0908J06480k732M5428P0078J26439K3383r216J2951J54124
$$ 6642530 6683433 6694341 6800821 6798089 6843517 6913595 7040034 7063417 7054201 7067152 7221276
4510G221276J9319Q6909L8366r538J73325Q846K5765J53567K952J48269l6097
$$ 7221276 7240595 7327504 7365870 7356332 7529657 7538503 7564268 7717835 7720787 7869056 7832959
4499G832959J03546N9830K421J41697O0847J71683j18319J68511J10661k7709
$$ 7832959 7936505 7996335 7998756 8140453 8201300 8372983 8254664 8423175 8533836 8506127
4489H506127K17725Q7376j509K23164L2136J37798L5516O8161J47590K14922L5755
$$ 8506127 8723852 8811228 8809719 9032883 9065019 9202817 9238333 9306494 9454084 9669006 9704761
4478I704761P6770J31008J80871K30930J23422M0469K33243J22547J66631K11159
$$ 9704761 9781531 9912539 10093410 10324340 10447762 10488231 10721474 10844021 11010652 11221811
4468A1221811R5527J91187K57976J98250N3700K36593L08209J45436K84781J31865
$$ 11221811 11317338 11508525 11766501 11964751 12018451 12255044 12563253 12708689 12993470 13125335
4458A3125335L38852J70228K81403L45407L32234M28999L60281M91114L35256
$$ 13125335 13464187 13634415 13915818 14261225 14593459 15022458 15382739 15873853 16209109
4449A6209109M40051M70293L03594J66233K34050K76246J60697K09372L08559
$$ 16209109 16649160 17119453 17423047 17589280 17823330 18099576 18260273 18469645 18778204
4440A8778204L79411K50715K65430L76257K76730L30790M21769O15556M21915
$$ 18778204 19157615 19408330 19673760 20050017 20326747 20657537 21079306 21694862 22116777
4431B2116777M93765N62250P45673P14875P54357R16316J062990J149769J351513
$$ 22116777 22610542 23172792 23918465 24633340 25387697 26304013 27367003 28516772 29868285
4422B9868285J442671J335808J064245R07860O73307M62154O29090N35462N69768
$$ 29868285 31310956 32646764 33711009 34618869 35292176 35754330 36383420 36918882 37488650
4413C7488650L19870L7593k32554N9236o7315L2032L84028K68363M15901N57328
$$ 37488650 37808520 37846113 37613559 37672795 37605480 37637512 38021540 38289903 38705804 39263132
4403C9263132O95799Q04328Q53833J165925J343977J469162J774131K054300K240859
$$ 39263132 39958931 40763259 41617092 42783017 44126994 45596156 47370287 49424587 51665446
4394E1665446K616937K390119K257077K327789K200593K354274K504746K644332
$$ 51665446 54282383 56672502 58929579 61257368 63457961 65812235 68316981 70961313
4386G0961313K282575J712231R30316R24763J488841K090331K985608L411721
$$ 70961313 73243888 74956119 75886435 76811198 78300039 80390370 83375978 86787699
4378H6787699L708587L588566K651554J282106K93258l20822P1399P89274J564049
$$ 86787699 90496286 94084852 96736406 98018512 98311770 97990948 98062347 98851621 100415670
4369A00415670K316184K729281K912566K284786Q68968o38244j052601l89068
$$ 100415670 102731854 105461135 108373701 110658487 111527455 110889211 109836610 109447542
4361A09447542O81511J898779K669414L010987K903920L034143M134013N580855
$$ 109447542 110129053 112027832 114697246 117708233 120612153 123646296 127780309 133361164
4353A33361164P405680R353269J0598472J0893089R424621O206539J444638j921029
$$ 133361164 140766844 150120113 160718585 171611674 181036295 187242834 188687472 186766443
4345A86766443l251174k583980p92424J004434K397158K773862K470482l35332
$$ 186766443 183515269 180931289 180138865 181143299 183540457 186314319 188784801 188449469
4337A88449469n367371r979003j1104090r485694o996279m568357k821065j439160
$$ 188449469 183082098 173103095 161999005 152513311 145517032 140948675 138127610 136688450
4329A36688450l47695J113588K690722M419546O409264Q405281R548273R750511
$$ 136688450 136340755 137454343 140145065 144564611 150973875 159379156 168927429 178677940
4321A78677940P856872M240721o29609l739181m543324l844574j855694N3120
$$ 178677940 186534812 190775533 190145924 186406743 181863419 178018845 176163151 176216271
4313A76216271J016463J316900K14278k817945q426823j2728922j3670545j1747605
$$ 176216271 177232734 178549634 178763912 175945967 167519144 154790222 141119677 129372072
4305A29372072r520562p570241o070683m797916l799754k774694j840074q70198
$$ 129372072 119851510 112281269 106210586 101412670 97612916 94838222 92998148 92127950
4297I2127950j08803Q78938J410900J383498Q46790m00676j931480k777948k735733
$$ 92127950 92019147 92898085 94308985 95692483 96539273 96138597 94207117 91429169 88693436
4288H8693436k319859j601505r78740n93790m38130r52398k214649m018611n351623
$$ 88693436 86373577 84772072 83793332 83199542 82761412 81809014 79594365 75575754 70224131
4279G0224131n253834m777375m017897l314872l018070k661230k388259k121725
$$ 70224131 64970297 60192922 56175025 52860153 49842083 47180853 44792594 42670869
4271D2670869j866584j754014j717065j521482j299485j307329j037304j074193
$$ 42670869 40804285 39050271 37333206 35811724 34512239 33204910 32167606 31093413
4263C1093413r48215r67480q26541p34311q33004n82582o80834n42838n86863
$$ 31093413 30145198 29177718 28351177 27616866 26783862 26201280 25520446 24977608 24390745
4254B4390745n11761n28122m26099l87825n43303l37310m28122l97336m48641
$$ 24390745 23878984 23350862 22924763 22536938 21993635 21656325 21228203 20830867 20382226
4245B0382226l54659k95747m47330k71958l71063k22904l38234j15057l19250
$$ 20382226 20027567 19731820 19284490 19012532 18641469 18418565 18080331 17965274 17646024
4236A7646024l24923k33869j95884k01354k36961r4564l38493j20406k87862j05139
$$ 17646024 17321101 17087232 16891348 16689994 16453033 16358469 16019976 15899570 15611708 15506569
4226A5506569j32498j90761j52889r2427k02588j63120o1095k32948j73575m6852
$$ 15506569 15374071 15183310 15030421 14937994 14735406 14572286 14511191 14278243 14104668 14057816
4216A4057816j62262o1224j38681j02031p9155k25231l486j32566q1737j12758
$$ 14057816 13895554 13834330 13695649 13593618 13514463 13289232 13285746 13153180 13071443 12958685
4206A2958685p9413o4464q5280j39566n8229j77949j8448O0331l30288R526j22094
$$ 12958685 12879272 12814808 12729528 12589962 12531733 12353784 12335336 12395667 12065379 12074905 11952811
4195A1952811k3258k03678L5724j23472K8344j33469n8958m4358p1593J7910q1563
$$ 11952811 11929553 11725875 11761599 11638127 11666471 11533002 11474044 11429686 11358093 11376003 11294440
4184A1294440p1438k4007k6989o6925j1501j66098M573P2167n2910m3825q1302
$$ 11294440 11223002 11198995 11172006 11105081 11093580 10927482 10932055 11004222 10951312 10907487 10826185
4173A0826185J42641j94329K3169k6326l2588m4830K2199N5981j64343m1273Q7792
$$ 10826185 10968826 10774497 10797666 10771340 10738752 10693922 10716121 10772102 10607759 10566486 10654278
4162A0654278k4035N7683j19278M3195K1009n7852L8228l9018j4959j5532L313
$$ 10654278 10630243 10687926 10568648 10611843 10632852 10575000 10613228 10574210 10559251 10543719 10547032
4151A0547032M8815k9052R2780n3868N0574M3319j4494Q8075j8034q6216J24632
$$ 10547032 10595847 10566795 10659575 10605707 10656281 10699600 10685106 10773181 10755147 10668931 10793563
4140A0793563O9094J81844j25054o23N7946J1464K77L2556p9340J87733O8850
$$ 10793563 10862657 11044501 10919447 10918824 10976770 10988234 10988511 11021067 10941727 11129460 11198310
4129A1198310q9610J9497L0680O7875M2337O3879J0949J0482P3859O8345n5884
$$ 11198310 11108700 11128197 11158877 11226752 11269089 11332968 11343917 11354399 11428258 11496603 11440719
4118A1440719J62505R1737m0722R1253P9236l9222P0654J34271R4750J34264j5167
$$ 11440719 11603224 11694961 11654239 11745492 11824728 11785506 11856160 11990431 12085181 12219445 12204278
4107A2204278L1235J13876J13480J16993N875Q077M0196J88873J3608K01107P0016
$$ 12204278 12235513 12349389 12462869 12579862 12585737 12593814 12634010 12822883 12836491 13037598 13107614
4096A3107614Q7393K0948J29729J38488J05128P273Q2301J20412P2882P4483J31556
$$ 13107614 13195007 13215955 13345684 13484172 13589300 13596573 13678874 13799286 13872168 13946651 14078207
4085A4078207Q4723Q7906j3203J41647J19749P5704J81831J22084M7094J27448
$$ 14078207 14162930 14250836 14237633 14379280 14499029 14574733 14756564 14878648 14925742 15053190
4075A5053190J83221M4567K25577J01679J93526K19034J07207K08406J97546J52241
$$ 15053190 15236411 15280978 15506555 15608234 15801760 16020794 16128001 16336407 16533953 16686194
4065A6686194J98503J11980O5881K43631Q9359K65804J65333R188K05241O6069
$$ 16686194 16884697 16996677 17062558 17306189 17395548 17661352 17826685 17835873 18041114 18107183
4055A8107183J89703J29357J0886J63317P0442K28294J86105J4510K23359J30533
$$ 18107183 18296886 18426243 18437129 18600446 18670888 18899182 19085287 19099797 19323156 19453689
4045A9453689K19754J36892J89138K10812J94276K10287K41305J26660J88590
$$ 19453689 19673443 19810335 19999473 20210285 20404561 20614848 20856153 20982813 21171403
4036B1171403N5982M11432J05529K24245K19261K97025K90592J85065K16899K93201
$$ 21171403 21227385 21638817 21744346 21968591 22187852 22484877 22775469 22960534 23177433 23470634
4026B3470634R5710K21006Q6054K88826J77516K26161J94909J76738K71315J94624
$$ 23470634 23566344 23787350 23873404 24162230 24339746 24565907 24760816 24937554 25208869 25403493
4016B5403493J31249K78567K33403K10977K32984J99001J82299L01967J71045
$$ 25403493 25534742 25813309 26046712 26257689 26490673 26689674 26871973 27173940 27344985
4007B7344985L05945J60352L46892J98087M12674K68529K95072L95975K75588
$$ 27344985 27650930 27811282 28158174 28356261 28768935 29037464 29332536 29728511 30004099
3998C0004099L57723M20545L40840L83854K53995N34183M27520J61547M59977
$$ 30004099 30361822 30782367 31123207 31507061 31761056 32295239 32722759 32884306 33344283
3989C3344283M33353L08090M80925L38708L63981M27942M46559L49039N01749
$$ 33344283 33777636 34085726 34566651 34905359 35269340 35697282 36143841 36492880 36994629
3980C6994629M19731L26069N36121L58489N84448N30413M02682M25069O46554
$$ 36994629 37414360 37740429 38276550 38635039 39219487 39749900 40152582 40577651 41224205
3971D1224205N42446N41982N30135N94451N32878O07617N58349P17267O36303
$$ 41224205 41766651 42308633 42838768 43433219 43966097 44573714 45132063 45849330 46485633
3962D6485633O28961O16052P14610O07152O68648O81442O54391P32305O41403
$$ 46485633 47114594 47730646 48445256 49052408 49721056 50402498 51056889 51789194 52430597
3953E2430597Q11048N84109P54258Q44839P62007P37823P25483Q42949P83483
$$ 52430597 53241645 53825754 54580012 55424851 56186858 56924681 57650164 58493113 59276596
3944E9276596P05598P95038R47043P39079Q82146Q51123R12922Q66021Q70571
$$ 59276596 59982194 60777232 61724275 62463354 63345500 64196623 65109545 65975566 66846137
3935F6846137Q80324J040685Q62307J022228Q13126J071593R60743R31426R71064
$$ 66846137 67726461 68767146 69629453 70651681 71464807 72536400 73497143 74428569 75399633
3926G5399633R90186J024018R61451R45547J102199R51851R93509J122138R79979
$$ 75399633 76389819 77413837 78375288 79320835 80423034 81374885 82368394 83490532 84470511
3917H4470511J051588J015411J073864R99974J058082R57621J057999J091494
$$ 84470511 85522099 86537510 87611374 88611348 89669430 90627051 91685050 92776544
3909I2776544R37120J091538J018743J094303R11634R35301R40964J005497Q76909
$$ 92776544 93713664 94805202 95823945 96918248 97829882 98765183 99706147 100711644 101588553
3900A01588553Q99192P76271R22737P60329P19409P63772P74491M66933O54727
$$ 101588553 102487745 103264016 104186753 104947082 105666491 106430263 107204754 107671687 108326414
3891A08326414M72750N07199L20099M86580K73806L03421K67543J53912J54941
$$ 108326414 108799164 109306363 109626462 110113042 110386848 110690269 110957812 111111724 111266665
3882A11266665J67807L0015n7262J04125L9842J07138j04306l3449q0377K9634
$$ 111266665 111434472 111464487 111407225 111511350 111551192 111658330 111554024 111520575 111440198 111469832
3872A11469832j02732j17467p4294k13760k59024k26472m81079l58109n00570
$$ 111469832 111367100 111249633 111175339 110961579 110702555 110476083 109995004 109636895 109136325
3863A09136325m09030m97195n66170n43819m15351n04180l85365l28697l77922
$$ 109136325 108727295 108230100 107663930 107120111 106704760 106200580 105815215 105486518 105108596
3854A05108596j00786k90145j0452j11969K68071J43346L80267N65712N87141
$$ 105108596 105007810 104717665 104707213 104595244 104863315 105006661 105386928 105952640 106539781
3845A06539781Q45380R50325J044845J184981J208117J120672J134464J058949
$$ 106539781 107385161 108335486 109380331 110565312 111773429 112894101 114028565 115087514
3837A15087514R93203N00995M38145K2756l7152k87829m16711n89703m37978n54447
$$ 115087514 116080717 116581712 117019857 117042613 117005461 116717632 116300921 115711218 115273240 114718793
3827A14718793m00770k19261j72798n3009L25117L13987P93778P10858J261310
$$ 114718793 114318023 114098762 113925964 113872955 114198072 114512059 115305837 116016695 117278005
3818A17278005J780134J826769K322812K730634L106159L620725L906508M485424
$$ 117278005 119058139 120884908 123207720 125938354 129044513 132665238 136571746 141057170
3810A41057170M824206N250621N655022N976683O188459O664240O492176O597630
$$ 141057170 145881376 151131997 156787019 162763702 168952161 175616401 182108577 188706207
3802A88706207O539026O446984O289150O076952N492891N063479M395827L682617
$$ 188706207 195245233 201692217 207981367 214058319 219551210 224614689 229010516 232693133
3794B32693133K925552K261947J655466J219809R74077N52309j4109n00091r44875
$$ 232693133 235618685 237880632 239536098 240755907 241729984 242282293 242268184 241768093 240823218
3785B40823218j486650j759401j556084j511601r57182j85616J204682K443037
$$ 240823218 239336568 237577167 236021083 234509482 233552300 233366684 234571366 237014403
3777B37014403L887224N236917O721104Q059244R477129J0616219J1403520J1798853
$$ 237014403 240901627 246138544 252859648 260918892 270396021 281012240 292415760 304214613
3769C04214613J1985854J1174328J0143906Q250225O197361M174011K393575J067731
$$ 304214613 316200467 327374795 337518701 345768926 351966287 356140298 358533873 359601604
3761C59601604j49654j114667k463622l488893n115768p141113r216534j0543294
$$ 359601604 359451950 358337283 355873661 352384768 347269000 340127887 330911353 320368059
3753C20368059j1731359j2090136j1647389j1218360r633485q365536o703794
$$ 320368059 308636700 296546564 284899175 273680815 264047330 255681794 248978000
3746B48978000n140049l258754j539349L326J569371K942534L635028M183783
$$ 248978000 243837951 240579197 239039848 239043174 240612545 243555079 247190107 251373890
3738B51373890M251798L733431K970496K003120R29699R6115r43509j572489k084425
$$ 251373890 255625688 259359119 262329615 264332735 265262434 265358549 264415040 262842551 260758126
3729B60758126k694569l448478m347193n283971o600654p465104q314265q670395
$$ 260758126 258063557 254615079 250267886 244983915 238383261 230918157 222603892 213933497
3721B13933497q891023q508336p995431p317747o597478n906815n067843m304810
$$ 213933497 205042474 196534138 188538707 181220960 174623482 168716667 163648824 159344014
3713A59344014l756770k860933k356322j883476j271821q73430m43789j73106
$$ 159344014 155587244 152726311 150369989 148486513 147214692 146341262 145897473 145724367
3705A45724367M19836O58367R85504J276456J391395J629417J776013J784467
$$ 145724367 146144203 146802570 147788074 149064530 150455925 152085342 153861355 155645822
3697A55645822K007754J892493K022552K135895K112349K104110K114619K126802
$$ 155645822 157653576 159546069 161568621 163704516 165816865 167920975 170035594 172162396
3689A72162396K106600K198280K021335K108056K327335K371568K358963K334122
$$ 172162396 174268996 176467276 178488611 180596667 182924002 185295570 187654533 189988655
3681A89988655K219079K117736J986615J864622J554316J288525P38127L59602
$$ 189988655 192207734 194325470 196312085 198176707 199731023 201019548 201757675 202117277
3673B02117277J1905l99852q81442j439326j834985k084625k570938k934443l122758
$$ 202117277 202129182 201729330 200847888 199408562 197573577 195488952 192918014 189983571 186860813
3664A86860813l322624l422556l438911l422023l461583l160583l156117k814463
$$ 186860813 183538189 180115633 176676722 173254699 169793116 166632533 163476416 160661953
3656A60661953k812122k592007k574866k511491k445877k378229k386348k411775
$$ 160661953 157849831 155257824 152682958 150171467 147725590 145347361 142961013 140549238
3648A40549238k659880k650851k558516k738729k685753k951987k905506k961303
$$ 140549238 137889358 135238507 132679991 129941262 127255509 124303522 121398016 118436713
3640A18436713k993599k946298l043363k983668k839301k707933k605116k419863
$$ 118436713 115443114 112496816 109453453 106469785 103630484 100922551 98317435 95897572
3632I5897572k304379k020666j735964j668975j495741j244998j091336r77675
$$ 95897572 93593193 91572527 89836563 88167588 86671847 85426849 84335513 83357838
3624H3357838o46611o49526l17777l27590o6075j96356L24566K26878M17071N47927
$$ 83357838 82711227 82061701 81743924 81416334 81350259 81153903 81478469 81705347 82122418 82670345
3614H2670345O51510P85978Q45478J002601J007340J092297J254621J330232J530537
$$ 82670345 83321855 84107833 84953311 85955912 86963252 88055549 89310170 90640402 92170939
3605I2170939J494215J872387J786853J978827K118138K239619K162826K316912
$$ 92170939 93665154 95537541 97324394 99303221 101421359 103660978 105823804 108140716
3597A08140716K399208K294553K326383K151628K253123K100499K190574J934101
$$ 108140716 110539924 112834477 115160860 117312488 119565611 121666110 123856684 125790785
3589A25790785K117467J877201J871052K049061J894821J926439K105082K269282
$$ 125790785 127908252 129785453 131656505 133705566 135600387 137526826 139631908 141901190
3581A41901190K346940K576646K757125K872185L121496L216683L220972L136585
$$ 141901190 144248130 146824776 149581901 152454086 155575582 158792265 162013237 165149822
3573A65149822K943122K828036K297694K103899J639554J182200O79461L66440
$$ 165149822 168092944 170920980 173218674 175322573 176962127 178144327 178823788 179190228
3565A79190228r6869n44781j058353j426293j738545k104942k470700k672383
$$ 179190228 179093359 178548578 177490225 176063932 174325387 172220445 169749745 167077362
3557A67077362k884594l057561l285588l260150l346432l242898l333633l360360
$$ 167077362 164192768 161135207 157849619 154589469 151243037 148000139 144666506 141306146
3549A41306146l516832l346783l570842l526854l783702l548154l913805l791696
$$ 141306146 137789314 134442531 130871689 127344835 123561133 120012979 116099174 112307478
3541A12307478m130485l991699m067697m184830m154724m040528l954168l945910
$$ 112307478 108176993 104185294 100117597 95932767 91778043 87737515 83783347 79837437
3533G9837437l682093l653094l467147l215558l068314k848038k733468k527158
$$ 79837437 76155344 72502250 69035103 65819545 62751231 59903193 57169725 54642567
3525E4642567k303296k305031j991470j895558j747704j769904j395030j511809
$$ 54642567 52339271 50034240 48042770 46147212 44399508 42629604 41234574 39722765
3517C9722765j358353j209845j254910j125635j015164r87708q44038r65762p76004
$$ 39722765 38364412 37154567 35899657 34774022 33758858 32771150 31927112 30961350 30185346
3508C0185346p90019p31176o94641o74952o49772p01091n72588n72935n74115
$$ 30185346 29395327 28664151 27969510 27294558 26644786 25943695 25371107 24798172 24224057
3499B4224057o12539n52206m53312n58661m59774m96239l80945l96974n56974
$$ 24224057 23611518 23059312 22606000 22047339 21587565 21091326 20710381 20313407 19756433
3490A9756433m52400l40668l14549m14755m87759k46272l65668k48663k43957
$$ 19756433 19304033 18963365 18648816 18234061 17746302 17500030 17134362 16885699 16641742
3481A6641742k89763k07033j53065l40946k34124l08370J1953k06965k69176j87495
$$ 16641742 16351979 16144946 15991881 15650935 15416811 15108441 15120394 14913429 14644253 14456758
3471A4456758k64227r7674k17952k63450j23994j38095k17727j47282k25707k79039
$$ 14456758 14192531 14094857 13876905 13613455 13489461 13351366 13133639 12986357 12760650 12481611
3461A2481611j59680j21680k90626k20959j45169j39209q2390k43133k04013n0487
$$ 12481611 12321931 12200251 11909625 11688666 11543497 11404288 11321898 11078765 10874752 10824265
3451A0824265j85403j48238j62825j71001j10815j27254q5979p8151j59112j02551
$$ 10824265 10638862 10490624 10327799 10156798 10045983 9918729 9832750 9754599 9595487 9492936
3441I492936j17332l8316j94071j12212J4141j82599J2371j8075j79936n4459
$$ 9492936 9375604 9337288 9143217 9031005 9045146 8862547 8874918 8856843 8676907 8622448
3431H622448m7982j18607R6m6887r6382J3526j73563j22348m4160l7133p872n2339
$$ 8622448 8574466 8455859 8455955 8409068 8312686 8326212 8152649 8030301 7986141 7949008 7941136 7888797
3419G888797Q712j41880j37314J00724j97449j4374k9277j54648k2007j84152
$$ 7888797 7897509 7755629 7618315 7719039 7521590 7507216 7477939 7323291 7301284 7117132
3409G117132N1213m0918j8590j32918k5482j09555k1171n4402j9300o4441n3821
$$ 7117132 7168345 7127427 7108837 6975919 6950437 6840882 6819711 6765309 6746009 6681568 6627747
3398F627747L8003q9517l4755K0020j7366j3715K5422n0108j7972O0108k21694
$$ 6627747 6665750 6576233 6541478 6561498 6544132 6530417 6555839 6505731 6487759 6547867 6326173
3387F326173O7134j8593j02921M9726n9520n5522n862k4649n7222j1736k1403
$$ 6326173 6393307 6374714 6271793 6321519 6261999 6206477 6200615 6175966 6118744 6107008 6085605
3376F085605n6456J6439k0336n7640O558j0761q982M0288k4047L7191j3339M7341
$$ 6085605 6029149 6045588 6025252 5967612 5974170 5963409 5954427 5994715 5970668 6007859 5994520 6041861
3364F041861j8039M3381R4134m5802j6020J29082o0419J90747k8476K9013r939
$$ 6041861 6023822 6067203 6161337 6115535 6099515 6228597 6168178 6358925 6330449 6359462 6349523
3353F349523K7527J9088M171K0477P6273p58M0202j0445N9498L7365k9305M4347
$$ 6349523 6377050 6396138 6400309 6420786 6497059 6496301 6536503 6526058 6585556 6622921 6593616 6637963
3341F637963p0347O3942j4806k5714N2551P4658O1600k5244J54130l8840j7179
$$ 6637963 6567616 6631558 6616752 6591038 6643589 6718247 6779847 6754603 6908733 6869893 6852714
3330F852714R8138M8017o8188O2020J02895n2712J39149p5369R3993q791m7378
$$ 6852714 6950852 6998869 6930681 6992701 7095596 7042884 7182033 7106664 7200657 7191866 7144488
3319G144488n368K1266p7618K6392Q2934l0468p3315j15663O7671J1297j9514
$$ 7144488 7139120 7160386 7082768 7109160 7192094 7161626 7088311 6972648 7040319 7051616 7032102
3308G032102m9817n7686J7749o704k5123r6510j3232m0744O1505m2252l4616m5909
$$ 7032102 6982285 6924599 6942348 6935644 6910521 6814011 6800779 6760035 6821540 6779288 6744672 6698763
3296F698763K6950K2964l6399L5057J6603j39485O829l9275O9608K2256L1708
$$ 6698763 6725713 6748677 6712278 6747335 6763938 6624453 6631282 6592007 6661615 6683871 6715579
3285F715579j01350k1864j3527n2458O3964k2233l1636J8617m9180O9617K3767
$$ 6715579 6614229 6592365 6578838 6526380 6590344 6568111 6536475 6555092 6505912 6575529 6599296
3274F599296k4777K2220N4697J04130O2860j23412J10132Q0391m3787K00362q6041
$$ 6599296 6574519 6596739 6651436 6755566 6818426 6695014 6805146 6885537 6841750 7042112 6956071
3263F956071J9131O1828J20177P683P8415j969J20465J31379J0107J82417N2846
$$ 6956071 6975202 7037030 7157207 7164890 7243305 7241336 7361801 7493180 7503287 7685704 7738550
3252G738550J18002k1557J08874J91670j3859J69652O3019O8488K28650Q8177
$$ 7738550 7856552 7834995 7943869 8135539 8121680 8291332 8354351 8422839 8651489 8739666
3242H739666P7610J38467J39711K33183P3827K77333J33539J87849K33057J97831
$$ 8739666 8817276 8955743 9095454 9328637 9402464 9679797 9813336 10001185 10234242 10432073
3232A0432073J53709K97163N8791J99154J49985J01079J23591K19339J90993R1099
$$ 10432073 10585782 10882945 10941736 11140890 11290875 11391954 11515545 11734884 11925877 12016976
3222A2016976L48176J25482K74763K95709J77073K35366K84520K13397K82881
$$ 12016976 12365152 12490634 12765397 13061106 13238179 13473545 13758065 13971462 14254343
3213A4254343K60954M31343M45432K76440M33352M19292O73556M92723O62876
$$ 14254343 14515297 14946640 15392072 15668512 16101864 16521156 17194712 17687435 18350311
3204A8350311O57504O38951N61484O90239N82495N72090M75687J60929K71118
$$ 18350311 19007815 19646766 20208250 20898489 21480984 22053074 22528761 22689690 22960808
3195B2960808Q3380L805K16920L7927K35386J29758L30465K88420M36132L17498
$$ 22960808 23044188 23047993 23264913 23302840 23538226 23667984 23998449 24286869 24723001 25040499
3185B5040499M05385M07848N43405O74748P89844P01839Q39018R30674J168082
$$ 25040499 25445884 25853732 26397137 27071885 27861729 28563568 29402586 30333260 31501342
3176C1501342J239027J317811J369002J590332J615328J640845J588084J605217
$$ 31501342 32740369 34058180 35427182 37017514 38632842 40273687 41861771 43466988
3168D3466988J485217J381082J401189J500301J331793J371494J364747J691033
$$ 43466988 44952205 46333287 47734476 49234777 50566570 51938064 53302811 54993844
3160E4993844J398762J257969P55994M07747K21040J56571L04815P16944R34905
$$ 54993844 56392606 57650575 58406569 58814316 59035356 59191927 59496742 60213686 61148591
3151F1148591J188828J122545J098790N32703K03134R0100K35664M01390J021858
$$ 61148591 62337419 63459964 64558754 65091457 65294591 65384691 65620355 66021745 67043603
3142F7043603J540336J886227K162624K522715K945154L298223L497475L744220
$$ 67043603 68583939 70470166 72632790 75155505 78100659 81398882 84896357 88640577
3134H8640577L806519M137067M101053L957005L895811L473612K577822J415555
$$ 88640577 92447096 96584163 100685216 104642221 108538032 112011644 114589466 116005021
3126A16005021K26987l97392l80635j23989L15932L24512Q1133l61631p09985
$$ 116005021 116232008 115834616 115453981 115329992 115645924 115970436 116051569 115689938 114979953
3117A14979953k019078l246533m149506l916593k873214j703630m47991L90713
$$ 114979953 112960875 109714342 105564836 101648243 98775029 97071399 96623408 97014121
3109I7014121J240117J825941K330608K867513L471072M052347M358686M695126
$$ 97014121 98254238 100080179 102410787 105278300 108749372 112801719 117160405 121855531
3101A21855531M960649M865136M102025K666737R25663m01831j284639j633973
$$ 121855531 126816180 131681316 135783341 138450078 139375741 138973910 137689271 136055298
3093A36055298j429705j230104j017433r12139j085027k541572m536278n980679
$$ 136055298 134625593 133395489 132378056 131465917 130380890 127839318 123303040 117322361
3085A17322361o706997o600804n970275m675102l668603k572640j910667j025104
$$ 117322361 110615364 104014560 98044285 93369183 89700580 87127940 85217273 84192169
3077H4192169m95639K37777J005341J539728K363998K663363K710704K081566
$$ 84192169 83696530 83934307 84939648 86479376 88843374 91506737 94217441 96299007
3069I6299007J246569J30244q37997j792893j754318j663440j066038p44800m07217
$$ 96299007 97545576 97675820 96837823 95044930 93290612 91627172 90561134 89816334 89409117
3060H9409117q84709j753118l044659l983967m981298m994085m771055m264764
$$ 89409117 88524408 86771290 83726631 79742664 74761366 69767281 64996226 60731462
3052F0731462l572012k940947k351584k155111j690370j464829r56458q07239
$$ 60731462 57159450 54218503 51866919 49711808 48021438 46556609 45600151 44792912
3044D4792912m29575k78027j41975K2480j21413l00074o42046p86443r15572r78713
$$ 44792912 44363337 44085310 43943335 43965815 43844402 43544328 42902282 42115839 41200267 40221554
3034D0221554q35021o74884m88843m45503m78808o07639j153633j203181j554118
$$ 40221554 39386533 38711649 38222806 37777303 37298495 36690856 35537223 34334042 32779924
3025C2779924j709113j458697j202776j224002r63115q14962p08233o43538o03678
$$ 32779924 31070811 29612114 28409338 27185336 26222221 25407259 24699026 24055488 23451810
3016B3451810n66422m31246m78736l42422l79843k92832k87026j51005k85899
$$ 23451810 22885388 22454142 21975406 21632984 21253141 20960309 20673283 20522278 20236379
3007B0236379k01942k08053p8584j47532j36225p5257j16347j9030k3756o3574
$$ 20236379 20034437 19826384 19747800 19600268 19464043 19388786 19272439 19253409 19229653 19166079
2997A9166079r451P7001J125K8249N2489k3480L7242N8811J41410K3715J26280
$$ 19166079 19156628 19233629 19234754 19263003 19315492 19292012 19329254 19388065 19529475 19553190 19679470
2986A9679470J24801J85392J02518J83682J02451K78736L10214J05920J65517
$$ 19679470 19804271 19989663 20092181 20275863 20378314 20657050 20967264 21073184 21238701
2977B1238701K88521K56225J64391K91546L66477L84320L35363K86833L76785
$$ 21238701 21527222 21783447 21947838 22239384 22605861 22990181 23325544 23612377 23989162
2968B3989162L74355M65556L82422N76820N35428M80739O23337N49744N48210
$$ 23989162 24363517 24829073 25211495 25788315 26323743 26804482 27427819 27977563 28525773
2959B8525773O08028O26813O82820P39617Q00401P36966O08442Q77464N53858
$$ 28525773 29133801 29760614 30443434 31183051 31983452 32720418 33328860 34206324 34760182
2950C4760182P79135P56754P38389P90276O98022J003954R96715R50916J180477
$$ 34760182 35539317 36296071 37034460 37824736 38522758 39526712 40523427 41474343 42654820
2941D2654820Q45414R91185J006160Q46651R68915P94810J175138J304119J410669
$$ 42654820 43500234 44491419 45497579 46344230 47313145 48107955 49283093 50587212 51997881
2932E1997881J464501J573848J657629J735480J727094J718627J711093J760465
$$ 51997881 53462382 55036230 56693859 58429339 60156433 61875060 63586153 65346618
2924F5346618J678695J768737J681627J748406J844193J728033K009928J969834
$$ 65346618 67025313 68794050 70475677 72224083 74068276 75796309 77806237 79776071
2916G9776071K266094K121869K108755K042855K001605J947200K081375K264862
$$ 79776071 82042165 84164034 86272789 88315644 90317249 92264449 94345824 96610686
2908I6610686K528269K589839K470030K055615J775469J768956J869087K003307
$$ 96610686 99138955 101728794 104198824 106254439 108029908 109798864 111667951 113671258
2900A13671258K189477K403675K519511K886177L023112K965359L101081L001041
$$ 113671258 115860735 118264410 120783921 123670098 126693210 129658569 132759650 135760691
2892A35760691L027285L113744L160776L444753L594560M186479M485527M901749
$$ 135760691 138787976 141901720 145062496 148507249 152101809 156288288 160773815 165675564
2884A65675564N316343N430101N563513N412916N205848M692589M375668M663084
$$ 165675564 170991907 176422008 181985521 187398437 192604285 197296874 201672542 206335626
2876B06335626N092619N807157O449476P100413P276341P441523O975384O262330
$$ 206335626 211428245 217235402 223684878 230785291 238061632 245503155 252478539 258740869
2868B58740869M805267L442578K573633L129799M402762N575683O843433P920593
$$ 258740869 263546136 266988714 269562347 272692146 277094908 282670591 289514024 297434617
2860B97434617Q516347Q347126O659563L881355J455486K14437m21535n21690
$$ 297434617 305950964 314298090 320957653 324839008 326294494 326508931 326087396 325565706
2852C25565706j002325j062172j119476p81532p80769q49449j374786k206318
$$ 325565706 324563381 323501209 322381733 321600201 320819432 319969983 318595197 316388879
2844C16388879l306707m659780o591116q680126r963870r922404q973151p715336
$$ 316388879 313082172 308422392 301831276 293151150 283187280 273264876 264291725 256576389
2836B56576389o516727n608629m613669m239434m688980o345780q212275r174407
$$ 256576389 250059662 244451033 239837364 235597930 230908950 224563170 216350895 207176488
2828B07176488q877093q169928p635898p206362o908488o512798o147869n941450
$$ 207176488 198299395 190129467 182493569 175287207 168378719 161865921 155718052 149776602
2820A49776602n951023n900708o128549o103606o178800n929897n584053n267512
$$ 149776602 143825579 137924871 131796322 125692716 119513916 113584019 107999966 102732454
2812A02732454m821165m308518l975919l770750l521595l285002l002879k870899
$$ 102732454 97911289 93602771 89626852 85856102 82334507 79049505 76046626 73175727
2804G3175727k558286k430696k256237k135712j815980j787468j732170j690729
$$ 73175727 70617441 68186745 65930508 63794796 61978816 60191348 58459178 56768449
2796E6768449j769619j692785j895841j761432j691347j594755j392616j324752
$$ 56768449 54998830 53306045 51410204 49648772 47957425 46362670 44970054 43645302
2788D3645302j276760j245065j382700j416654j231930j343466j199954j080485
$$ 43645302 42368542 41123477 39740777 38324123 37092193 35748727 34548773 33468288
2780C3468288r19670r58438r03852r44052q01122r04708p41789p81743q27340
$$ 33468288 32548618 31590180 30686328 29742276 28941154 28036446 27294657 26512914 25685574
2771B5685574o00714o94656n95855o25382m51714n18131n22264m79568m69757
$$ 25685574 25084860 24390204 23794349 23168967 22717253 22199122 21676858 21197290 20727533
2762B0727533m64123m80590k83770n12898l62468l34866l16641m33422l21857
$$ 20727533 20263410 19782820 19499050 18986152 18623684 18288818 17972177 17538755 17216898
2753A7216898l20003k38955l56054k35655m62544j34173l36684j97549l73121
$$ 17216898 16896895 16657940 16301886 16066231 15603687 15469514 15132830 14935281 14562160
2744A4562160j71546k41447j96808k99607j64830l12127j21378k88577j56113
$$ 14562160 14390614 14149167 13952359 13652752 13487922 13175795 13054417 12765840 12609727
2735A2609727k07089k28180j80144k47715j82600k10478k17066j22410m5747l23682
$$ 12609727 12402638 12174458 11994314 11746599 11563999 11353521 11136455 11014045 10968298 10644616
2725A0644616j55528j51239j69581j87643j19242j25286o7117j68746j26488j58387
$$ 10644616 10489088 10337849 10168268 9980625 9861383 9736097 9668980 9500234 9373746 9215359
2715I215359j86937l3146j52433k12294K3766k42637L6382k31617P2777j84738
$$ 9215359 9028422 8995276 8842843 8630549 8654315 8411678 8448060 8216443 8289220 8104482
2705H104482j11997o2034j22806n175j18309j64981M3931j44132j8630r7709m2899
$$ 8104482 7992485 7930451 7807645 7802470 7684161 7519180 7563111 7418979 7400349 7302640 7259741
2694G259741m8078j12992N9970j70377J6822r6771k2590n0549r3640m1924j11231
$$ 7259741 7211663 7098671 7158641 6988264 7005086 6908315 6885725 6835176 6741536 6699612 6588381
2683F588381k173K647m7785q363p6511j49488M0131q5282J12932r5126O505Q5458
$$ 6588381 6586208 6588855 6541070 6532707 6456196 6306708 6346839 6261557 6374489 6279363 6285868 6371326
2671F371326j11420q755Q8145j62609J8004O7281O6427J2690r1815L6770J55883
$$ 6371326 6259906 6251151 6339296 6176687 6194691 6261972 6328399 6341089 6249274 6286044 6441927
2660F441927k5963q1912J14909j35532J00028O4861R8170j4619J7046P0308p4356
$$ 6441927 6415964 6334052 6448961 6313429 6413457 6478318 6576488 6561869 6578915 6649223 6574867
2649F574867J76472j33976J39798j22753J04553j5413M5184N1128k6098L8466
$$ 6574867 6751339 6617363 6757161 6634408 6738961 6723548 6768732 6819860 6793762 6832228
2639F832228p221m8268N3307j12262Q3157J02719P3218j24379J51278J06934k3686
$$ 6832228 6825007 6776739 6830046 6717784 6800941 6903660 6976878 6852499 7003777 7110711 7087025
2628G087025K711K50322O0604R2855J28065J48328n0745L0824p2604p2438k188
$$ 7087025 7089736 7340058 7400662 7493517 7621582 7769910 7719165 7749989 7677385 7604947 7602759
2617G602759J63650P134J16896O6372q9448L7940J7264j44045j89301j8272K7537
$$ 7602759 7766409 7773543 7890439 7956811 7867363 7905303 7922567 7778522 7589221 7570949 7598486
2606G598486n0709k3342L9050L8746R337R7204o6364K6270J03567r5513J9176
$$ 7598486 7547777 7524435 7563485 7602231 7611568 7708772 7642408 7668678 7772245 7676732 7695908
2595G695908J00552o5945J02448m3900q4160Q706J21826O7944n6462O5668j10195
$$ 7695908 7796460 7730515 7832963 7789063 7704903 7713609 7835435 7903379 7846917 7912585 7802390
2584G802390n249j01070R2657l2178j28219R6008j37010n2344J20039m0815J2084
$$ 7802390 7797141 7696071 7788728 7756550 7628331 7724339 7587329 7534985 7655024 7614209 7626293
2573G626293K68k0567m442l9488j4961J98861j04773l5932m3136J33861k4312
$$ 7626293 7626561 7605994 7601552 7562064 7547103 7745964 7641191 7605259 7562123 7695984 7671672
2562G671672R2170M1520l0936p2506R7969Q310N1072J9630N8032l8935K1636J01128
$$ 7671672 7763842 7805362 7774426 7701920 7799889 7808199 7859271 7878901 7936933 7897998 7919634 8020762
2550H020762n4605J05812K1940r6134J65041P0210J09500j297K447J06869L7103
$$ 8020762 7966157 8071969 8093909 7997775 8162816 8233026 8342526 8341229 8343676 8450545 8487648
2539H487648J48392J5488J48742N0288Q1331K7318j7291J41357k4816J53959J90477
$$ 8487648 8636040 8651528 8800270 8850558 8931889 8959207 8941916 9083273 9058457 9212416 9402893
2528I402893K60075j26398J06725K05823M7271J40039P2772J64702Q1767J51203
$$ 9402893 9662968 9536570 9643295 9849118 9896389 10036428 10109200 10273902 10355669 10506872
2518A0506872J27091K28943M0486K85812J01128K55463Q3164K32278K14453J93668
$$ 10506872 10633963 10862906 10903392 11189204 11290332 11545795 11628959 11861237 12075690 12269358
2508A2269358K13349J86677K29245K17513K15324K94541K78157K43697K96915
$$ 12269358 12482707 12669384 12898629 13116142 13331466 13626007 13904164 14147861 14444776
2499A4444776M67991L08629L53222L63320K46959K90736M21111K22902M56848
$$ 14444776 14912767 15221396 15574618 15937938 16184897 16475633 16896744 17119646 17576494
2490A7576494M37463L22381N23482L41994N48415N21694N62733O48518N92748
$$ 17576494 18013957 18336338 18859820 19201814 19750229 20271923 20834656 21483174 22075922
2481B2075922Q46751Q84834R33503R88083J060142P48808L75383L98497J26807
$$ 22075922 22922673 23807507 24741010 25729093 26789235 27538043 27913426 28311923 28438730
2472B8438730K10143R2077K68249N28708K88109M19442N03687M02650N09725O64044
$$ 28438730 28648873 28740950 29009199 29537907 29826016 30245458 30749145 31151795 31661520 32325564
2462C2325564O84077P71524P22663R60627R99127R63989J311011J367177J731993
$$ 32325564 33009641 33781165 34503828 35464455 36463582 37427571 38738582 40105759 41837752
2453D1837752J742822K259123K526065K473704K205461J805527J592857J043523
$$ 41837752 43580574 45839697 48365762 50839466 53044927 54850454 56443311 57486834
2445E7486834J025460J003667J025240Q77335K30042m02743q37630o43711m89956
$$ 57486834 58512294 59515961 60541201 61418536 61648578 61245835 60408205 59764494 59274538
2436E9274538l11619p8011Q2562K53137M12460O65722P77288J137879J327555
$$ 59274538 58962919 58884908 58967470 59220607 59633067 60298789 61076077 62213956 63541511
2427F3541511J554834J887131K503334K639586L234643L173987L287385L456082
$$ 63541511 65096345 66983476 69486810 72126396 75361039 78535026 81822411 85278493
2419H5278493L582960L697245M238739M672804M690399M472251L155092K763184
$$ 85278493 88861453 92558698 96797437 101470241 106160640 110632891 113787983 116551167
2411A16551167L177157M335743N837945P276022Q159706Q619193P550441N491177
$$ 116551167 119728324 124064067 129902012 137178034 145337740 153956933 161507374 166998551
2403A66998551J927362m37808j259383n75004N97429K032250K975224L459394
$$ 166998551 168925913 168488105 167228722 166653718 167251147 169283397 172258621 175718015
2395A75718015L261757J563466k447768n748947o477020m906929k782749p68688
$$ 175718015 178979772 180543238 178095470 172346523 165869503 160962574 158179825 157411137
2387A57411137P31980J793809K303752L681454N492638P773407J0335363J2863731
$$ 157411137 158143117 159936926 162240678 165922132 171414770 179188177 189523540 202387271
2379B02387271J4277476J4208804J1658309O394365m11331m697659n644523l980972
$$ 202387271 216664747 230873551 242531860 248926225 248514894 243817235 238172712 234191740
2371B34191740j707268N83100J968778K651649J536159l081253j1464476j7413847
$$ 234191740 232484472 233067572 235036350 237687999 239224158 236142905 224678429 207264582
2363B07264582j8074491j5596570j2133214r311767o893657n460080l499449k174468
$$ 207264582 189190091 173593521 161460307 152148540 145254883 139794803 136295354 134120886
2355A34120886o09877O52377K396813L466226M535791M149058L098547K90053
$$ 134120886 133511009 134163386 136560199 140026425 144562216 148711274 151809821 152099874
2347A52099874k635338m385876m307805l529249k132525j208323l95664l33724
$$ 152099874 149464536 145078660 140770855 137241606 135109081 133900758 133505094 133171370
2339A33171370j050686l622294p626722j0116764j0173877q895283p303226o196400
$$ 133171370 132120684 128498390 120871668 110754904 100581027 91685744 84382518 78186118
2331G8186118n146888m706687m154551l720619l362411l151812k783247k571437
$$ 78186118 73039230 68332543 64177992 60457373 57094962 53943150 51159903 48588466
2323D8588466k284709k102207k062379j725935j819056j502209j466918j381926
$$ 48588466 46303757 44201550 42139171 40413236 38594180 37091971 35625053 34243127
2315C4243127j117707j121002j039594j026367r34488p33731p62380p72338p45164
$$ 34243127 33125420 32004418 30964824 29938457 29003969 28270238 27507858 26735520 25990356
2306B5990356p46379o50149o67893p75906o19512o07687o11403o44217n60787
$$ 25990356 25243977 24593828 23925935 23150029 22530517 21922830 21311427 20667210 20106423
2297B0106423n24028n22729m55629m93719l23738n24427l39202k68295m37780
$$ 20106423 19582395 19059666 18604037 18110318 17786580 17262153 16922951 16654656 16216876
2288A6216876l13536l96532k78918k77885l08553l02139m19525j01566k81558
$$ 16216876 15903340 15506808 15227890 14950005 14641452 14339313 13919788 13818222 13536664
2279A3536664k37730k39481l68134k20553j92904j51039k75006l10103j16030
$$ 13536664 13298934 13059453 12691319 12470766 12277862 12126823 11851817 11541714 11425684
2270A1425684j45805j66033l31575k28327j59026k46028j11268k10562j79323
$$ 11425684 11279879 11113846 10782271 10553944 10394918 10148890 10037622 9827060 9647737
2261I647737k26966j00954k06618j80672j57157j94145q5455k43188j28673k48233
$$ 9647737 9420771 9319817 9113199 8932527 8775370 8581225 8495770 8252582 8123909 7875676
2251G875676q9591j92959l5778j60633j80911j53351j17094j85068j00121j60458
$$ 7875676 7786085 7593126 7557348 7396715 7215804 7062453 6945359 6760291 6660170 6499712
2241F499712j6730j06536j64470j09206j48885j24646k0175k66565J0471j87896
$$ 6499712 6482982 6376446 6211976 6102770 5953885 5829239 5809064 5542499 5552970 5365074
2231E365074n1138p7211j35668j80797j7366p6885j79097p3720j38451m7298j38944
$$ 5365074 5313936 5236725 5101057 4920260 4902894 4826009 4646912 4573192 4434741 4387443 4248499
2220D248499r6584n5962j85469J2122o4721n876l1236j29275p6702m1011p7885
$$ 4248499 4151915 4095953 3910484 3922606 3857885 3852009 3820773 3691498 3614796 3573785 3495900
2209C495900l9490l8179n5908j54097O2543j08802k2692K8865k06188K3197l1977
$$ 3495900 3456410 3418231 3362323 3208226 3270769 3161967 3139275 3168140 2961952 2985149 2953172
2198B953172O1539l2881j45670N1954j00370m2848k5555j33654P7819K0871j36321
$$ 2953172 3014711 2981830 2836160 2888114 2787744 2744896 2719341 2585687 2663506 2684377 2548056
2187B548056n3647M0523j07389l1303l1681o4892L939p7027O8984N159p1121J47100
$$ 2548056 2494409 2534932 2427543 2396240 2364559 2299667 2303606 2226579 2295563 2300722 2229601 2376701
2175B376701l7209k4763L9011o0539J53120p7591l0961O4975J2869J3247J3404
$$ 2376701 2339492 2314729 2353740 2293201 2446321 2368730 2337769 2402744 2415613 2428860 2442264
2164B442264J0183j9860M3926M0041m1095j8129k03R9937P1915J01374l4643j4215
$$ 2442264 2452447 2432587 2476513 2516554 2475459 2457330 2457127 2557064 2628979 2730353 2695710 2681495
2152B681495j20597L2733J18161j04966K4710J27598O2418m6282J36938n9331
$$ 2681495 2560898 2593631 2711792 2606826 2631536 2759134 2821552 2775270 2912208 2852877
2142B852877n627l8201r5005J14552N7541J184J664P3780M6759j5421J90610N2920
$$ 2852877 2847250 2809049 2714044 2828596 2886137 2887321 2888985 2962765 3009524 2994103 3184713 3237633
2130C237633J34402J60660J01455J25292P9232K9191K3610K2224p7806J44371
$$ 3237633 3372035 3532695 3634150 3759442 3838674 3867865 3891475 3913699 3835893 3980264
2120C980264K2196l490P9585o6002j9727J30998k64805m602q3944O9203j16918
$$ 3980264 4002460 3998970 4078555 4012553 3992826 4123824 3859019 3854417 3770473 3839676 3722758
2109C722758N5323K9276N2780K3743O1444J26916O1119N4391K45933o2654m5490
$$ 3722758 3778081 3807357 3860137 3883880 3945324 4072240 4133359 4187750 4433683 4371029 4325539
2098D325539n7067q7549J6471j31261m0549J6439N1668k5960k21986q1446j96726
$$ 4325539 4268472 4180923 4197394 4066133 4025584 4042023 4093691 4067731 3845745 3764299 3567573
2087C567573j94099j74430j44181j53323j2555r1807q7981k0509p0141p0456j26689
$$ 3567573 3373474 3199044 3054863 2901540 2888985 2797178 2709197 2688688 2618547 2548091 2421402
2076B421402P6059J1888p7318r7746j33089R0578k04698O06p4473o5778k3235
$$ 2421402 2497461 2509349 2432031 2334285 2201196 2291774 2087076 2087682 2013209 1947431 1924196
2065A924196j14051o8358j69974j20295l5335j38918p9769L1715j49993r1982
$$ 1924196 1810145 1741787 1571813 1451518 1416183 1277265 1197496 1229211 1079218 987236
2055I87236L3381j63405n6639p4735r3962n2613j2721j33419J9068j51267N684
$$ 987236 1020617 857212 800573 725838 631876 579263 566542 433123 452191 300924 306608
2044C06608L8106j49567p1983l2326o6441r799o5835M1243j15071n5918j09372
$$ 306608 344714 195147 123164 90838 24397 14598 -51237 -9994 -125065 -180983 -290355
2033b90355J00709n1351K7259r8226j15641R420K1140J8607O5903j83418q0265
$$ -290355 -189646 -240997 -213738 -311964 -427605 -418185 -397045 -378438 -312535 -495953 -576218
2022e76218l8697J33615j1326j28428L5118r2591O3829n6243o202J3426l8650
$$ -576218 -614915 -481300 -492626 -621054 -585936 -678527 -614698 -670941 -677143 -663717 -702367
2011g02367l8736n3436m415L7981j24702M1958K3524M006r2831Q2472j00950N2881
$$ -702367 -741103 -794539 -798954 -760973 -885675 -843717 -820193 -816187 -909018 -826546 -927496 -874615
1999h74615m7088l7754L4545o3972M7002R8981k9463j27236k1123K0253l2580
$$ -874615 -921703 -959457 -924912 -988884 -941882 -842901 -872364 -999600 -1020723 -1000470 -1033050
1988a033050l1480J14406j54622k0603L5729o4205O3890J0700o8580o8522O0254
$$ -1033050 -1064530 -950124 -1104746 -1125349 -1089620 -1153825 -1089935 -1079235 -1147815 -1216337 -1156083
1977a156083R0035l5181k8067K5800k9698m0159K632p5900K5749P1950r1653k4731
$$ -1156083 -1066048 -1101229 -1129296 -1103496 -1133194 -1173353 -1170721 -1246621 -1220872 -1148922 -1240575 -1265306
1965a265306O9770q4483P7068l0419J0018k6920L5861j5354N0334j15153M9797
$$ -1265306 -1195536 -1280019 -1202951 -1233370 -1223352 -1250272 -1214411 -1229765 -1179431 -1294584 -1244787
1954a244787j10075Q0340K485k0388N534J4249r6565O5171L3263m6848N9359p3362
$$ -1244787 -1354862 -1274522 -1272037 -1292425 -1286891 -1272642 -1369207 -1304036 -1270773 -1317621 -1258262 -1331624
1942a331624M8054j31697L2541Q790Q024K1948o7641J42393l3001p4705L6597
$$ -1331624 -1283570 -1415267 -1382726 -1373936 -1365912 -1343964 -1411605 -1269212 -1302213 -1376918 -1340321
1931a340321K1166l5291m3002j2608L1142o956l7267J7877N6146j4830k0720k743
$$ -1340321 -1319155 -1354446 -1397448 -1410056 -1378914 -1385870 -1423137 -1405260 -1349114 -1363944 -1384664 -1387407
1919a387407o5377M8691q058k0491l0249O8583q716o4646j4519Q9386o0845O4503
$$ -1387407 -1452784 -1404093 -1412151 -1432642 -1462891 -1394308 -1403024 -1467670 -1482189 -1392803 -1453648 -1389145
1907a389145j26183N7947r5605K10600j69393J9204N3710n0424j2332N7252p8628
$$ -1389145 -1515328 -1457381 -1552986 -1342386 -1511779 -1492575 -1438865 -1489289 -1501621 -1444369 -1522997
1896a522997N9128k1197l2627q589R0319k2531m5945L0845k0060P3381j24001
$$ -1522997 -1463869 -1485066 -1517693 -1526282 -1435963 -1458494 -1504439 -1473594 -1493654 -1420273 -1544274
1885a544274K1061L8791Q7261n1979j04904J74729n3773m8258k8751k6945J16999
$$ -1544274 -1523213 -1484422 -1397161 -1449140 -1554044 -1379315 -1433088 -1481346 -1510097 -1537042 -1420043
1874a420043j56228M1958m3714J27876j8358K2539q7036l5379M9349J6765K5216
$$ -1420043 -1576271 -1534313 -1578027 -1450151 -1468509 -1445970 -1533006 -1568385 -1519036 -1502271 -1477055
1863a477055O5613N309j41795q8230J56581M5980j68456R6055m1021Q9842l1821
$$ -1477055 -1411442 -1406133 -1547928 -1636158 -1479577 -1433597 -1602053 -1505998 -1547019 -1457177 -1488998
1852a488998j1782o7110J3860m4209P8935l3662J9116j32687k0162J03127o2221
$$ -1488998 -1500780 -1567890 -1554030 -1598239 -1519304 -1552966 -1533850 -1666537 -1686699 -1583572 -1645793
1841a645793O2668l8265N3768k804k6797L8304q1527N7193K3045p6210J34600
$$ -1645793 -1583125 -1621390 -1567622 -1570426 -1597223 -1558919 -1640446 -1583253 -1560208 -1636418 -1501818
1830a501818l3160P3866q0398P0154k4912p3685Q743Q4973j13470P3368j676j3094
$$ -1501818 -1534978 -1461112 -1541510 -1471356 -1496268 -1569953 -1561210 -1476237 -1589707 -1516339 -1518015 -1531109
1818a531109N4874j11463O475N5695n5035l3835J31760q749n2588K144r9644J27707
$$ -1531109 -1476235 -1587698 -1581223 -1525528 -1580563 -1614398 -1482638 -1491387 -1543975 -1541831 -1641475 -1513768
1806a513768N427l4818j0401O1857N1962p6966j03467Q4192n6728L3407Q0790
$$ -1513768 -1508341 -1543159 -1553560 -1491703 -1439741 -1516707 -1620174 -1535982 -1592710 -1559303 -1478513
1795a478513r4001o6771O3669L2102o3677J7071M2914R124o8555J15437j21734
$$ -1478513 -1572514 -1639285 -1575616 -1543514 -1607191 -1590120 -1547206 -1538082 -1606637 -1491200 -1612934
1784a612934Q1039p45m3380j216O092m4606J71399q2386k0130J3286j4229j9572
$$ -1612934 -1531895 -1532640 -1576020 -1577236 -1571144 -1615750 -1444351 -1526737 -1546867 -1533581 -1547810 -1567382
1772a567382j5014R5319o6623O403k3862R475p5817P512Q3574l8793l7168j9161
$$ -1567382 -1582396 -1487077 -1553700 -1547297 -1571159 -1561684 -1637501 -1629989 -1546415 -1585208 -1622376 -1641537
1760a641537O5272K9999j1582J6687l553J0238N841j31044P3548m0518Q7219j5539
$$ -1641537 -1576265 -1546266 -1557848 -1541161 -1544714 -1534476 -1528635 -1659679 -1586131 -1626649 -1539430 -1554969
1748a554969q1725n0665J22989o8441l636J3786M4716j05049O2672M9393O5476
$$ -1554969 -1636694 -1687359 -1564370 -1632811 -1636447 -1622661 -1577945 -1682994 -1620322 -1570929 -1505453
1737a505453j5384j12310M5567O4732j08771J01934j7286q4821Q8338p4448k764
$$ -1505453 -1520837 -1633147 -1587580 -1522848 -1631619 -1529685 -1546971 -1631792 -1543454 -1617902 -1620666
1726a620666l8324J03223L1126l8830p2249P5377L9495j13141J9357J16789j19060
$$ -1620666 -1658990 -1555767 -1524641 -1563471 -1635720 -1560343 -1520848 -1633989 -1614632 -1497843 -1616903
1715a616903Q4496r7274J03238j11935N5009m1146R7255j09901j4312R9488l9555
$$ -1616903 -1532407 -1629681 -1526443 -1638378 -1583369 -1624515 -1527260 -1637161 -1651473 -1551985 -1591540
1704a591540Q0469l3463o5379J2909K8608M9351j31462J26481j00369P7423p920
$$ -1591540 -1511071 -1544534 -1609913 -1597004 -1568396 -1519045 -1650507 -1524026 -1624395 -1546972 -1554892
1693a554892q1563R136J27578p4176r427Q4282p5800O0492o9688K7166j6916l0299
$$ -1554892 -1636455 -1627319 -1499741 -1573917 -1583344 -1499062 -1574862 -1514370 -1584058 -1556892 -1573808 -1604107
1681a604107N063o753L8322K436M1471m3833l450K5217p3009N3763o5355O8092
$$ -1604107 -1599044 -1605797 -1567475 -1565039 -1523568 -1567401 -1570851 -1545634 -1618643 -1564880 -1630235 -1562143
1669a562143n695k0043n7640J52788p0656M1637N3890j20069N3801m5742m6357
$$ -1562143 -1567838 -1587881 -1645521 -1492733 -1563389 -1521752 -1467862 -1587931 -1534130 -1579872 -1626229
1658a626229Q7197p7310J4960m882R6325o4207N5216M8529j10116O6837j14298
$$ -1626229 -1539032 -1616342 -1601382 -1606264 -1509939 -1574146 -1518930 -1470401 -1580517 -1513680 -1627978
1647a627978L8298N5546r057j0494l1424L7422j23752J13988m2995R1478j57328
$$ -1627978 -1589680 -1534134 -1543191 -1553685 -1585109 -1547687 -1671439 -1557451 -1600446 -1508968 -1666296
1636a666296J48578n0223N0921q0219K8956J3003L1625k5939K3809O764j080o6939
$$ -1666296 -1517718 -1567941 -1517020 -1597239 -1568283 -1555280 -1523655 -1549594 -1525785 -1519021 -1520101 -1587040
1624a587040Q6656j0248k6800M4089r4262l9594J05287J3037Q9845j29726l3830
$$ -1587040 -1500384 -1510632 -1537432 -1493343 -1587605 -1627199 -1521912 -1508875 -1419030 -1548756 -1582586
1613a582586O7680L1317j19645M6853m3001P9661j7076l0538m1596K1324n158
$$ -1582586 -1514906 -1483589 -1603234 -1556381 -1599382 -1519721 -1536797 -1567335 -1608931 -1587607 -1592765
1602a592765P486l9257J37725j8510m8469m6665L7610l6624K3268J16236j12609
$$ -1592765 -1585279 -1624536 -1486811 -1505321 -1553790 -1600455 -1562845 -1599469 -1576201 -1459965 -1572574
1591a572574j2515M3743P4596n3352n5342P0520k1858K1103n2859K7586P3449
$$ -1572574 -1585089 -1541346 -1466750 -1520102 -1575444 -1504924 -1526782 -1505679 -1558538 -1530952 -1457503
1580a457503j7238q8307L2252K7973j8593K9415m7807n152n9994M431j5749R0869
$$ -1457503 -1474741 -1563048 -1530796 -1502823 -1521416 -1492001 -1539808 -1544960 -1604954 -1600523 -1616272 -1525403
1568a525403m7493j2261J07324o4008K4395r7621R0100K4822j2186K3619k8725
$$ -1525403 -1572896 -1585157 -1477833 -1541841 -1517446 -1615067 -1524967 -1500145 -1512331 -1488712 -1517437
1557a517437Q2147l0333q8229P317k8968O4696o7533P1930R052J9808J0944l712
$$ -1517437 -1435290 -1465623 -1553852 -1546535 -1575503 -1510807 -1578340 -1506410 -1497358 -1477550 -1466606 -1470318
1545a470318J1183l6455o4619J67637l4446L8785r5013L4081o7240k3627L6916
$$ -1470318 -1459135 -1495590 -1560209 -1392572 -1427018 -1388233 -1483246 -1449165 -1516405 -1540032 -1503116
1534a503116K0757m320q5858J38090o2138Q5371m7875J5068j3035J61823k27876
$$ -1503116 -1482359 -1486679 -1572537 -1434447 -1496585 -1411214 -1459089 -1444021 -1457056 -1295233 -1523109
1523a523109J28199m0806m161R4582r9445j9364K8888M0841L3936P590p1861J11084
$$ -1523109 -1394910 -1435716 -1439877 -1345295 -1444740 -1464104 -1435216 -1394375 -1360439 -1352849 -1424710 -1313626
1511a313626K531n1451J9140K7206o2278K105L0593q7235N9509o1087O361K5284
$$ -1313626 -1311095 -1362546 -1343406 -1316200 -1378478 -1376373 -1345780 -1433015 -1373506 -1434593 -1428232 -1402948
1499a402948k6771J7935N13P4813n8370l5764J60634m0685j829m7596J52624K1098
$$ -1402948 -1429719 -1411784 -1411271 -1336458 -1394828 -1430592 -1269958 -1310643 -1312472 -1360068 -1207444 -1186346
1487a186346j03456l4570N1934j7J8725P1743J698J1623L4137P8562l9364J40814
$$ -1186346 -1289802 -1324372 -1272438 -1272455 -1253730 -1181987 -1180289 -1168666 -1134529 -1055967 -1095331 -954517
1475i54517P1056m8843M1127J22912J0410L765Q441L3360o9285n4312Q3666L4488
$$ -954517 -883461 -932304 -891177 -768265 -757855 -754090 -745649 -712289 -781574 -835886 -752220 -717732
1463g17732l326o2868L7296m886j58883o3273p2235r4119j20324P7583o7642O4079
$$ -717732 -721058 -783926 -746630 -751516 -910399 -973672 -1045907 -1140026 -1260350 -1182767 -1250409 -1186330
1451a186330j4628l0848K281k255j06116Q7543j58104J09125O2410j30663k2917
$$ -1186330 -1200958 -1231806 -1229525 -1231780 -1337896 -1250353 -1408457 -1299332 -1236922 -1367585 -1390502
1440a390502P2149j15351M9075j02o771m3750L4557m2063k3636O6682r9190R8372
$$ -1390502 -1318353 -1433704 -1384629 -1384731 -1391502 -1435252 -1400695 -1442758 -1466394 -1399712 -1498902 -1400530
1428a400530r7664Q5371j3434J5309j4196m6468N9940p2567K1912L0543p6075
$$ -1400530 -1498194 -1412823 -1426257 -1410948 -1425144 -1471612 -1411672 -1484239 -1462327 -1431784 -1507859
1417a507859j6874Q9805j29045J01966L3279l3303o9033M3358j0997P502j8792
$$ -1507859 -1524733 -1434928 -1563973 -1462007 -1428728 -1462031 -1531064 -1487706 -1498703 -1491201 -1509993
1406a509993M6479j06884O0456L6125K4828r2765R57J61002p0176l6902n6535
$$ -1509993 -1463514 -1570398 -1509942 -1473817 -1448989 -1541754 -1540797 -1379795 -1449971 -1486873 -1543408
1395a543408J09231l5135J19131l3304k7663p6131P7760j27271K9200Q4242J287
$$ -1543408 -1434177 -1469312 -1350181 -1383485 -1411148 -1487279 -1409519 -1536790 -1507590 -1423348 -1422061
1384a422061p2275L7215j5063q1838m189J55972p8676p1556Q6903N6765l8883
$$ -1422061 -1494336 -1457121 -1472184 -1554022 -1558211 -1402239 -1480915 -1552471 -1465568 -1408803 -1447686
1373a447686m9696K1736N1787o7363R927j4702o1472Q7907q7599P4836N5019o3867
$$ -1447686 -1497382 -1475646 -1423859 -1491222 -1481295 -1495997 -1557469 -1469562 -1557161 -1482325 -1427306 -1491173
1361a491173o1488N9094K0279M888K1024o5509K9346L6954j5741j06446R2402
$$ -1491173 -1552661 -1493567 -1473288 -1468400 -1447376 -1512885 -1483539 -1446585 -1462326 -1568772 -1476370
1350a476370L6706Q659l2579m6467R1959l2746k8665K316j9814L136k1636N2986
$$ -1476370 -1439664 -1431005 -1463584 -1510051 -1418092 -1450838 -1479503 -1477187 -1497001 -1493865 -1515501 -1462515
1338a462515L2320p0338J23772j3033m9951k7736j7280l8184N2465N4296k8547
$$ -1462515 -1430195 -1500533 -1376761 -1389794 -1439745 -1467481 -1484761 -1522945 -1470480 -1416184 -1444731
1327a444731n0038j4621p594j451Q3180J1249j76937J98206j29085P4937j2331
$$ -1444731 -1494769 -1509390 -1516984 -1518435 -1435255 -1424006 -1600943 -1402737 -1531822 -1456885 -1469216
1316a469216l1713M8550M0873o2671l6910J89670j82955M6520q7703O7664n2228
$$ -1469216 -1500929 -1452379 -1411506 -1474177 -1511087 -1321417 -1504372 -1457852 -1545555 -1477891 -1530119
1305a530119M4603N2671L6145j37841J01892j643q3447J61377j13414l6733J2289
$$ -1530119 -1485516 -1432845 -1396700 -1534541 -1432649 -1434292 -1517739 -1356362 -1469776 -1506509 -1494220
1294a494220L9367M1940J5877o9518K4373o7597O0147o6067o2578J44662M1311
$$ -1494220 -1454853 -1412913 -1397036 -1466554 -1442181 -1509778 -1449631 -1515698 -1578276 -1433614 -1392303
1283a392303k2884j9188L064j169m1177l0098K376k2596m3540J30977j06884L9402
$$ -1392303 -1415187 -1434375 -1431311 -1432480 -1473657 -1503755 -1501379 -1523975 -1567515 -1436538 -1543422 -1504020
1271a504020j0373P4253l8917j6855J21060n7559J8161j3236N302o2196L279N1085
$$ -1504020 -1514393 -1440140 -1479057 -1495912 -1374852 -1432411 -1414250 -1427486 -1422184 -1484380 -1481101 -1430016
1259a430016l8711p77Q5032p6232j4630j7553N8472k5997K0487p2694J66050j54027
$$ -1430016 -1468727 -1469504 -1384472 -1460704 -1475334 -1492887 -1434415 -1460412 -1439925 -1512619 -1346569 -1500596
1247a500596O0356J027n3390N0798o0597Q4519m0299n0093O3186J4123m0047Q529
$$ -1500596 -1440240 -1439213 -1492603 -1441805 -1502402 -1417883 -1458182 -1508275 -1445089 -1430966 -1471013 -1462484
1235a462484p9630K7777m7400R7401M3569p3564k0856J23543r5179M7402m2706
$$ -1462484 -1542114 -1514337 -1561737 -1464336 -1420767 -1494331 -1515187 -1391644 -1486823 -1439421 -1482127
1224a482127K7715M7573Q235j04803Q3360j39636J34650m4395K7524J9718l2218
$$ -1482127 -1454412 -1406839 -1398604 -1503407 -1420047 -1559683 -1425033 -1469428 -1441904 -1422186 -1454404
1213a454404P9976l5559p2301P6063O487J8746r8348O2338P4428j76902M3941
$$ -1454404 -1374428 -1409987 -1482288 -1406225 -1399738 -1380992 -1479340 -1417002 -1342574 -1519476 -1475535
1202a475535K9684N0479k6139q4469J07517M3083j4598o0072n5366N9934M4529
$$ -1475535 -1445851 -1395372 -1421511 -1505980 -1398463 -1355380 -1369978 -1430050 -1485416 -1425482 -1380953
1191a380953j63422O2411J16207q8066L9211J9846l0223J6406j3017n5804N9049
$$ -1380953 -1544375 -1481964 -1365757 -1453823 -1414612 -1394766 -1424989 -1408583 -1421600 -1477404 -1418355
1180a418355J8178m5395R461j1973q1196J42156j7942L6861k7348k9982o3316
$$ -1418355 -1400177 -1445572 -1436111 -1448084 -1529280 -1387124 -1405066 -1368205 -1395553 -1425535 -1488851
1169a488851K647L7162J0723M0894K6176n9264j21571J28467L7898K520r4662
$$ -1488851 -1486204 -1449042 -1438319 -1397425 -1371249 -1430513 -1552084 -1423617 -1385719 -1383199 -1477861
1158a477861K2926k8884M7900k037Q047L2706q8438R1327q218r4037O0556q989
$$ -1477861 -1454935 -1483819 -1435919 -1437956 -1429909 -1397203 -1485641 -1394314 -1402532 -1496569 -1436013 -1445002
1146a445002k1856J16509j17602J1337N6031m2358K9284K6570k4517l1634Q6652
$$ -1445002 -1466858 -1350349 -1467951 -1456614 -1400583 -1442941 -1413657 -1387087 -1411604 -1443238 -1356586
1135a356586k7671o1001q9992N496P7058p8887P9045L4736p2662Q0828k2801k1610
$$ -1356586 -1384257 -1445258 -1535250 -1529754 -1452696 -1531583 -1452538 -1417802 -1490464 -1409636 -1432437 -1454047
1123a454047L9789O772m1786R6955m8250O8938j33480J5398l1347m3748R2700
$$ -1454047 -1414258 -1407486 -1449272 -1352317 -1400567 -1331629 -1465109 -1449711 -1481058 -1524806 -1432106
1112a432106m8982k9862O7712r603K9320q1087K7604M3414j0358k6750j9208l0116
$$ -1432106 -1481088 -1510950 -1443238 -1452841 -1423521 -1504608 -1477004 -1433590 -1443948 -1470698 -1489906 -1520022
1100a520022J17538K603q2356M1082m4J12052q4311J5255k312L9808j04486N9977
$$ -1520022 -1402484 -1399881 -1482237 -1441155 -1441199 -1329147 -1413458 -1398203 -1400515 -1360707 -1465193 -1405216
1088a405216P7377o2271K8088o2454n3220M7895N5091j09234j229l4832Q0153
$$ -1405216 -1327839 -1390110 -1362022 -1424476 -1477696 -1429801 -1374710 -1483944 -1485173 -1520005 -1439852
1077a439852k4316l7049k1399J12569Q669M0058r8399N9841q6796J11288J7946
$$ -1439852 -1464168 -1501217 -1522616 -1410047 -1401378 -1361320 -1459719 -1399878 -1486674 -1375386 -1357440
1066a357440m5292o4459L4334l4505J27403j27448Q4960k4940m5496O7186p4823
$$ -1357440 -1402732 -1467191 -1432857 -1467362 -1339959 -1467407 -1382447 -1407387 -1452883 -1385697 -1460520
1055a460520N905J01973r5967L3667J07340j33464L6415P872o9540J6900O1716
$$ -1460520 -1454615 -1352642 -1448609 -1414942 -1307602 -1441066 -1404651 -1396779 -1466319 -1449419 -1387703
1044a387703m4792J0085J37482j40426M1230R7988R448j50100K6206J31315j16838
$$ -1387703 -1432495 -1422410 -1284928 -1425354 -1384124 -1286136 -1276688 -1426788 -1400582 -1269267 -1386105
1033a386105j6762o6729Q7075n0972L2840k5588l2228k7092L7930O0639n5892
$$ -1386105 -1402867 -1469596 -1382521 -1433493 -1400653 -1426241 -1458469 -1485561 -1447631 -1386992 -1442884
1022a442884l5375Q8903J8865j6732M2799J3141j17145O5582m3661k5695M2034
$$ -1442884 -1478259 -1389356 -1370491 -1387223 -1344424 -1331283 -1448428 -1382846 -1426507 -1452202 -1410168
1011a410168R1352j46261J17621j42108Q9131q3705J47244j38190k4256J13214
$$ -1410168 -1318816 -1465077 -1347456 -1489564 -1400433 -1484138 -1336894 -1475084 -1499340 -1386126
$$ [...]
##END NTUPLES=NMR SPECTRUM
##END=
