##TITLE=abcd
##JCAMPDX= 6.0         $$ Bruker NMR JCAMP-DX V2.0
##DATA TYPE= NMR SPECTRUM
##DATA CLASS= NTUPLES
##ORIGIN= UXNMR, Bruker Analytische Messtechnik GmbH
##OWNER= root
$$ XWIN-NMR		Version 3.5
$$ Tue Aug 26 13:12:11 2025 Russian Standard Time (UT+4h)  servis@DPX200
##.OBSERVE FREQUENCY= 200.131235884673
##.OBSERVE NUCLEUS= ^1H
##.ACQUISITION MODE= SIMULTANEOUS
##.ACQUISITION SCHEME= undefined
##.AVERAGES= 32
##.DIGITISER RES= 18
##SPECTROMETER/DATA SYSTEM= spect
##.PULSE SEQUENCE= zg
##.SOLVENT NAME= CDCl3
##.SHIFT REFERENCE= (INTERNAL, CDCl3, 0, 16.4885)
##AUDIT TRAIL= $$ (NUMBER, WHEN, WHO, WHERE, WHAT)
$$ ##TITLE= Audit trail, XWIN-NMR		Version 3.5
$$ ##JCAMPDX= 5.01
$$ ##ORIGIN= Bruker BioSpin GmbH
$$ ##OWNER= servis
$$ F:\spectra/data/av/nmr/H1/1/pdata/1/auditp.txt
$$ ##AUDIT TRAIL=  $$ (NUMBER, WHEN, WHO, WHERE, WHAT)
(   1,<2025-08-26 13:11:22.10 +0400>,<servis>,<DPX200>,
      <created by zg, POWCHK disabled, PULCHK disabled
       configuration hash MD5:
       00 E9 B6 7A A2 85 ED C7 34 08 36 98 17 FE 4E 26
       data hash MD5: 32K
       80 9E 4D A9 E1 C9 22 6D D5 E1 AB D1 7C 28 8C DE>)
(   2,<2025-08-26 13:11:41.00 +0400>,<servis>,<DPX200>,
      <Start of raw data processing
       efp BC_mod = 2 LB = 0.05 FT_mod = 6 PKNL = 1 PHC0 = -273.9419 PHC1 = 0.101552 SI = 16K 
       data hash MD5: 16K
       7C CF FF 1C 7F EA A2 A0 D2 22 C4 94 11 95 57 3E>)
$$ ##END=
$$ 
$$ hash MD5
$$ 1F 6B D2 AE 9D D9 74 B8 FE 2C 63 E5 D5 27 5B 52
##$RELAX= 
##$RELAX= 
##$RELAX= 
##$RELAX= 
##$RELAX= 
##$RELAX= 
##$RELAX= 
##$RELAX= 
$$ Bruker specific parameters
$$ --------------------------
##$DU= <F:\spectra>
##$EXPNO= 1
##$NAME= <H1>
##$PROCNO= 1
##$TYPE= <nmr>
##$USER= <av>
##$AMP= (0..31)
100 100 100 100 100 100 100 100 100 100 100 100 100 100 100 100 100 100 
100 100 100 100 100 100 100 100 100 100 100 100 100 100 
##$AQSEQ= 0
##$AQ_mod= 1
##$AUNM= <au_zg>
##$AUTOPOS= <>
##$BF1= 200.13
##$BF2= 200.13
##$BF3= 200.13
##$BF4= 200.13
##$BF5= 500.13
##$BF6= 500.13
##$BF7= 500.13
##$BF8= 500.13
##$BYTORDA= 1
##$CFDGTYP= 0
##$CFRGTYP= 5
##$CHEMSTR= <none>
##$CNST= (0..31)
1 1 145 1 1 1 1 1 1 1 1 1 1 1 1 1 1 1 1 1 1 1 1 1 1 1 1 1 1 1 1 1 
##$CPDPRG= <>
##$CPDPRG1= <>
##$CPDPRG2= <>
##$CPDPRG3= <>
##$CPDPRG4= <mlev>
##$CPDPRG5= <mlev>
##$CPDPRG6= <mlev>
##$CPDPRG7= <mlev>
##$CPDPRG8= <mlev>
##$CPDPRGB= <>
##$CPDPRGT= <>
##$D= (0..31)
0 2 0 0 0 0 0 0 0 0.06 0 0 0 0 0 0 0.0002 0 0 0 0 0 0 0 0 0 0 0 0 0 0 
0 
##$DATE= 1756199481
##$DBL= (0..7)
120 120 120 120 120 120 120 120 
##$DBP= (0..7)
150 150 150 150 150 150 150 150 
##$DBP07= 0
##$DBPNAM0= <>
##$DBPNAM1= <>
##$DBPNAM2= <>
##$DBPNAM3= <>
##$DBPNAM4= <>
##$DBPNAM5= <>
##$DBPNAM6= <>
##$DBPNAM7= <>
##$DBPOAL= (0..7)
0.5 0.5 0.5 0.5 0.5 0.5 0.5 0.5 
##$DBPOFFS= (0..7)
0 0 0 0 0 0 0 0 
##$DE= 6
##$DECBNUC= <off>
##$DECIM= 32
##$DECNUC= <off>
##$DECSTAT= 4
##$DIGMOD= 1
##$DIGTYP= 9
##$DL= (0..7)
0 120 120 120 120 120 120 120 
##$DP= (0..7)
150 150 150 150 150 150 150 150 
##$DP07= 0
##$DPNAME0= <>
$$ [...]
##$SUBNAM4= <"">
##$SUBNAM5= <"">
##$SUBNAM6= <"">
##$SUBNAM7= <"">
##$SUBNAM8= <"">
##$SUBNAM9= <"">
##$SW= 20.6817932712277
##$SWIBOX= (0..15)
0 0 3 0 0 0 0 0 0 0 0 0 0 0 0 0 
##$SW_h= 4139.07284768212
##$TD= 32768
##$TD0= 1
##$TE= 0
##$TE2= 300
##$TE3= 300
##$TEG= 300
##$TL= (0..7)
0 120 120 120 120 120 120 120 
##$TP= (0..7)
150 150 150 150 150 150 150 150 
##$TP07= 0
##$TPNAME0= <>
##$TPNAME1= <>
##$TPNAME2= <>
##$TPNAME3= <>
##$TPNAME4= <>
##$TPNAME5= <>
##$TPNAME6= <>
##$TPNAME7= <>
##$TPOAL= (0..7)
0.5 0.5 0.5 0.5 0.5 0.5 0.5 0.5 
##$TPOFFS= (0..7)
0 0 0 0 0 0 0 0 
##$TUNHIN= 0
##$TUNHOUT= 0
##$TUNXOUT= 0
##$USERA1= <user>
##$USERA2= <user>
##$USERA3= <user>
##$USERA4= <user>
##$USERA5= <user>
##$V9= 5
##$VALIST= <valist>
##$VCLIST= <CCCCCCCCCCCCCCC>
##$VD= 0
##$VDLIST= <DDDDDDDDDDDDDDD>
##$VPLIST= <PPPPPPPPPPPPPPP>
##$VTLIST= <TTTTTTTTTTTTTTT>
##$WBST= 1024
##$WBSW= 30
##$XGAIN= (0..3)
0 0 0 0 
##$XL= 0
##$YL= 0
##$YMAX_a= 2193786
##$YMIN_a= -2033189
##$ZGOPTNS= <>
##$ZL1= 120
##$ZL2= 120
##$ZL3= 120
##$ZL4= 120
##$ABSF1= 0
##$ABSF2= 0
##$ABSG= 0
##$ABSL= 0
##$ALPHA= 0
##$AQORDER= 0
##$ASSFAC= 0
##$ASSFACI= 0
##$ASSFACX= 0
##$ASSWID= 0
##$AUNMP= <proc_1d>
##$AZFE= 0.1
##$AZFW= 0.1
##$BCFW= 0
##$BC_mod= 2
##$BYTORDP= 0
##$COROFFS= 0
##$CY= 18.4799938201904
##$DATMOD= 1
##$DC= 0
##$DFILT= <>
##$DTYPP= 0
##$F1P= 9.9274215381318
##$F2P= -0.165520771350173
##$FCOR= 1
##$FTSIZE= 16384
##$FT_mod= 6
##$GAMMA= 0
##$GB= 0
##$INTBC= 1
##$INTSCL= 4.127829e-11
##$ISEN= 128
##$LB= 0.05
##$LEV0= 0
##$LPBIN= 0
##$MAXI= 10000
##$MC2= 0
##$MEAN= 0
##$ME_mod= 0
##$MI= 50
##$NCOEF= 0
##$NC_proc= -5
##$NLEV= 6
##$NOISF1= 3.799351
##$NOISF2= 2.8
##$NSP= 0
##$NTH_PI= 0
##$NZP= 0
##$OFFSET= 16.48848
##$PC= 4
##$PHC0= -273.9419
##$PHC1= 0.101552
##$PH_mod= 1
##$PKNL= yes
##$PPARMOD= 0
##$PSCAL= 4
##$PSIGN= 0
##$REVERSE= no
##$SF= 200.130005582386
##$SI= 16384
##$SIGF1= 3
##$SIGF2= 2
##$SINO= 400
##$SIOLD= 16384
##$SREGLST= <1H.CDCl3>
##$SSB= 0
##$STSI= 16384
##$STSR= 0
##$SW_p= 4139.07284768211
##$SYMM= 0
##$S_DEV= 0
##$TDeff= 32768
##$TDoff= 0
##$TI= <>
##$TILT= no
##$TM1= 0
##$TM2= 0
##$TOPLEV= 0
##$USERP1= <user>
##$USERP2= <user>
##$USERP3= <user>
##$USERP4= <user>
##$USERP5= <user>
##$WDW= 1
##$XDIM= 16384
##$YMAX_p= 356864908
##$YMIN_p= -2353199
$$ End of Bruker specific parameters
$$ ---------------------------------
##NTUPLES= NMR SPECTRUM
##VAR_NAME=  FREQUENCY,     SPECTRUM/REAL,   SPECTRUM/IMAG
##SYMBOL=    X,             R,               I
##VAR_TYPE=  INDEPENDENT,   DEPENDENT,       DEPENDENT
##VAR_FORM=  AFFN,          ASDF,            ASDF
##VAR_DIM=   16384,         16384,           16384
##UNITS=     HZ,            ARBITRARY UNITS, ARBITRARY UNITS
##FACTOR=    0.252644378177508, 1,           1
##FIRST=     3299.83951724647, 0,            0
##LAST=      -839.233330435636, 0,           0
##MIN=       -839.233330435636, -2353199,    0
##MAX=       3299.83951724647, 356864908,    0
$$ Real data points
##PAGE= N=1
##DATA TABLE= (X++(R..R)), XYDATA
$$ [...]
8756 -783675 -707669 -767599 -709020 -690891 -684976 -788057 -739530 -639193 -834932 -788632 -596252
8745 -596252 -722729 -686902 -723717 -701548 -777832 -706287 -739480 -727953 -681664 -669464 -736519
8734 -736519 -762890 -682455 -737582 -794328 -688011 -715743 -738527 -607736 -707575 -682970 -701314
8723 -701314 -724983 -707352 -692475 -666623 -625040 -656133 -774982 -815695 -668404 -691444 -745917
8712 -745917 -682356 -756772 -637089 -701745 -737342 -694606 -589785 -751746 -735015 -745761 -734165
8701 -734165 -688508 -852224 -698904 -697138 -668618 -694976 -647369 -707250 -693526 -653122 -687274
8690 -687274 -749205 -728029 -782002 -763804 -671437 -801287 -644906 -687597 -658091 -662363 -657126 -638010
8678 -638010 -673351 -755023 -659219 -631813 -796130 -710669 -641831 -715522 -706695 -690846 -754121 -764475
8666 -764475 -676847 -721443 -703598 -760284 -747605 -749316 -770232 -699225 -591833 -696331 -689578 -709043
8654 -709043 -692388 -737645 -636244 -704585 -683932 -708722 -771738 -638488 -824320 -768018 -705145
8643 -705145 -758674 -676136 -606180 -754336 -775146 -655783 -699328 -686120 -701993 -628816 -746173
8632 -746173 -763534 -656434 -735874 -670487 -738709 -631593 -721099 -677819 -758323 -664689 -709795
8621 -709795 -617413 -716831 -760771 -705521 -751225 -758894 -710939 -682084 -685532 -687447 -787167 -645199
8609 -645199 -712840 -685315 -693828 -728728 -764617 -709716 -643585 -797983 -700633 -717487 -776717 -754469
8597 -754469 -733107 -701500 -663433 -646080 -709697 -691609 -748752 -735145 -711869 -749479 -593624
8586 -593624 -689518 -690555 -684779 -662191 -694726 -685958 -666125 -751564 -654173 -656677 -686060 -745133
8574 -745133 -630130 -711741 -711947 -762369 -691734 -638721 -626823 -710474 -658786 -708334 -697544 -686527
8562 -686527 -663447 -740644 -760948 -733831 -657840 -609991 -732252 -685206 -714720 -668633 -642461
8551 -642461 -668328 -695942 -602267 -616115 -686355 -762935 -736579 -658492 -673297 -724339 -737040 -760215
8539 -760215 -692540 -715110 -691125 -688548 -882437 -360109 -861586 -784217 -701126 -711859 -727025
8528 -727025 -720975 -702242 -739331 -783505 -625838 -624421 -711033 -729159 -663312 -721657 -673602 -686462
8516 -686462 -678868 -540981 -707844 -593495 -710772 -599608 -735972 -784221 -711711 -711546 -650989
8505 -650989 -751527 -693531 -617951 -677919 -699187 -701552 -674406 -825335 -734636 -635379 -785173
8494 -785173 -666692 -759994 -679951 -713119 -727335 -640821 -681382 -653914 -635635 -625626 -691799
8483 -691799 -695405 -711704 -681239 -723879 -688829 -688206 -717511 -721316 -732519 -757831 -682295 -691522 -699642
8470 -699642 -703544 -744576 -750276 -699452 -635300 -658745 -677178 -724834 -633741 -686944 -697615 -714689
8458 -714689 -669759 -706256 -713849 -585881 -648827 -685999 -776245 -646999 -705386 -710117 -690130 -702480
8446 -702480 -724801 -620737 -713763 -670545 -705548 -839033 -653371 -691373 -512176 -668713 -662151
8435 -662151 -700222 -682190 -687237 -732201 -635319 -688933 -651598 -681096 -690553 -681011 -684231 -680564 -722296
8422 -722296 -632052 -687986 -674808 -608996 -622277 -546170 -589715 -721840 -636589 -637370 -711618 -726415
8410 -726415 -867924 -700069 -596033 -627267 -681848 -679835 -691709 -582201 -590400 -681548 -757299
8399 -757299 -630431 -696950 -567081 -723236 -617239 -672202 -655645 -650808 -566403 -546416 -714335
8388 -714335 -615729 -708452 -663618 -650011 -702576 -718624 -716141 -627352 -606949 -651996 -673444 -584550
8376 -584550 -743736 -697095 -703047 -712147 -668091 -744563 -687323 -680715 -617113 -595258 -720154 -669137
8364 -669137 -734444 -677823 -736201 -662549 -713665 -606798 -626212 -684009 -695795 -704032 -607630 -641553
8352 -641553 -623081 -637507 -684743 -737829 -658758 -700966 -665557 -737814 -611320 -687094 -699224
8341 -699224 -631583 -723669 -697707 -716001 -684972 -730852 -756152 -735218 -676859 -663845 -743415 -639521
8329 -639521 -626795 -597507 -609131 -705575 -581034 -572297 -700949 -615460 -684136 -592508 -569278
8318 -569278 -636094 -631513 -683468 -697055 -672770 -705133 -651266 -666020 -613090 -709830 -653717 -709720
8306 -709720 -679525 -715050 -578716 -703271 -637860 -632010 -649085 -652961 -594697 -628300 -689469 -622207
8294 -622207 -653438 -678265 -594358 -649873 -661091 -725005 -661965 -630098 -663339 -679825 -759803 -767602
8282 -767602 -626820 -681197 -668825 -734546 -722379 -758416 -724242 -690183 -682278 -724878 -645842 -654420
8270 -654420 -573103 -644791 -684152 -615977 -620238 -617932 -588512 -689069 -627110 -582082 -775476 -661456
8258 -661456 -609770 -757885 -576097 -626098 -633427 -560237 -615446 -770563 -679755 -673605 -623214
8247 -623214 -666705 -725541 -693697 -651077 -609779 -732434 -689820 -662894 -625982 -633328 -646545 -618479
8235 -618479 -791411 -687660 -657749 -647446 -689402 -734526 -686596 -671489 -633334 -643089 -563434
8224 -563434 -719019 -700614 -736653 -676489 -686099 -573003 -652096 -660343 -578844 -721637 -685992
8213 -685992 -666195 -585941 -612084 -726785 -629280 -598245 -729074 -663407 -691694 -675531 -703679
8202 -703679 -677393 -577840 -769779 -702765 -646965 -692062 -689966 -699856 -569190 -708612 -614287
8191 -614287 -393599 -493864 -593204 -577819 -557473 -591116 -656513 -588918 -675842 -605018 -625908
8180 -625908 -639719 -583819 -665150 -566552 -642797 -726012 -658876 -626240 -638558 -565222 -689109
8169 -689109 -622764 -658421 -620684 -520500 -639801 -564203 -640755 -671518 -617007 -673116 -673632 -625791
8157 -625791 -638106 -596947 -576381 -599863 -658033 -608261 -682957 -701814 -670343 -641261 -682045 -592175
8145 -592175 -571169 -583202 -602479 -566844 -655603 -688298 -607729 -711593 -653175 -551116 -600408
8134 -600408 -652279 -671917 -610908 -600125 -689122 -602296 -635416 -628400 -734874 -590972 -658266
8123 -658266 -555435 -680159 -595039 -700069 -657331 -630755 -586391 -633428 -603068 -711936 -650201
8112 -650201 -574372 -633595 -681398 -645671 -697031 -748092 -551494 -622052 -593192 -631046 -612455
8101 -612455 -530115 -680934 -632546 -696643 -586156 -583002 -668420 -692676 -731639 -633181 -628123 -620712
8089 -620712 -559723 -522680 -651493 -638586 -577560 -601496 -677764 -648783 -528475 -612567 -602910
8078 -602910 -586574 -698379 -608942 -579547 -695329 -678192 -684924 -643457 -683227 -588733 -648714
8067 -648714 -580787 -595473 -686491 -614790 -587167 -606515 -550132 -654279 -614254 -615644 -621953 -590555
8055 -590555 -576868 -682247 -617744 -728419 -607013 -596590 -609103 -572028 -601908 -552425 -557609
8044 -557609 -603726 -634115 -613398 -576720 -568218 -692419 -639179 -663867 -599870 -613507 -630735 -680399
8032 -680399 -663503 -667194 -684435 -613506 -536798 -668356 -560237 -656821 -546702 -643664 -646168
8021 -646168 -545559 -526214 -651887 -629890 -709242 -638597 -693878 -615274 -624957 -581796 -657707
8010 -657707 -588634 -645615 -625631 -645303 -711224 -656822 -657665 -581197 -616727 -612467 -685829 -603832
7998 -603832 -668337 -601396 -655629 -642692 -546323 -699379 -580517 -583130 -541476 -625951 -586783
7987 -586783 -594124 -618000 -613718 -588566 -591175 -570463 -667197 -568851 -640803 -572701 -567683 -663607
7975 -663607 -696183 -502977 -610851 -538115 -646913 -623629 -625503 -586061 -528809 -624138 -680804
7964 -680804 -657059 -531277 -514254 -561495 -600105 -726664 -644831 -619554 -577844 -585669 -563786
7953 -563786 -575244 -581787 -614269 -577181 -576402 -596235 -682475 -630889 -597148 -588274 -487120 -622944
7941 -622944 -608330 -524038 -606385 -581134 -604430 -566204 -595000 -570573 -586570 -593384 -480066 -612771
7929 -612771 -629895 -648785 -667427 -588051 -563064 -566422 -681452 -688420 -547254 -624278 -530495 -576556
7917 -576556 -603562 -608772 -622621 -576892 -506357 -580200 -554709 -684262 -592289 -573075 -570248 -592292
7905 -592292 -620522 -615515 -615681 -669018 -556909 -539217 -612908 -479892 -540880 -649708 -639242 -633083
7893 -633083 -614141 -558613 -672268 -567800 -581838 -628758 -574202 -584258 -613052 -632477 -614264
7882 -614264 -566925 -631301 -609935 -599053 -579341 -518861 -594701 -568748 -590647 -522151 -591629 -487659
7870 -487659 -598507 -612932 -577841 -665936 -563456 -655786 -570037 -700790 -579203 -623376 -641413
7859 -641413 -595604 -621722 -553325 -685967 -607484 -626118 -666006 -716940 -1255095 -2353199 -208537
7848 -208537 -427690 -514386 -456608 -539533 -587408 -559476 -610864 -615361 -580052 -548150 -697908
7837 -697908 -540780 -606127 -616496 -643121 -526179 -656466 -638559 -538236 -575307 -661592 -596322
7826 -596322 -613766 -512426 -508264 -527703 -537954 -598957 -635381 -626283 -538524 -498541 -581937 -592387
7814 -592387 -496456 -530233 -530663 -561098 -647642 -508961 -647584 -552633 -640310 -538024 -597723
7803 -597723 -651923 -539770 -553350 -566204 -535242 -522628 -582452 -608507 -564475 -548665 -527312
7792 -527312 -559827 -616133 -565323 -692603 -537977 -530623 -564757 -650666 -534313 -572712 -565046
7781 -565046 -616350 -563016 -592987 -638678 -500988 -491600 -592539 -627954 -548960 -545968 -559566 -534164
7769 -534164 -498209 -536179 -562505 -491043 -601834 -587407 -442589 -525758 -499190 -561349 -576275
7758 -576275 -467735 -570037 -627914 -621235 -653939 -607257 -562710 -566572 -575177 -629842 -603286 -497709
7746 -497709 -439905 -502597 -567922 -606578 -590047 -594193 -598338 -539830 -580082 -560784 -557227 -557696 -526846
7733 -526846 -641527 -590519 -627355 -562257 -460165 -566463 -537069 -527680 -558336 -604895 -613866
7722 -613866 -502757 -569068 -524556 -607278 -556222 -563367 -572936 -528667 -529004 -616663 -544828 -609397
7710 -609397 -476533 -630310 -511954 -537976 -535886 -535810 -570494 -498788 -555903 -505219 -519778 -531669
7698 -531669 -486138 -482066 -594763 -547239 -541722 -569029 -576911 -615847 -567510 -530542 -592030 -561284
7686 -561284 -529049 -526132 -486014 -535928 -546927 -523248 -479757 -554110 -502675 -549044 -675804 -588618
7674 -588618 -534986 -496162 -503677 -588631 -494546 -563763 -552219 -522311 -557107 -621542 -520330 -555490
7662 -555490 -611352 -588347 -521684 -562176 -572232 -549743 -542364 -531205 -461374 -565349 -529018 -535312
7650 -535312 -481446 -571325 -528745 -568872 -503830 -561125 -474163 -548191 -492007 -433688 -507122 -591721
7638 -591721 -604419 -543590 -481043 -611146 -548526 -543577 -510957 -521602 -509783 -502470 -589921 -523686
7626 -523686 -478214 -542835 -457375 -522557 -532240 -501034 -485858 -448694 -530181 -524339 -562617 -471547
7614 -471547 -547900 -523143 -560810 -392645 -573589 -449158 -494825 -570943 -518421 -482560 -520519
7603 -520519 -594612 -517824 -456414 -420222 -613607 -486701 -460208 -498838 -615620 -488721 -567991
7592 -567991 -511308 -468100 -526725 -488463 -505896 -523139 -543335 -492870 -439234 -523728 -583173 -516876
7580 -516876 -505004 -538624 -580232 -574933 -527329 -470642 -550329 -472897 -562629 -456726 -447060 -580151
7568 -580151 -551649 -517274 -512284 -562781 -622941 -542595 -575744 -472935 -429330 -572852 -467579
7557 -467579 -462777 -566712 -473499 -490328 -491544 -481910 -532911 -485507 -480024 -437213 -538413 -508336
7545 -508336 -481694 -490246 -533352 -496372 -486420 -556014 -507146 -481081 -445869 -445706 -509011 -496904
7533 -496904 -445465 -460007 -462827 -497696 -509910 -549125 -514848 -438249 -503600 -431359 -463928 -489042
7521 -489042 -496172 -486785 -511201 -559412 -526510 -518623 -488068 -415120 -545400 -441635 -537494 -479902
7509 -479902 -509695 -386199 -520818 -463130 -504839 -552751 -440017 -529205 -413239 -464523 -594669
7498 -594669 -499833 -562041 -394393 -471775 -403121 -438009 -515009 -459343 -509630 -524836 -430134
7487 -430134 -394195 -459392 -396248 -468425 -475905 -503319 -536642 -354206 -437578 -461482 -514177 -484893
7475 -484893 -480607 -457013 -424265 -493513 -465820 -428057 -451259 -407504 -479164 -480624 -495107 -387714
7463 -387714 -368295 -516953 -417684 -506035 -486887 -405084 -311938 -508629 -525379 -430027 -509020
7452 -509020 -523593 -419110 -358894 -431116 -447254 -467829 -474870 -331849 -443484 -384664 -491898
7441 -491898 -466117 -560295 -466585 -531220 -382845 -466528 -404063 -467203 -471708 -441676 -407629 -460807
7429 -460807 -375973 -479414 -494666 -391826 -481963 -422689 -317928 -449474 -412837 -431915 -517617
7418 -517617 -443866 -432748 -490812 -391848 -417475 -477182 -422351 -460561 -392378 -474920 -495939 -419525
7406 -419525 -443705 -348247 -463753 -372740 -466867 -427441 -468829 -459463 -436936 -452956 -412977 -496804
7394 -496804 -350249 -414789 -404450 -332713 -362610 -315275 -486508 -392035 -364969 -400840 -370043
7383 -370043 -442100 -447503 -429974 -336058 -414063 -366572 -403760 -411546 -342814 -416769 -362836 -407066
7371 -407066 -440685 -328419 -435083 -326704 -370929 -350873 -365354 -335438 -415092 -415801 -448691
7360 -448691 -424416 -430841 -342646 -384230 -422302 -377627 -386224 -380761 -340705 -361256 -500924 -339245
7348 -339245 -324404 -434147 -437739 -469003 -388324 -356390 -315883 -376905 -418177 -345088 -363702 -319057
7336 -319057 -347592 -274140 -396087 -429125 -332036 -386442 -409403 -296464 -201333 -399415 -474617
7325 -474617 -278684 -368872 -296902 -311112 -194946 -359635 -287555 -371326 -318066 -381018 -386763
7314 -386763 -320446 -308459 -428477 -338728 -222636 -303603 -367609 -414187 -277211 -266475 -277304
7303 -277304 -252197 -177468 -271030 -272855 -257939 -204377 -368704 -201545 -321581 -192406 -262404
7292 -262404 -130383 -188614 -210808 -175016 -101433 -218903 -161981 -63448 -17713 -40556 -96779
7281 -96779 -102530 -35908 -109191 -168059 -171017 -139654 -64670 -32956 -24845 14905 -85112 -93014
7269 -93014 -54346 -113624 -87965 16267 -75048 -96079 52683 -46289 -21364 21 28112
7258 28112 23702 91900 115461 129602 101019 197153 332684 350065 376839 473940 384923 276449
7246 276449 313166 278337 188504 234357 174226 124870 89356 97855 132117 96477 140485 109638
7234 109638 42459 134209 111869 220648 132575 200566 189678 241055 215813 305949 266718
7223 266718 324568 401908 343315 435688 562894 652100 767846 942503 1025531 1357431 1836888
7212 1836888 2149696 2490510 2413101 2500391 2554844 2132295 1969845 1873159 1983949 1849746
7202 1849746 2185523 2518013 2869041 2285415 1792243 1492794 1175840 1053959 742492 761607
7192 761607 695438 525819 531889 385127 318458 395728 314444 204367 149898 103093 185155
7181 185155 65091 80379 20391 -40708 -37635 -11127 5532 -115698 -8380 -23977 -51498
7170 -51498 -4058 -144834 -71733 -84452 -93899 -123509 -254390 -181641 -138165 -150195 -311047
7159 -311047 -225569 -195542 -262349 -243948 -222521 -269905 -283411 -310482 -160278 -256801 -256857 -280490
7147 -280490 -266516 -194822 -341018 -215803 -180269 -371839 -289516 -294512 -237112 -223646 -325083
7136 -325083 -412099 -388757 -293030 -289398 -308391 -291130 -306056 -340966 -315508 -319313 -313572 -247456
7124 -247456 -306598 -351175 -335092 -299463 -285540 -354904 -342505 -258686 -267540 -373315 -319204 -255569
7112 -255569 -337719 -251145 -399622 -325390 -241047 -309515 -340756 -256037 -360962 -359720 -356338 -361144
7100 -361144 -397518 -369320 -414488 -296457 -324595 -320289 -303901 -391411 -344520 -348610 -369782 -274900
7088 -274900 -381460 -366551 -370864 -428127 -458560 -312514 -415616 -432637 -350499 -335169 -342642
7077 -342642 -338366 -317461 -399534 -457737 -436784 -321339 -423836 -340024 -261398 -492393 -444802
7066 -444802 -429857 -398709 -353583 -387668 -345093 -444348 -392669 -411228 -349847 -396317 -457879 -339790
7054 -339790 -331544 -281416 -460928 -378944 -406546 -310361 -381823 -325778 -366386 -366402 -324346 -441540
7042 -441540 -388287 -383765 -424831 -367129 -388732 -291147 -325614 -297284 -400837 -438501 -405702 -371676
7030 -371676 -307592 -381867 -400431 -431977 -304912 -398093 -327637 -281460 -299163 -410157 -404436
7019 -404436 -436394 -452405 -353245 -435676 -361874 -401960 -422136 -398727 -398363 -429514 -348147 -358991
7007 -358991 -365484 -380168 -315963 -447466 -400638 -379912 -352916 -483603 -346130 -416116 -423794
6996 -423794 -420514 -408469 -426847 -442484 -417482 -333607 -420458 -408209 -358514 -394746 -377757 -325575
6984 -325575 -286324 -420999 -397156 -437508 -399359 -428332 -398223 -339568 -326569 -440515 -427865
6973 -427865 -486503 -382541 -411526 -373747 -457066 -394057 -458032 -325012 -395787 -403530 -396332 -436876
6961 -436876 -366985 -423645 -354146 -283919 -333000 -385965 -312357 -340063 -406512 -361412 -367842 -516603
6949 -516603 -426969 -397405 -404150 -422880 -299143 -363598 -421275 -402826 -391563 -285564 -450506
6938 -450506 -445634 -428867 -359086 -402922 -385326 -259576 -399123 -380152 -386987 -381665 -350909 -382080
6926 -382080 -385084 -325643 -334546 -357589 -479197 -304782 -400562 -272217 -399712 -316893 -370076
6915 -370076 -381797 -347432 -330428 -286158 -344805 -322792 -363676 -312879 -272406 -410958 -313756
6904 -313756 -437094 -360334 -433560 -454194 -432743 -392944 -346106 -374072 -424173 -349617 -341756 -431927
6892 -431927 -357889 -419834 -402773 -401286 -275494 -403377 -424120 -325354 -452855 -364544 -424280
6881 -424280 -423747 -373948 -377560 -356652 -386667 -347269 -427968 -415365 -294709 -445075 -342831 -310117
6869 -310117 -445648 -292617 -432674 -413490 -412468 -316912 -303931 -397465 -299616 -314854 -420182
6858 -420182 -386400 -264512 -354388 -384366 -477497 -371174 -359823 -344188 -366062 -402809 -396956
6847 -396956 -276264 -401013 -297464 -322888 -330424 -280845 -368360 -399489 -269740 -366425 -319411
6836 -319411 -366821 -347485 -374147 -429324 -414091 -398861 -326982 -320379 -330833 -327472 -284720 -372995
6824 -372995 -360345 -308772 -433959 -353072 -322127 -240900 -301658 -396006 -310186 -308045 -343499 -358960
6812 -358960 -271954 -347455 -385811 -379494 -309307 -221810 -306614 -342016 -247290 -335743 -333644 -349853
6800 -349853 -287663 -306156 -269863 -326777 -251703 -310692 -221829 -323976 -374248 -200589 -313557
6789 -313557 -270842 -367694 -306141 -216104 -343402 -266819 -352004 -258051 -249545 -410496 -328779
6778 -328779 -311717 -209911 -323752 -219625 -291935 -291084 -281021 -196563 -223580 -254187 -313268
6767 -313268 -325861 -258231 -316631 -291296 -275850 -340692 -269681 -315514 -279497 -288178 -286911 -249222
6755 -249222 -225379 -266997 -379000 -382787 -278962 -303105 -325518 -301371 -351860 -294480 -337428
6744 -337428 -307508 -288460 -219106 -284338 -189298 -300645 -235934 -338202 -328986 -240128 -291856
6733 -291856 -298429 -298370 -142480 -272981 -299866 -161454 -120684 -308031 -341989 -259905 -219191 -286646
6721 -286646 -195401 -352300 -295103 -246962 -277532 -333210 -262950 -294257 -362723 -297324 -291491 -401882
6709 -401882 -251985 -322514 -253418 -314613 -325402 -356310 -267389 -407612 -342170 -314272 -364481
6698 -364481 -257229 -274434 -293828 -381891 -283155 -355035 -333533 -362927 -354873 -379008 -347482 -324498
6686 -324498 -244716 -345708 -372857 -374476 -368869 -348713 -311459 -334247 -329762 -363459 -296992 -330321
6674 -330321 -351013 -270876 -411917 -471987 -347478 -432180 -377355 -351485 -353321 -305703 -410599
6663 -410599 -326217 -342249 -320379 -279821 -272617 -379033 -358252 -322365 -442587 -326839 -340622
6652 -340622 -334401 -341554 -403572 -343372 -314090 -318843 -344627 -380851 -379849 -322432 -463807 -295006
6640 -295006 -309027 -258136 -417724 -425755 -343980 -265685 -251643 -289720 -325857 -446564 -403338
6629 -403338 -378446 -354511 -395113 -401404 -385354 -292323 -403527 -355723 -353434 -464765 -358888
6618 -358888 -334929 -500637 -402305 -434890 -360167 -362510 -439003 -351513 -359599 -369451 -451928 -402253
6606 -402253 -389921 -343460 -413753 -302809 -453267 -399685 -402755 -463206 -358464 -362053 -376756
6595 -376756 -323232 -373814 -345053 -455606 -417399 -355383 -324286 -345427 -362619 -410045 -357323
6584 -357323 -371819 -355270 -443710 -407286 -340967 -320404 -310701 -353692 -384026 -461629 -401234 -335001
6572 -335001 -352358 -488178 -360211 -361088 -434713 -376270 -404263 -380534 -412252 -302468 -377374
6561 -377374 -370011 -463531 -293542 -454872 -352763 -311643 -373644 -339949 -453608 -318859 -264106
6550 -264106 -419155 -339507 -463095 -380525 -353919 -330831 -399150 -409387 -422863 -416335 -467099
6539 -467099 -375607 -369117 -379943 -409451 -334152 -458702 -319739 -379848 -323653 -332372 -354514 -394852
6527 -394852 -359289 -332134 -384392 -396914 -363311 -312430 -359871 -324331 -377341 -260433 -427035
6516 -427035 -383785 -385389 -422262 -474046 -406897 -457061 -352752 -319793 -366250 -321373 -358873 -351992
6504 -351992 -385080 -345012 -368683 -326213 -467997 -367488 -424106 -359879 -418960 -375288 -386727
6493 -386727 -302758 -424678 -332094 -422920 -408668 -414952 -376448 -357002 -308507 -357641 -313691 -329110
6481 -329110 -410461 -460987 -451984 -321490 -327946 -484892 -383951 -337149 -453781 -381982 -378816
6470 -378816 -374282 -313336 -386926 -365432 -350013 -346999 -362023 -404738 -379321 -346244 -354735 -384011
6458 -384011 -329877 -360078 -418368 -359286 -345813 -336380 -340569 -329842 -344638 -370271 -339543 -381952
6446 -381952 -401837 -378824 -444171 -324158 -345522 -471114 -374776 -356588 -362680 -381275 -450737
6435 -450737 -427792 -446612 -338415 -332922 -323173 -341459 -411390 -460010 -324704 -367224 -371656 -384247
6423 -384247 -277585 -391994 -372103 -306801 -365016 -360324 -399842 -309322 -369372 -379250 -402102 -297272
6411 -297272 -344969 -314830 -278379 -491336 -301635 -370066 -287202 -273642 -335179 -236976 -341477
6400 -341477 -281511 -377297 -334457 -396579 -312950 -312958 -262981 -310552 -337849 -403707 -366659 -300282
6388 -300282 -376266 -413339 -350615 -325266 -348037 -287027 -269224 -373717 -309046 -334400 -345015
6377 -345015 -409738 -405257 -329912 -299338 -296334 -184102 -339288 -357630 -318362 -329747 -406255 -352745
6365 -352745 -291039 -331969 -355701 -270443 -276875 -263787 -372148 -289705 -238871 -399994 -256597
6354 -256597 -347788 -190731 -339830 -324575 -355668 -307059 -333560 -354730 -344450 -284520 -310086
6343 -310086 -199459 -284783 -165158 -186951 -317316 -275537 -272342 -264034 -337611 -396729 -290693
6332 -290693 -184508 -262649 -217899 -211830 -160814 -178793 -153262 -182441 -283484 -207228 -263152
6321 -263152 -268646 -246459 -184476 -133111 -151825 -146936 -157746 -208192 -96406 -123786 -126059 -196986
6309 -196986 -93323 -93341 -59067 40230 -105597 -69810 -96897 -57436 -61293 -43002 -48869 -114358
6297 -114358 -91610 -19890 -58088 -144167 -103218 -119603 -66045 3005 -67579 96980 73348
6286 73348 74685 -44627 -25139 -69846 -86382 10104 -15603 64513 56915 113410 90656 42572
6274 42572 84959 202829 180275 243846 132634 235045 133670 20910 152056 205589 171607
6263 171607 289238 288656 304413 263155 316310 315037 302277 216819 328498 316996 287898 280788
6251 280788 377207 282617 454855 314540 358067 467277 368562 504805 350086 506533
6241 506533 490311 564329 575408 609482 638918 697114 695862 834591 805493 850187 930748 1048869
6229 1048869 1097914 1119008 1230283 1227268 1200543 1287586 1388457 1505815 1440718 1443518 1481911
6218 1481911 1386942 1291985 1355584 1364213 1313862 1273705 1278885 1135941 1129687 1088896 1094104 967255
6206 967255 879543 967413 791245 827092 675387 679982 709130 560431 548160 369204 490549
6195 490549 453423 424442 342763 313872 280821 323756 174335 200946 216704 124656 150930
6184 150930 104945 83748 76120 95568 96310 71814 25543 2995 21042 28072 -12779 -105137
6172 -105137 88212 -104306 -48612 37851 -50673 -128291 -109348 -60145 -156524 -68216 -83958
6161 -83958 -142375 -146470 -147199 -139179 -186401 -196121 -172766 -130116 -70472 -180507 -234718 -154154 -258433
6148 -258433 -121196 -159631 -259306 -212751 -168674 -243725 -238283 -254945 -219403 -191164 -238675 -205667
6136 -205667 -258142 -207149 -254373 -142841 -195722 -105669 -255885 -176684 -229795 -205563 -146651
6125 -146651 -224585 -227714 -191755 -192535 -158781 -235621 -304194 -174547 -175924 -270524 -184164 -281945
6113 -281945 -256637 -217211 -296923 -277850 -180267 -300899 -231772 -270718 -247923 -304297 -224202
6102 -224202 -340196 -199293 -229225 -338674 -225753 -257555 -213186 -238361 -210427 -275601 -234997
6091 -234997 -326057 -238309 -241883 -222594 -309618 -271163 -229925 -310915 -245996 -203854 -354818 -295727
6079 -295727 -250341 -301253 -279822 -275461 -278587 -121612 -185295 -315656 -320616 -280899 -203498 -337712
6067 -337712 -304491 -244024 -290612 -290613 -196216 -198008 -206731 -258302 -275078 -231296 -296253 -332044 -241453
6054 -241453 -301297 -297733 -203697 -252869 -219321 -236120 -368676 -160319 -293528 -309036 -291044
6043 -291044 -295311 -352413 -326901 -219869 -384453 -331752 -195903 -264225 -306888 -265740 -296337
6032 -296337 -306023 -207002 -354069 -324856 -355213 -234577 -306469 -307557 -317429 -280997 -234810 -320521
6020 -320521 -234136 -321686 -277720 -249587 -219031 -340929 -256344 -286574 -221776 -336071 -243758
6009 -243758 -280465 -222735 -282869 -248862 -297981 -320793 -309646 -173330 -244843 -215993 -256398
5998 -256398 -189611 -321245 -253664 -255934 -281137 -245446 -229924 -342962 -352351 -316862 -340386 -234590
5986 -234590 -237568 -263379 -403954 -285146 -223239 -229994 -329608 -214523 -372961 -251468 -263532
5975 -263532 -252220 -241345 -269856 -226916 -205621 -205912 -217021 -264291 -306405 -241509 -316877 -262019
5963 -262019 -214109 -278736 -338403 -241368 -226194 -271676 -243617 -262803 -301322 -269231 -288390 -282514
5951 -282514 -288833 -273761 -253024 -222289 -255024 -265552 -235390 -173015 -319980 -241823 -277987 -210838
5939 -210838 -194347 -203803 -218303 -183268 -242652 -216329 -225582 -193485 -285563 -265460 -238119 -224574
5927 -224574 -197550 -264778 -292215 -330937 -92291 -179328 -149619 -116602 -292697 -341011 -336242
5916 -336242 -241016 -238446 -289075 -273433 -242863 -203399 -217768 -181747 -238585 -309345 -265357 -255796
5904 -255796 -356266 -251333 -226371 -229895 -236633 -174644 -214683 -165891 -232291 -178157 -204841 -166889
5892 -166889 -282294 -191511 -217324 -200365 -110171 -213863 -254325 -235596 -149123 -249999 -191698
5881 -191698 -251086 -202340 -161811 -123921 -260860 -253255 -258232 -245714 -193199 -174707 -295382 -177039
5869 -177039 -274991 -208893 -263461 -195555 -223039 -121460 -147054 -191981 -111656 -188360 -270570
5858 -270570 -169018 -270125 -171418 -226913 -217687 -143486 -194914 -233883 -281875 -107095 -202037
5847 -202037 -213202 -240381 -263112 -158780 -225090 -173074 -156847 -212606 -207751 -136646 -164646 -182737
5835 -182737 -320782 -235719 -272675 -261538 -267959 -247660 -126192 -286549 -275944 -249032 -202719
5824 -202719 -197345 -227662 -163591 -107350 -65536 -215181 -134756 -122408 -90660 -57132 -194185
5813 -194185 -156326 -142534 -192755 -147450 -151668 -189261 -163183 -244679 -152973 -172886 -228732 -220039
5801 -220039 -42682 -273223 -109535 -120754 -147548 -67148 -157156 -120511 -131754 -198393 -218217
5790 -218217 -170335 -206958 -120546 -85847 -102162 -126672 -106680 -133973 -141998 -114926 -142358 -163013
5778 -163013 -103401 -119254 -124875 -25214 -166694 -59054 -156292 -132841 -88025 -51395 -56373 -154782
5766 -154782 -84577 -110091 -140074 -123841 -47209 -129226 -189508 -119363 -170081 -161509 -155489 -188554
5754 -188554 -107628 -208908 -79099 -168079 -146304 -103891 -99733 -133193 -95411 -78632 -15665
5743 -15665 -114038 -71548 9240 1497 -18494 -91384 -96774 -73823 -60365 -61517 -61157 -100671 32782
5730 32782 -44128 -155798 12367 -122217 -68528 -32490 -49798 -107881 -78708 -31662 -54345
5719 -54345 -75388 -64535 -50585 -84509 -108860 -17840 -86992 -45922 -55378 -70160 -158564 -91575
5707 -91575 -146331 -103178 -37228 -4062 -75018 -21393 -102031 -112696 -4032 20967 77974 5730
5695 5730 -22747 7116 -30805 -64453 -31946 76159 39717 -100789 36051 7495 -74442
5684 -74442 24998 -15072 -18839 13430 -4548 -36666 7395 26484 47889 55249 48992 57471 55745
5671 55745 45286 5765 36274 57356 54456 -34219 9877 -425 100174 161060 97495 -27422
5659 -27422 67422 125839 -8332 36549 -25677 69316 72748 -1236 44989 -6373 87589 102562
5647 102562 148107 116153 9949 58870 81880 65454 101276 87083 109474 150547 237805
5636 237805 76979 163381 173969 104187 114179 100501 122254 145423 158726 139847 131690 209478
5624 209478 120417 108740 134553 84929 154981 112354 241205 135320 171664 68011 102747
5613 102747 145584 200246 116267 189650 165992 80322 186324 153012 178283 244972 235613 238278
5601 238278 218696 233522 225935 194226 222864 273855 323900 239045 148300 90861 337583 226477
5589 226477 284861 188304 272219 162543 204940 237429 175059 236171 288486 215562 266462
5578 266462 269443 300478 260016 296761 248113 272850 309037 175000 190469 247144 293202 280689
5566 280689 305806 298860 320415 372781 353938 371986 317947 384646 314682 290399 340103 240329
5554 240329 388208 407471 463056 399239 418715 370651 391371 415514 491600 405957 355201
5543 355201 415384 394579 387703 407078 425681 448379 470824 343715 536313 486322 473343
5532 473343 465126 545098 494182 597288 513899 539171 518326 536478 469935 425646 562873
5521 562873 585841 544801 479323 564530 520784 651285 517626 596784 583178 564916 573630
5510 573630 621649 645976 661796 622086 587430 614607 706152 767420 720364 683802 709370 686276
5498 686276 812655 772693 769302 695419 723444 749769 783975 829516 790575 823544 697489
5487 697489 811291 845672 897800 791794 870981 802564 837536 946806 879486 806617 844215
5476 844215 903572 854075 941068 984235 877905 923267 831534 950645 999620 999010 1074938 1004608
5464 1004608 1009982 1056894 1078145 1101161 1067714 1166770 1218621 1161419 1102704 1236371 1168335
5453 1168335 1151362 1190782 1309540 1227069 1227862 1222819 1156995 1247288 1319724 1261542 1286018 1339088
5441 1339088 1415947 1395794 1393563 1347737 1509299 1481465 1558806 1417667 1524584 1499535 1652986
5430 1652986 1663854 1589982 1645201 1661676 1716161 1808865 1799026 1760793 1855594 1992487 1954682
5419 1954682 1882701 1920246 1997197 2100434 2070266 2006140 2062335 2159165 2176440 2306901 2284636
5408 2284636 2432710 2378468 2474979 2377883 2428200 2420975 2559465 2622984 2574346 2678995 2753768
5397 2753768 2864850 2814476 3009229 3016086 3021825 3155875 3133444 3210700 3245876 3309561 3374950
5386 3374950 3454463 3480417 3634368 3739562 3720964 3736696 3858618 3875193 3979862 4074966 4117194
5375 4117194 4204130 4330247 4436350 4408678 4473958 4687357 4743097 4907047 4890748 5099422
5365 5099422 5250806 5354077 5337833 5494177 5608793 5761296 5816820 6012553 6084157 6191938
5355 6191938 6324306 6457100 6696790 6706422 6821852 6917047 7219873 7355777 7377747 7630024
5345 7630024 7760875 7880777 7988758 8063150 8388082 8455281 8631186 8780873 8936970 9035830
5335 9035830 9237131 9389407 9557376 9709845 9899262 10064259 10212633 10416936 10580578 10768761
5325 10768761 10954095 11224742 11321666 11631587 11793425 12058661 12222802 12571833 12675084 12875580
5315 12875580 13157168 13351596 13619404 13710382 13891430 14094590 14270347 14514811 14651267 14762253
5305 14762253 15085497 15196105 15361947 15650099 15775472 15984251 16296241 16548923 16760058
5296 16760058 16986767 17231798 17527608 17717867 18070789 18312382 18597778 18922052 19192788
5287 19192788 19337807 19627370 19912283 20182540 20408360 20625993 20838042 20963558 21160682
5278 21160682 21272788 21390055 21398351 21444209 21532028 21387588 21358124 21246206 20959579 20809121
5268 20809121 20407140 20071647 19628159 19253650 18858529 18485521 18117441 17621295 17308151
5259 17308151 16782393 16311645 15771966 15250727 14813278 14396387 13944108 13538003 13134449
5250 13134449 12788689 12367597 11990192 11620896 11279749 10985982 10640614 10397642 10066093
5241 10066093 9862772 9632224 9298332 9028604 8867376 8647817 8405757 8134147 7898363
5232 7898363 7734019 7496745 7340079 7157570 6922193 6803579 6568708 6372736 6355543 6083451
5222 6083451 5903719 5850964 5592549 5501821 5421080 5220003 5120466 5002407 4862680 4708283
5212 4708283 4693397 4550927 4470904 4380016 4258012 4199784 4013105 3942479 3901084 3889249 3800884
5201 3800884 3767564 3630673 3516371 3526620 3328559 3228137 3302634 3251359 3143988 3056303
5191 3056303 3010102 2972335 3012022 2992607 2937868 2895001 2906962 2756913 2690223 2615293 2623280
5180 2623280 2564986 2656295 2536859 2444845 2392894 2429215 2385843 2417165 2268025 2152948 2286570
5169 2286570 2307879 2206016 2096446 2186729 2226400 2029597 2079681 2088808 2106859 1939516 1996912
5158 1996912 1901209 1935605 1997044 1928387 1824494 1870211 1815862 1833782 1771063 1726683 1721884
5147 1721884 1796681 1684846 1701847 1590912 1669838 1658501 1552324 1617196 1579823 1503623 1550350
5136 1550350 1511656 1556503 1528588 1405851 1475882 1457686 1460808 1494284 1396833 1312337 1386935
5125 1386935 1344153 1373352 1336144 1292587 1268687 1405739 1333517 1308519 1309467 1249572 1224245 1276768
5113 1276768 1278777 1196415 1209717 1181886 1126020 1301274 1189335 1166175 1159869 1147459 1117629
5102 1117629 1206251 1200027 1171697 1078230 1127659 1123319 1198170 1135355 1090263 1173462 1146578 1033755
5090 1033755 1106391 1037511 969601 1022025 1062060 1073977 971010 1101359 1099100 939988 1002255
5079 1002255 1010851 1069394 1007775 920689 1012520 959605 1044008 920561 982482 962489 987872
5068 987872 1065161 1027128 904974 995474 970033 888519 969802 948264 903818 950035 943159 925173
5056 925173 1006075 882742 934029 898701 995328 890898 937101 961152 857538 993620 999689
5045 999689 919070 866373 835191 857152 896812 891771 924856 986633 981281 858907 952455 877400
5033 877400 897231 929287 903581 966342 897044 876194 938920 921909 877363 917851 955353 923152
5021 923152 894123 957756 800618 938621 1053093 894961 867302 796959 827996 965594 897217
5010 897217 894255 926687 919890 920606 983908 834054 928394 821781 836622 902259 883182 943603
4998 943603 894256 867738 880334 887939 867650 882485 931741 875138 883438 836693 938188 896487
4986 896487 818726 877393 823889 841591 813750 878069 819055 831555 829627 908695 811742 828757
4974 828757 717466 826754 867245 840103 758032 770265 863442 790534 819102 882380 815273
4963 815273 880254 853275 815536 848713 977254 784411 847237 843801 862476 838227 847220 838060
4951 838060 896937 882798 888956 825729 854763 840387 809286 758642 755390 775977 791953 796333
4939 796333 758926 784442 810787 660425 808355 824427 751667 742224 852259 827319 809442
4928 809442 852261 800187 945130 761158 848490 887199 908096 876383 888867 787283 885392
4917 885392 777970 842195 886053 771931 882831 861838 791823 826184 814404 882100 868289
4906 868289 880211 910457 774035 820541 807941 896100 922278 804240 797381 808465 781255
4895 781255 898001 849675 905517 953072 869702 917344 874737 876535 857222 802671 899369 979726
4883 979726 890209 851125 858941 849696 852740 899510 891902 931430 881730 846981 887248 992475
4871 992475 979346 963521 1031091 948247 965847 854523 964682 891575 968925 1046035 924606
4860 924606 938753 897234 979748 1065312 1004490 969250 928786 1102245 1012963 1008503 960590 1049007
4848 1049007 1037025 1214149 1080607 1046282 1063472 1111828 1061864 1035122 1133908 996012 1083997
4837 1083997 1048896 1100554 1158642 1209829 1116881 1226648 1212203 1182117 1173433 1082073 1178404
4826 1178404 1120662 1200026 1181605 1188528 1176502 1134413 1214342 1197660 1257654 1140622 1207557
4815 1207557 1238467 1145490 1200096 1221777 1173169 1265948 1285685 1327313 1288554 1311550 1319704 1260777
4803 1260777 1185173 1329287 1237745 1265837 1361185 1386605 1230162 1382291 1338293 1359246 1448938
4792 1448938 1370090 1294205 1370384 1346896 1425307 1300937 1310510 1275487 1239490 1372780 1346334
4781 1346334 1354637 1409761 1395380 1397544 1386733 1389626 1308268 1248719 1392404 1397415 1407413 1383129
4769 1383129 1414511 1481334 1407798 1504854 1461477 1494558 1449836 1347374 1415032 1480137 1557688
4758 1557688 1450606 1538668 1503792 1496926 1511446 1583118 1579385 1504444 1555635 1584797 1607810 1564569
4746 1564569 1638881 1594086 1565369 1561323 1626285 1521665 1707774 1721932 1663151 1657301 1719281
4735 1719281 1627711 1665114 1808335 1736367 1770302 1819344 1766888 1742220 1697649 1852161 1822759
4724 1822759 1784977 1802888 1662190 1879936 1836668 1712662 1800744 1859025 1809057 1870059 1999353
4713 1999353 1943161 1881695 1911338 1854093 1965151 1797980 1978329 2062299 1961249 2021987 1986380
4702 1986380 2034302 2090927 2012463 2166664 2037089 2065160 2083037 2097023 2156367 2190036 2245525
4691 2245525 2169306 2206131 2220529 2201739 2215720 2200923 2246634 2304762 2246316 2219623 2278660
4680 2278660 2272530 2256247 2217763 2294150 2398319 2321653 2377538 2482962 2508929 2511704 2566101
4669 2566101 2516257 2625133 2607126 2661302 2641740 2587817 2576071 2659553 2736197 2720672 2843216
4658 2843216 2786913 2829193 2803534 2913798 2907674 2892393 2927939 3022311 2946708 2933238 2942165 2980229
4646 2980229 3126438 3113291 3103702 3215220 3206925 3121121 3159490 3219441 3153098 3289667 3329047
4635 3329047 3279772 3201007 3309415 3326303 3464171 3544502 3678283 3711208 3711205 3827471 3776595
4624 3776595 3707396 3757273 3811082 3841342 3865125 3880944 3983884 3984908 4123374 4148606 3957934
4613 3957934 3990240 3914038 3842129 3794836 3899058 3876252 3889045 3966051 3908833 4041354 4088531
4602 4088531 4115544 4214712 4227231 4382690 4430129 4429217 4492139 4371325 4337138 4407962 4369688
4591 4369688 4371412 4463188 4688477 4653569 4580904 4418907 4396552 4295565 4288572 4344950 4193984
4580 4193984 4289371 4251271 4311800 4362646 4444808 4389563 4347803 4479095 4527693 4543639 4491724
4569 4491724 4561795 4597046 4453755 4565226 4585598 4607392 4617612 4707876 4812601 4830593 4814151
4558 4814151 4816804 4803424 4757027 4770367 4840973 4797327 4748587 4837612 4893806 4807963 4873014 4919105
4546 4919105 4990715 5018346 4998777 5026293 5062634 5052779 5095176 5175618 5191748 5264411 5252791 5322962
4534 5322962 5291583 5339394 5441220 5394604 5513832 5483831 5521738 5645792 5613138 5711480 5724002
4523 5724002 5689917 5753575 5855121 5862594 5993082 5977877 6052315 6068208 6126225 6226617 6219897
4512 6219897 6322151 6368258 6427830 6510457 6491718 6639429 6662731 6716323 6838628 6690344 6842377
4501 6842377 6900411 6965215 7080630 7032759 7109788 7320271 7266581 7348287 7402535 7514544 7622029
4490 7622029 7754370 7827466 7904727 7998122 8087868 8170586 8284716 8300422 8567484 8617811 8787125
4479 8787125 8841841 9056007 9083840 9257665 9425530 9575104 9636337 9916156 10009293 10172692
4469 10172692 10269416 10308076 10520193 10651269 10913514 11117093 11172536 11478663 11679029 11839068
4459 11839068 12102772 12322221 12625122 12782882 13247320 13551098 14012427 14594525 15096342
4450 15096342 15535733 15774648 15967852 16127575 16138033 16328737 16497952 16731054 16883986 17108144
4440 17108144 17350789 17581159 17957081 18216233 18576832 18943969 19302249 19732849 20236501
4431 20236501 20812216 21354507 22141575 22827286 23836915 24948199 26406203 27787153 29281766
4422 29281766 30654780 31441753 31917171 32257531 32653187 33436672 34600146 34762042 34049754
4413 34049754 33492237 33218735 33190555 33198873 33188097 33320878 33639202 33988650 34476788 35120454
4403 35120454 35925622 36874042 37917331 39143811 40544991 42319036 44410846 46844150
4395 46844150 49425800 51657905 53599277 55195884 57032291 59633546 63025571 66857040
4387 66857040 67468370 65779563 65114374 65240706 66435817 68227087 70646359 74747679 79704259
4378 79704259 84231268 87606922 88919534 90466359 89753317 87144198 85673132 85928723
4370 85928723 88195829 91631288 97481668 105193351 107712504 103413329 99914336 98405414
4362 98405414 99017425 101402859 104230409 103792037 102896476 103521720 106085673 110641982 116959546
4353 116959546 125697508 138541799 153279536 165754509 173870482 175678396 177902416 171863029
4345 171863029 161088240 154607540 152933951 155437827 162126336 175046821 191582928 189008719
4337 189008719 168300444 151549715 139744422 131503783 126367143 122082446 118276192 116215901
4329 116215901 115879838 117564088 120885710 126236050 134461501 147117112 160472053 172037583
4321 172037583 177475908 178064088 178600711 169194900 157758999 150773390 148651781 150672701
4313 150672701 157197524 170023922 183894827 174978703 151626971 133612904 119654740
4306 119654740 109342021 100955487 93911210 88698895 84759889 81908836 80007175 78850975
4298 78850975 78685241 79590523 82457193 85262961 87437839 87433523 86430388 84994155 80144771
4289 80144771 75580698 72627810 71386737 71458904 73151578 77178778 80291622 74919451
4281 74919451 66469612 59997518 54776458 50610213 47208330 44158924 41751517 39374317
4273 39374317 37343674 35485331 33897226 32227141 30915099 29776344 28737919 27736389
4265 27736389 26770642 26014358 25150635 24438740 23722567 23014707 22506968 21991440 21423613
4256 21423613 20860144 20519694 20144418 19682693 19405009 19113174 18727751 18386375 18116966
4247 18116966 17833912 17397518 17099268 16741345 16363959 16177538 15792572 15642450 15368050
4238 15368050 15209187 14957401 14920695 14600148 14467000 14340866 14147628 14081656 13851981 13698291
4228 13698291 13578893 13422121 13214652 13140101 13029651 12816249 12758863 12627502 12358589 12318951
4218 12318951 12173940 12125731 11939991 11932571 11804160 11765255 11681934 11452535 11389460 11414685 11268488
4207 11268488 11121614 11154716 11027533 11038171 10968913 10796423 10782588 10749014 10622499 10486179
4197 10486179 10478966 10351334 10338379 10350613 10244066 10187037 10064408 10061467 9984899 9953670 9961946
4186 9961946 9865333 9823103 9777651 9736683 9732452 9636452 9577125 9534184 9566832 9568933 9500997 9527557
4174 9527557 9491896 9515512 9525099 9460324 9415385 9423085 9259653 9391310 9349838 9369092 9271612
4163 9271612 9300455 9258001 9214849 9218435 9293394 9205292 9163157 9278556 9250175 9316856 9271856
4152 9271856 9294979 9325274 9333798 9278892 9230528 9402209 9383337 9437041 9446252 9428751 9561951
4141 9561951 9566526 9542461 9493249 9623854 9602013 9640524 9651987 9741794 9743324 9706476 9774070 9746762
4129 9746762 9827120 9808359 9903062 9977225 9990654 9956354 10025211 10063665 10132788 10199853 10130287
4118 10130287 10228052 10270816 10362142 10369478 10452646 10466387 10635443 10681339 10712569 10874446 10821586
4107 10821586 10959218 11074428 11092973 11138162 11303674 11261023 11397436 11415391 11639430 11694167
4097 11694167 11680512 11811331 12039516 12061452 12093751 12097259 12208024 12378738 12371562 12629429 12489648
4086 12489648 12581601 12806765 12937706 13016566 13096701 13200185 13180156 13325286 13431650 13556067
4076 13556067 13683422 13862459 13940332 14089768 14341056 14402420 14663255 14852353 15121095 15177709
4066 15177709 15417562 15469351 15694108 15725271 15854825 16000509 16231817 16441048 16697524 17030271
4056 17030271 17060436 17164632 17212243 17406183 17524201 17640248 17861901 17983806 18240762 18331824
4046 18331824 18581213 18844573 19088999 19297078 19598642 19841400 20131498 20357348 20583424
4037 20583424 20697336 20913358 21082511 21425893 21658941 21964860 22292971 22685679 22992719
4028 22992719 23229958 23477694 23713509 23873293 24295174 24573901 24972240 25194312 25621340
4019 25621340 25930028 26305562 26587045 26954607 27293368 27736079 28050741 28395664 28871463
4010 28871463 29220463 29540032 29843410 30216593 30586528 30918381 31452432 31937293 32501265
4001 32501265 32887016 33481491 33885254 34453962 34920785 35518134 35984557 36585226 37215774
3992 37215774 37701538 38228344 38876342 39474236 40034918 40698936 41250589 41809654 42482452
3983 42482452 43009872 43731093 44305428 44963404 45632085 46185271 46914005 47603553 48273069
3974 48273069 49008213 49849745 50595888 51507621 52232958 53132088 54134128 54978086 55953629
3965 55953629 56871026 57811826 58749687 59809480 60858909 61846408 62868687 63969899 64954676
3956 64954676 65952397 66987774 68055908 69117094 70190685 71237496 72261660 73245109
3948 73245109 74496506 75484310 76506087 77685548 78860627 80104298 81304416 82573390
3940 82573390 83922555 85379412 86913983 88408433 90107971 91831057 93630990 95401700
3932 95401700 97490739 99580456 101672536 103626675 105930554 108143063 110396601 112667704
3924 112667704 114920493 117256842 119527789 121813274 123929669 126116020 127896889 129815828
3916 129815828 131492010 133057356 134415974 135487087 136453984 137097189 137604011 137839252 137775759
3907 137775759 137592771 137136065 136452987 135466994 134304845 132894107 131462635 129743693 127999003
3898 127999003 126039654 124063809 121784250 119615073 117390170 114977983 112768346 110553439
3890 110553439 108234817 106041784 103811749 101639703 99462869 97456266 95528734 93667443
3882 93667443 91857668 90164280 88502590 87013161 85619416 84353544 83135489 82009292
3874 82009292 81019578 80093528 79249890 78464398 77719528 77152718 76448709 75751776 75191681
3865 75191681 74496607 73958150 73229739 72744716 72175528 71683024 71319035 70933268 70631480
3856 70631480 70532209 70424427 70372788 70364214 70453463 70709155 71288987 71662276 72431408 73346327
3846 73346327 74313796 75557742 76944951 78532565 80225934 82016705 83794868 85610254
3838 85610254 87254872 88846328 90135752 91168447 91909435 92306437 92640334 92679721 92653791
3829 92653791 92425899 92248236 92130897 92133226 92104077 92344678 92655553 93206728 93881645 94979411
3819 94979411 96221333 97897319 99846633 102079058 104625420 107672879 111076763 114949213
3811 114949213 119054984 123661607 128717038 134077709 139565822 145519483 151763406 157971539
3803 157971539 164150215 170368971 176716186 183235438 189573531 195982835 202321080 208208063
3795 208208063 213728160 218462960 222301759 225482455 228071951 230161072 231923852 233558817
3787 233558817 234830087 235763668 235800901 235286246 234381624 233141689 231508215 229888302 228917590
3778 228917590 228907836 230292058 232774092 236560165 241653862 248262280 256364870 265988148
3770 265988148 276915615 288793022 301145420 313659024 325340583 335614872 344138082
3763 344138082 350094996 353797037 355652593 356787386 356864908 356254855 355318437 353759389 349975648
3754 349975648 343225609 334145719 323172278 310687065 297723393 285094859 273452378
3747 273452378 263073541 254331713 247110703 241460100 237848853 236205397 236457128 238280532
3739 238280532 241590878 245772724 250316217 254677889 258635823 261727496 263283678 263704590
3731 263704590 263397202 262315247 260866046 259127035 257138737 254808862 251022341 246021355
3723 246021355 239825592 232468351 223643491 214309963 204681622 195672977 187157224 179235823
3715 179235823 172229672 165841201 160393393 155798399 151953369 148921955 146422692 144451126
3707 144451126 143060948 142185509 141772262 141849336 142196278 142946815 144070426 145435893 147001441
3698 147001441 148705140 150708191 152667082 154670798 156777041 158989862 161306539 163539651
3690 163539651 165507213 167847823 170126628 172318097 174519833 176730959 178948997 181422081
3682 181422081 184013978 186385956 188844353 191293519 193735499 195955885 197949146 199632541
3674 199632541 200977894 201935405 202500115 202660232 202394397 201649343 200344411 198732829 196681467
3665 196681467 194274078 191381390 188364860 184873480 181476194 177979153 174350200 170822685
3657 170822685 167567071 164534197 161578372 158546968 155858232 153275599 150740353 148186186
3649 148186186 145837930 143401394 140816199 138324186 135724074 133177147 130439508 127702172
3641 127702172 124863549 121924344 118931574 115963136 112916892 109751426 106599637 103567166
3633 103567166 100755032 98034342 95392269 93122833 90914120 88941392 87348367 85867396
3625 85867396 84553758 83432041 82500229 81581286 81100929 80851951 80406716 80412779 80419722 80568296
3615 80568296 80802356 81142114 81803789 82452856 83229065 83919574 84828617 85738813 86748749
3606 86748749 87892789 89118182 90436118 91954011 93686232 95667202 97698134 99936433
3598 99936433 102258000 104632429 106970414 109395382 111703030 113976587 116307199 118466991
3590 118466991 120732420 122956739 124993163 127130960 129083429 131171208 133042773 135003101
3582 135003101 136936892 139014426 141190394 143512528 146129373 149011171 151973744 155134381
3574 155134381 158443957 161850236 165085436 168343757 171261569 173854664 176092921 177877494
3566 177877494 179312050 180076300 180592420 180680701 180320544 179477391 178258425 176650223 174789906
3557 174789906 172205086 169450424 166566594 163410975 160107409 156645785 153142652 149723945
3549 149723945 146244111 142724369 139187222 135567196 131949673 128375607 124628540 120792215
3541 120792215 116998644 113129406 109003754 104939663 100796441 96602776 92268504 87965872
3533 87965872 83853479 79839498 75917209 72108962 68603866 65211744 61996619 59022304
3525 59022304 56144564 53602636 51134233 48778391 46726907 44800421 42921468 41216253
3517 41216253 39694403 38146401 36687273 35400428 34294684 33111438 32094658 31129332
3509 31129332 30075290 29147954 28343215 27532879 26701961 25999393 25340919 24654511 24047569
3500 24047569 23369298 22814341 22225068 21725801 21170307 20639135 20019214 19659844 19097698
3491 19097698 18623541 18178742 17662485 17276623 16971500 16562394 16228948 15855920 15464408
3482 15464408 15225697 14885648 14611371 14389993 14172165 13928057 13646720 13493245 13323281
3473 13323281 13037114 12924244 12707517 12578987 12374585 12240498 12035238 11863276 11712370
3464 11712370 11588828 11410975 11159268 10971177 10885297 10674988 10501673 10333979 10110193 9997115
3454 9997115 9864872 9802681 9627931 9521215 9329150 9232735 9024993 8880148 8827276 8606224
3444 8606224 8631801 8603088 8390676 8358834 8310826 8294293 8226479 8029192 7989419 7928189 7981324
3433 7981324 7846574 7654891 7633201 7601380 7527359 7539087 7401505 7418366 7396087 7331183 7308434
3422 7308434 7245983 7317284 7203573 7116971 7091430 6999634 7019516 6886357 6931561 6730018 6760965
3411 6760965 6714828 6627596 6527667 6398250 6552330 6358419 6383095 6319396 6428305 6301091
3401 6301091 6123777 6211393 5995241 6083891 6072270 6154926 5967002 6126045 6079090 6011958 5986156
3390 5986156 5980875 5913620 5911699 5970716 5887885 5992017 5846336 5852209 5884454 5886578 5870091 5827371
3378 5827371 5819659 5738004 5707014 5621173 5685549 5667009 5592470 5550991 5641211 5620221 5478688
3367 5478688 5716547 5643392 5691882 5678688 5600700 5698913 5742344 5718678 5698718 5813308 5866825
3356 5866825 5892830 5942018 5967188 6027478 6109840 6072734 6140664 6225811 6234473 6305491 6277795 6233604
3344 6233604 6287559 6331972 6393937 6366187 6364274 6283303 6365059 6358342 6510098 6431211 6645153
3333 6645153 6605436 6647462 6753800 6743854 6929074 6889145 7040748 6930379 6987222 7011044 7051790
3322 7051790 7045806 7021106 7094610 7041699 7115248 7084602 6988691 6945476 7011069 6799415 6966649
3311 6966649 6879114 6796611 6784348 6816693 6739029 6678928 6668739 6648620 6738365 6663840 6550753
3300 6550753 6611705 6579241 6604017 6504845 6521987 6464757 6390859 6383387 6388010 6337485 6384586 6292547
3288 6292547 6343833 6312821 6273612 6266658 6173842 6295804 6232780 6207912 6112279 6111720 6238166 6202442
3276 6202442 6163925 6282154 6229086 6256426 6245107 6316248 6279040 6315267 6348988 6298802 6396531
3265 6396531 6476043 6543666 6531743 6573538 6679592 6669281 6698927 6814265 6888179 6939287 7083222
3254 7083222 7182523 7298731 7381164 7411560 7521775 7708329 7629560 7748291 7858158 8004285
3244 8004285 8077360 8218254 8372781 8416610 8539363 8741885 8859099 9016564 9205398 9404401
3234 9404401 9596064 9852232 10086367 10319105 10476658 10668992 10761687 10928752 11106104 11257194
3224 11257194 11383774 11560002 11770988 11925334 12157552 12371802 12544188 12719807 12998993
3215 12998993 13276668 13498143 13784033 14179796 14429412 14781774 15194226 15830183 16281726
3206 16281726 16825363 17414625 17994645 18763038 19421699 19999680 20635903 21283821 21961181
3197 21961181 22159586 22421471 22538207 22594333 22504006 22599017 22704004 22892314 22969198 23368922
3187 23368922 23721396 23986599 24291104 24734577 25325195 25880704 26421144 27168610 27948993
3178 27948993 28867375 29824587 31049511 32194523 33613090 35177387 36648385 38353087
3170 38353087 40112003 41646456 42937091 44182423 45617176 46863049 47765999 48524158
3162 48524158 49590025 51219485 52935239 54847992 56532977 57852854 58444978 58576246
3154 58576246 58735905 58513625 58804263 59595736 61160957 63352592 65067704 66292338 67181748
3145 67181748 67049569 66800792 66960549 67685526 68757813 70052319 71877795 74117946 76794283
3136 76794283 79799217 82581774 85638781 88937533 92674341 96708776 101322148 106184181
3128 106184181 110575747 113783623 115603283 116195026 116421445 115738537 115064038 115357615 115972063
3119 115972063 116484664 117700616 119493571 120099847 117489858 111883712 106336610 102135103
3111 102135103 99548157 98224716 97870497 98333647 99538322 101304071 103356120 105955231
3103 105955231 109325399 113247298 118292758 124208534 129545345 134650960 138126974 140239788
3095 140239788 141000930 139484934 137912628 136075023 133599482 132333080 132726513 134689120
3087 134689120 135807540 132611616 127071771 119930573 111690084 104253501 98269306 93459275
3079 93459275 90006354 87199629 85160638 84065249 83636565 83987362 85213937 87244682
3071 87244682 90212266 93452415 96106784 98378748 99391622 98673762 97113736 94745954
3063 94745954 92199288 90084979 89324940 89954811 91068487 90846452 89655827 86552323 81674861
3054 81674861 75698956 69730335 64596849 60383178 56848438 53969542 51366429 49134989
3046 49134989 47433775 46133934 45170569 44423329 44135311 44120584 44159788 44075915 43876022 43657493
3036 43657493 43083702 41865917 40829580 39602039 38700353 37935687 37727239 37845125 37774500
3027 37774500 37104178 36162148 34610506 32614467 30929270 29438146 28078564 26914407
3019 26914407 26006429 25295796 24432278 23792153 23183744 22620431 22166731 21824090 21448802
3010 21448802 21098328 20863610 20588080 20347495 20166596 19911658 19797245 19663357 19512270
3001 19512270 19476409 19362174 19312703 19250377 19265998 19224488 19223915 19242670 19277578 19248135 19314550
2990 19314550 19337431 19454635 19558182 19642983 19645253 19900624 19991885 20177167 20373329 20594726
2980 20594726 20683159 20855206 21145900 21398805 21718108 21938267 22154554 22504998 22790733 22965417
2970 22965417 23363030 23765887 24189914 24551695 24938089 25374647 25899604 26483974 27013668
2961 27013668 27611892 28177660 28877070 29437934 30183006 30780815 31500020 32295379 33018660
2952 33018660 33698313 34538693 35082308 35940270 36544340 37324128 38087390 38911375 39831825
2943 39831825 40751760 41826626 42903896 43850855 44695592 45561181 46404186 47371089 48291519
2934 48291519 49406503 50644855 51952724 53485619 55127916 56737432 58495530 60129725
2926 60129725 61719498 63449042 65099291 66766698 68453826 70192831 71933032 73742512
2918 73742512 75345394 77221035 79103219 81255027 83435963 85598404 87834100 89860756
2910 89860756 91709342 93744967 96055719 98752968 101467226 103745565 105491227 107334778
2902 107334778 109383211 111276505 113090989 115004618 117109458 119757931 122574904 125433492
2894 125433492 128617620 131494897 134201752 136805491 139255832 141887353 144693839 147958670
2886 147958670 151736285 156027373 160598816 165750480 171503710 177646061 183821049 189416922
2878 189416922 193655673 197101655 201001276 205525755 211003288 217193195 224175604 231981010
2870 231981010 240585817 249031649 256556763 262746292 267019215 270047752 271905123 273707692
2862 273707692 276564357 281391578 288700114 298928281 311110588 322804478 330036170 332071534
2854 332071534 331928313 331671949 331290524 330062890 328209697 326554650 325701588 325548363 325611346
2845 325611346 325803190 326102281 325329509 322903633 318152461 310216595 300676600 290007224
2837 290007224 278551252 267715412 258368424 251035016 245989270 243627477 242577263 239446804
2829 239446804 231330894 220667332 210414505 201414422 193174628 185294792 177344491 169922163
2821 169922163 163349624 157199194 151445736 145842463 140011805 133861508 127312907 120572960
2813 120572960 114307809 108532073 103219548 98373745 93802969 89675988 85624768 82037274
2805 82037274 78503911 75364385 72459042 69725710 67267248 64883778 62694741 60739676
2797 60739676 59013194 57293320 55752307 54082327 52305268 50187821 48205674 46540025
2789 46540025 44840784 43546735 42362302 41121306 39760225 38375546 36773386 35382294
2781 35382294 34020665 32774869 31577723 30742751 29822922 28907585 28087755 27323690 26259682
2772 26259682 25379485 24632706 23817991 23186230 22599070 21988765 21368727 20863941 20347445
2763 20347445 19878996 19333230 18943454 18507732 18083933 17608082 17317586 17039087 16583623
2754 16583623 16315554 16040011 15776865 15417653 15281443 14928263 14590001 14372485 14042717
2745 14042717 13836694 13651127 13498554 13095199 13052500 12772809 12527898 12326142 12183367 11938159
2735 11938159 11746634 11602421 11414657 11151670 11032099 10986182 10764593 10644509 10476596 10336374
2725 10336374 10137071 10003921 9869739 9771931 9534760 9431237 9359602 9141323 9081464 8940746
2715 8940746 8873907 8700289 8601054 8528404 8342598 8227729 8115593 8012854 7958890 7858182
2705 7858182 7875644 7717411 7678797 7530394 7569820 7387603 7303021 7360722 7265181 7260325 7150152
2694 7150152 7066350 6983500 6999253 6900664 6935408 6788285 6797947 6678250 6565122 6624843 6546223
2683 6546223 6457950 6363488 6414276 6414469 6387684 6260215 6270712 6240308 6246792 6151779 6196716 6139344
2671 6139344 6179845 6203202 6160068 6136286 6200267 6154865 6230155 6136080 6213726 6208111 6163980 6207408
2659 6207408 6222269 6279412 6270065 6341099 6383934 6492356 6546046 6622062 6603119 6689935 6689132 6605935
2647 6605935 6523841 6507257 6625460 6640067 6663875 6691227 6852463 6753537 6736385 6689527 6667036
2636 6667036 6732531 6786633 6717257 6725117 6801085 6877332 6865131 7053411 7073947 7193130 7484569
2625 7484569 7545451 7788082 7683832 7759485 7702089 7612722 7588055 7502263 7525583 7610381 7792409
2614 7792409 8019702 8174508 7953986 7775976 7685247 7512543 7497407 7455266 7411188 7410534 7385204
2603 7385204 7453029 7509239 7578103 7589391 7653779 7802487 7733239 7755307 7876233 7756578 7649297
2592 7649297 7692309 7549820 7619172 7757049 7796522 7880769 7978823 7930426 7800336 7878082 7713483
2581 7713483 7694369 7569442 7715290 7653691 7567339 7698172 7573511 7648813 7562455 7566281 7598445
2570 7598445 7527593 7557992 7587815 7706856 7724546 7627468 7713133 7817585 7666762 7767798 7775352
2559 7775352 7712758 7855443 7919856 8012448 7988547 8039529 8018623 7985180 8089899 8169892 8105786
2548 8105786 8178865 8286861 8363964 8214241 8292164 8412448 8525215 8634276 8714229 8734087
2538 8734087 8723589 8848226 8909857 8945698 9104798 9193738 9349085 9431401 9440022 9589435 9790470
2527 9790470 9772616 9959233 10031181 10116615 10167264 10343330 10415891 10557492 10766873 10839730 10987387
2516 10987387 11174790 11329872 11530283 11721612 11882322 12150740 12321923 12582866 12747613
2507 12747613 12973328 13261226 13564460 13798677 14132903 14349173 14683655 15060636 15367821
2498 15367821 15504122 15876142 16114541 16408643 16791584 17075140 17468112 17881653 18205171
2489 18205171 18653158 19039094 19614091 20169371 20679770 21279017 22025314 22920427 23901258
2480 23901258 25083360 26206259 27272630 27944089 28157033 28283124 28150926 28217142 28564189
2471 28564189 28751752 28977950 29410080 29858743 30309029 30740785 31188448 31796307 32290668
2462 32290668 33194031 33971784 34891597 35827462 37019382 38413764 39724955 41522489 43732541
2453 43732541 46274950 49145468 52270423 54764717 56329215 57532973 58311167 59639734
2445 59639734 61838788 64952893 65680176 63184040 61265599 60183931 59419192 59012065 58563549
2436 58563549 58405618 58608300 58850772 59468775 60073707 60917725 62133272 63428984 65049861
2427 65049861 66872306 69221056 72331805 75692932 79448703 82770342 86109639 89366929
2419 89366929 93549994 98795594 105924385 114859561 115032644 112981910 112619049 114478506
2411 114478506 118047835 123649521 131112306 142593016 156617846 169053114 178678080 181516609
2403 181516609 185053593 182128523 172891139 167276960 165836239 169046434 176271664 189031565
2395 189031565 207042625 211047752 195334533 180910340 171775718 166605444 165179782 164761456
2387 164761456 162743759 161965333 163222343 167408193 174021452 183633273 197056587 219618584
2379 219618584 243339921 265708948 276998679 278305644 284285408 267559306 247436084
2372 247436084 234624172 230601692 233600429 244088135 265914381 299180695 287334128
2365 287334128 246545107 216200262 192529170 175306734 162095676 151282062 143609099
2358 143609099 138629141 135213400 133540494 133364921 134864085 138956103 147298425 156188055
2350 156188055 164010581 166364464 165013623 163753149 153616359 142537424 135568242 132710772
2342 132710772 133323287 137926091 147982300 158831758 149392124 128815964 112917193 100428402
2334 100428402 90900768 82962082 76205341 70838396 66096417 62030648 58341647 54797887
2326 54797887 51436654 48581993 46003232 43735248 41702035 39942812 38109305 36523637
2318 36523637 34912499 33586775 32458928 31266574 30131318 29088198 28064002 27225142
2310 27225142 26509265 25776750 25067741 24407470 23790730 23258081 22597715 21970050 21337371
2301 21337371 20506414 19847835 19249664 18619200 18189442 17715996 17260564 16981404 16510799
2292 16510799 16191069 15848085 15476027 15093789 14753204 14517004 14216750 13944836 13690664
2283 13690664 13363297 13196578 12949249 12626372 12359567 12180046 11957561 11698160 11558327
2274 11558327 11241616 11051372 10798639 10667547 10465682 10316431 10022646 9931881 9847164 9667062
2264 9667062 9427695 9229222 8953860 8851904 8703301 8549980 8396697 8239326 8033596 7944208
2254 7944208 7765631 7716256 7421141 7387237 7169129 7032015 6928402 6695530 6651643 6396195
2244 6396195 6339184 6199260 6239844 5891559 5847570 5774769 5672790 5519123 5336519 5404036
2234 5404036 5240492 5198075 4949116 4966111 4807002 4668011 4637086 4506350 4399449 4389570
2224 4389570 4140022 4127382 4085268 4096417 3925800 3802602 3752236 3715620 3584960 3496990 3498151
2213 3498151 3433394 3300889 3272965 3186351 3228120 3081746 3034309 2914624 2820510 2908713 2865779
2202 2865779 2864423 2808810 2809532 2717618 2681623 2711752 2708912 2518995 2533673 2544874 2471798 2444177
2190 2444177 2320596 2283862 2251661 2332144 2166306 2148038 2125435 2139011 2094865 1996710 2056035
2179 2056035 1954512 1970274 1988969 1999003 1943209 2024033 2050417 2175209 2163901 2260376 2187386
2168 2187386 2132656 2206519 2200363 2186313 2165823 2131123 2263071 2202920 2237865 2183750 2453215
2157 2453215 2521758 2483622 2486816 2510256 2559200 2427392 2324994 2375185 2297775 2440503 2505306
2146 2505306 2714994 2741422 2676483 2601816 2538840 2639400 2546709 2639815 2568353 2644535 2664217
2135 2664217 2564357 2693364 2704563 2895715 2973643 3216949 3447927 3524695 3599978 3756569
2125 3756569 3755486 3601088 3529121 3633763 3543032 3819171 3816854 4063582 4209052 4027267 3898889
2114 3898889 3774793 3689692 3616575 3575726 3470120 3430164 3491468 3511314 3591284 3791135 3796182
2103 3796182 3977592 4096573 4289340 4363742 4463520 4393023 4275757 4145019 3954426 3938205
2093 3938205 3927453 3949609 4121380 4226474 4265799 3961395 3612314 3469892 3198033 3011725
2083 3011725 2919870 2763162 2644387 2617124 2523187 2420301 2403149 2382194 2295065 2413868 2315078
2072 2315078 2234921 2168271 2151594 2061293 1937812 1896334 1837560 1775079 1679381 1650475 1528886
2061 1528886 1465652 1271211 1198157 1173748 1051062 1007519 908623 818120 762471 659422 471627
2050 471627 510882 456144 431420 292504 222570 125344 98449 -14802 -9763 -82112 -164086
2039 -164086 -125602 -184407 -265319 -316641 -317570 -367100 -365330 -381142 -397561 -485508 -519839 -521073
2027 -521073 -574717 -617907 -689151 -656340 -681182 -736811 -799443 -733636 -818859 -712886 -866419
2016 -866419 -798969 -905240 -879936 -903245 -1013375 -915413 -960203 -1025451 -1037750 -1100440 -968276
2005 -968276 -1031585 -1044534 -1131660 -1045605 -1105204 -1131291 -1192387 -1188305 -1195172 -1183662 -1121642 -1246544
1993 -1246544 -1130167 -1226005 -1226634 -1140677 -1197482 -1378771 -1239120 -1289721 -1278103 -1248547 -1322416
1982 -1322416 -1369261 -1363966 -1384235 -1300657 -1289930 -1359277 -1373980 -1332585 -1430584 -1395835 -1355986 -1377890
1970 -1377890 -1360204 -1391546 -1410113 -1500048 -1374476 -1479153 -1474537 -1457505 -1495187 -1403511 -1475455
1959 -1475455 -1438241 -1482519 -1395894 -1453321 -1420525 -1423832 -1435352 -1505453 -1628803 -1511994 -1542559
1948 -1542559 -1531693 -1524053 -1381572 -1493382 -1514659 -1539714 -1534273 -1630953 -1607654 -1510776 -1586028
1937 -1586028 -1497717 -1510670 -1587116 -1571430 -1469986 -1623419 -1620661 -1622798 -1655540 -1640249 -1633538 -1702353
1925 -1702353 -1650898 -1592217 -1673097 -1574675 -1599322 -1513809 -1625219 -1668689 -1659377 -1609586 -1624124
1914 -1624124 -1632370 -1678017 -1671434 -1702916 -1679135 -1607324 -1587961 -1609474 -1651615 -1640190 -1677685 -1652948
1902 -1652948 -1683046 -1664534 -1613123 -1601303 -1663173 -1677212 -1655899 -1722702 -1648241 -1625525 -1703970
1891 -1703970 -1648185 -1700149 -1703109 -1719393 -1769900 -1668062 -1677289 -1664650 -1672904 -1701475 -1629552 -1701594
1879 -1701594 -1689455 -1730960 -1750698 -1698178 -1685367 -1747957 -1775659 -1689687 -1711869 -1722628 -1693218
1868 -1693218 -1757153 -1744037 -1708268 -1780838 -1759770 -1696826 -1697217 -1745672 -1722059 -1702941 -1768472 -1674771
1856 -1674771 -1779242 -1684699 -1746753 -1697467 -1686476 -1702867 -1781137 -1722408 -1762880 -1723279 -1661537
1845 -1661537 -1697210 -1712906 -1707863 -1677406 -1717277 -1765748 -1697569 -1753731 -1831665 -1759546 -1779111 -1735088
1833 -1735088 -1785300 -1789717 -1756538 -1742986 -1734672 -1779660 -1733872 -1646270 -1773356 -1641943 -1642426 -1742106
1821 -1742106 -1728889 -1751655 -1785661 -1740047 -1698172 -1700240 -1757204 -1760332 -1708847 -1789917 -1801809 -1747166
1809 -1747166 -1804865 -1746923 -1802766 -1789742 -1772833 -1811911 -1765388 -1779880 -1786103 -1804914 -1687364
1798 -1687364 -1725314 -1820794 -1774230 -1695373 -1746974 -1728953 -1802522 -1688255 -1788372 -1776269 -1718855
1787 -1718855 -1769602 -1721271 -1730146 -1749838 -1787827 -1858446 -1769483 -1656408 -1724171 -1608390 -1575849
1776 -1575849 -1805174 -1746539 -1611487 -1668049 -1801965 -1810460 -1817497 -1774743 -1836318 -1806630 -1803201
1765 -1803201 -1731435 -1754857 -1797566 -1788229 -1819196 -1817808 -1741850 -1767377 -1787040 -1683660 -1800344
1754 -1800344 -1788240 -1740113 -1724866 -1727866 -1697605 -1709630 -1724432 -1778683 -1883290 -1702637 -1620442
1743 -1620442 -1748642 -1755514 -1840631 -1758410 -1719943 -1678847 -1722592 -1801198 -1802079 -1879770 -1739543 -1771690
1731 -1771690 -1732054 -1853170 -1769536 -1716423 -1756745 -1777586 -1741122 -1674111 -1829404 -1763581 -1743325
1720 -1743325 -1747236 -1693009 -1709107 -1714228 -1733175 -1704403 -1770169 -1704619 -1761133 -1792667 -1749556 -1745027
1708 -1745027 -1706295 -1857132 -1757052 -1764566 -1711167 -1696128 -1779500 -1850078 -1762087 -1789609 -1670327
1697 -1670327 -1756768 -1789489 -1770141 -1708065 -1638620 -1693791 -1799138 -1755159 -1704923 -1709391 -1715855 -1782703
1685 -1782703 -1736733 -1735517 -1695166 -1740263 -1709344 -1654631 -1732558 -1727312 -1686817 -1750879 -1673248 -1623685
1673 -1623685 -1717289 -1670571 -1721190 -1712555 -1731265 -1695212 -1703301 -1798735 -1708452 -1664506 -1637844 -1687228
1661 -1687228 -1699141 -1697133 -1597177 -1725612 -1748941 -1722046 -1733805 -1711620 -1749275 -1707376 -1701946 -1801914
1649 -1801914 -1642978 -1716423 -1726890 -1657789 -1668260 -1754725 -1630785 -1589128 -1672300 -1593293 -1714479
1638 -1714479 -1682571 -1756919 -1784405 -1715914 -1650426 -1718115 -1660764 -1644511 -1695561 -1649684 -1753275
1627 -1753275 -1768526 -1708247 -1639253 -1766854 -1650666 -1757835 -1620846 -1671719 -1783274 -1789509 -1689124
1616 -1689124 -1698066 -1690376 -1704160 -1695790 -1669857 -1677569 -1717613 -1667386 -1687043 -1646490 -1693488 -1631299
1604 -1631299 -1726849 -1733336 -1697310 -1775807 -1722237 -1659591 -1733292 -1689038 -1730041 -1708405 -1739950 -1674322
1592 -1674322 -1702159 -1718701 -1633274 -1764812 -1658563 -1648824 -1625760 -1678715 -1712924 -1620938 -1685789
1581 -1685789 -1635047 -1648893 -1658066 -1669252 -1717880 -1653539 -1650447 -1592554 -1682452 -1695143 -1642257 -1752733
1569 -1752733 -1642270 -1743053 -1629935 -1634123 -1648357 -1623432 -1724606 -1603653 -1660961 -1737259 -1684313
1558 -1684313 -1666898 -1617266 -1705857 -1704775 -1565325 -1533317 -1609815 -1709025 -1610865 -1621129 -1585168
1547 -1585168 -1637844 -1548588 -1581588 -1559560 -1598067 -1650169 -1587306 -1527133 -1514007 -1566506 -1626176
1536 -1626176 -1559675 -1581847 -1634690 -1601624 -1618790 -1600346 -1669400 -1599614 -1618610 -1577497 -1592981
1525 -1592981 -1624016 -1656474 -1578004 -1540900 -1568027 -1497442 -1620064 -1551012 -1499431 -1545441 -1557557
1514 -1557557 -1572609 -1497099 -1563174 -1488172 -1503543 -1524440 -1436243 -1409371 -1553693 -1472716 -1479074
1503 -1479074 -1505899 -1528385 -1418743 -1566588 -1510205 -1491887 -1552202 -1515889 -1437969 -1585480 -1574526
1492 -1574526 -1385225 -1501513 -1475367 -1586827 -1442752 -1484590 -1457154 -1519434 -1444485 -1263759
1482 -1263759 -1396088 -1372654 -1400721 -1371597 -1332424 -1243642 -1283783 -1230074 -1139578 -1069332 -973610
1471 -973610 -880929 -728600 -805766 -767952 -753770 -855772 -865958 -926078 -955205 -957172 -842752
1460 -842752 -746881 -723553 -760756 -925753 -1036167 -1064018 -1131235 -1277006 -1306532 -1285738 -1241895
1449 -1241895 -1375865 -1434134 -1434979 -1382060 -1333239 -1481020 -1480104 -1578482 -1457184 -1492667 -1454505 -1449289
1437 -1449289 -1471474 -1547061 -1513544 -1501172 -1510344 -1581389 -1607099 -1534466 -1570538 -1496028 -1618464
1426 -1618464 -1560610 -1537517 -1481822 -1610918 -1698136 -1633344 -1617167 -1594661 -1640818 -1578479 -1565525
1415 -1565525 -1526304 -1586833 -1561297 -1598251 -1523182 -1617454 -1566122 -1494232 -1506053 -1627872 -1555847
1404 -1555847 -1621444 -1593643 -1622456 -1537848 -1653565 -1690166 -1607950 -1607886 -1690247 -1562027 -1579424 -1673385
1392 -1673385 -1621573 -1607241 -1553035 -1605733 -1577559 -1634909 -1562889 -1577329 -1643133 -1629937 -1582771
1381 -1582771 -1602684 -1571871 -1586452 -1626625 -1642263 -1560777 -1595190 -1659445 -1670800 -1577923 -1550737
1370 -1550737 -1562170 -1629541 -1693308 -1580638 -1571218 -1591280 -1559293 -1592307 -1636717 -1591063 -1523305
1359 -1523305 -1601874 -1594800 -1547609 -1523286 -1625145 -1589942 -1622180 -1491835 -1624783 -1584226 -1574206
1348 -1574206 -1477333 -1541123 -1597901 -1619046 -1627541 -1574964 -1558322 -1505020 -1558819 -1596970 -1605776 -1687151
1336 -1687151 -1612489 -1600048 -1653307 -1546739 -1549905 -1538662 -1586370 -1557756 -1510483 -1540328 -1525156
1325 -1525156 -1654715 -1542263 -1628816 -1534577 -1601366 -1559807 -1632977 -1577905 -1525987 -1492194 -1497366
1314 -1497366 -1550068 -1464273 -1542764 -1565416 -1614784 -1558917 -1585836 -1546174 -1471668 -1590757 -1575553
1303 -1575553 -1570104 -1632234 -1578267 -1637763 -1567243 -1546801 -1522179 -1527912 -1607795 -1553649 -1555786 -1645117
1291 -1645117 -1543945 -1677655 -1560704 -1654912 -1572139 -1595937 -1588369 -1669934 -1579973 -1534131 -1620051
1280 -1620051 -1689295 -1661927 -1644182 -1528587 -1561394 -1678012 -1479590 -1517889 -1610924 -1558644 -1603039
1269 -1603039 -1583835 -1475142 -1598188 -1566226 -1584253 -1528893 -1574474 -1596054 -1474386 -1577791 -1552092
1258 -1552092 -1553097 -1503253 -1544049 -1445673 -1557414 -1477294 -1551235 -1575271 -1729710 -1537497 -1496904
1247 -1496904 -1548437 -1498396 -1560048 -1566241 -1540766 -1602754 -1558187 -1612683 -1641886 -1637275 -1507081 -1530467
1235 -1530467 -1507692 -1590892 -1615792 -1565296 -1546421 -1549106 -1473774 -1572226 -1557772 -1487615 -1547169 -1640174
1223 -1640174 -1546088 -1594287 -1524993 -1630797 -1576931 -1610122 -1565781 -1590604 -1610711 -1474775 -1606652
1212 -1606652 -1445401 -1491045 -1581037 -1591625 -1436395 -1568721 -1473859 -1512794 -1496828 -1655315 -1577962
1201 -1577962 -1542502 -1603941 -1563413 -1497293 -1509195 -1437448 -1468234 -1540132 -1597568 -1540559 -1552696
1190 -1552696 -1550988 -1528724 -1489687 -1573982 -1556975 -1518788 -1533870 -1527496 -1545257 -1597996 -1499473 -1427197
1178 -1427197 -1549440 -1474268 -1473398 -1514072 -1550242 -1557169 -1550825 -1571772 -1514551 -1657453 -1448294 -1584344
1166 -1584344 -1547038 -1570261 -1477874 -1531705 -1487290 -1444286 -1514105 -1569246 -1538792 -1625445 -1621738 -1568945
1154 -1568945 -1580327 -1529685 -1592001 -1400757 -1544589 -1504483 -1416926 -1589087 -1476505 -1555616 -1545371
1143 -1545371 -1564209 -1591690 -1482823 -1538767 -1539936 -1481620 -1443927 -1532876 -1508064 -1546731 -1516395
1132 -1516395 -1630557 -1522360 -1655689 -1564957 -1490692 -1646286 -1468778 -1640950 -1508538 -1594151
1122 -1594151 -1615775 -1390124 -1513906 -1458560 -1449088 -1459640 -1530001 -1591715 -1496644 -1559150 -1429464
1111 -1429464 -1622758 -1472862 -1472811 -1545937 -1480868 -1628220 -1494433 -1542072 -1587192 -1506994 -1592084
1100 -1592084 -1522020 -1492238 -1588666 -1538318 -1510216 -1528328 -1547316 -1560800 -1495883 -1517574 -1543956
1089 -1543956 -1426134 -1460997 -1501073 -1591128 -1501755 -1484981 -1508430 -1572807 -1495284 -1539861 -1434835
1078 -1434835 -1527562 -1558706 -1530514 -1507544 -1551839 -1480380 -1483858 -1444897 -1550877 -1501415 -1588935
1067 -1588935 -1442126 -1457086 -1409980 -1499474 -1530164 -1412813 -1398812 -1440096 -1495114 -1615577 -1421534
1056 -1421534 -1404769 -1501481 -1457648 -1568934 -1496825 -1537411 -1469066 -1485490 -1582716 -1597471 -1545767
1045 -1545767 -1397410 -1515450 -1429713 -1504086 -1562786 -1597587 -1470557 -1492271 -1476871 -1484236 -1522543
1034 -1522543 -1446690 -1482947 -1511548 -1508107 -1523663 -1439731 -1452399 -1481987 -1532364 -1528009 -1512666 -1421583
1022 -1421583 -1467387 -1503650 -1515299 -1520629 -1461072 -1317281 -1388862 -1389614 -1473142 -1451121 -1491622 -1447527
1010 -1447527 -1468982 -1541930 -1463811 -1463077 -1544111 -1452933 -1548597 -1442938 -1474935 -1504797 -1442437 -1537717
998 -1537717 -1535056 -1573950 -1416439 -1556125 -1489555 -1490220 -1460827 -1451850 -1500141 -1593988 -1555967 -1499985
986 -1499985 -1430555 -1455347 -1363866 -1381827 -1424550 -1472725 -1461940 -1425966 -1542089 -1420775 -1526293
975 -1526293 -1468604 -1414182 -1411589 -1464803 -1459123 -1498695 -1513489 -1531706 -1514699 -1559678 -1427205 -1407571
963 -1407571 -1485540 -1441159 -1487869 -1442719 -1523667 -1501216 -1430087 -1398661 -1541576 -1435786 -1586181
952 -1586181 -1521853 -1465073 -1488051 -1389323 -1462671 -1495754 -1400049 -1415335 -1383929 -1450116 -1452162 -1469175
940 -1469175 -1408387 -1568605 -1488231 -1433469 -1567840 -1542663 -1465407 -1522514 -1570894 -1506901 -1479789
929 -1479789 -1504179 -1436337 -1488534 -1403832 -1488538 -1442759 -1507399 -1394369 -1401332 -1508803 -1502787 -1392243
917 -1392243 -1414169 -1423609 -1464407 -1418573 -1367931 -1388596 -1450280 -1421798 -1502014 -1487513 -1437014 -1392426
905 -1392426 -1373929 -1383660 -1375405 -1488113 -1376561 -1538650 -1429983 -1486157 -1445157 -1408556 -1505612
894 -1505612 -1409963 -1377077 -1425339 -1363074 -1420305 -1347185 -1423726 -1473777 -1484722 -1435704 -1500412 -1408728
882 -1408728 -1511442 -1492064 -1454426 -1491135 -1382367 -1494855 -1386000 -1390992 -1394073 -1385977 -1417335
871 -1417335 -1390016 -1470490 -1499768 -1502884 -1453689 -1504961 -1422677 -1343121 -1456182 -1425797 -1322963
860 -1322963 -1401356 -1378431 -1515870 -1462972 -1520041 -1460517 -1377395 -1493982 -1442991 -1417194 -1374836
849 -1374836 -1457201 -1372827 -1483058 -1461900 -1453616 -1544712 -1451780 -1451466 -1404001 -1297446 -1485095 -1450734
837 -1450734 -1386135 -1404156 -1540684 -1383279 -1464613 -1395211 -1421381 -1504899 -1414193 -1434506 -1424194
826 -1424194 -1545145 -1441508 -1413218 -1459804 -1448987 -1438169 -1443075 -1480202 -1433902 -1566134 -1438848
815 -1438848 -1418822 -1468520 -1480912 -1449196 -1300127 -1406323 -1403615 -1399187 -1409980 -1392581 -1405406 -1365338
803 -1365338 -1404515 -1492255 -1445087 -1517654 -1512724 -1400927 -1450808 -1337360 -1427954 -1485905 -1385290
792 -1385290 -1441337 -1423140 -1380326 -1459921 -1454403 -1477724 -1406685 -1418510 -1406284 -1404092 -1525890 -1457701
780 -1457701 -1454343 -1443630 -1421147 -1437141 -1397563 -1386834 -1379427 -1429803 -1441545 -1362313 -1506319 -1378840
768 -1378840 -1461233 -1317093 -1403664 -1419220 -1443050 -1325687 -1429272 -1449603 -1465205 -1406536 -1434870
757 -1434870 -1321607 -1478101 -1425245 -1496073 -1426484 -1438246 -1429533 -1391325 -1440956 -1491750 -1399286
746 -1399286 -1368975 -1389571 -1459125 -1399704 -1457240 -1408605 -1387837 -1415654 -1435157 -1296489 -1434530
735 -1434530 -1413403 -1402362 -1318680 -1365693 -1392328 -1461749 -1442506 -1333838 -1498971 -1434588 -1400619
724 -1400619 -1453218 -1412342 -1362113 -1353914 -1456737 -1406001 -1564966 -1324475 -1462288 -1423211 -1358718
713 -1358718 -1451977 -1499576 -1448834 -1371155 -1466217 -1433312 -1433122 -1355796 -1386743 -1360951 -1401971 -1412994
701 -1412994 -1418991 -1395919 -1361732 -1370200 -1423586 -1362173 -1427353 -1439630 -1403137 -1366709 -1474857 -1408543
689 -1408543 -1464567 -1461257 -1438657 -1399175 -1454568 -1451940 -1394750 -1331710 -1439769 -1475353 -1445103 -1393903
677 -1393903 -1426780 -1358869 -1388762 -1322281 -1418841 -1376050 -1475531 -1421377 -1465519 -1338371 -1341138 -1360500
665 -1360500 -1425376 -1312905 -1433551 -1300599 -1416415 -1419269 -1443728 -1351189 -1423180 -1416831 -1371231
654 -1371231 -1350796 -1377592 -1401351 -1441911 -1456478 -1414890 -1443285 -1469715 -1370783 -1382345 -1391175 -1483911
642 -1483911 -1402898 -1393973 -1359167 -1443199 -1435868 -1378235 -1392508 -1394977 -1362807 -1390312 -1318842 -1483124
630 -1483124 -1446481 -1340970 -1371623 -1397674 -1438491 -1332996 -1424581 -1408648 -1370630 -1299313 -1284565
619 -1284565 -1333777 -1447878 -1389526 -1397455 -1358837 -1331598 -1341353 -1395483 -1356877 -1421111 -1447073 -1441397
607 -1441397 -1417705 -1326074 -1363190 -1407058 -1468905 -1350720 -1345310 -1439920 -1461142 -1308004 -1293335
596 -1293335 -1386984 -1448370 -1415125 -1302823 -1370090 -1384805 -1357503 -1340170 -1466747 -1369014 -1275658
585 -1275658 -1371322 -1377279 -1377057 -1371646 -1414107 -1428662 -1358573 -1322231 -1363619 -1354053 -1452491 -1357161 -1402804
572 -1402804 -1403101 -1433644 -1380450 -1306789 -1310184 -1405755 -1476606 -1386478 -1335609 -1451362 -1338646 -1388122
560 -1388122 -1436387 -1438505 -1438939 -1418899 -1381820 -1268743 -1388996 -1417703 -1390557 -1324747 -1315975 -1371672
548 -1371672 -1506958 -1301470 -1352390 -1386360 -1386565 -1267161 -1367763 -1350828 -1353333 -1355605 -1290214 -1375192
536 -1375192 -1351927 -1382704 -1393580 -1358315 -1311824 -1361487 -1379987 -1399418 -1376926 -1390841 -1320342 -1345595
524 -1345595 -1414099 -1334467 -1388398 -1307639 -1318895 -1343238 -1278350 -1259820 -1358015 -1351321 -1311215 -1361600
512 -1361600 -1322494 -1308069 -1362728 -1329531 -1289445 -1368344 -1336630 -1303686 -1341035 -1326321 -1350030 -1407035
500 -1407035 -1343112 -1392913 -1429209 -1391805 -1353389 -1327419 -1327340 -1372483 -1323889 -1462160 -1391369 -1384958
488 -1384958 -1268459 -1318729 -1434821 -1388662 -1371901 -1390133 -1406194 -1421099 -1420727 -1329361 -1391558 -1385811
476 -1385811 -1334040 -1494549 -1414694 -1377875 -1391839 -1381857 -1328621 -1216817 -1263738 -1356753 -1310226
465 -1310226 -1291649 -1354219 -1233864 -1314653 -1292345 -1434181 -1432220 -1390599 -1290667 -1404906 -1278743
454 -1278743 -1332915 -1369592 -1459727 -1402187 -1383295 -1439691 -1512518 -1394100 -1382318 -1290294 -1330862
443 -1330862 -1440222 -1345141 -1358915 -1363156 -1393193 -1239947 -1317444 -1384867 -1421524 -1422218 -1368662 -1376432
431 -1376432 -1282518 -1401648 -1400508 -1271067 -1299629 -1276038 -1314230 -1341613 -1400030 -1488391 -1413378
420 -1413378 -1345606 -1371776 -1346713 -1377391 -1300616 -1374562 -1337254 -1378217 -1227095 -1348603 -1309074
409 -1309074 -1397823 -1328388 -1431903 -1378275 -1359252 -1376354 -1351089 -1364182 -1296636 -1295609 -1210239 -1368747
397 -1368747 -1392386 -1414791 -1325442 -1352234 -1354351 -1297687 -1260535 -1317032 -1263635 -1281373 -1208667 -1342950
385 -1342950 -1355892 -1252786 -1373862 -1313307 -1381005 -1278891 -1371509 -1407069 -1364381 -1367818 -1256809
374 -1256809 -1335648 -1398983 -1335770 -1254966 -1360782 -1323868 -1367355 -1283317 -1323429 -1281293 -1400394
363 -1400394 -1224886 -1270231 -1309237 -1245047 -1373816 -1400306 -1379323 -1358586 -1265912 -1351479 -1317706
352 -1317706 -1333400 -1335194 -1333246 -1379226 -1410710 -1352298 -1420137 -1329029 -1256981 -1358723 -1325523 -1289021
340 -1289021 -1307234 -1286791 -1289007 -1338300 -1442100 -1228562 -1238430 -1382396 -1189359 -1364964 -1309605
329 -1309605 -1275761 -1347866 -1379254 -1320147 -1293155 -1395403 -1331899 -1290068 -1344103 -1365864 -1316400
318 -1316400 -1351190 -1283642 -1317283 -1297320 -1271362 -1352574 -1333961 -1333502 -1312828 -1323201 -1236194 -1307512
306 -1307512 -1282190 -1359157 -1371333 -1263926 -1381903 -1317533 -1240279 -1374080 -1374875 -1346132 -1280261
295 -1280261 -1363580 -1340429 -1415575 -1392486 -1383480 -1481056 -1408993 -1328268 -1296359 -1340657 -1365086 -1370897
283 -1370897 -1362270 -1338955 -1396549 -1336039 -1280336 -1265959 -1330387 -1357780 -1318704 -1314822 -1363884 -1338012
271 -1338012 -1412485 -1347253 -1253408 -1325974 -1298713 -1288885 -1262863 -1238908 -1374120 -1297000 -1340905 -1382302
259 -1382302 -1299138 -1322268 -1370626 -1327371 -1289230 -1282455 -1297128 -1349256 -1311558 -1340150 -1343140 -1294592
247 -1294592 -1402603 -1317371 -1292421 -1341669 -1314737 -1330715 -1284761 -1350642 -1297954 -1403596 -1335813
236 -1335813 -1384628 -1277400 -1203017 -1246934 -1285587 -1293278 -1278026 -1272080 -1345888 -1378107 -1275526 -1248722
224 -1248722 -1301796 -1321367 -1262886 -1334890 -1324190 -1286150 -1323076 -1365279 -1242245 -1323523 -1406504
213 -1406504 -1322995 -1273104 -1351533 -1252296 -1350963 -1338804 -1378315 -1245668 -1283946 -1247213 -1236715
202 -1236715 -1350694 -1305288 -1273210 -1281964 -1297781 -1365695 -1304698 -1188419 -1316916 -1378009 -1368080
191 -1368080 -1314572 -1153252 -1252340 -1281068 -1260078 -1265867 -1309697 -1349752 -1279785 -1305095 -1247993 -1274045
179 -1274045 -1255621 -1296510 -1331368 -1352994 -1273583 -1289929 -1336814 -1289537 -1380777 -1317449 -1295624 -1222832
167 -1222832 -1276671 -1244220 -1264414 -1339341 -1280433 -1325722 -1314486 -1313605 -1253355 -1322476 -1318884 -1323695
155 -1323695 -1388625 -1285389 -1262314 -1323169 -1260031 -1243299 -1367917 -1365415 -1332597 -1278211 -1322206
144 -1322206 -1417479 -1304621 -1244464 -1372267 -1318881 -1374060 -1297575 -1288465 -1256563 -1252567 -1249693 -1320445
132 -1320445 -1323012 -1298769 -1333020 -1403057 -1310092 -1272285 -1263482 -1286239 -1357863 -1311668 -1277897 -1304282
120 -1304282 -1295352 -1339636 -1244126 -1339629 -1342468 -1241934 -1418033 -1288757 -1319497 -1251063 -1231831
109 -1231831 -1273290 -1339235 -1352251 -1256569 -1296291 -1321804 -1244323 -1337526 -1317184 -1280733 -1328964 -1304759
97 -1304759 -1290198 -1323662 -1289128 -1283925 -1298427 -1371156 -1365139 -1307830 -1331841 -1253493 -1247848 -1240502 -1271598
84 -1271598 -1309184 -1343249 -1278905 -1342061 -1213229 -1244116 -1310339 -1297230 -1214235 -1180607 -1244965 -1254924
72 -1254924 -1284627 -1339273 -1310116 -1299122 -1330402 -1254901 -1297397 -1302060 -1257942 -1290774 -1303983 -1330514
60 -1330514 -1269958 -1255326 -1233539 -1264440 -1282892 -1286525 -1200190 -1262467 -1233677 -1290081 -1274910 -1221159
48 -1221159 -1298834 -1351107 -1259458 -1312012 -1292100 -1261879 -1351641 -1300632 -1339874 -1293959 -1251689 -1253234
36 -1253234 -1259339 -1291236 -1179302 -1312361 -1338573 -1236348 -1343960 -1352793 -1269827 -1294210 -1281721
25 -1281721 -1306129 -1326451 -1225254 -1294117 -1249381 -1314706 -1362204 -1326981 -1338049 -1278268 -1274895 -1320605
13 -1320605 -1312515 -1316824 -1275932 -1311508 -1332430 -1267869 -1266356 -1322730 -1320361 -1246324 -1268959 -1275273 -1240387
0 -1240387
$$ Imaginary data points
##PAGE= N=2
##DATA TABLE= (X++(I..I)), XYDATA
16383 -5576484 -5500419 -5410847 -5381769 -5334020 -5256676 -5202113 -5170716 -5130910 -5060060 -4996190 -4959474
16372 -4959474 -4806911 -4802869 -4753354 -4654852 -4670963 -4523140 -4477871 -4380950 -4370687 -4259183 -4235839
16361 -4235839 -4153025 -4085582 -3998052 -4008305 -3891509 -3848909 -3863884 -3784072 -3666536 -3698411 -3610364
16350 -3610364 -3491136 -3458218 -3432550 -3339788 -3308985 -3210249 -3219315 -3102368 -3069412 -2887271 -2904728
16339 -2904728 -2821671 -2815565 -2751849 -2753787 -2716798 -2518372 -2564755 -2440417 -2412085 -2330037 -2342990
16328 -2342990 -2245811 -2200668 -2145030 -2062107 -2019116 -1980141 -1967589 -1884585 -1822851 -1778606 -1698367
16317 -1698367 -1647025 -1621125 -1518936 -1581091 -1488153 -1465013 -1376867 -1394430 -1282732 -1218250 -1172614
16306 -1172614 -1044943 -1075282 -1018377 -946182 -963516 -824673 -807683 -688770 -689063 -665980 -561238
16295 -561238 -537867 -523600 -493828 -472830 -399273 -344430 -229209 -231610 -200487 -107898 -74022
16284 -74022 -96996 -17149 76010 83825 85914 168358 256330 229707 272145 302031 391797 371302
16272 371302 409522 511414 498246 585800 619001 669321 649720 763209 744521 871733 835454
16261 835454 924445 917191 931430 1062185 1023076 1025022 1107266 1164540 1185333 1269495 1256555 1337842
16249 1337842 1338705 1256520 1382552 1462561 1414838 1477436 1548955 1557102 1584604 1640486 1634162 1704192
16237 1704192 1727956 1841610 1782762 1787973 1901723 1862939 1912030 2008546 2015182 1880943 2079560
16226 2079560 2073273 2105074 2071856 2127761 2184227 2170858 2163144 2267256 2294225 2325023 2300293
16215 2300293 2371101 2406624 2404756 2410229 2466016 2476895 2548506 2524254 2568934 2560879 2528041 2592055
16203 2592055 2651118 2677623 2675702 2781646 2719199 2795943 2772637 2828555 2775550 2835702 2802302
16192 2802302 2859039 2900553 2823627 2839460 3068427 2988990 2967765 3004986 2997478 3029198 3066934
16181 3066934 2995982 3110248 3129598 3225157 3040295 3150011 3245974 3249457 3274628 3226925 3246637
16170 3246637 3266757 3258422 3282886 3186021 3339738 3261009 3212617 3296737 3388864 3344716 3338722
16159 3338722 3363879 3364190 3381466 3582335 3445175 3475206 3463503 3429988 3480067 3499898 3453415
16148 3453415 3447210 3504551 3577206 3486148 3528685 3542276 3562844 3557305 3595095 3558580 3635405 3627149
16136 3627149 3649803 3624669 3589990 3634401 3621663 3718958 3681420 3690629 3650859 3739626 3748370 3688587
16124 3688587 3664196 3765752 3759598 3768629 3728340 3854709 3694798 3846021 3752470 3737915 3773685
16113 3773685 3801240 3732238 3859173 3768017 3777903 3794093 3844853 3823627 3813130 3793870 3915236
16102 3915236 3856623 3871126 3921226 3891277 3779719 3849143 3805888 3919031 3887920 3905119 3949180
16091 3949180 3880337 3976945 4010318 3890277 4095173 3885980 3896627 3861014 3885283 3855214 3971552
16080 3971552 4004245 3962550 3975771 3862880 3903887 3991783 3876082 3896734 3906566 3947343 3915261
16069 3915261 3955579 3914254 3983120 3977631 3826505 3939708 3864858 4013935 3915039 3906306 3954535
16058 3954535 4027056 4071155 3938917 3994216 4009238 4000207 4010519 4019887 4013360 4136930 4001145
16047 4001145 3970801 3990440 3965656 4016651 3935193 3954134 4026508 3967085 3965298 3911248 3929094
16036 3929094 3994037 3970313 3899968 3937569 3911412 3914004 4035928 3975522 3920868 4019689 4019777 3980404
16024 3980404 3977113 4129234 3991252 4061199 4036167 3987117 4016774 4028816 4008042 4047788 4023094
16013 4023094 4103331 4077233 4040954 4021649 4106874 3981844 3948113 4046013 4040959 4019692 4043399
16002 4043399 4021334 3991285 3993135 4100658 4049880 4063528 4076891 3975549 3951494 3969464 3998358
15991 3998358 4035698 3996485 3997343 4036705 3992006 4039829 3988251 4054660 4094245 4074100 3954899
15980 3954899 4010935 4067627 4023897 3987816 4029293 4000689 4113962 4010702 4064944 4007342 4023075
15969 4023075 4044608 4129448 4064267 4013354 4036242 4018387 4058844 4089095 4111471 4111744 3953920
15958 3953920 4054273 4112042 4110818 4018610 4043979 4053644 4064961 4098943 4058517 3927203 3929779
15947 3929779 4067795 4035690 4032135 4128792 4108763 4003121 4150670 4140614 4096700 4117500 4119536
15936 4119536 4050548 4103158 4085730 4034639 4009262 4065085 4063920 4035368 4014465 3999230 4062079
15925 4062079 4110782 4103777 4119533 4009357 3966423 4078382 4156691 4035846 4164565 4084790 4084472
15914 4084472 4031953 4017609 4016495 4100742 4110507 4008743 4085253 4045110 4014816 4010047 4141374
15903 4141374 4076446 4096237 4083974 4137712 4079549 4075360 3999017 4083152 4074739 4070782 4083885 4128120
15891 4128120 4091046 4158233 4178732 4018635 3973711 4065674 4045910 4088989 4027704 4101274 4114785
15880 4114785 4092376 4004104 4119533 4043517 4093186 4097570 4059347 4109793 4064385 4030246 4092809
15869 4092809 4016455 4072099 4146722 4045540 4097756 4116569 4127127 4094686 4113225 4138444 4129721
15858 4129721 4054412 4067408 4087500 4148479 4192303 4098696 4020758 4013616 4058885 4091340 4032959
15847 4032959 4163032 4058872 4071265 4067219 4054044 4024909 4078264 4026649 4100751 4048499 4116143
15836 4116143 4122238 4071871 4088282 4104285 4079470 4202379 4088706 4181971 4086727 4050439 4081652
15825 4081652 4120060 4081809 4140320 4125980 4056017 4059654 4047163 4059782 4144716 4192807 4140129
15814 4140129 4132508 4148935 4089921 4065617 4104815 4122986 4098843 4163979 4174282 4160554 4135713
15803 4135713 4074310 4093269 4112656 4056127 4155447 4117793 4092917 4124967 4112271 4063839 4099238
15792 4099238 4238871 4051569 4090644 4089427 4088973 4063830 4051875 4089415 4114892 4093311 4081296
15781 4081296 4155390 4148608 4085004 4033460 4105632 4200243 4066495 4132989 4200741 4076849 4162284
15770 4162284 4068201 4208528 4228186 4040828 4105175 4137994 4146526 4008181 4072230 4071862 4152681
15759 4152681 4113110 4175491 4188006 4176851 4078594 4176218 4078653 4113599 4043691 4142842 4133108
15748 4133108 4226027 4076207 4203078 4057773 4101722 4133289 4060011 4116496 4081264 4160143 4157827
15737 4157827 4073952 4129056 4073143 4114855 4168601 4194045 4145396 4094516 4098738 4107842 4142477 4117162
15725 4117162 4091938 4149234 4170062 4160438 4053307 4195040 4100507 4135967 4097449 4101896 4129344
15714 4129344 4172704 4111446 4113676 4071332 4107072 4171606 4203075 4101333 4120448 4210272 4126325
15703 4126325 4174309 4117433 4204281 4127302 4172390 4114217 4095170 4108244 4194014 4125457 4123488
15692 4123488 4152071 4129749 4146882 4080109 4149529 4152694 4142701 4229296 4170183 4220970 4158839 4210372
15680 4210372 4168894 4192156 4134595 4192308 4147219 4157946 4092872 4154103 4150127 4258685 4226202
15669 4226202 4142550 4203675 4184854 4154943 4216529 4151978 4139594 4232313 4219831 4189459 4171615
15658 4171615 4195233 4101437 4203710 4103774 4126590 4140172 4083075 4260987 4148476 4152540 4175223
15647 4175223 4051811 4093388 4162174 4162644 4193259 4208765 4196261 4176784 4152245 4123230 4153851
15636 4153851 4142068 4175982 4028729 4146224 4137573 4131592 4200824 4145776 4207239 4189513 4193516
15625 4193516 4104791 4172839 4268043 4137898 4071287 4124161 4175049 4192781 4236267 4213963 4198896
15614 4198896 4124591 4127431 4141200 4163325 4160331 4148864 4169859 4116495 4108050 4222182 4207501 4155898
15602 4155898 4201118 4164094 4113791 4196031 4178299 4085177 4054819 4200164 4177200 4210528 4168766
15591 4168766 4215805 4190275 4270686 4259085 4150948 4202687 4146748 4261452 4266044 4153708 4251509
15580 4251509 4239017 4213164 4188608 4210020 4231836 4105240 4203189 4170714 4163025 4081154 4276456
15569 4276456 4105784 4151711 4151116 4240899 4206933 4143508 4228809 4220566 4219845 4177371 4186792 4180842
15557 4180842 4239345 4268687 4193086 4155340 4130022 4299557 4153962 4121471 4174676 4189131 4227819
15546 4227819 4251881 4276559 4234771 4197716 4316698 4175626 4196306 4172141 4169585 4198822 4249404
15535 4249404 4214413 4211441 4301084 4184416 4275652 4280210 4138319 4165323 4226688 4170068 4188684
15524 4188684 4125579 4257787 4261352 4180300 4238248 4234294 4178033 4226654 4253542 4258099 4234283 4223725
15512 4223725 4229871 4187900 4285478 4187812 4266116 4277662 4172395 4163123 4226285 4245516 4182744
15501 4182744 4141354 4238509 4201522 4234238 4231583 4124756 4213935 4261231 4255583 4251993 4163619 4179803
15489 4179803 4105957 4281499 4176661 4248312 4233718 4224938 4160579 4259181 4266282 4222932 4254492
15478 4254492 4212691 4206937 4233040 4310065 4239135 4224251 4169067 4165758 4279709 4144083 4166445
15467 4166445 4184460 4287876 4309215 4189123 4241887 4230315 4224466 4206317 4258814 4105961 4221152
15456 4221152 4173272 4233471 4236846 4221021 4195147 4313900 4179355 4221928 4225248 4221576 4329773
15445 4329773 4224383 4172963 4243277 4156552 4186987 4309430 4192271 4194958 4263925 4246988 4262736
15434 4262736 4340984 4285507 4249522 4343418 4214607 4210019 4141835 4252060 4190585 4281391 4247844
15423 4247844 4256950 4241607 4223039 4276527 4273817 4189188 4266747 4288834 4211028 4209996 4198264 4294352
15411 4294352 4161519 4282101 4237578 4177811 4258137 4203807 4277502 4354323 4310622 4248849 4148944
15400 4148944 4235014 4224860 4235727 4226664 4177582 4229159 4287280 4197346 4205376 4171063 4265916 4233545
15388 4233545 4193491 4253820 4144872 4355285 4288634 4285283 4285097 4287914 4336421 4180293 4239878
$$ [...]
##END NTUPLES=NMR SPECTRUM
##END=
