##TITLE=abcd
##JCAMPDX= 6.0         $$ Bruker NMR JCAMP-DX V2.0
##DATA TYPE= NMR SPECTRUM
##DATA CLASS= NTUPLES
##ORIGIN= UXNMR, Bruker Analytische Messtechnik GmbH
##OWNER= root
$$ XWIN-NMR		Version 3.5
$$ Tue Aug 26 12:28:01 2025 Russian Standard Time (UT+4h)  servis@DPX200
##.OBSERVE FREQUENCY= 200.131235884673
##.OBSERVE NUCLEUS= ^1H
##.ACQUISITION MODE= SIMULTANEOUS
##.ACQUISITION SCHEME= undefined
##.AVERAGES= 32
##.DIGITISER RES= 18
##SPECTROMETER/DATA SYSTEM= spect
##.PULSE SEQUENCE= zg
##.SOLVENT NAME= CDCl3
##.SHIFT REFERENCE= (INTERNAL, CDCl3, 0, 16.4885)
##AUDIT TRAIL= $$ (NUMBER, WHEN, WHO, WHERE, WHAT)
$$ ##TITLE= Audit trail, XWIN-NMR		Version 3.5
$$ ##JCAMPDX= 5.01
$$ ##ORIGIN= Bruker BioSpin GmbH
$$ ##OWNER= servis
$$ F:\spectra/data/av/nmr/H1/1/pdata/1/auditp.txt
$$ ##AUDIT TRAIL=  $$ (NUMBER, WHEN, WHO, WHERE, WHAT)
(   1,<2025-08-26 12:27:31.28 +0400>,<servis>,<DPX200>,
      <created by zg, POWCHK disabled, PULCHK disabled
       configuration hash MD5:
       00 E9 B6 7A A2 85 ED C7 34 08 36 98 17 FE 4E 26
       data hash MD5: 32K
       95 BE 53 AA 4A 1E FD D7 B7 4C AC 28 71 6B C2 B9>)
(   2,<2025-08-26 12:27:32.93 +0400>,<servis>,<DPX200>,
      <Start of raw data processing
       efp BC_mod = 2 LB = 0.05 FT_mod = 6 PKNL = 1 PHC0 = -273.9419 PHC1 = 0.101552 SI = 16K 
       data hash MD5: 16K
       E6 50 DA 5D 09 FD 99 1A 60 1D 2C 1C 8E 73 95 00>)
$$ ##END=
$$ 
$$ hash MD5
$$ 7D D1 54 AF 7F F2 C8 29 09 37 34 33 35 5E EB CC
##$RELAX= 
##$RELAX= 
##$RELAX= 
##$RELAX= 
##$RELAX= 
##$RELAX= 
##$RELAX= 
##$RELAX= 
$$ Bruker specific parameters
$$ --------------------------
##$DU= <F:\spectra>
##$EXPNO= 1
##$NAME= <H1>
##$PROCNO= 1
##$TYPE= <nmr>
##$USER= <av>
##$AMP= (0..31)
100 100 100 100 100 100 100 100 100 100 100 100 100 100 100 100 100 100 
100 100 100 100 100 100 100 100 100 100 100 100 100 100 
##$AQSEQ= 0
##$AQ_mod= 1
##$AUNM= <au_zg>
##$AUTOPOS= <>
##$BF1= 200.13
##$BF2= 200.13
##$BF3= 200.13
##$BF4= 200.13
##$BF5= 500.13
##$BF6= 500.13
##$BF7= 500.13
##$BF8= 500.13
##$BYTORDA= 1
##$CFDGTYP= 0
##$CFRGTYP= 5
##$CHEMSTR= <none>
##$CNST= (0..31)
1 1 145 1 1 1 1 1 1 1 1 1 1 1 1 1 1 1 1 1 1 1 1 1 1 1 1 1 1 1 1 1 
##$CPDPRG= <>
##$CPDPRG1= <>
##$CPDPRG2= <>
##$CPDPRG3= <>
##$CPDPRG4= <mlev>
##$CPDPRG5= <mlev>
##$CPDPRG6= <mlev>
##$CPDPRG7= <mlev>
##$CPDPRG8= <mlev>
##$CPDPRGB= <>
##$CPDPRGT= <>
##$D= (0..31)
0 2 0 0 0 0 0 0 0 0.06 0 0 0 0 0 0 0.0002 0 0 0 0 0 0 0 0 0 0 0 0 0 0 
0 
##$DATE= 1756196850
##$DBL= (0..7)
120 120 120 120 120 120 120 120 
##$DBP= (0..7)
150 150 150 150 150 150 150 150 
##$DBP07= 0
##$DBPNAM0= <>
##$DBPNAM1= <>
##$DBPNAM2= <>
##$DBPNAM3= <>
##$DBPNAM4= <>
##$DBPNAM5= <>
##$DBPNAM6= <>
##$DBPNAM7= <>
##$DBPOAL= (0..7)
0.5 0.5 0.5 0.5 0.5 0.5 0.5 0.5 
##$DBPOFFS= (0..7)
0 0 0 0 0 0 0 0 
##$DE= 6
##$DECBNUC= <off>
##$DECIM= 32
##$DECNUC= <off>
##$DECSTAT= 4
##$DIGMOD= 1
##$DIGTYP= 9
##$DL= (0..7)
0 120 120 120 120 120 120 120 
##$DP= (0..7)
150 150 150 150 150 150 150 150 
##$DP07= 0
##$DPNAME0= <>
$$ [...]
##$SUBNAM4= <"">
##$SUBNAM5= <"">
##$SUBNAM6= <"">
##$SUBNAM7= <"">
##$SUBNAM8= <"">
##$SUBNAM9= <"">
##$SW= 20.6817932712277
##$SWIBOX= (0..15)
0 0 3 0 0 0 0 0 0 0 0 0 0 0 0 0 
##$SW_h= 4139.07284768212
##$TD= 32768
##$TD0= 1
##$TE= 0
##$TE2= 300
##$TE3= 300
##$TEG= 300
##$TL= (0..7)
0 120 120 120 120 120 120 120 
##$TP= (0..7)
150 150 150 150 150 150 150 150 
##$TP07= 0
##$TPNAME0= <>
##$TPNAME1= <>
##$TPNAME2= <>
##$TPNAME3= <>
##$TPNAME4= <>
##$TPNAME5= <>
##$TPNAME6= <>
##$TPNAME7= <>
##$TPOAL= (0..7)
0.5 0.5 0.5 0.5 0.5 0.5 0.5 0.5 
##$TPOFFS= (0..7)
0 0 0 0 0 0 0 0 
##$TUNHIN= 0
##$TUNHOUT= 0
##$TUNXOUT= 0
##$USERA1= <user>
##$USERA2= <user>
##$USERA3= <user>
##$USERA4= <user>
##$USERA5= <user>
##$V9= 5
##$VALIST= <valist>
##$VCLIST= <CCCCCCCCCCCCCCC>
##$VD= 0
##$VDLIST= <DDDDDDDDDDDDDDD>
##$VPLIST= <PPPPPPPPPPPPPPP>
##$VTLIST= <TTTTTTTTTTTTTTT>
##$WBST= 1024
##$WBSW= 30
##$XGAIN= (0..3)
0 0 0 0 
##$XL= 0
##$YL= 0
##$YMAX_a= 2191123
##$YMIN_a= -2032107
##$ZGOPTNS= <>
##$ZL1= 120
##$ZL2= 120
##$ZL3= 120
##$ZL4= 120
##$ABSF1= 0
##$ABSF2= 0
##$ABSG= 0
##$ABSL= 0
##$ALPHA= 0
##$AQORDER= 0
##$ASSFAC= 0
##$ASSFACI= 0
##$ASSFACX= 0
##$ASSWID= 0
##$AUNMP= <proc_1d>
##$AZFE= 0.1
##$AZFW= 0.1
##$BCFW= 0
##$BC_mod= 2
##$BYTORDP= 0
##$COROFFS= 0
##$CY= 18.4799938201904
##$DATMOD= 1
##$DC= 0
##$DFILT= <>
##$DTYPP= 0
##$F1P= 9.9274215381318
##$F2P= -0.165520771350173
##$FCOR= 1
##$FTSIZE= 16384
##$FT_mod= 6
##$GAMMA= 0
##$GB= 0
##$INTBC= 1
##$INTSCL= 4.127829e-11
##$ISEN= 128
##$LB= 0.05
##$LEV0= 0
##$LPBIN= 0
##$MAXI= 10000
##$MC2= 0
##$MEAN= 0
##$ME_mod= 0
##$MI= 50
##$NCOEF= 0
##$NC_proc= -5
##$NLEV= 6
##$NOISF1= 3.799351
##$NOISF2= 2.8
##$NSP= 0
##$NTH_PI= 0
##$NZP= 0
##$OFFSET= 16.48848
##$PC= 4
##$PHC0= -273.9419
##$PHC1= 0.101552
##$PH_mod= 1
##$PKNL= yes
##$PPARMOD= 0
##$PSCAL= 4
##$PSIGN= 0
##$REVERSE= no
##$SF= 200.130005582386
##$SI= 16384
##$SIGF1= 3
##$SIGF2= 2
##$SINO= 400
##$SIOLD= 16384
##$SREGLST= <1H.CDCl3>
##$SSB= 0
##$STSI= 16384
##$STSR= 0
##$SW_p= 4139.07284768211
##$SYMM= 0
##$S_DEV= 0
##$TDeff= 32768
##$TDoff= 0
##$TI= <>
##$TILT= no
##$TM1= 0
##$TM2= 0
##$TOPLEV= 0
##$USERP1= <user>
##$USERP2= <user>
##$USERP3= <user>
##$USERP4= <user>
##$USERP5= <user>
##$WDW= 1
##$XDIM= 16384
##$YMAX_p= 355495965
##$YMIN_p= -1859121
$$ End of Bruker specific parameters
$$ ---------------------------------
##NTUPLES= NMR SPECTRUM
##VAR_NAME=  FREQUENCY,     SPECTRUM/REAL,   SPECTRUM/IMAG
##SYMBOL=    X,             R,               I
##VAR_TYPE=  INDEPENDENT,   DEPENDENT,       DEPENDENT
##VAR_FORM=  AFFN,          ASDF,            ASDF
##VAR_DIM=   16384,         16384,           16384
##UNITS=     HZ,            ARBITRARY UNITS, ARBITRARY UNITS
##FACTOR=    0.252644378177508, 1,           1
##FIRST=     3299.83951724647, 0,            0
##LAST=      -839.233330435636, 0,           0
##MIN=       -839.233330435636, -1859121,    0
##MAX=       3299.83951724647, 355495965,    0
$$ Real data points
##PAGE= N=1
##DATA TABLE= (X++(R..R)), XYDATA
$$ [...]
6686c70020J8409R9904j43602N97J10476q308m6448p2772l719O2620L7253O2293
6674b53317o5889O6662j01640J27386o9439j17156N4228J9768m8800Q8302j808
6663c01703n770L1843n8669K3881K7840m7442R57P904j6406m622J9581L475Q122
6650c11009n5460O2983l6770K2210K1896n1989q9149J36665o9283O5881k6500
6639c30525n5421R1091K4334j43565P8134j4765L508o113R1705p6117m4746K4176
6627c58304o7771J02669r2375J29339j26867N6157K3832l7308k0264j2694J9818
6616c83768R464M0773q493q286J0676j3890J4926k35J4462j18190J57498q8462
6604c73525K9152m8868L1821J6702o2723J3668n9942K4380l6863O8458O8051n2353
$$ y = [-370020, -351611, -251707, -395309, -394712, -284236, -292544, -338992, -411764, -415483, -352863, -315610, -253317, -319206, -252544, -354184, -226798, -296237, -413393, -359165, -339397, -388197, -299895, -301703, -307473, -275630, -334299, -310418, -282578, -330020, -329063, -321159, -337565, -342187, -322606, -319131, -311009, -366469, -303486, -340256, -318046, -296150, -348139, -437288, -300623, -369906, -304025, -330525, -385946, -294855, -270521, -414086, -335952, -350717, -347209, -353322, -261617, -337734, -382480, -358304, -426075, -323406, -415781, -286442, -413309, -357152, -333320, -370628, -390892, -403586, -383768, -374304, -333531, -342024, -350310, -339634, -353524, -338598, -338833, -324371, -442561, -285063, -373525, -344373, -393241, -361420, -344718, -407441, -393773, -453715, -429335, -466198, -397740, -329689, -382042]
6592c82042Q7752j03219P5821q3282J15676M1485p4112l2723L0855J3625j05189
6581d15353J32245n6899l804L3709r6849J62195j60286J31320j52681L9031j6745
6570d04117K3772J01729p8363N18q1265J8542P2315J9737o7106M5256n6495L8186
6558c67291M2778n3200l8115N1524J7318N622K4477l5240k2778k4113L2892K7001
6546c39125R544L1521j25950J14074j37565J16297N8241j30452K4028K9519K0988
6535c28880O1950n5190o8851J08273p1425O9710L8646j33636j1098Q0094J8799
6524b91608n0793k8059J9912l7149O9485q1274N4468r341n8527K8905j2834J52516
6512b44299j08681j1786M4357j22923J00801J5610o0001r640L1040K3775J03797
$$ y = [-382042, -294290, -397509, -321688, -404970, -289294, -247809, -321921, -354644, -323789, -310164, -415353, -283108, -340007, -343811, -310102, -406951, -244756, -405042, -273722, -426403, -387372, -404117, -380345, -278616, -356979, -356461, -437726, -419184, -346869, -327132, -394238, -348982, -405477, -367291, -324513, -377713, -415828, -364304, -346986, -341364, -316887, -352127, -374905, -399018, -366126, -339125, -329581, -298060, -424010, -309936, -447501, -331204, -272963, -403415, -379387, -349868, -328880, -266930, -322120, -390971, -282698, -354123, -284413, -245767, -379403, -390501, -310407, -291608, -342401, -370460, -350548, -387697, -318212, -399486, -345018, -354359, -412886, -383981, -396815, -244299, -352980, -364766, -320409, -443332, -342531, -326921, -386922, -396562, -365522, -341747, -237950]
6501b37950l1869j04964M0040j127m2691J2324j8463M3123K0322j5484l2192j1941
6489c80872L4621J399P3515o3761q046L7420N416K819n4902J0784n612K8622L5301
6476b83296N1749r2170O3821K7860q2758K938n7719O2814j0320m1901N6570O2007
6464b40405q3190L7599j2463k403j21614J36299j8590R134q4436Q5645o7888k8546
6452c90858K34032j09561q6270N5343j24906R1222O5453L115p6077l4862Q0138
6441b93231n5252o7757M6756j6858J12291r4223j335P7166o3977K4456O777J2981
6429c12206k0214o0390M8741M3986k6478M2581r4720R3938m4631O2540n6128q7770
6417d10751J62515K223n3436L9788j8749j59652K98315l01100N0086J14571q0597
$$ y = [-237950, -269819, -374783, -334743, -335870, -378561, -366237, -384700, -341577, -321255, -336739, -368931, -380872, -346251, -344852, -271337, -335098, -343144, -305724, -300308, -297489, -352391, -341607, -347219, -318597, -283296, -231547, -323717, -259896, -232036, -314794, -311856, -369575, -306761, -317081, -358982, -302412, -240405, -323595, -285996, -298459, -300862, -422476, -286177, -304767, -295633, -380069, -294424, -362312, -390858, -156826, -266387, -352657, -297314, -422220, -330998, -265545, -262430, -338507, -373369, -293231, -348483, -416240, -369484, -386342, -274051, -368274, -369609, -292443, -356420, -331964, -325187, -312206, -332420, -392810, -344069, -300083, -326561, -283980, -378700, -284762, -329393, -266853, -322981, -410751, -248236, -246013, -299449, -259661, -278410, -438062, -139747, -440847, -390761, -276190, -356787]
6406c56787N4427j7194M8368l9205j903J8176J9067K5237o689j01539L9821K9109
6394b89112K085L9729q8365J488j0512P4646r7655l5687J11273k3628O439N7986
6382b51313m1793p4691Q3394j3719J26824r5258N5011j35311L1339N1906P9667
6371a83944r9036K3526p0571L1592N554M3382j4861m6506K8891K7000J2963K4516
6359b17494k1079o736r7812K0985M2037p449P8786r6619L1240M1631k8994o309
6347b67813P3393j08389R1783n7494J8470N5444N9266m8448j5478j37652P5824
6336b61094J7330j5823j1730J34640r5372p1935O442O7686l6294O8061p4453J47729
6324a24813r6065L154M7451j5857O206r5924R845Q2317n3882J29551P9296j16748
$$ y = [-356787, -302360, -319554, -271186, -310391, -312294, -294118, -275051, -249814, -256503, -358042, -318221, -289112, -287027, -247298, -335663, -334175, -344687, -270041, -367696, -403383, -292110, -315738, -309299, -251313, -293106, -367797, -284403, -298122, -171298, -266556, -211545, -346856, -315517, -263611, -183944, -282980, -259454, -330025, -298433, -292879, -249497, -264358, -310864, -281973, -254973, -242010, -217494, -238573, -245309, -343121, -322136, -280099, -287548, -208762, -305381, -274141, -232510, -261504, -267813, -194420, -302809, -211026, -268520, -250050, -194606, -135340, -183788, -199266, -336918, -261094, -243764, -259587, -271317, -136677, -232049, -303984, -297542, -229856, -266150, -198089, -272542, -124813, -220878, -217724, -170273, -186130, -179924, -275848, -266003, -183686, -237568, -108017, -28721, -145469]
6312a45469M0127k7712k9895N1202k4638j0347J53252Q152q1818j07432N9103
6301a15475M6126J3169m586o670M2197J9264l9897j21024M8678O209M005J64037
6289E6033l2939J2660N7334o0944J1808N685r0368l402P603L1799J1608Q7446
6277I4323L0937K7942L3518l4711M0389p0186M2543p7744J59557q0046j0794j0358
6265A45370m9728J0809P8156N9444R5856r677n7194Q6011j0662L9593j49583K3387
6253B61782J3340P9620O305r635m8056J16559J6486M7651r6202M8932m9195M5312
6241D32899N5164O6758L568m905M3634P3426m4624R7222Q7699M4382j488N6489
6229I10224P3149R823N5131l7382N4591J57056M3378N1871P0939j625O3968j5339
$$ y = [-145469, -105342, -133054, -162949, -111747, -136385, -146732, 6520, 14672, -67146, -174578, -115475, -69349, -56180, -60766, -67436, -25239, -5975, -45872, -166896, -118218, -112009, -108004, 56033, 23094, 35754, 93088, 32144, 43952, 49637, -40731, -44133, -36530, -4731, 6877, 94323, 125260, 153202, 186720, 152009, 192398, 122212, 164755, 87011, 246568, 166522, 155728, 145370, 95642, 106451, 184607, 244051, 339907, 330230, 273036, 359047, 348385, 387978, 238395, 261782, 275122, 354742, 361047, 351412, 303356, 419915, 436401, 484052, 387850, 436782, 387587, 432899, 488063, 554821, 558389, 553484, 597118, 670544, 625920, 723142, 810841, 855223, 853735, 910224, 983373, 993196, 1048327, 1010945, 1065536, 1222592, 1265970, 1317841, 1388780, 1387155, 1451123, 1435784]
6217A435784N7827j14777n5326Q2944k5095j6252r4160m8332J37780j03140j00646
6206A156607n9130n1604j23384Q3170o8539j14926r3213K3675j11729k1932p4999
6195E43996M1054n1758j84384J40627j62781m3872o2073J05550j20429Q2261k4053
6184B64138j19168j0239j5574j5884n1479j7973P7507L2139m8488J8198L2784
6173A45961j0693n9465Q860j08332Q9934l6763m5950j94514K71834j57318k0574
6162a17020m9524K5457j3538N4669N7895k0593k7547m9372n2844J18266k0024
6151i4175r5777j1776r515P4305J18246j10820n6005M143P0982o259j9064j58901
6139b94616J83518j40840M6287J30306p6413K8601p0207l3350L6538J6578N617
$$ y = [1435784, 1493611, 1378834, 1323508, 1406452, 1381357, 1365105, 1270945, 1222613, 1360393, 1257253, 1156607, 1097477, 1045873, 922489, 1005659, 937120, 822194, 728981, 752656, 640927, 618995, 543996, 585050, 533292, 348908, 489535, 326754, 282882, 220809, 326359, 205930, 288191, 264138, 144970, 134731, 119157, 103273, 51794, 33821, 111328, 143467, 94979, 113177, 145961, 135268, 75803, 84663, -23669, 66265, 29502, -16448, -210962, 60872, -96446, -117020, -166544, -141087, -154625, -99956, -42061, -62654, -90201, -139573, -192417, -74151, -94175, -189952, -201728, -211243, -136938, -18692, -129512, -185517, -181374, -110392, -116651, -135715, -294616, -111098, -251938, -205651, -75345, -151758, -123157, -193364, -226714, -190176, -173598, -167981]
6128a67981J9656j4714r2222P5565q1611N4600J5554m8116P7497N60k1004O2479
6116a19737n9194J2583j17271N5386L7535J4762N1587j01941K07L6692j37154
6105c26545J60970k8093o9585P6556J6433J1988k4245M9879j23629o5165J15291
6094b06145j14732R9261L4592n7021k1743R9716r2311O010R8970k0265l3908j26368
6082c33944J69417j06627J3892k0636j186J73803j10666l5914P0040p4634M7902
6071b08553L8766j22909O2442j7353m5960J06497r3019M1213N1141j2840k157
6060b02732p630j2318m6955l8731K3214P7828k6164O295n8915O1602k030r331
6048b35867n0732K8974j8378O9148j8834J2039R7210p4607p5954N7021j3306l8619
$$ y = [-167981, -148325, -163039, -255261, -179696, -261307, -206707, -191153, -239269, -161772, -161212, -182216, -119737, -178931, -166348, -283619, -228233, -190698, -175936, -124349, -226290, -226083, -189391, -326545, -165575, -193668, -263253, -186697, -170264, -158276, -182521, -132642, -256271, -321436, -206145, -320877, -221616, -187024, -244045, -265788, -166072, -258383, -252373, -153403, -173668, -207576, -333944, -164527, -271154, -257262, -277898, -279084, -105281, -215947, -251861, -181821, -256455, -208553, -169787, -292696, -230254, -247607, -293567, -187070, -280089, -238876, -187735, -200575, -202732, -210362, -222680, -269635, -308366, -285152, -207324, -233488, -227193, -286108, -224506, -226536, -235867, -286599, -257625, -276003, -206855, -225689, -213650, -116440, -191047, -267001, -209980, -223286, -261905]
6036b61905m4987J46828j50510Q3109l3441M5159j11887J49097r6769J2482O1119
6025b01705k9923J8778N2867p3986K9446j11378J45743o3964r084N9272l3103
6014b17037n5765R0218j18528N910K8177J37684j04427j8968j5692L3877M6075
6003a88476l7278o6679J10335J2363j26250Q3865L8892m1583n22k9097r883R4986
5991a59327j47043m0539O7532k5279k8546Q3926L5995j3596j475J6118k5466M5207
5979a92493j46965J58614o9529J16884r7415K5535L2063m3449q2995J01869q488
5968b06369o74j8465n8829P6802L1101p1744M0745J9672N1876m9667j1004Q395
5956a88161p1466M4444q5522R6901J0281n6467P3592p1309n7406n940J70395j17861
$$ y = [-261905, -306892, -160064, -310574, -227465, -260906, -215747, -327634, -178537, -275306, -262824, -201705, -231628, -212850, -159983, -233969, -204523, -315901, -170158, -234122, -243206, -183934, -217037, -272802, -182584, -301112, -295202, -267025, -129341, -233768, -252736, -268428, -234551, -188476, -225754, -292433, -182098, -169735, -295985, -212120, -173228, -214811, -215333, -244430, -254313, -159327, -306370, -346909, -279377, -304656, -333202, -249276, -213281, -226877, -228352, -212234, -237700, -192493, -339458, -180844, -250373, -133489, -230904, -205369, -173306, -216755, -299750, -197881, -206369, -207043, -225508, -284337, -207535, -176434, -248178, -207433, -187761, -135885, -185552, -196556, -188161, -259627, -215183, -300705, -203804, -193523, -249990, -176398, -247707, -305113, -311053, -140658, -258519]
5944b58519j5720P1770q0609R6558o832k5451M4662p402M6532m971L3515n6758
5932a63225j47186M9474N3097J0198l4075o432J47445q6210k1875l6394l8222
5921b73405M4755M9994J0588j05411P0004M0958m5209L2043J4566K0127p2556
5910b13546L5446l8186O5586j13841P5018M2308m7582l8405M7426Q293N447l6712
5898b08748L6947r2826P0068L4468m0915N9617j1255k0025J7321q3727J01175
5887a37900p6394M3059l6198j5684l122j3558P4601k7414L1486j2438o9987J04627
5875a38922j66737J76803r4948J47152j27918R3031p5847M2894n3272p7171J72844
5864a02091k0106j12436j8285J28682m2298K8193l1129L0292l4438K8422J6391
$$ y = [-258519, -274239, -202469, -283078, -186520, -193352, -218803, -174141, -181543, -135011, -139982, -106467, -163225, -310411, -260937, -207840, -197642, -231717, -238149, -90704, -176914, -198789, -235183, -273405, -228650, -178656, -168068, -273479, -203475, -162517, -207726, -175683, -161117, -140990, -213546, -178100, -216286, -150700, -264541, -189523, -147215, -194797, -233202, -185776, -177483, -172036, -208748, -171801, -264627, -194559, -160091, -201006, -141389, -152644, -172669, -155348, -239075, -137900, -214294, -171235, -207433, -223117, -226239, -239797, -165196, -192610, -161124, -173562, -243549, -138922, -305659, -128856, -223804, -76652, -204570, -111539, -187386, -144492, -197764, -274935, -102091, -122197, -234633, -252918, -124236, -166534, -138341, -169470, -139178, -173616, -145194, -128803]
5853a28803l2083n7421j2563k1395J89433j12608J21711j9203l8962o9179J6923
5842a64150L629L6301k2500o2035O7252Q024j4429k7175J3103N0728p9393R1004
5830i9641l735l9545R169l0453j1449L1170l6946K4917k8592J23600q9288N3168
5818i7625j7013J28759j51815j7440K9835j3283M9462R5404j02831J9879q4648
5807a61316M1889n2524K6405n3016M2724Q265R3496o0694l1913O9910j06957J37652
5795d6079r9960J3431k2904N7225J9557k0797K4311l5947Q6066q8805K6291l8789
5783a26400J26681j40242p933J03778m7136J13508l2377o3049o0521L0676Q586
5772i4429L9193n83k2817O1548k7252J9634k9688J02699r7133Q007l4662L9145
$$ y = [-128803, -160886, -218307, -230870, -252265, -62832, -175440, -53729, -72932, -111894, -181073, -164150, -160521, -124220, -146720, -208755, -141503, -133479, -147908, -175083, -161980, -111252, -190645, -99641, -103376, -142921, -133752, -164205, -175654, -144484, -181430, -156513, -185105, -61505, -150793, -97625, -114638, 14121, -137694, -155134, -125299, -138582, -89120, 6284, -96547, -76668, -161316, -119427, -171951, -145546, -198562, -155838, -147573, -54077, -114771, -146684, -76774, -183731, -46079, -146039, -132608, -155512, -98287, -78730, -99527, -75216, -111163, -25097, -113902, -87611, -126400, 281, -139961, -147894, -44116, -91252, 22256, -10121, -73170, -133691, -103015, -94429, -55236, -55819, -78636, -17088, -44340, -24706, -54394, 48305, -48828, -40821, -75483, -36338]
5760c6338l3476k696k4827L9285K7304l7516j0996l2418K8760J8610p6597J18744
5748b2161m6292p2911O7217q72L6084L1982M3677j51223J23747l0740q8570L2784
5736g7278K08355j28546K7400n8213n6828R7252j34323N8472P0998n1756R4817
5725E0350p8048J26564r5536o4857k2065J81710l5359o0932n8525J12973p8083
5714b1808N6809O0492j06900K1620j8831k8013K1900k2238K3631j09507Q9546
5703c3299M9199p512J6117k9010N7115K3475o1307M2974n8341j663Q3145j7300
5691F3593L071J6655m7580Q2337J1933j10124N9754O3792j74520K2859L3174j2673
5679A2271n0483M7937p481L6323R1724J909q5092N1014l7891K5102N5387L4127
$$ y = [-36338, -69814, -72510, -97337, -58052, -30748, -68264, -79260, -111678, -82918, -64308, -140905, -22161, -68453, -141364, -74147, -75019, -38935, -6953, 36724, -114499, 9248, -21492, -110062, -77278, 131077, 2531, 29931, -28282, -85110, 12142, -122181, -63709, 7289, -44467, 50350, -27698, 98866, 3330, -61527, -83592, 98118, 62759, 1827, -56698, 56275, -21808, 35001, 95493, -11407, 10213, -8618, -36631, -14731, -36969, -13338, -122845, -33299, 15900, 8388, 24505, -4505, 52610, 76085, 14778, 57752, -589, -2252, 80893, 63593, 66664, 83319, 35739, 118076, 130009, 19885, 79639, 143431, -31089, -8230, 24944, 12271, -38212, 9725, 2244, 38567, 130291, 132200, 47108, 98122, 60231, 85333, 140720, 174847]
5667A74847K1525j20781K4959M214o0091R7199l1371j2739M8173R1367j27964
5656A09338l1071L2664J2549k926L4472K736p4970n388J00777j16906Q9595M753
5644A55623L876R2525n4314q1573J06872o1026j9760P3163j5048q0053R3115o6676
5632A46724L5118M0270j2069o2843Q0280J4325m5734O7752k3352L9091j11905
5621A67657P5760R5736n2621j54547R8642j09756K15104m1802k8457m8384M1648
5610B58980j1012J6711o2678J32720j93589J53299o9683R6596K4150n0407O1688
5599C56775n691k303j1012l0120M65j273O2651p0532L2445m0050N47K0193M762
5586C16857M5764o7814O4922O4597m4187j05647J52889j951r4516m7839M9962
$$ y = [174847, 196372, 75591, 100550, 104764, 44673, 141872, 110501, 97762, 145935, 237302, 109338, 78267, 110931, 123480, 120554, 155026, 157762, 82792, 77404, 178181, 61275, 150870, 155623, 159499, 252024, 197710, 116137, 223009, 161983, 142223, 215386, 200338, 120285, 213400, 146724, 181842, 222112, 210043, 147200, 227480, 241805, 196071, 263823, 240471, 279562, 167657, 243417, 339153, 286532, 131985, 230627, 120871, 335975, 294173, 265716, 217332, 258980, 247968, 264679, 202001, 334721, 141132, 294431, 224748, 321344, 345494, 295087, 356775, 351084, 348781, 337769, 307649, 308114, 306841, 369492, 298960, 331405, 291355, 291902, 312095, 316857, 362621, 294807, 359729, 424326, 380139, 274492, 427381, 425430, 330914, 283075, 333037]
5575C33037J05455m1866Q555K6212o2643J2481j4556l0079J31769R312n5580p6612
5563C45485N0578P7584l5481j05951J19832p969r74R021J8231Q9788j28195P8897
5551E10846L0193j34191J44593l6254m7282J37178r6487q6044K1158J16726l6700
5540E23736k7549J03383l2629j8397O7387q0542K7415R2178j31251n4121J22746
5529E92356O0734k7987K1239m9600L369L9020L1686N1539l6866l6431J4478L7487
5517G01024o5356Q3138L7140l1203J4758j1084n957M6010J2536P6418l4207Q2816
5505I06033o2720m0163M1039M3619r7136K0878M5571r1969J21637K4754n777O0525
5493I66291o3647K5709j1417N298p9050J04323K8506l6644M5790n0471J9976J5463
$$ y = [333037, 438492, 396626, 405181, 431393, 368750, 381231, 366675, 336596, 468365, 477677, 422097, 345485, 396063, 473647, 438166, 332215, 452047, 444078, 443104, 452125, 470356, 560144, 431949, 510846, 541039, 406848, 551441, 515187, 467905, 605083, 508596, 422552, 443710, 560436, 523736, 496187, 599570, 566941, 548544, 615931, 535389, 562804, 654982, 523731, 469610, 592356, 653090, 625103, 646342, 596742, 600111, 639131, 670817, 722356, 685490, 649059, 663537, 701024, 635668, 718806, 755946, 724743, 739501, 728417, 722460, 768470, 781006, 857424, 823217, 906033, 843313, 803150, 844189, 887808, 790672, 811550, 857121, 765152, 886789, 911543, 905766, 966291, 902644, 928353, 916936, 922234, 843184, 947507, 976013, 939369, 985159, 934688, 954664, 970127]
5481I70127R3357j14673R7941p1041J07170j8530K6548J9930l2334j47427J60262
5470A091330O880j57l6438P7222M56J02957r7358L8494N1266O8828l268K0983
5458A321195j14301J10279P7027j190N9158p3162L0642R511J2256l4397K7884
5447A424902N9932K8132O9050r0914K4463P3626r0737J76959m8254N9175J6633
5436A702967l7489J29015P34j47524J53065l2617O0508l6700J41482l5178N8115
5425A956378j0168Q7773k6330j9571J88486l9920m710J67353o8521Q9498k9593
5414B290675K5073n4303K21346r029J01135L8801j6459Q6498J09798N8807r1296
5403B761046J01275n237P0481J26642M185p107J29991J05791j3750J56913o4185
$$ y = [970127, 1063484, 948811, 1046752, 975711, 1082881, 1064351, 1090899, 1110829, 1078495, 931068, 1091330, 1098210, 1098053, 1061615, 1138837, 1139293, 1242250, 1144892, 1183386, 1234652, 1303480, 1300212, 1321195, 1206894, 1317173, 1394200, 1393010, 1452168, 1379006, 1409648, 1419159, 1431415, 1397018, 1424902, 1484834, 1512966, 1582016, 1491102, 1515565, 1589191, 1498454, 1675413, 1627159, 1686334, 1702967, 1665478, 1794493, 1795227, 1647703, 1800768, 1768151, 1828659, 1791959, 1933441, 1898263, 1956378, 1946210, 2033983, 2007653, 1988082, 2176568, 2136648, 2131938, 2299291, 2230770, 2320268, 2290675, 2315748, 2261445, 2482791, 2473762, 2574897, 2613698, 2597239, 2683737, 2793535, 2852342, 2761046, 2862321, 2857084, 2927565, 3054207, 3058392, 3051285, 3181276, 3287067, 3273317, 3430230, 3366045]
5392C366045J55548p614O7662J21285J03902k4083J28774P5182J01138j3830J26940
5381D200949N3203J19984j3675Q7027J76283O6036J42439K4978Q5686J02213K5795
5370E070918K35755M0144J46974J24394J04242P475R0874K05024R8075P2027J39292
5359F335194J47089J49594J91499J47123O5789K28071N3691J67264J57354J15399
5349G758067P9042J67593J25742K26770O5665J59463J86364R6902J95528J85853
5339I246989O5774L12826J2708J64599K58232J69443K28435J94131J81184K14674
5329A1048995O3132K56455K20027K18295K08126J78938K94524J11458L38377K39152
5319A3177479K31018K10414J90675K43115J98611K05232R4084L38695J73566J12325
$$ y = [3366045, 3521593, 3513979, 3581641, 3702926, 3806828, 3782745, 3911519, 3986701, 4087839, 4074009, 4200949, 4254152, 4374136, 4360461, 4447488, 4623771, 4689807, 4832246, 4857224, 4942910, 5045123, 5070918, 5306673, 5346817, 5493791, 5618185, 5722427, 5729902, 5820776, 6025800, 6123875, 6195902, 6335194, 6482283, 6631877, 6823376, 6970499, 7036288, 7264359, 7318050, 7485314, 7642668, 7758067, 7837109, 8004702, 8130444, 8357214, 8422879, 8582342, 8768706, 8865608, 9061136, 9246989, 9312763, 9625589, 9638297, 9802896, 10061128, 10230571, 10459006, 10653137, 10834321, 11048995, 11112127, 11368582, 11588609, 11806904, 12015030, 12193968, 12488492, 12599950, 12938327, 13177479, 13408497, 13618911, 13809586, 14052701, 14251312, 14456544, 14550628, 14889323, 15062889, 15175214]
5309A5175214L14217J36843J79831K56347J46173K34569K33269K54104K40835
5300A7171402J57541K95501J75660K16516K89964K36513L09711K38099K53443
5291A9344350K91350J99406L75559J03072M16847K69674J41986K61300K23734
5282B1627278K55842J95548J67962N9366K87218N4427N4404Q9661M9280l3034
5272B2807952m9451o0504k05325r4828k62218k00086l95596k57382l38019l11226
5262B0633317m32823n01109k93846m15260m49140n57122m35453l68504m19341
5253A6760719m00304n19911l80188l57512m90586l51049l50387l82607l46890
5244A3181285l55002l96731k52484l71098l04054l08041k86139l74103j85168
$$ y = [15175214, 15489431, 15626274, 15806105, 16062452, 16208625, 16443194, 16676463, 16930567, 17171402, 17328943, 17624444, 17800104, 18016620, 18306584, 18543097, 18852808, 19090907, 19344350, 19635700, 19835106, 20210665, 20313737, 20730584, 21000258, 21142244, 21403544, 21627278, 21883120, 22078668, 22246630, 22305996, 22593214, 22647641, 22702045, 22791706, 22840986, 22807952, 22758501, 22697997, 22492672, 22397844, 22135626, 21935540, 21539944, 21282562, 20944543, 20633317, 20200494, 19699385, 19405539, 18990279, 18541139, 17984017, 17548564, 17180060, 16760719, 16360415, 15840504, 15460316, 15102804, 14612218, 14261169, 13910782, 13528175, 13181285, 12826283, 12429552, 12177068, 11805970, 11501916, 11193875, 10907736, 10533633, 10348465]
5235A0348465k99623k67325k58911k22017j78043k93311k17661k69059j80413
5226H162102j71197k03607j64097k92705j02322j78351j07022l40456k08495j42220
5216F251630m7565j35227j7876l30553m7805k44713q7936q8006k42202K973l0188
5205D982532j27232k36146j0039r3178p4369j25893j29414L4303j89608l0982
5195C999974j05800k1750p0396l3602j68214J1316j03063m8612m0704O0079j16579
5184C362649q1604r5989R890J7383j33961o6655J6429p5299k5546N471j36920
5173B795848l3221m2698K7256k1375l8204j55826P3574p9858R00l9808j02255
5162B384333M7733p0376J35024k24124m016o3848m811k5733P4124r6914l4520
$$ y = [10348465, 10048842, 9781517, 9522606, 9300589, 9122546, 8829235, 8611574, 8342515, 8162102, 7990905, 7787298, 7623201, 7330496, 7228174, 7049823, 6942801, 6602345, 6393850, 6251630, 6204065, 6068838, 6050962, 5720409, 5672604, 5427891, 5339955, 5251949, 5009747, 5012720, 4982532, 4855300, 4619154, 4609115, 4515937, 4441568, 4315675, 4186261, 4220564, 4030956, 3999974, 3894174, 3872424, 3802028, 3768426, 3600212, 3611528, 3508465, 3459853, 3419149, 3479228, 3362649, 3281045, 3185056, 3194946, 3212329, 3078368, 3011713, 3028142, 2952843, 2927297, 2932768, 2795848, 2762627, 2719929, 2747185, 2725810, 2687606, 2531780, 2605354, 2525496, 2526396, 2486588, 2384333, 2432066, 2361690, 2496714, 2272590, 2268574, 2204726, 2199915, 2174182, 2248306, 2151392, 2116872]
5151B116872K656j6935j06205k7165q570k0588o5436O5530k2550l691m5911j8297
5139A849710K1710l2062o9095J6741N3899N7415j43203p6807J12848j22604l637
5128A664915j6375M2857m1076q193L8478j48842Q6162j11841J16030q4325r7475
5117A440315p53P3747m2402J15832j61652m551q717P376M6713k2400j02044k998
5105A338466P6555j14766Q2715j12290N0241n9048L8997n7039M5054k0258L4849
5094A303476o8449K3561q5583J13164j28492L5011n834o8708K8836J43382k0376
5083A269988r1151J9967k6725Q0571r7139K4220K2871q4058P735k7601P992J3389
5071A120059o368l6586K5700m3535r4674N3422N7492K0771n0823j0403M2933k2343
$$ y = [2116872, 2119528, 2102593, 1996388, 1969223, 1960653, 1940065, 1874629, 1940159, 1917609, 1913918, 1868007, 1849710, 1871420, 1839358, 1770263, 1787004, 1840903, 1898318, 1755115, 1678308, 1791156, 1668552, 1664915, 1648540, 1691397, 1650321, 1642128, 1680606, 1531764, 1617926, 1506085, 1622115, 1537790, 1440315, 1439562, 1513309, 1470907, 1586739, 1425087, 1420536, 1411819, 1419195, 1465908, 1443508, 1341464, 1338466, 1415021, 1300255, 1382970, 1270680, 1320921, 1261873, 1300870, 1243831, 1288885, 1268627, 1303476, 1235027, 1258588, 1173005, 1286169, 1157677, 1192688, 1186854, 1118146, 1146982, 1290364, 1269988, 1178837, 1198804, 1172079, 1252650, 1155511, 1179731, 1202602, 1118544, 1126279, 1098678, 1106670, 1120059, 1113691, 1077105, 1102805, 1059270, 964596, 1018018, 1075510, 1096281, 1045458, 1035055, 1077988, 1055645]
5059A055645j1726n658l0013L1436K6083n7801K5503M4088N8427j27963L8855
5048A046876p3637L9410q393J03297j57766J71310j12540L4311k0835j3025o328
5037A002680L8731N1634j23750N0768J45978o1784j42621M2140j32780J22266
5027I93262l0257o5426J45144p4756N472j2812K4566L2055n143J6799l9520J4647
5015A004031L3588M8990m8691q3881J5235J06657n8994j30984J01412j3301P4654
5004A048716j07650J808k56q9012N1561J25886j02596J2595k0523N0167P0873
4993A041569M6789r0990q8423J59646j79130L2231k7399L3559O2549n2162J1295
4982I49534K8315K1741k4324j4444R7599j31267K2398j15847J17441j5058l3286
$$ y = [1055645, 1043919, 1038261, 1008248, 1039684, 1065767, 1007966, 1033469, 1077557, 1135984, 1008021, 1046876, 973239, 1012649, 1004256, 1107553, 949787, 1121097, 1008557, 1042868, 1022033, 1009008, 1002680, 1041411, 1093045, 969295, 1020063, 1166041, 1104257, 961636, 1003776, 870996, 993262, 963005, 897579, 1042723, 967967, 973439, 960627, 985193, 1017248, 1012105, 1028904, 989384, 1004031, 1037619, 1086609, 1037918, 954037, 969272, 1075929, 1016935, 885951, 987363, 974062, 1048716, 941066, 942874, 942618, 853606, 905167, 1031053, 928457, 941052, 920529, 970696, 1041569, 1088358, 997368, 908945, 1068591, 889461, 921692, 894293, 927852, 990401, 938239, 949534, 977849, 999590, 975266, 960822, 1058421, 927154, 949552, 833705, 951146, 936088, 902802]
4971I02802k161O50q4794N3697P2550n9203N8159j33380P5196r1319R9372j6988
4959H74581N0925j5562j3167N8771j01430M3075R713m7334m4795J56680o4734
4948I06723m1849M7378j5413L9779l4514p6678O0691L2649k6489n7691J5134K991
4936H52711L1069P6792j72674Q2124j7171J347k3130K6636O9844k4812O9335k5179
4924I46892l9721N7907r5404M7268J4680m2742l6397K5931N6787o0710O5241o0077
4912H79655K739N322M5871Q609N853o4877j7820M7877p8820J00529j36776J45763
4900I43925J3235p0611J11663M91j51490M2772P0679o0504N9782q2877M9071q809
4888I17327L6279k4193K4950q3192J49874j08079J87446p2026l5474M7585r9436
$$ y = [902802, 900641, 901291, 816497, 870194, 942744, 883541, 941700, 808320, 883516, 792197, 891569, 874581, 925506, 909944, 896777, 955548, 854118, 897193, 906906, 859572, 814777, 971457, 906723, 864874, 912252, 896839, 936618, 902104, 825426, 886117, 918766, 892277, 834586, 849720, 852711, 883780, 960572, 787898, 870022, 852851, 854198, 831068, 857704, 927548, 902736, 972071, 946892, 907171, 965078, 869674, 916942, 931622, 888880, 852483, 878414, 935201, 874491, 939732, 879655, 882394, 887716, 933587, 942196, 948049, 883172, 865352, 913229, 834409, 934938, 798162, 943925, 957160, 886549, 998212, 998703, 847213, 889985, 960664, 900160, 959942, 877065, 926136, 917327, 953606, 929413, 954363, 871171, 1021045, 912966, 1100412, 1028386, 992912, 1040497, 941061]
4877I41061N334K5496n764Q7241m7993L0035P5056r9605j4452m302L1935J6579
4865A040621j7468l185L6521n7751M1840j0176J906L1686q2011L8267N7391j14394
4853I63247J24901k1822o0215J70777n5645N6491j8066p2926J4187j4024K0662
4842A107567L2773k7126k3696k3625J06822M1426o2088J5782P5545q8840R2469
4831A247009p4226p5566Q6623j39650R5460N7373m0380L0348L6015O4138J4122
4820A301266m8416N7407l0762k5679P4061K888j9165n4099n8549M9398R8760K4863
4808A371973n2184L3498j0027M1571n0216j8062M0371j03236N5227r2963J35660
4797A351612l4047O4210k8345L8144L4524m5411M700J6385m1464Q5915q1574k1625
$$ y = [941061, 946395, 971891, 966127, 1053368, 1005375, 1035410, 1110466, 1010861, 996409, 992107, 1024042, 1040621, 1023153, 1019968, 1056489, 998738, 1040578, 1030402, 1032308, 1063994, 981983, 1020250, 1077641, 963247, 1088148, 1066326, 1006111, 1176888, 1121243, 1177734, 1159668, 1086742, 1100929, 1086905, 1107567, 1140340, 1113214, 1089518, 1065893, 1172715, 1214141, 1152053, 1167835, 1243380, 1154540, 1247009, 1172783, 1097217, 1183840, 1044190, 1139650, 1197023, 1156643, 1186991, 1223006, 1287144, 1301266, 1252850, 1310257, 1279495, 1253816, 1327877, 1330765, 1311600, 1257501, 1198952, 1248350, 1347110, 1371973, 1319789, 1353287, 1343260, 1384831, 1334615, 1316553, 1356924, 1253688, 1308915, 1215952, 1351612, 1317565, 1381775, 1353430, 1391574, 1426098, 1380687, 1385387, 1401772, 1360308, 1446223, 1364649, 1343024]
4785A343024L1125J01481j07933J00184L2568l2329M1479p75n1618M1145j31934
4774A366417N8824q1415O8139J4032L2565k0462M6650L3896N9652q3692J33091
4763A627697j20339J0103j06442J23232l5188P5806O9541j03041p953L3933j7929
4752A549420O3118K1667o2332l5286J40480k0476k4344J3651m200k241j8496j3512
4740A607449Q7140N9333o5096L1461M4531k0167J3911j1963O5181L8603r5152
4729A755231R8171p5955P7088p630j8822r84k1986K4348r75R3350j31046J08370
4717A899160m7056L0009m6501R9843m3854J4068J24853r6719m7622M4747J27800
4706B058728J7619m9708m1779J25253M094K2064k5783j4623R6292k9015m1907
$$ y = [1343024, 1374149, 1475630, 1367697, 1467881, 1500449, 1468120, 1509599, 1508824, 1457206, 1498351, 1366417, 1425241, 1343826, 1411965, 1425997, 1458562, 1438100, 1484750, 1518646, 1578298, 1494606, 1627697, 1507358, 1517461, 1411019, 1534251, 1499063, 1574869, 1644410, 1541369, 1533416, 1567349, 1549420, 1612538, 1634205, 1571873, 1536587, 1677067, 1656591, 1632247, 1645898, 1641698, 1639457, 1620961, 1607449, 1694589, 1753922, 1688826, 1720287, 1764818, 1744651, 1758562, 1746599, 1811780, 1850383, 1755231, 1853402, 1777447, 1854535, 1846905, 1828083, 1827099, 1805113, 1829461, 1828486, 1921836, 1790790, 1899160, 1852104, 1882113, 1835612, 1935455, 1891601, 1905669, 2030522, 1933803, 1886181, 1930928, 2058728, 2076347, 2026639, 1984860, 2110113, 2114207, 2136271, 2110488, 2095865, 2192157, 2163142, 2121235]
4695B121235L5630O2780N4521K353r0809J67959j33287L7900L5147m0961K2845
4684B275313k0229M3195J5132q8369J86757p7237R6229r2014R218O8761J01512
4673B518268j12796P874J04900o8915N5103L2033P4489M7700N0851N1851j25002
4662B636356J37805l4092K9594J39674j48897Q1766Q4506R1562k6818m5061J28860
4651C075255n8195j4850k734O6683m7356L6690J60041o3708P5632o4337J06301
4640C269422J637k1526l5174P9041L5286o0426k1102J88803O714J0076Q2680N9545
4628C594976N8856M1023J49902p1082J11937K3539j0156m6907o1343K7356J25340
4617C943441P4270J04388R2020j76580q525J4244n5575j2101o3224K8277j2192
$$ y = [2121235, 2156865, 2219645, 2274166, 2276519, 2185710, 2353669, 2220382, 2258282, 2293429, 2252468, 2275313, 2255084, 2298279, 2313411, 2225042, 2411799, 2334562, 2430791, 2338777, 2347995, 2416756, 2518268, 2405472, 2413346, 2518246, 2449331, 2504434, 2536467, 2610956, 2658656, 2709507, 2761358, 2636356, 2774161, 2740069, 2769663, 2909337, 2760440, 2842206, 2926712, 3018274, 2991456, 2946395, 3075255, 3017060, 3002210, 2999476, 3066159, 3018803, 3055493, 3215534, 3151826, 3227458, 3163121, 3269422, 3271059, 3249533, 3214359, 3293400, 3328686, 3268260, 3247158, 3435961, 3442675, 3452751, 3535431, 3594976, 3653832, 3694855, 3844757, 3773675, 3885612, 3909151, 3898995, 3852088, 3790745, 3818101, 3943441, 4017711, 4122099, 4214119, 4037539, 4029014, 4043258, 3987683, 3975582, 3912358, 3940635, 3928443]
4606C928443j8289j0899J35639K6941J47620O277J16183M9218K9305J61114L7071
4595D608623m7965j64362n0435J21628j32855J35971R1847J18070O0865j93208
4585D548179o2013m7960o1077k4968j18692J10704J7151R436m1326J29617l5398
4574D423653P3363N4143r1412R3432N2238J38243n4372K3112m9043l9536O1505
4563D685326j2312J32212L3891O4269R914K9849o6360r6436Q9899O8811j12690
4552D826373L40J9725R3454L5416k6654j7965R1619P4776r646M5396J0730n4112
4540E089452M2390Q8115m6207O6435J1605N4594M2505O8957K4362Q8422k6567
4529E504063R3442j6577J7512Q3132L5996n1988N1782Q4575J25081N5595Q3P5298
$$ y = [3928443, 3910154, 3899255, 4034894, 4061835, 4209455, 4215732, 4331915, 4381133, 4410438, 4571552, 4608623, 4560658, 4396296, 4345861, 4467489, 4334634, 4470605, 4562452, 4680522, 4741387, 4548179, 4486166, 4438206, 4377129, 4352161, 4233469, 4344173, 4361324, 4370760, 4329434, 4459051, 4423653, 4497016, 4551159, 4459747, 4553179, 4605417, 4743660, 4689288, 4712400, 4663357, 4623821, 4685326, 4673014, 4805226, 4839117, 4903386, 4913300, 4943149, 4876789, 4780353, 4870252, 4939063, 4826373, 4826713, 4846438, 4939892, 4975308, 4948654, 4930689, 5022308, 5097084, 5087438, 5132834, 5143564, 5089452, 5131842, 5219957, 5173750, 5240185, 5251790, 5306384, 5348889, 5417846, 5442208, 5530630, 5504063, 5597505, 5580928, 5598440, 5681572, 5717568, 5665580, 5717362, 5801937, 5927018, 5982613, 5982696, 6057994]
4517F057994J5640R9015j764J4348M6523J18498l4299J66687K8541K402P5853
4506F589438m0631J66790Q2544m9752J19964M1411j8673Q3420J54746k4951J81587
4495G285893M5386J23809J2549Q8612N5089O8060R7823N0818J49155p5305K13766
4484H115655J16865K6362Q8430J77494J07790J76315J20373J42718J25995Q5003
4474I283000K13761J60417J15136N8526J88856J70462J44393KK60353J73464K16826
4463A0985196J18605L13701J83037J51493L88068J42409K86550L27835L79773
4454A3276667L12331M48277L84902O67313K69488M06178J32871P2335N7625K68922
4444A6296909J77697K26675J30584K87235K51272K20587L59062K34063L10523
$$ y = [6057994, 6073634, 6172649, 6170885, 6185233, 6231756, 6350254, 6315955, 6482642, 6511183, 6513585, 6589438, 6548807, 6715597, 6798141, 6748389, 6868353, 6909764, 6891091, 6974511, 7129257, 7104306, 7285893, 7331279, 7455088, 7467637, 7556249, 7611338, 7679398, 7777221, 7828039, 7977194, 7901889, 8115655, 8232520, 8258882, 8347312, 8524806, 8632596, 8808911, 8929284, 9072002, 9197997, 9283000, 9496761, 9657178, 9772314, 9830840, 10019696, 10190158, 10334551, 10334553, 10594906, 10768370, 10985196, 11103801, 11417502, 11600539, 11752032, 12140100, 12282509, 12569059, 12896894, 13276667, 13588998, 14037275, 14422177, 15089490, 15358978, 15765156, 15898027, 15970362, 16027987, 16296909, 16474606, 16701281, 16831865, 17119100, 17370372, 17590959, 17950021, 18184084, 18494607]
4435A8494607L53063L57074M54809N05540N22642O57385P52812P93591R48874
4426B3840397J255750J265383J278540J409683J197623P20950N08865k2723K81596
4417C1736064O66487R61487J120156N71177p30655n88340j34545j02401l9682
4408C3459748o3612J15167M72873L76223O35147P88600R21234R15073J110819
4399C8731272J593694J707341K064148K175891K216421K052413J614460J574102
4391E3729742J138676J964776K702991L377128L944525J778631j684055p61485
4383F6190929L03809J023440J651884K286162L915700M960829N089873L186480
4375H8609106J607421j60982k789961j734888k14081J041665K202396L871427
$$ y = [18494607, 18847670, 19204744, 19659553, 20165093, 20687735, 21345120, 22097932, 22891523, 23840397, 25096147, 26361530, 27640070, 29049753, 30247376, 30968326, 31477191, 31454468, 31736064, 32402551, 33364038, 34484194, 35055371, 34324716, 33736376, 33601831, 33499430, 33459748, 33396136, 33511303, 33984176, 34360399, 34995546, 35784146, 36705380, 37620453, 38731272, 40324966, 42032307, 44096455, 46272346, 48488767, 50541180, 52155640, 53729742, 54868418, 56833194, 59536185, 62913313, 66857838, 68636469, 66952414, 66190929, 66494738, 67518178, 69170062, 71456224, 75371924, 80332753, 85422626, 88609106, 90216527, 90055545, 87265584, 85530696, 85316615, 86358280, 88560676, 92432103]
4367I2432103O380122P675960K145792n243429m179078j626991O76323K684308
4359A00945110L579038R58897q11304R44163L019975M297963N847541Q752807
4351A27534190J2545019J4395960J4285541O849582K530760m585143j0667629
4344A62888280p634742l407537p53817K848676P489529J5021366J6723984l520643
4336A89655096k2752268j8563366j2358565p803237m730528k857103k686266j606498
4328A16297265K87813K139618L138910N218953Q374521J2353395J3606265J2983575
4320A74400315M074766J015678p909515j1763372q016402m142844j399541K301529
4312A48560614P426719J5051770J3453205r693621k5680390j9910274j4167602
$$ y = [92432103, 98812225, 106488185, 108633977, 103390548, 99211470, 97584479, 98260802, 100945110, 104524148, 105483045, 104671741, 105615904, 108635879, 112933842, 118781383, 127534190, 140079209, 154475169, 168760710, 175610292, 178141052, 173555909, 162888280, 155253538, 151846001, 151092184, 153940860, 161430389, 176451755, 193175739, 189655096, 166902828, 148339462, 135980897, 128177660, 123447132, 120590029, 117903763, 116297265, 116585078, 118724696, 121863606, 127082559, 135457080, 147810475, 161416740, 174400315, 178475081, 179490759, 171581244, 159817872, 151801470, 147658626, 146259085, 148560614, 155987333, 171039103, 184492308, 174798687, 149118297, 129208023, 115040421]
4305A15040421j0258931p644226n960462m553652l437284k577953j560755j170022
4297G7877136k59503J250927K634370L310819K610468l13925j223799m545416
4289H1341077m865384l316768j997915j113759J92092K071384M967994K747782
4281H0026503n755794r140390p113869n239851l978220l338985k650009k290977
4273D0518408k125083j974064j809490j516573j383993j477812j051826r47683
4265B8231884j055256q12193j001275o28140p59914n83484o39479m96207n22587
4256B1733349n49269n04960m19671k72314l47066m70313j95738l46664l42089
4247A8285265l28870l12903l63301k90777m03975m12435j40836k55653j77445
$$ y = [115040421, 104781490, 97137264, 91176802, 86623150, 83185866, 80607913, 79047158, 77877136, 77617633, 78868560, 81502930, 84813749, 87424217, 87110292, 85886493, 81341077, 76475693, 73158925, 71161010, 70047251, 70239343, 72310727, 77278721, 80026503, 74270709, 65130319, 58016450, 52776599, 48798379, 45459394, 42809385, 40518408, 38393325, 36419261, 34609771, 33093198, 31709205, 30231393, 29179567, 28231884, 27176628, 26364435, 25363160, 24735020, 23975106, 23391622, 22752143, 22255936, 21733349, 21184080, 20679120, 20259449, 19987135, 19640069, 19169756, 18974018, 18627354, 18285265, 17956395, 17643492, 17280191, 16989414, 16585439, 16173004, 16032168, 15776515, 15599070]
4238A5599070j87034k45465j52596k48632j49593j69856k58305k22168k4104p2569
4228A3868748j65462k48888j60168M2023k65080q5345j72145j17257j82577L0881
4218A2544730j94725r1141p1905j35764n0135m5653j10861k02564r1273R496j80931
4207A1379274k4749q5933k00998m8925M2876j44399r8572L0842j02733o2694j50629
4196A0533360K9635j28031J667p2699j54702O1600j5683j78655J54830j88697
4186A0042625L947j13332N1376m2337j49747j4889k8155L0469k7541k30592O1698
4175I583522J1188M6846j31454R244o7420Q2481J6831q5957k9515N9210J6663
4164I511639j71731P3801J6389j7093n1977Q1984r01l7239l2736M4348J09775
$$ y = [15599070, 15412036, 15166571, 15013975, 14765343, 14615750, 14445894, 14187589, 13965421, 13941317, 13868748, 13703286, 13454398, 13294230, 13336253, 13071173, 12985828, 12813683, 12696426, 12513849, 12544730, 12350005, 12258864, 12186959, 12051195, 12001060, 11955407, 11844546, 11641982, 11550709, 11560205, 11379274, 11354525, 11268592, 11067594, 11018669, 11061545, 10917146, 10818574, 10849416, 10746683, 10683989, 10533360, 10562995, 10434964, 10436631, 10363932, 10209230, 10270830, 10255147, 10076492, 10231322, 10042625, 10046572, 9933240, 9984616, 9942279, 9792532, 9777643, 9749488, 9779957, 9752416, 9521824, 9583522, 9594710, 9641556, 9510102, 9519346, 9451926, 9534407, 9551238, 9465281, 9435766, 9494976, 9511639, 9339908, 9413709, 9430098, 9413005, 9361028, 9443012, 9442111, 9404872, 9372136, 9416484, 9526259]
4153I526259k07434O5610j4252L8351R472O2684r8798N6042j0133L4738N0547
4142I513086j1263M0512R668Q3059o6823R3023k4416R4885j06216J46615L0214
4131I802344m0210K8144Q2613o3124J99139r1567J24698m5388J26063l0570M6111
4120A0138253n5733J84766P6125q7063R8000Q9416J3629J02928O0318k666J39794
4109A0757767L863O9363Q7485J40599O7073p4011J55687J25871r300P4153R9435
4098A1497985Q8571J36899M5881R6604J54775K9146K5465J33699J14347K2727
4088A2346099P3862J42400J81167Q263K64802k8154O6514l9862K45439K1363J53492
4077A3435385J11645Q712K20930J31471R8814K05613J74917K22745J22902K82551
$$ y = [9526259, 9318825, 9384435, 9370183, 9408534, 9418006, 9480690, 9381892, 9437934, 9427801, 9462539, 9513086, 9501823, 9542335, 9552003, 9635062, 9568239, 9661262, 9636846, 9731731, 9625515, 9772130, 9802344, 9762134, 9790278, 9872891, 9809767, 10008906, 9917339, 10042037, 9996649, 10122712, 10092142, 10138253, 10082520, 10267286, 10343411, 10256348, 10354348, 10443764, 10457393, 10560321, 10620639, 10617973, 10757767, 10761630, 10830993, 10918478, 11059077, 11126150, 11052139, 11207826, 11333697, 11324397, 11398550, 11497985, 11586556, 11723455, 11769336, 11865940, 12020715, 12049861, 12075326, 12209025, 12323372, 12346099, 12419961, 12562361, 12743528, 12751791, 13016593, 12988439, 13054953, 13015091, 13260530, 13281893, 13435385, 13547030, 13555742, 13776672, 13908143, 14006957, 14212570, 14387487, 14610232, 14733134, 15015685]
4067A5015685K25029J61381J03020Q0516J20923J44302J24638K31197J31457K70808
4057A6608956L22567K45062k9853R6810K04818J27074j7843K34838J29975K40004
4047A8162408J08452K03798L01525J50511K54973K43775L18710K57474J85215
4038B0186841K18882K37796J92980K72708J27335K84632J41865M40861L19012
4029B2422912M26244L77450M1702M03686J59674L44343K08520L85803L81826K63463
4019B5415623L18336M00541L57961K66304M18765K92064M34813L47016L47217
4010B8598640M54120L10750L48299M44728K90841M52809M63833L92211M99523
4001C2255754M78395N04970L77556O18115M53184N79283N46999M82244O63169
$$ y = [15015685, 15240714, 15402095, 15505115, 15585631, 15706554, 15850856, 15975494, 16206691, 16338148, 16608956, 16931523, 17176585, 17146732, 17243542, 17448360, 17575434, 17557591, 17792429, 17922404, 18162408, 18270860, 18474658, 18776183, 18926694, 19181667, 19425442, 19744152, 20001626, 20186841, 20405723, 20643519, 20836499, 21109207, 21236542, 21521174, 21663039, 22103900, 22422912, 22849156, 23226606, 23268308, 23671994, 23831668, 24176011, 24384531, 24770334, 25152160, 25415623, 25733959, 26134500, 26492461, 26758765, 27177530, 27469594, 27904407, 28251423, 28598640, 29052760, 29363510, 29711809, 30156537, 30447378, 30900187, 31364020, 31756231, 32255754, 32734149, 33239119, 33616675, 34234790, 34687974, 35267257, 35814256, 36296500, 36959669]
3992C6959669N50286N44166O56207N57533N68060N37393O42602N89814O32756
3983D2238486P06019N18721N94253O66784O10936O24278P95614O36898P07705
3974D8099694O96699P80657P27331P74649Q78937Q72684Q39946Q97990R18052
3965E5486639R82467J037401Q52334J076457R64014J038829R59094J030932J119272
3956F4547439R45094J140984J050917R69329J171920J050594J000537J106373
3948G2983187J028398J276599R74076J134849J170899J154278J235257J275297
3940H2232840J394603J289108J444694J552656J624905J583539J728009J785644
3932I4635998J848413J969314J970745K106939K042777K167566K128585K221042
$$ y = [36959669, 37509955, 38054121, 38710328, 39267861, 39835921, 40373314, 41015916, 41605730, 42238486, 42944505, 43463226, 44057479, 44724263, 45335199, 45959477, 46755091, 47391989, 48099694, 48796393, 49577050, 50304381, 51079030, 51957967, 52830651, 53670597, 54568587, 55486639, 56469106, 57506507, 58358841, 59435298, 60399312, 61438141, 62397235, 63428167, 64547439, 65492533, 66633517, 67684434, 68653763, 69825683, 70876277, 71876814, 72983187, 74011585, 75288184, 76262260, 77397109, 78568008, 79722286, 80957543, 82232840, 83627443, 84916551, 86361245, 87913901, 89538806, 91122345, 92850354, 94635998, 96484411, 98453725, 100424470, 102531409, 104574186, 106741752, 108870337, 111091379]
3924A11091379K058903K299954K240960K112140K030927K133144J855915J842745
3916A27666067J634594J536846J229365J132722J061844P33295N33342K88592
3908A35816667J35873j63234k81182o38370p60934j081944j079690j414354j586626
3899A28946206j620258j836099j957917k031924k033222k156132k277247k213235
3891A12820172k152702k279047k224141k076635k096329k238351j973885j911262
3883I5867820j914704j790021j699543j512105j559005j447043j274649j105786
3875H3564964j255374r21459r48979q66797p86651o95726o56724p16994o69045
3866G6047215o47475o69080p14825n84948o52658n76499m14124n35383k70374
$$ y = [111091379, 113150282, 115450236, 117691196, 119803336, 121834263, 123967407, 125823322, 127666067, 129300661, 130837507, 132066872, 133199594, 134261438, 134994733, 135528075, 135816667, 135952540, 135789306, 135508124, 134869754, 134108820, 133026876, 131947186, 130532832, 128946206, 127325948, 125489849, 123531932, 121500008, 119466786, 117310654, 115033407, 112820172, 110667470, 108388423, 106164282, 104087647, 101991318, 99752967, 97779082, 95867820, 93953116, 92163095, 90463552, 88951447, 87392442, 85945399, 84670750, 83564964, 82309590, 81388131, 80439152, 79572355, 78785704, 78089978, 77433254, 76716260, 76047215, 75399740, 74730660, 74015835, 73430887, 72778229, 72201730, 71787606, 71252223, 70981849]
3857G0981849l77367k76778j01698n3963J30854K0248K98478M13741M73393O27964
3847G2136721Q31594J036812J171801J279360J487302J602477J757900J848177
3839H3152144J589164J676678J464572J380558J101693Q28394N51301N50097J62313
3830I2456914K38253j20380j55972j34930j33932q7364K20914K35481L67688P07559
3820I3594231R12460J086506J481581J761412K072534K429924K890824L150817
3812A09380289L502325M032937M278832M651487N035790N474237N531513O174294
3804A48061704O349109O372654O515131O282545O305552O501515O386713O300924
3796A99075847O047272N604219M928453M277230L616399K865317K223137J807608
$$ y = [70981849, 70604482, 70327704, 70226006, 70172043, 70302897, 70323145, 70621623, 71035364, 71508757, 72136721, 72968315, 74005127, 75176928, 76456288, 77943590, 79546067, 81303967, 83152144, 84741308, 86417986, 87882558, 89263116, 90364809, 91193203, 91744504, 92294601, 92456914, 92695167, 92574787, 92418815, 92283885, 92149953, 92062589, 92283503, 92518984, 92886672, 93594231, 94506691, 95593197, 97074778, 98836190, 100908724, 103338648, 106229472, 109380289, 112882614, 116915551, 121194383, 125845870, 130881660, 136355897, 141887410, 148061704, 154410813, 160783467, 167298598, 173581143, 179886695, 186388210, 192774923, 199075847, 205123119, 210727338, 215655791, 219933021, 223549420, 226414737, 228637874, 230445482]
3788B30445482J869911J717091J555900Q07779J92426o97460r48102j238046j694338
3779B32010643j414109q20169M28514J700752K868571M488635N633067P150107
3771B52046011Q560903R929891J1168064J2008722J2305809J2027009J1255335
3764C29301744R538523P303100M595905K778319J354135O24239p4797m54934n28838
3755C54437396j523425m087920p403501r701741j1518827j2916541j3420879j2620241
3747B81244321j1486462j0070316q458804o782001n057924l050515j046954P79883
3739B36071228K149672L671234M562034M509946M201231L659590K369151J118005
3731B62312091K07709p35035j421108j551438j537138j718186k423232l933531
$$ y = [230445482, 232315393, 234032484, 235588384, 236396163, 236588589, 235891129, 234943027, 233704981, 232010643, 230596534, 229776365, 230204879, 231905631, 234774202, 239262837, 244895904, 252046011, 260606914, 270536805, 281704869, 293713591, 306019400, 318046409, 329301744, 338840267, 346143367, 350739272, 353517591, 354871726, 355495965, 355421168, 354966234, 354437396, 352913971, 348826051, 341422550, 331720809, 320201982, 307285441, 293864562, 281244321, 269757859, 259687543, 251228739, 244446738, 239388814, 236338299, 235291345, 236071228, 238220900, 241892134, 246454168, 250964114, 255165345, 258824935, 261194086, 262312091, 262519800, 261784765, 260363657, 258812219, 257275081, 255556895, 253133663, 249200132]
3723B49200132n219689o404232p839611r002292r886122r625959r111076q391650
3715A83719501p676269o828035n895471n272513m304276l393073k905008k197772
3707A45247084j672148j200464m96691k93504J53229O90942Q56228J153836J607641
3698A46046153J571757J834436J989846K067576K026655K155882K319113K385153
3690A62396571K273658K115658K304346K312731K256806K166421K288550K321534
3682A80436275K419636K422206K451027K414635K312025K216823K139098J774126
3674A98585851J547532J312914O94260L20864J09129m42846r13986j425282j826122
3665A97962314k114037k468094k930296l365082l379745l406755l615993l629729
$$ y = [249200132, 243980443, 237576211, 229736600, 220734308, 210848186, 201222227, 192111151, 183719501, 176043232, 169215197, 163319726, 158047213, 153742937, 150349864, 147444856, 145247084, 143574936, 142374472, 141877781, 141584277, 141737506, 142428448, 143284676, 144438512, 146046153, 147617910, 149452346, 151442192, 153509768, 155536423, 157692305, 160011418, 162396571, 164670229, 166785887, 169090233, 171402964, 173659770, 175826191, 178114741, 180436275, 182855911, 185278117, 187729144, 190143779, 192455804, 194672627, 196811725, 198585851, 200133383, 201446297, 202140557, 202461421, 202570550, 202127704, 201213718, 199788436, 197962314, 195848277, 193380183, 190449887, 187084805, 183705060, 180298305, 176682312, 173052583]
3657A73052583l469940l319883l193435k837590k807345k722502k692027k519973
3649A49489888k396096k577360k485425k384020k515707k536809k663875k676414
3641A29254182k808140k867966k853378l012618l084181l148488l004482l065258
3633A05409671k913071k940377k744083k468874k246350k017357j873980j618324
3625H6587255j445593j087655r87553r60366o62787n90030l18671k04158n7953
3616H0272489J05461K22079M14285M67901O62348P08206P12908R17866R93388
3607H5476931R54305J066153J241283J340737J534983J499190J839734J902121
3599I6855437K124168K157126K447636K221788K437674K378966K233753K331387
$$ y = [173052583, 169582643, 166262760, 163069325, 160231735, 157424390, 154701888, 152009861, 149489888, 147093792, 144516432, 142031007, 139646987, 137131280, 134594471, 131930596, 129254182, 126446042, 123578076, 120724698, 117712080, 114627899, 111479411, 108474929, 105409671, 102496600, 99556223, 96812140, 94343266, 92096916, 90079559, 88205579, 86587255, 85141662, 84054007, 83066454, 82106088, 81443301, 80853271, 80534600, 80330442, 80272489, 80377950, 80600029, 81014314, 81482215, 82144563, 82852769, 83565677, 84483543, 85476931, 86431236, 87497389, 88738672, 90079409, 91614392, 93113582, 94953316, 96855437, 98979605, 101136731, 103584367, 105806155, 108243829, 110622795, 112856548, 115187935]
3591A15187935K285876K204592K270816K184558K253837K048447J994130K006331
3583A32436522K020605J916092J914873K222085K227106K377285K608498K782775
3575A50505841L111941L107014L203434L225452L351336L062998K830977K319975
3567A74718968K033603J595331J182064P45506L40690k8199n22392r88386j317084
3558A77760101j647751k116757k740831k813936l042361l188197l456305l629470
3550A55124493l506903l597874l553650l520974l618380l634926l533132l727634
3542A26431020l680563l749074l916284l960541l989851m085687m151028m240733
3534I4657259m287662m183276m106882m031483l927138l579682l466720l312166
$$ y = [115187935, 117473811, 119678403, 121949219, 124133777, 126387614, 128436061, 130430191, 132436522, 134457127, 136373219, 138288092, 140510177, 142737283, 145114568, 147723066, 150505841, 153617782, 156724796, 159928230, 163153682, 166505018, 169568016, 172398993, 174718968, 176752571, 178347902, 179529966, 180275472, 180616162, 180587963, 180065571, 179077185, 177760101, 176112350, 173995593, 171254762, 168440826, 165398465, 162210268, 158753963, 155124493, 151617590, 148019716, 144466066, 140945092, 137326712, 133691786, 130158654, 126431020, 122750457, 119001383, 115085099, 111124558, 107134707, 103049020, 98897992, 94657259, 90369597, 86186321, 82079439, 78047956, 74120818, 70541136, 67074416, 63762250]
3526F3762250l107146l041882k696330k620582k294392k246227k071262j857438
3518D3826991j885877j559377j462744j385462j367352j396171j085841r63591
3510C2720576j118819r50458r65877q14471q12469q69023p12262p16218o31205
3501B5129774o45643p19014n94146n22541o83789n62655l58184n13033o32832
3492A9897937m39836n41345l77635n39966m12574m22266l35617l43228n16013
3483A5969457k73635l05112k73049k70143l26706k99571k16985k42837q5386l18669
3473A3357364j21859j41493k66096r8938j18559j92628k48107j67583j65625j54819
3463A1681657j88685p2897k04817k51712p4309k37991q1416k06692k51030j30882
$$ y = [63762250, 60655104, 57613222, 54916892, 52296310, 50001918, 47755691, 45684429, 43826991, 41941114, 40381737, 38918993, 37533531, 36166179, 34770008, 33684167, 32720576, 31601757, 30651299, 29685422, 28870951, 28058482, 27189459, 26477197, 25760979, 25129774, 24484131, 23765117, 23170971, 22648430, 21964641, 21401986, 21043802, 20530769, 19897937, 19458101, 18916756, 18539121, 17999155, 17586581, 17164315, 16828698, 16485470, 15969457, 15695822, 15390710, 15117661, 14847518, 14520812, 14221241, 14004256, 13761419, 13676033, 13357364, 13235505, 13094012, 12827916, 12728978, 12610419, 12417791, 12169684, 12002101, 11836476, 11681657, 11492972, 11420075, 11215258, 10963546, 10889237, 10651246, 10569830, 10363138, 10112108, 9981226]
3453I981226j47873n5867j48774j74287j58860j33336j7507j21861j63880r0489
3443H768492j75214j602j59032n2231j07844P1364k37380L4473j26925J4449j01408
3432G927142r7107o6644m3316l4084j09088k3768k9471R527j44375o6545Q934
3421G331205l3099N6271j18796r6229M315l8881j66943K8991l4137j01928k9315
3410F801454j9222j1551o1012q4232o0110o1686r6467k1671j89575R4945M7207
3399F338080j24529n2419L4974j12803o6870J43338j01595p7444J10278q6143
3389F004867j8144L6682P6046j69426J40720r2029o2379n7798o9452P4087j1338
3378E851836o6972m5314r5805J33588j15524P5273j782k3113l2846j67944P9971
$$ y = [9981226, 9833353, 9777486, 9628712, 9454425, 9295565, 9162229, 9144722, 9022861, 8858981, 8768492, 8593278, 8591676, 8432644, 8380413, 8272569, 8343933, 8106553, 8141026, 8014101, 8028550, 7927142, 7830035, 7763391, 7720075, 7685991, 7576903, 7553135, 7523664, 7533191, 7388816, 7322271, 7331205, 7298106, 7354377, 7235581, 7139352, 7143667, 7104786, 6937843, 6966834, 6932697, 6830769, 6801454, 6782232, 6770681, 6709669, 6625437, 6565327, 6503641, 6407174, 6385503, 6195928, 6290873, 6338080, 6213551, 6161132, 6196106, 6083303, 6016433, 6159771, 6058176, 5980732, 6091010, 6004867, 5986723, 6023405, 6099451, 5930025, 6070745, 5978716, 5916337, 5858539, 5789087, 5863174, 5851836, 5784864, 5739550, 5643745, 5777333, 5661809, 5737082, 5735300, 5712187, 5679341, 5511397, 5591368]
3367E591368O8754r1127M4141j17143O9663J27422O3503J0527r9411J15439Q0854
3356E863990J03180p1735l8744K47767j19450o3384K03446q1936J77598m8841
3346F171891R0456j0330L7424O7022L4400o8256J8975R473l2118J45466p8616
3335F385787L1021J00151N5224J29956p014O85N2237J16660m9090J39922o9260
3324F886279O7295M9692M4145J8042j56693J06491P943K590J2374q4525O8173
3313G021806K858o9257l8079j55655O7583q0667j2941o6299R3592j13375m293
3302F645273n9165Q913M3821j33734M5037o1071N415p8537K7499k6371O942k8026
3290F395996L42r3859J9307J870j5232j15291L7642M7249n0042j41193J25899
$$ y = [5591368, 5660122, 5568995, 5613136, 5495993, 5565656, 5693078, 5756581, 5767108, 5667697, 5783136, 5863990, 5967170, 5895435, 5856691, 6104458, 5985008, 5921624, 6125070, 6043134, 6220732, 6171891, 6262347, 6252017, 6289441, 6356463, 6390863, 6322607, 6341582, 6351055, 6318937, 6464403, 6385787, 6416808, 6516959, 6572183, 6702139, 6695125, 6695810, 6748047, 6864707, 6815617, 6955539, 6886279, 6953574, 7003266, 7047411, 7065453, 6908760, 7015251, 7023194, 7025784, 7038158, 6953633, 7021806, 7024664, 6955407, 6917328, 6761673, 6829256, 6748589, 6735648, 6669349, 6762941, 6649566, 6645273, 6586108, 6595021, 6638842, 6505108, 6550145, 6489074, 6494489, 6415952, 6443451, 6417080, 6424022, 6395996, 6396338, 6302479, 6321786, 6323656, 6308424, 6193133, 6230775, 6278024, 6227982, 6086789, 6212688]
3279F212688o6319P7017k9371m4072O413k367L313M3982K4811O337J15348q5060
3267F262720J10153j2669L986L8328J15507J24442n6741Q1449N4273O1039p513
3256F774974J24186J23023O7107J43904N5546N9107R7522J17299L7884O2372Q6810
3245G749734J06480J50457J64290O4670Q4960K05369J37047K02046J13845J29443
3235I108341K12456J94448K19051L04418R1448K30740J36422K94961M7586P6967
3225A0916838J28791K12103J39684K12255J23171K43121J31766K73205K03375
3216A2584309K63997L07563K76167K32282L71852J83264M36448M48684N11259
3207A5615825M58429N15544O62037O49866N90401N96329O72528O57331M84319
$$ y = [6212688, 6146369, 6223386, 6194015, 6149943, 6156356, 6153989, 6157302, 6201284, 6226095, 6232432, 6347780, 6262720, 6372873, 6360204, 6364190, 6402518, 6518025, 6642467, 6585726, 6667175, 6721448, 6782487, 6774974, 6899160, 7022183, 7089290, 7233194, 7288740, 7347847, 7445369, 7562668, 7600552, 7662924, 7749734, 7856214, 8006671, 8170961, 8235631, 8320591, 8525960, 8663007, 8865053, 8978898, 9108341, 9320797, 9515245, 9734296, 10038714, 10130162, 10360902, 10497324, 10792285, 10839871, 10916838, 11045629, 11257732, 11397416, 11609671, 11732842, 11975963, 12107729, 12380934, 12584309, 12848306, 13155869, 13432036, 13664318, 14036170, 14219434, 14655882, 15104566, 15615825, 16074254, 16589798, 17251835, 17901701, 18492102, 19088431, 19760959, 20418290, 20902609]
3198B0902609M95569M70872L09311J59738J84113K1135J15770P4270L4359J70485
3188B2938231K61116K17330K93642M27074M45998M17618N71656N56945P42325
3179B6871935P05038R09286J006741J022341J159238J250161J457522J503036
3171C5885298J574932J550444J606647J472328J189853J291686J504655J310469
3163D7386312J037316P60335J124094J533645J917225J859223J622351R68615
3155E8209116M33358L1588k46948o0573N11406J122745J842945K366691J791047
3146F6001375J290600Q26278k68661m91993j3724P23726J133984J446460J889923
3137G2537968K452626K896270L254661L106691L151602L524184L838443M072690
$$ y = [20902609, 21398178, 21869050, 22178361, 22338099, 22522212, 22543347, 22659117, 22733387, 22767746, 22938231, 23199347, 23416677, 23710319, 24137393, 24583391, 25001009, 25572665, 26129610, 26871935, 27576973, 28486259, 29493000, 30515341, 31674579, 32924740, 34382262, 35885298, 37460230, 39010674, 40617321, 42089649, 43279502, 44571188, 46075843, 47386312, 48423628, 49183963, 50308057, 51841702, 53758927, 55618150, 57240501, 58209116, 58642474, 58674062, 58427114, 58366541, 58877947, 60000692, 61843637, 64210328, 66001375, 67291975, 68118253, 67849592, 67357599, 67343875, 68067601, 69201585, 70648045, 72537968, 74990594, 77886864, 81141525, 84248216, 87399818, 90924002, 94762445, 98835135]
3129I8835135M313587M485452M033963L001091J626398R0709q06870j342223K3392
3120A14260634J021816Q76921O66551J536383K025132M09148l307719o488835
3112A11000031n948179m011934k408258j009204J27959Q11039J648850J975490
3104A02185794K561058K909925L271792M240414N006753N283289N619388M916966
3096A35995379L132258J666885r72524k063620j537588j908230k078408n48292
3088A31685860Q96168K608458J009354l704816o372349p905127q937569p579282
3080A01700697n793732m272914l196467k522456j401420r51406p1421O03292J302411
3071H5396584K290784L242673L190682K841005J908769L50747j222604k268050
$$ y = [98835135, 103148722, 107634174, 111668137, 114669228, 116295626, 116386335, 115579465, 114237242, 114260634, 115282450, 116159371, 116825922, 118362305, 120387437, 120796585, 117488866, 111000031, 105051852, 101039918, 98631660, 97622456, 97750415, 98561454, 100210304, 102185794, 104746852, 107656777, 110928569, 115168983, 120175736, 125459025, 131078413, 135995379, 139127637, 140794522, 139821998, 137758378, 136220790, 134312560, 132234152, 131685860, 132582028, 135190486, 136199840, 132495024, 126122675, 118217548, 109279979, 101700697, 95906965, 91634051, 88437584, 85915128, 84513708, 83562302, 83490881, 84094173, 85396584, 87687368, 90930041, 94120723, 96961728, 98870497, 99221244, 97998640, 95730590]
3063I5730590k794057k728709j598677j42336J290961J231556j85976j426785
3055H9376567l486507n422579o622757o150193n108772l997482l370841k673244
3047E2544192k344611j963308j576577j265200q97310m85588k24353L7693O7133
3038D3892071j8140j66714m58950r69748r54945j309891j170391q58827m41922
3029C7542543j45306K65120r3129o28532j042989j670022k098407k016908j483197
3020B8629173j214284r25177r48002p07323q56387n86377n40400m89234m31289
3011B1930700l68218l66609l04164k55355l11960j43819k67078j22082k00204
3002A9591211j74538l8943j58462J40426j74015m1418o8276O7463M7498n8185
$$ y = [95730590, 92936533, 90207824, 88609147, 88466811, 89757772, 90989328, 90803352, 89376567, 85890060, 80467481, 73844724, 67694531, 62585759, 58588277, 55217436, 52544192, 50199581, 48236273, 46659696, 45394496, 44497186, 44011598, 43787245, 43824938, 43892071, 43873931, 43707217, 43248267, 42278519, 41323574, 40013683, 38843292, 37984465, 37542543, 37397237, 37662357, 37569228, 36940696, 35897707, 34227685, 32129278, 30112370, 28629173, 27414889, 26489712, 25541710, 24834387, 23978000, 23391623, 22851223, 22361989, 21930700, 21562482, 21195873, 20891709, 20636354, 20324394, 20180575, 19913497, 19791415, 19591211, 19416673, 19377730, 19219268, 19359694, 19185679, 19144261, 19075985, 19143448, 19190946, 19132761]
2992A9132761J8457R4668J6212J6694J42444J09072J12434J49084l3118K66939
2982B0025647K92838L0513K22086K38993K24236K02919K09725J74696L74599L11818
2972B2308070K80025K84894M17516L59409K77160M28420M74493M01400M65111
2963B5696498N43036O11467M84678O64292N08202P05229O72290O16294P53803
2954C1255789O33058Q15516P89570O04977Q70293O29370O88584P68083Q24938
2945C7880178Q82701Q04875R82601J056746J059461Q64384R39007Q08073Q62568
2936D6140594Q37201R65851J094937J115821J369490J400009J515584J734835
2928E6174322J487326J665431J583690J477045J596103J599916J653863J621328
$$ y = [19132761, 19151218, 19245886, 19262098, 19278792, 19421236, 19530308, 19642742, 19791826, 19758708, 20025647, 20318485, 20348998, 20571084, 20810077, 21034313, 21237232, 21446957, 21621653, 21996252, 22308070, 22588095, 22872989, 23290505, 23649914, 23927074, 24355494, 24829987, 25231387, 25696498, 26239534, 26851001, 27335679, 27999971, 28508173, 29213402, 29885692, 30501986, 31255789, 31888847, 32704363, 33493933, 34098910, 34969203, 35598573, 36287157, 37055240, 37880178, 38762879, 39567754, 40550355, 41607101, 42666562, 43530946, 44469953, 45278026, 46140594, 46977795, 47943646, 49038583, 50154404, 51523894, 52923903, 54439487, 56174322, 57661648, 59327079, 60910769, 62387814, 63983917, 65583833, 67237696, 68859024]
2920F8859024J818653J942613J793564J685412K009227J974768K124220K028607
2912H4236088K226945K123677J797163J901109K015063K445788K770973K904348
2904A02421154K342230J961370J844264J783506J731337J911086J893142K162650
2896A18050739K618839K993234L129166L212693K961048K738367K843968K712222
2888A41260276K675224K807225L314323L820606M253763M777089N330165N895001
2880A74133672O065723O262677N466687M216065L488924L863185M810111N569815
2872B13876859O491762P130048Q029677Q602863Q430546P969505O014883L553639
2864B70099782J384971P66392K197232M086763N537246P814199J0563032J2954577
$$ y = [68859024, 70677677, 72620290, 74413854, 76099266, 78108493, 80083261, 82207481, 84236088, 86463033, 88586710, 90383873, 92284982, 94300045, 96745833, 99516806, 102421154, 104763384, 106724754, 108569018, 110352524, 112083861, 113994947, 115888089, 118050739, 120669578, 123662812, 126791978, 130004671, 132965719, 135704086, 138548054, 141260276, 143935500, 146742725, 150057048, 153877654, 158131417, 162908506, 168238671, 174133672, 180199395, 186462072, 191928759, 196144824, 199633748, 203496933, 208307044, 213876859, 220368621, 227498669, 235528346, 244131209, 252561755, 260531260, 266546143, 270099782, 271484753, 272251145, 274448377, 278535140, 284072386, 291886585, 302449617, 315404194]
2856C15404194J1738041O309603M49788j457068j190068j178020j523855j973511
2848C26579104j612575n89396M03001L13055L17137L3247j077253k309334n198389
2839C16858597q638010j1301295j2654357j1724259r765606q446068o820119m465142
2831B43043741j812726m29749l230752r126700j1559499j0753060r242540q123419
2823A88765296p901975p587308o967053o298808o008198n481064n467166n671147
2815A37382577o288551o614164o653976o341007n782672n055409m726036m295974
2807I1624788m052333l721110l507550l427809l082298k812148k697847k358225
2799F5965468k406885k085103j768891j628907j524331j521264j762933j845667
$$ y = [315404194, 327142235, 333451838, 333901626, 332444558, 331254490, 330076470, 328552615, 326579104, 324966529, 324377133, 324780134, 325093189, 325410326, 325443573, 324366320, 322056986, 316858597, 308220587, 296919292, 284264935, 272540676, 262775070, 254329002, 247508883, 243043741, 241231015, 240801266, 237570514, 228443814, 216884315, 206131255, 196888715, 188765296, 180863321, 173276013, 166308960, 160010152, 154001954, 148520890, 143053724, 137382577, 131094026, 124479862, 117825886, 111484879, 105702207, 100646798, 95920762, 91624788, 87572455, 83851345, 80343795, 76915986, 73833688, 71021540, 68323693, 65965468, 63558583, 61473480, 59704589, 58075682, 56551351, 55030087, 53267154, 51421487]
2791E1421487k006336j948187j748832j506076j302164j038946j234719j329403
2783C9306824j387415j643996j396619j533162j029958j103262q33563r21671
2775B9457178q55628q24495q84715q62239q52502q19843p16406p53674m45282
2766B2442394n72500o53904n70888m78464m69926l25504n17057l64409m64679
2757A8025063l58856m19792l53027k22002l56657l85270k65591k02921l25498
2748A5135449k39373k41341l19512k17325k03501k17521k12758j92287k33634
2739A3058197k07423l29104j73117j49015j22283k36205l06656m6637j55779j84703
2729A1147275j94574l6701l45580p404j91230k22954j18773m7629k13739j10506
$$ y = [51421487, 49415151, 47466964, 45718132, 44212056, 42909892, 41870946, 40636227, 39306824, 37919409, 36275413, 34878794, 33345632, 32315674, 31212412, 30378849, 29457178, 28601550, 27777055, 26892340, 26030101, 25177599, 24357756, 23641350, 22887676, 22442394, 21869894, 21215990, 20645102, 20166638, 19696712, 19371208, 18854151, 18489742, 18025063, 17666207, 17246415, 16893388, 16671386, 16314729, 15929459, 15663868, 15460947, 15135449, 14896076, 14654735, 14335223, 14117898, 13914397, 13696876, 13484118, 13291831, 13058197, 12850774, 12521670, 12348553, 12199538, 12077255, 11841050, 11534394, 11487757, 11331978, 11147275, 10952701, 10916000, 10570420, 10563016, 10371786, 10148832, 10030059, 9982430, 9768691, 9658185]
2719I658185r0030k30889l2440q8125k76639j60739k2145r9466j5934l40938P3099
2708H373939j05565n2892j06794j41455m1136j61860o5170j21164J9610j10976
2698G486537j04714q3122q1260K3504q5402K6716n045k25988J035j2856j04567
2687F834838q3880M9567o2487j01304m3504r2116j654m311j53713j2216K1360
2676F350580j03528K7564k3918n3358N4678l1509l6983k4159N9656p4788J18563
2665F262798m8215n255l1067R8377L9018j09133l6457P8238m6746N8350K5728
2654F285636P3979J52665k1791N6152J48901l9407p4061K8282j59076Q3521M0089
2643F574890k3688Q285K14835O795k0534j32168l2026j3578P8882O2050K6761
$$ y = [9658185, 9568155, 9337266, 9304826, 9216701, 8940062, 8779323, 8757178, 8657712, 8641778, 8300840, 8373939, 8268374, 8215482, 8108688, 7967233, 7926097, 7764237, 7699067, 7577903, 7597513, 7486537, 7381823, 7298701, 7217441, 7240945, 7155543, 7182259, 7177214, 6951226, 6952261, 6939405, 6834838, 6750958, 6800525, 6738038, 6636734, 6593230, 6501114, 6499460, 6495149, 6341436, 6329220, 6350580, 6247052, 6274616, 6250698, 6197340, 6252018, 6220509, 6183526, 6159367, 6219023, 6144235, 6262798, 6214583, 6209328, 6178261, 6276638, 6315656, 6206523, 6170066, 6248304, 6201558, 6259908, 6285636, 6359615, 6512280, 6490489, 6546641, 6695542, 6656135, 6582074, 6610356, 6451280, 6534801, 6574890, 6551202, 6559487, 6774322, 6781117, 6760583, 6628415, 6596389, 6582811, 6661693, 6723743, 6750504]
2632F750504n2839M1526J57047J19280j27403Q6779K44083R3786K82405J15878
2622G711046J5823P8748j19261q8141j23113o9248J11097Q5260J05185K95453
2612H002849Q9719k69467p2802l08496J6369l4172j39908K0666R657j2497O282
2601G308200J99896n7255P4458J01339R424R2602N032K6476o5691j14250m4340
2590G535891j8503J08339L1090Q2545Q7871R9118l5555j25664r6571j31610K7542
2579G564493j09324L7815L3909M9975p7125O5996p8209L0821P749j4797L6818
2568G548121l2367p1234J34465m1417J10233N2573N3792j01102K0868J15076o6077
2557G722931l2534M708J17071P1420O4406J13084J0486o1614J29906k2234p728
$$ y = [6750504, 6697665, 6739191, 6896238, 7015518, 6888115, 6974894, 7218977, 7312763, 7595168, 7711046, 7726869, 7805617, 7686356, 7598215, 7475102, 7405854, 7516951, 7602211, 7707396, 8002849, 8092568, 7823101, 7750299, 7441803, 7458172, 7424000, 7284092, 7304758, 7314415, 7301918, 7308200, 7508096, 7450841, 7525299, 7626638, 7636062, 7728664, 7733696, 7760172, 7694481, 7580231, 7535891, 7517388, 7625727, 7656817, 7739362, 7827233, 7926351, 7890796, 7765132, 7668561, 7536951, 7564493, 7455169, 7492984, 7526893, 7576868, 7499743, 7565739, 7487530, 7518351, 7526100, 7511303, 7548121, 7515754, 7444520, 7578985, 7537568, 7647801, 7700374, 7754166, 7653064, 7673932, 7789008, 7722931, 7690397, 7695105, 7812176, 7883596, 7948002, 8061086, 8071572, 8009958, 8139864, 8117630, 8109902]
2546H109902J3724Q9410J10985O5298k1546K2105J58019j4902N6824O2404J32726
2535H784949J05156n7607J56393J25526M8251J66532K5715o4520L56755M5100
2525I692250Q0566N0676J98508Q0990J39711J66156K09129J70140J08767J19390
2515A1016283J76802J97123J44100J70992K56266J09533K77262K16430K88056
2506A2852847K07619J45147M46447L25780J38286L75946M01422K83657J76739
2497A5353890K69723K15614L07746L87692L42027L27235M51507L88149M82620
2488A8526203M20625M86452N04531O38561N28281R17910Q73603R73423J133170
2479B5002759J200156Q65703O30701L80765j31732j87821K58815K13673L75287
$$ y = [8109902, 8123626, 8213036, 8324021, 8389319, 8367773, 8389878, 8547897, 8532995, 8589819, 8652223, 8784949, 8890105, 8832498, 8988891, 9114417, 9162668, 9329200, 9354915, 9290395, 9647150, 9692250, 9772816, 9823492, 10022000, 10102990, 10242701, 10408857, 10617986, 10788126, 10896893, 11016283, 11193085, 11390208, 11534308, 11705300, 11961566, 12071099, 12348361, 12564791, 12852847, 13060466, 13205613, 13652060, 13977840, 14116126, 14492072, 14893494, 15177151, 15353890, 15623613, 15839227, 16146973, 16534665, 16876692, 17203927, 17655434, 18043583, 18526203, 18946828, 19433280, 19937811, 20576372, 21104653, 22022563, 22896166, 23869589, 25002759, 26202915, 27068618, 27699319, 28080084, 27948352, 27760531, 28019346, 28233019, 28608306]
2470B8608306K51607K37168L82143M80759M69003N85841L86172P01506O13738
2461C2716243P74520Q41509J142569J119300J252947J347001J956270K218724
2453D3369083K460122K502463K847288K127634J525508J210086j31113R13422
2445E6824493J571132K289663K931771J698182k364313j898854j072750q22060
2437E9157264o83874m61377j50301K17432M30424O53305Q43678J007804J142513
2428F2156868J357791J879838K161349K691065L060737L346029K869869K829388
2420H2352934K855562L031529M133898N345436O880978Q938567K395434k047125
2412A13887213k33908K080912L514396M718132P264695J1092905J3018402J4171473
$$ y = [28608306, 28859913, 29097081, 29479224, 29959983, 30428986, 31014827, 31400999, 32102505, 32716243, 33490763, 34332272, 35474841, 36594141, 37847088, 39194089, 41150359, 43369083, 45829205, 48331668, 51178956, 53306590, 54832098, 56042184, 55911071, 56824493, 58395625, 60685288, 63617059, 65315241, 62950928, 61052074, 59979324, 59157264, 58473390, 58012013, 57861712, 58079144, 58509568, 59162873, 60006551, 61014355, 62156868, 63514659, 65394497, 67555846, 70246911, 73307648, 76653677, 79523546, 82352934, 85208496, 88240025, 92373923, 97719359, 104600337, 113538904, 115934338, 113887213, 113653305, 115734217, 119248613, 123966745, 131231440, 142324345, 155342747, 169514220]
2404A69514220Q315097L737678j594385q488280o649760k591731L4701L602723
2396A65880263P682975J4204311J8181150K668404j7139010j5557698r514943
2389A66405452m702238r46417R93129j05281n45260K313397M865139O057829Q699577
2380A83035327J3349664K1655643K2933097K6314767O513690O041449j2507139
2373B67336498k0293736j4206038p213808k687158L215631J1400364K6294352
2366B63846105L0130409j1576444m3977522l2958104k3501475j6684527j1773149
2359A53505293q665355o211313m067833k617668j140713l58072J311494M572474
2351A36328307Q016946Q967026Q919812J218724j055698q448075j1332187p840078
$$ y = [169514220, 177829317, 181566995, 179972610, 171484330, 164834570, 162242839, 162277540, 165880263, 173563238, 187767549, 205948699, 208617103, 191478093, 175920395, 166405452, 161703214, 160756797, 161749926, 161644645, 161099385, 163412782, 168277921, 174335750, 183035327, 196384991, 218040634, 240973731, 267288498, 273802188, 279843637, 267336498, 247042762, 232836724, 225622916, 222935758, 226151389, 237551753, 263846105, 293976514, 282400070, 238422548, 205464444, 181962969, 165278442, 153505293, 144839938, 138628625, 134560792, 131943124, 130802411, 130444339, 131755833, 136328307, 144345253, 153312279, 162232091, 163450815, 162395117, 153947042, 142614855, 134774777]
2343A34774777m551855k229101Q85371N213987J1831257R871858j0045434k2178656
2335A23572204j6866621j2392643r310940p233006n638659m734963m362427l773743
2327E9259202l671554l379447l067602k615724k380507k080188k082173j791656
2319C8190351j689920j554752j301141j244539j219979j019674j033179r87507
2311B8139660r62936p61154q92204p10537n69838n56957n18244p54949n95566
2302B1817275m91114p56327o79503o66189n55848n96843m79946l43445m12812
2293A6835248m05028l42723l43821l10934m47095k98009j84418k78787m27444
2284A3796989j10142k96022l60923k87067j09345l42819j88613k84356j35781
$$ y = [134774777, 130222922, 127993821, 128879192, 134093179, 145924436, 155796294, 145750860, 123572204, 106705583, 94312940, 85002000, 77768994, 72130335, 67395372, 63032945, 59259202, 55587648, 52208201, 49140599, 46524875, 44144368, 42064180, 39982007, 38190351, 36500431, 34945679, 33644538, 32399999, 31180020, 30160346, 29127167, 28139660, 27176724, 26415570, 25523366, 24812829, 24242991, 23686034, 23167790, 22412841, 21817275, 21326161, 20569834, 19890331, 19224142, 18668294, 18071451, 17591505, 17248060, 16835248, 16430220, 16087497, 15743676, 15432742, 14985647, 14687638, 14503220, 14224433, 13796989, 13686847, 13390825, 13029902, 12742835, 12633490, 12290671, 12102058, 11817702, 11681921]
2275A1681921k93429j40721k11325k57539j85743k12031j51629r4285j84014k91164
2265I660041k0175l12925j5297k10126j06696k44687j67550j60003j83324j30301
2255H108957k00843j39185j11612j30744k08439j01352j42089j77558j3779k10972
2245F672384k20614l8983j61609j46499q2698k11799j8355j59177n3061k14885
2235E364704n0177q6782j24707p8438o1647o3975q5357j15421j87826k0645j57442
2224D332287j13943l0206j44907p5362n4909m2914j30001k2147j3810q9034q9423
2213C525631j01399j5843j52423k201r6264m7125j3408r4854m1525l7121k4781
2202B898687m5001p7684q1125J5363k1884j04487K7253j20843o3944P5325j23693
$$ y = [11681921, 11388492, 11247771, 11036446, 10778907, 10593164, 10381133, 10229504, 10135219, 9951205, 9660041, 9639866, 9326941, 9311644, 9101518, 8994822, 8750135, 8582585, 8422582, 8239258, 8108957, 7908114, 7768929, 7657317, 7526573, 7318134, 7216782, 7074693, 6897135, 6883356, 6672384, 6451770, 6412787, 6251178, 6104679, 6021981, 5810182, 5791827, 5632650, 5579589, 5364704, 5314527, 5227745, 5103038, 5024600, 4962953, 4898978, 4813621, 4698200, 4510374, 4489729, 4332287, 4218344, 4188138, 4043231, 3967869, 3912960, 3870046, 3740045, 3717898, 3704088, 3615054, 3525631, 3424232, 3408389, 3255966, 3253765, 3157501, 3110376, 3096968, 3002114, 2960589, 2923468, 2898687, 2853686, 2776002, 2694877, 2710240, 2688356, 2583869, 2611122, 2490279, 2426335, 2501660, 2377967]
2191B377967l9868Q0699m4849q4119j5666o9306l9291Q452r4889J00141j46042
2180B033229P7208O248k6737m2293O7813m9558m0822R2888n2268K9990p6541J285
2168B020442N5764M8954k1749R5349j09646J6230L0659J2294P9614K0205N7883
2157B305999q0073J01649R0524O7111k4434l1950k9423n7052k2984j4815P6628
2146B381180L8955J43604J59195K9384j18436j19593j19050R9954J3733k297N8626
2135B565255o6584N3651J31839N0820M9620J48614J51679L22157L816K00148J5208
2124C626223J4489m7963j20841L9486O2285J08647J47321K80165J08694j84429
2114D034077j48728j82797j40019j62740l2666R9533N4578j29621Q7758k4956
$$ y = [2377967, 2338099, 2418798, 2373949, 2289830, 2274164, 2204858, 2165567, 2174019, 2079130, 2179271, 2033229, 2110437, 2116685, 2089948, 2047655, 2115468, 2065910, 2025088, 2117976, 2065708, 2095698, 2019157, 2020442, 2076206, 2125160, 2103411, 2198760, 2089114, 2105344, 2136003, 2148297, 2227911, 2248116, 2305999, 2225926, 2327575, 2418099, 2485210, 2460776, 2428826, 2399403, 2342351, 2319367, 2304552, 2381180, 2420135, 2563739, 2722934, 2752318, 2633882, 2514289, 2395239, 2495193, 2508926, 2506629, 2565255, 2498671, 2552322, 2684161, 2734981, 2784601, 2933215, 3084894, 3407051, 3410867, 3611015, 3626223, 3640712, 3592749, 3471908, 3511394, 3573679, 3682326, 3829647, 4109812, 4218506, 4034077, 3885349, 3702552, 3562533, 3399793, 3367127, 3466660, 3521238, 3391617, 3479375, 3454419]
2104C454419J32864J55329J47605J53368K96348N9174J18466j96154j73670j33199
2094D014550j33796R92M621Q0287J30854J18801j18535k88498l33274k31973j87917
2083C056112j11534j18149j12884j46778q6153n5646O4390m1871l1746o0342l1500
2072B323899n7422p9485Q439k27352R4738j93692Q059j63832k7972N311l5614
2061A655077j11918k01641k1792j18252j46859l8698j19902j0649j02802o1255
2051G21309r9628j39313l6926p3073n9519o2100J4153j73753J4086j01622q6906
2040h3292L27p4022q4934P764M776j38544K069j4394o9672M3192o3747l113m889
2027d78479r5769q4916K1984n3703R6543j01702k9799M4603j14755l3390P351
$$ y = [3454419, 3587283, 3742612, 3890217, 4043585, 4339933, 4399107, 4517573, 4321419, 4147749, 4014550, 3880754, 3881746, 3886367, 3966654, 4097508, 4216309, 4097774, 3809276, 3476002, 3244029, 3056112, 2944578, 2826429, 2713545, 2566767, 2480614, 2424968, 2489358, 2447487, 2415741, 2355399, 2323899, 2266477, 2186992, 2195431, 1968079, 2062817, 1869125, 1877184, 1713352, 1685380, 1690691, 1655077, 1543159, 1341518, 1319726, 1201474, 1054615, 1015917, 896015, 885366, 782564, 721309, 621681, 482368, 445442, 372369, 312850, 250750, 264903, 91150, 105236, 3614, -83292, -82965, -156987, -241921, -234157, -229381, -367925, -365856, -380250, -449922, -406730, -470477, -473590, -478479, -574248, -659164, -637180, -690883, -594340, -696042, -725841, -681238, -795993, -829383, -822032]
2016h22032O5569l8776j58237J04004o5284m8989J068N8943j14200Q9494o0406
2005i88846p1148K4261p872q5375J6641M5706m0967l4685M4917N4769j74298M0746
1993a176151L8493r6632M087o8493O0192j22953M5204L8087M1099m2136m3745
1982a322948M5658p9842P7050o7230M2471m9376M5302r3142K5231M3054r6708
1971a430480J37371n7136r5823J26106j54883L7745l5138N6582R219m0524L7238
1960a409723n5623j6530J37361j15664K7977N6237j08304O9080o7487M1234m3510
1949a484952L402M2287P673j4480n6616n0632L2726k9198q446K5022N1980j25940
1937a607174N6880m1330J8063J3458M4969n8536N1578l3199J19549j72948K6757
$$ y = [-822032, -756463, -795239, -953476, -849472, -914756, -963745, -962677, -903734, -1017934, -928440, -988846, -1059994, -1035733, -1043605, -1128980, -1112339, -1066633, -1107600, -1142285, -1097368, -1042599, -1216897, -1176151, -1137658, -1234290, -1230203, -1298696, -1238504, -1361457, -1316253, -1278166, -1237067, -1279203, -1322948, -1277290, -1357132, -1280082, -1347312, -1304841, -1354217, -1308915, -1402057, -1376826, -1333772, -1430480, -1293109, -1350245, -1446068, -1319962, -1474845, -1437100, -1472238, -1415656, -1406437, -1446961, -1409723, -1465346, -1481876, -1344515, -1460179, -1432202, -1375965, -1484269, -1415189, -1482676, -1441442, -1484952, -1481550, -1439263, -1431590, -1446070, -1502686, -1553318, -1520592, -1549790, -1558236, -1533214, -1481234, -1607174, -1550294, -1591624, -1573561, -1560103, -1515134, -1573670, -1522092, -1555291, -1435742, -1608690, -1581933]
1926a581933j7426k8663N2501j3563N64l2600M5562p1199k4551O3544K816k2026
1914a626974m2963K6238l1741p716P8901r4161L1382o1863R5135L2173j05649
1903a707238J60851j07501K8717P640p1770l9618P1498O5629r0453o0219M7942
1892a694522N2793m3511k8933p107o1832K3689P7216Q3720n1746q9373N6294M207
1880a679105L2996O3508j65705p208k7272J15498l0808k0844N8959p7402J16298
1869a621085j00050K626R5043j33275J27624k4258r6995J877L0480J4983K95j9691
1857a722426K2858q1275J81788p9094q793N714J8312q3648k6876O0649l6600L0121
1845a719270j2403l7799M5647J6161n5156n5632O4600M6081q8313R2141o2627
$$ y = [-1581933, -1599359, -1628022, -1575521, -1589084, -1588520, -1621120, -1575558, -1646757, -1671308, -1607764, -1604948, -1626974, -1669937, -1643699, -1675440, -1683156, -1604255, -1698416, -1667034, -1728897, -1633762, -1601589, -1707238, -1546387, -1653888, -1625171, -1617531, -1689301, -1728919, -1657421, -1591792, -1682245, -1742464, -1694522, -1641729, -1685240, -1714173, -1721280, -1783112, -1759423, -1682207, -1598487, -1650233, -1739606, -1683312, -1679105, -1646109, -1582601, -1748306, -1755514, -1782786, -1667288, -1698096, -1718940, -1659981, -1737383, -1621085, -1721135, -1718509, -1623466, -1756741, -1629117, -1653375, -1750370, -1748493, -1718013, -1703030, -1702735, -1722426, -1699568, -1780843, -1599055, -1678149, -1686942, -1681228, -1662916, -1746564, -1773440, -1712791, -1749391, -1719270, -1731673, -1769472, -1723825, -1707664, -1762820, -1818452, -1753852, -1707771, -1796084, -1703943, -1766570]
1834a766570k8704O2519l1863n1049P8254J4767m4896P466J64153l3770n4q4786
1822a714533n5357L6252J0264O4462n7438n3622Q82O0246n9772J9174r938M2430
1810a716950j8796O6178m9133j01558J08113k9365K9425O5851m6263p9757O391
1799a765864R1101J7795m7816o5005P4552m9150o1858R7148o6004J2465P0285
1788a692351n5650O9447K530r4724P0873L920j06233Q1993n335r6155J38152m2774
1776a726307L7982j615P0883j05382M446L3071j16628J42283j55714R6826j5937
1765a736092r519l6860P8589n8160P786k2963K4168l7195P1318J0381k2695O859
1753a724383L3880p9890J128J7821J7317k1712K5028K9719j2683M266K7273j7151
$$ y = [-1766570, -1795274, -1732755, -1764618, -1815667, -1737413, -1722646, -1767542, -1760076, -1595923, -1629693, -1629747, -1714533, -1769890, -1733638, -1723374, -1658912, -1716350, -1769972, -1769090, -1708844, -1768616, -1749442, -1759380, -1716950, -1735746, -1669568, -1718701, -1820259, -1712146, -1741511, -1712086, -1646235, -1692498, -1772255, -1765864, -1674763, -1656968, -1704784, -1769789, -1695237, -1744387, -1806245, -1709097, -1775101, -1762636, -1692351, -1748001, -1678554, -1676024, -1770748, -1699875, -1695955, -1802188, -1720195, -1725530, -1821685, -1683533, -1726307, -1688325, -1689940, -1619057, -1724439, -1719993, -1686922, -1803550, -1661267, -1816981, -1720155, -1736092, -1745611, -1782471, -1703882, -1762042, -1754256, -1777219, -1753051, -1790246, -1718928, -1708547, -1731242, -1724383, -1690503, -1770393, -1769265, -1751444, -1734127, -1755839, -1730811, -1701092, -1713775, -1709509, -1682236, -1699387]
1741a699387j35119J05344o3053K1701L7318j02640L4038K6021M9885K8712j5633
1730a712813l376M4244n2301K0539j27140P8413n9020R0390n0718K0851o2495
1719a813426K3825J20996j14545J5601K2930p1732J27352j05593K3354Q302N0546
1708a712390J6209j2804m5067n1336J25122p8790L0862O8057j66848O2922J18797
1697a645266p6752o4361K9593M4098q3599Q6089q4124j952J03574J7962j8278
1686a693016k1792l3157M8871M1600r6203P9296k8983m9898M5882O8066j39637
1675a778971N0779J22681r9794L5229K7718j08734j129J47129o6543o034K2038
1664a655631L3065o3993m6368J827M7688j1159K1802l1907m2880Q7908m0741m5464
$$ y = [-1699387, -1834506, -1729162, -1792215, -1770514, -1733196, -1835836, -1801798, -1775777, -1725892, -1697180, -1712813, -1716189, -1671945, -1724246, -1703707, -1830847, -1752434, -1811454, -1721064, -1771782, -1750931, -1813426, -1789601, -1668605, -1783150, -1767549, -1744619, -1816351, -1688999, -1794592, -1771238, -1762936, -1712390, -1696181, -1708985, -1754052, -1805388, -1680266, -1759056, -1728194, -1660137, -1826985, -1764063, -1645266, -1722018, -1786379, -1756786, -1712688, -1796287, -1710198, -1794322, -1796274, -1692700, -1674738, -1693016, -1714808, -1747965, -1699094, -1657494, -1753697, -1674401, -1703384, -1753282, -1707400, -1639334, -1778971, -1728192, -1605511, -1705305, -1670076, -1642358, -1751092, -1752221, -1605092, -1671635, -1677669, -1655631, -1622566, -1686559, -1732927, -1731100, -1683412, -1694571, -1672769, -1704676, -1747556, -1659648, -1700389, -1745853]
1652a745853J08291m907j6789r9896P9201N1522n6678m155n6172K1284P9881m2116
1640a686387L571j4686k4382O8027o0748Q5181J858l7842o9602O30M1891Q0813
1628a611676j12280J599J6336k7606M0523K632M6421o955M553R8259j43144R866
1616a681472j8605L4691o948O1069l5819q1598K9762l1142Q1541k8077l2596l7732
1604a746926O9699k9460K7482R674l0102L3331o7798K4474J3095n6810J57988
1593a595353o4608J02619j75480O1792j8704L940K6510N7115j07745Q0218J6775
1582a612921n0707J6617n7402m8273J46534q5266P5890J7432K7277j1288k0031
1571a602138k3870m6956Q463j6150K2802J21980j11085n6793J2076J30342n9886
$$ y = [-1745853, -1637562, -1642469, -1659258, -1759154, -1679953, -1628431, -1685109, -1689264, -1745436, -1724152, -1644271, -1686387, -1682816, -1697502, -1721884, -1653857, -1714605, -1629424, -1627566, -1665408, -1735010, -1734380, -1692489, -1611676, -1723956, -1722357, -1706021, -1733627, -1693104, -1690472, -1644051, -1651006, -1646453, -1548194, -1691338, -1681472, -1700077, -1665386, -1672334, -1611265, -1647084, -1728682, -1698920, -1730062, -1648521, -1676598, -1709194, -1746926, -1677227, -1706687, -1679205, -1669531, -1699633, -1666302, -1734100, -1709626, -1696531, -1753341, -1595353, -1659961, -1557342, -1732822, -1671030, -1689734, -1685794, -1659284, -1602169, -1709914, -1629696, -1612921, -1663628, -1647011, -1704413, -1752686, -1606152, -1691418, -1615528, -1598096, -1570819, -1582107, -1602138, -1626008, -1672964, -1664501, -1680651, -1657849, -1535869, -1646954, -1703747, -1691671, -1561329, -1621215]
1560a621215j1246Q2605k2479p4224M2038J7658m2301n1570J16227L9467j01901
1549a626941K7073k5114J04768j43499M8503j3638J9708P9983K9155M6527j27258
1538a580733N5892n6878K9194N50n8818N3503n1593L4271m2279L9183q216n6530
1526a642454Q0205K3840J697k7219j4984k1762R5120r958M876o3293L4282Q5609
1514a454041J249k834j2590L3122j38165J12795P5655m5820j803j4045J5907j52887
1502a583457R4823R174j9802n6336N3572Q04J01974r3774L7397K3603J701n8555
1490a488876n5757J95241q9130j7718M8617R382r0519N7483l3227L5634Q3339
1479a345531N4177J980j9707K2805O5644J05767P4670l2846J85360J04058l9369
$$ y = [-1621215, -1632461, -1549856, -1572335, -1646559, -1604521, -1586863, -1629164, -1680734, -1564507, -1525040, -1626941, -1599868, -1624982, -1520214, -1663713, -1615210, -1628848, -1609140, -1529157, -1500002, -1453475, -1580733, -1524841, -1581719, -1552525, -1551975, -1610793, -1557290, -1608883, -1574612, -1616891, -1577708, -1585924, -1642454, -1562249, -1538409, -1536712, -1563931, -1578915, -1600677, -1505557, -1515515, -1510639, -1573932, -1539650, -1454041, -1452792, -1455626, -1468216, -1435094, -1573259, -1460464, -1384809, -1430629, -1432432, -1446477, -1430570, -1583457, -1488634, -1479460, -1499262, -1555598, -1502026, -1501222, -1399248, -1493022, -1455625, -1432022, -1430321, -1488876, -1544633, -1349392, -1438522, -1456240, -1407623, -1398241, -1488760, -1431277, -1464504, -1428870, -1345531, -1291354, -1289374, -1309081, -1286276, -1220632, -1114865, -1040195, -1073041, -887681, -783623, -822992]
1468h22992J28543l4519q8671r8164L9466L4107j12644R5972K6870J12690L5427
1457f83915r0406j22438j52623j35573O3076r6112p9256m7213o0416J61077j08085
1446a351884M984q5332K2512O4573q5731M6396p5731n4072l9109L1403M9609o8436
1434a540818k8501R2395n3261k4347J3587k8818R509P0132L1724j04916K3991
1423a539323O1572m6469K4600n6075q601k5142K9300k7933k9057R7301m3811m7050
1411a610688j6831n6897J44411j67575J28329l5151K4209r863n6141J3609M7035
1400a595553K3515N9834q1287M8371p1091K7365l8591L1267R4495l7869m5900
1389a585444p8054M0188O8778P0938o2013J7275j5010o0776j623J37564p7915
$$ y = [-822992, -694449, -728968, -817639, -915803, -876337, -842230, -954874, -858902, -832032, -719342, -683915, -774321, -896759, -1049382, -1184955, -1121879, -1217991, -1297247, -1344460, -1404876, -1243799, -1351884, -1346900, -1432232, -1409720, -1345147, -1430878, -1384482, -1460213, -1514285, -1553394, -1521991, -1472382, -1540818, -1569319, -1476924, -1530185, -1554532, -1540945, -1569763, -1560254, -1490122, -1458398, -1563314, -1539323, -1477751, -1524220, -1499620, -1555695, -1564296, -1589438, -1560138, -1588071, -1617128, -1519827, -1563638, -1610688, -1627519, -1684416, -1540005, -1707580, -1579251, -1614402, -1590193, -1600056, -1656197, -1642588, -1595553, -1572038, -1512204, -1593491, -1545120, -1616211, -1588846, -1627437, -1596170, -1501675, -1539544, -1585444, -1663498, -1623310, -1554532, -1483594, -1545607, -1528332, -1543342, -1604118, -1605741, -1468177, -1546092]
1378a546092p5918P6199q206K0363j9602o4141J38603j14319K0968P8754j04549
1367a597940M3091Q0473j49405L2151L3588N1981l8663r9671P4383l3371J2035
1356a591348J6256k3002o3622n4208J89649l8194k9119m5034O498Q1209l7351
1345a588266M45P6310j6089j01695J07198k9835r795M2215o6871M0579K9679M379
1333a511746m9493L2896n670o3083J02379j3589j5339n3884O5314j5966k1077
1322a549258j1311K2134j11379J52516p0752J26017n3670j34133J43485j02557
1312a588908Q784R7635p5870j8189O1912K0315j05636J40505k16340J76179l7459
1301a537072p8467K3540n6020O9133q8115R2148k5834O6124Q879P266p1093N2713
$$ y = [-1546092, -1622010, -1545811, -1554017, -1533654, -1553256, -1617397, -1478794, -1593113, -1572145, -1493391, -1597940, -1554849, -1474376, -1623781, -1591630, -1558042, -1506061, -1544724, -1644395, -1570012, -1603383, -1591348, -1575092, -1598094, -1661716, -1715924, -1526275, -1564469, -1593588, -1638622, -1632124, -1550915, -1588266, -1587821, -1511511, -1527600, -1629295, -1522097, -1551932, -1561727, -1519512, -1586383, -1545804, -1516125, -1511746, -1561239, -1528343, -1534013, -1597096, -1494717, -1508306, -1523645, -1577529, -1512215, -1528181, -1549258, -1560569, -1538435, -1649814, -1497298, -1568050, -1442033, -1495703, -1629836, -1486351, -1588908, -1580124, -1482489, -1558359, -1576548, -1514636, -1494321, -1599957, -1459452, -1675792, -1499613, -1537072, -1615539, -1591999, -1648019, -1578886, -1667001, -1574853, -1600687, -1534563, -1525684, -1518418, -1589511, -1536798]
1289a536798p2330Q2045j21841R9737k701p0023N3337j6885o8650J32731Q866
1278a512512q5906M8424N1379l7374J40875j95701M1689K54K6330n5733J5149
1267a563126P2570m3878j1433j05011J90670j01967P1135p2388J69P5111j32854
1256a621002M9508L0576O816J2559r90j47j9414l5111k0258L4952o150j4698m7851
1243a631210J23711J1394J6324j1885q1164n733M8288o5096P0772k4292N4050
1232a494841m4807l5959R6920m2460j1463k7451L2471J6227m250P2352r5198k6027
1220a564486J00991o2715R145j5774j5720K9443k9149J6902K4869J4551k9271
1209a521214J8069k6593L6429q363p1539M0949P5011r5181P5101o9661J1754l6255
$$ y = [-1536798, -1609128, -1527083, -1648924, -1549187, -1551888, -1621911, -1568574, -1585459, -1654109, -1521378, -1512512, -1598418, -1549994, -1498615, -1535989, -1395114, -1590815, -1549126, -1548872, -1522542, -1578275, -1563126, -1490556, -1534434, -1545867, -1650878, -1460208, -1562175, -1491040, -1563428, -1563259, -1488148, -1621002, -1571494, -1540918, -1534102, -1521543, -1522533, -1522680, -1542094, -1577205, -1597463, -1562511, -1568661, -1583359, -1631210, -1507499, -1496105, -1479781, -1491666, -1572830, -1578563, -1530275, -1595371, -1524599, -1548891, -1494841, -1539648, -1575607, -1478687, -1521147, -1532610, -1560061, -1527590, -1511363, -1515613, -1443261, -1538459, -1564486, -1463495, -1526210, -1517065, -1532839, -1548559, -1519116, -1548265, -1531363, -1506494, -1491943, -1521214, -1503145, -1529738, -1493309, -1501672, -1573211, -1532262, -1457251, -1552432, -1477331, -1546992, -1535238, -1571493]
1197a571493J6046Q5084k5689n8465L8643l2299K9480j09663J04644M6365k381
1186a479728p4381J19357o4565Q5714o8156p2941K1793L3391p393k5073O714J49458
1174a375810p7887p1981J1697L9391j6211N4764j22463l8107J1290K8237R7096
1163a459984k2049j369L9054n1550M3495l4101K2701k0004j48294J56709L255
1152a472137k9212p8842k207P6180k4506K7247n3961Q6470l1646l4394O289M0789
1140a489930p1840R5958r1273M1994L8102L183o9764m130L3206N8659l2969l6674
1128a525478K748R2756o7399l1924p21O3137m2984O1070r4587J5651K0919P4406
1116a432406q6955k4871O7642o7386m5052K9708M9215L5695j6069l8459J62347
$$ y = [-1571493, -1555447, -1470363, -1496052, -1554517, -1515874, -1548173, -1518693, -1628356, -1523712, -1477347, -1479728, -1554109, -1434752, -1499317, -1413603, -1481759, -1554700, -1532907, -1499516, -1506909, -1531982, -1525268, -1375810, -1453697, -1525678, -1513981, -1474590, -1490801, -1436037, -1558500, -1596607, -1585317, -1557080, -1459984, -1482033, -1483402, -1444348, -1495898, -1452403, -1486504, -1463803, -1483807, -1632101, -1475392, -1472137, -1501349, -1580191, -1582398, -1506218, -1530724, -1503477, -1557438, -1470968, -1502614, -1537008, -1530719, -1489930, -1561770, -1465812, -1557085, -1515091, -1476989, -1473806, -1543570, -1547700, -1514494, -1455835, -1488804, -1525478, -1522730, -1429974, -1497373, -1529297, -1530018, -1466881, -1509865, -1448795, -1543382, -1527731, -1506812, -1432406, -1519361, -1544232, -1476590, -1543976, -1589028, -1559320, -1510105, -1474410, -1490479, -1528938, -1366591]
1105a366591j18090j4435l4891J7293l47K4791k3270J6445n9988M7142o2232J582
1093a572591K4828J43468m8022j05277O2127M5688k0100l3327j7677l9732l516
1082a564131Q7481m0796K1500q2925N608P8932o6552J84661j20720K1618p16j5890
1070a491930M5356n5625M378M917j7390j2228J19975q7736l0641R2068q7881j7833
1058a534570Q8509L1627j61020J09826k5122o4366J04879m861K1625o9584l02
1047a503359r497Q587L2283k7867L6412J4319j35406R2583p5403J54434j8737
1036a431651n8586P1687L1276l1718o2883K596J6899O1496j3744j66538O4756
1025a516410M1162o1761L4738M602n84L0395L6028j995L7285R436m4375J03078
$$ y = [-1366591, -1484681, -1499116, -1534007, -1516714, -1517061, -1492270, -1515540, -1499095, -1559083, -1511941, -1574173, -1572591, -1547763, -1404295, -1452317, -1557594, -1495467, -1449779, -1469879, -1503206, -1520883, -1560615, -1564131, -1476650, -1517446, -1495946, -1578871, -1573263, -1494331, -1560883, -1376222, -1496942, -1475324, -1476040, -1491930, -1446574, -1502199, -1497821, -1492904, -1510294, -1522522, -1402547, -1490283, -1520924, -1428856, -1516737, -1534570, -1446061, -1414434, -1575454, -1465628, -1490750, -1555116, -1450237, -1455098, -1433473, -1503057, -1503359, -1512856, -1504269, -1471986, -1499853, -1463441, -1449122, -1584528, -1491945, -1567348, -1412914, -1431651, -1490237, -1418550, -1387274, -1418992, -1481875, -1479279, -1462380, -1400884, -1414628, -1581166, -1516410, -1475248, -1537009, -1502271, -1497669, -1498253, -1467858, -1431830, -1433825, -1396540, -1387104, -1431479, -1328401]
1013a328401j97291R0437j30661O2776M0374n5599k473O6353j4096k155J2840
1002a457896R782N403n8467L5513Q635P0239n4607n4991N9582q5417J39760r9273
$$ y = [-1328401, -1525692, -1435255, -1565916, -1503140, -1462766, -1518365, -1520838, -1454485, -1468581, -1470736, -1457896, -1448114, -1442711, -1501178, -1465665, -1457030, -1386791, -1441398, -1496389, -1436807, -1522224, -1382464, -1481737]
$$ [...]
##END NTUPLES=NMR SPECTRUM
##END=
