##TITLE=abcd
##JCAMPDX= 6.0         $$ Bruker NMR JCAMP-DX V2.0
##DATA TYPE= NMR SPECTRUM
##DATA CLASS= NTUPLES
##ORIGIN= UXNMR, Bruker Analytische Messtechnik GmbH
##OWNER= root
$$ XWIN-NMR		Version 3.5
$$ Wed Aug 27 11:50:58 2025 Russian Standard Time (UT+4h)  servis@DPX200
##.OBSERVE FREQUENCY= 200.131235884673
##.OBSERVE NUCLEUS= ^1H
##.ACQUISITION MODE= SIMULTANEOUS
##.ACQUISITION SCHEME= undefined
##.AVERAGES= 32
##.DIGITISER RES= 18
##SPECTROMETER/DATA SYSTEM= spect
##.PULSE SEQUENCE= zg
##.SOLVENT NAME= CDCl3
##.SHIFT REFERENCE= (INTERNAL, CDCl3, 0, 16.4885)
##AUDIT TRAIL= $$ (NUMBER, WHEN, WHO, WHERE, WHAT)
$$ ##TITLE= Audit trail, XWIN-NMR		Version 3.5
$$ ##JCAMPDX= 5.01
$$ ##ORIGIN= Bruker BioSpin GmbH
$$ ##OWNER= servis
$$ F:\spectra/data/av/nmr/H1/1/pdata/1/auditp.txt
$$ ##AUDIT TRAIL=  $$ (NUMBER, WHEN, WHO, WHERE, WHAT)
(   1,<2025-08-27 11:48:29.76 +0400>,<servis>,<DPX200>,
      <created by zg, POWCHK disabled, PULCHK disabled
       configuration hash MD5:
       00 E9 B6 7A A2 85 ED C7 34 08 36 98 17 FE 4E 26
       data hash MD5: 32K
       BF 70 31 2E B1 DD 6C 09 87 BD EC 6F 83 C3 6A 9A>)
(   2,<2025-08-27 11:50:27.31 +0400>,<servis>,<DPX200>,
      <Start of raw data processing
       efp BC_mod = 2 LB = 0.05 FT_mod = 6 PKNL = 1 PHC0 = -270.7419 PHC1 = 0.101552 SI = 16K 
       data hash MD5: 16K
       41 F7 22 6B 99 31 0F 0E 35 A8 D8 A3 81 21 A3 DA>)
$$ ##END=
$$ 
$$ hash MD5
$$ 5E 95 AD 73 98 0D 41 9B BC 4C 5F 44 DE DC 04 94
##$RELAX= 
##$RELAX= 
##$RELAX= 
##$RELAX= 
##$RELAX= 
##$RELAX= 
##$RELAX= 
##$RELAX= 
$$ Bruker specific parameters
$$ --------------------------
##$DU= <F:\spectra>
##$EXPNO= 1
##$NAME= <H1>
##$PROCNO= 1
##$TYPE= <nmr>
##$USER= <av>
##$AMP= (0..31)
100 100 100 100 100 100 100 100 100 100 100 100 100 100 100 100 100 100 
100 100 100 100 100 100 100 100 100 100 100 100 100 100 
##$AQSEQ= 0
##$AQ_mod= 1
##$AUNM= <au_zg>
##$AUTOPOS= <>
##$BF1= 200.13
##$BF2= 200.13
##$BF3= 200.13
##$BF4= 200.13
##$BF5= 500.13
##$BF6= 500.13
##$BF7= 500.13
##$BF8= 500.13
##$BYTORDA= 1
##$CFDGTYP= 0
##$CFRGTYP= 5
##$CHEMSTR= <none>
##$CNST= (0..31)
1 1 145 1 1 1 1 1 1 1 1 1 1 1 1 1 1 1 1 1 1 1 1 1 1 1 1 1 1 1 1 1 
##$CPDPRG= <>
##$CPDPRG1= <>
##$CPDPRG2= <>
##$CPDPRG3= <>
##$CPDPRG4= <mlev>
##$CPDPRG5= <mlev>
##$CPDPRG6= <mlev>
##$CPDPRG7= <mlev>
##$CPDPRG8= <mlev>
##$CPDPRGB= <>
##$CPDPRGT= <>
##$D= (0..31)
0 2 0 0 0 0 0 0 0 0.06 0 0 0 0 0 0 0.0002 0 0 0 0 0 0 0 0 0 0 0 0 0 0 
0 
##$DATE= 1756280909
##$DBL= (0..7)
120 120 120 120 120 120 120 120 
##$DBP= (0..7)
150 150 150 150 150 150 150 150 
##$DBP07= 0
##$DBPNAM0= <>
##$DBPNAM1= <>
##$DBPNAM2= <>
##$DBPNAM3= <>
##$DBPNAM4= <>
##$DBPNAM5= <>
##$DBPNAM6= <>
##$DBPNAM7= <>
##$DBPOAL= (0..7)
0.5 0.5 0.5 0.5 0.5 0.5 0.5 0.5 
##$DBPOFFS= (0..7)
0 0 0 0 0 0 0 0 
##$DE= 6
##$DECBNUC= <off>
##$DECIM= 32
##$DECNUC= <off>
##$DECSTAT= 4
##$DIGMOD= 1
##$DIGTYP= 9
##$DL= (0..7)
0 120 120 120 120 120 120 120 
##$DP= (0..7)
150 150 150 150 150 150 150 150 
##$DP07= 0
##$DPNAME0= <>
$$ [...]
##$SUBNAM4= <"">
##$SUBNAM5= <"">
##$SUBNAM6= <"">
##$SUBNAM7= <"">
##$SUBNAM8= <"">
##$SUBNAM9= <"">
##$SW= 20.6817932712277
##$SWIBOX= (0..15)
0 0 3 0 0 0 0 0 0 0 0 0 0 0 0 0 
##$SW_h= 4139.07284768212
##$TD= 32768
##$TD0= 1
##$TE= 0
##$TE2= 300
##$TE3= 300
##$TEG= 300
##$TL= (0..7)
0 120 120 120 120 120 120 120 
##$TP= (0..7)
150 150 150 150 150 150 150 150 
##$TP07= 0
##$TPNAME0= <>
##$TPNAME1= <>
##$TPNAME2= <>
##$TPNAME3= <>
##$TPNAME4= <>
##$TPNAME5= <>
##$TPNAME6= <>
##$TPNAME7= <>
##$TPOAL= (0..7)
0.5 0.5 0.5 0.5 0.5 0.5 0.5 0.5 
##$TPOFFS= (0..7)
0 0 0 0 0 0 0 0 
##$TUNHIN= 0
##$TUNHOUT= 0
##$TUNXOUT= 0
##$USERA1= <user>
##$USERA2= <user>
##$USERA3= <user>
##$USERA4= <user>
##$USERA5= <user>
##$V9= 5
##$VALIST= <valist>
##$VCLIST= <CCCCCCCCCCCCCCC>
##$VD= 0
##$VDLIST= <DDDDDDDDDDDDDDD>
##$VPLIST= <PPPPPPPPPPPPPPP>
##$VTLIST= <TTTTTTTTTTTTTTT>
##$WBST= 1024
##$WBSW= 30
##$XGAIN= (0..3)
0 0 0 0 
##$XL= 0
##$YL= 0
##$YMAX_a= 785477
##$YMIN_a= -752308
##$ZGOPTNS= <>
##$ZL1= 120
##$ZL2= 120
##$ZL3= 120
##$ZL4= 120
##$ABSF1= 0
##$ABSF2= 0
##$ABSG= 0
##$ABSL= 0
##$ALPHA= 0
##$AQORDER= 0
##$ASSFAC= 0
##$ASSFACI= 0
##$ASSFACX= 0
##$ASSWID= 0
##$AUNMP= <proc_1d>
##$AZFE= 0.1
##$AZFW= 0.1
##$BCFW= 0
##$BC_mod= 2
##$BYTORDP= 0
##$COROFFS= 0
##$CY= 18.4799938201904
##$DATMOD= 1
##$DC= 0
##$DFILT= <>
##$DTYPP= 0
##$F1P= 9.9274215381318
##$F2P= -0.165520771350173
##$FCOR= 1
##$FTSIZE= 16384
##$FT_mod= 6
##$GAMMA= 0
##$GB= 0
##$INTBC= 1
##$INTSCL= 4.127829e-11
##$ISEN= 128
##$LB= 0.05
##$LEV0= 0
##$LPBIN= 0
##$MAXI= 10000
##$MC2= 0
##$MEAN= 0
##$ME_mod= 0
##$MI= 50
##$NCOEF= 0
##$NC_proc= -6
##$NLEV= 6
##$NOISF1= 3.799351
##$NOISF2= 2.8
##$NSP= 0
##$NTH_PI= 0
##$NZP= 0
##$OFFSET= 16.48848
##$PC= 4
##$PHC0= -270.7419
##$PHC1= 0.101552
##$PH_mod= 1
##$PKNL= yes
##$PPARMOD= 0
##$PSCAL= 4
##$PSIGN= 0
##$REVERSE= no
##$SF= 200.130005582386
##$SI= 16384
##$SIGF1= 3
##$SIGF2= 2
##$SINO= 400
##$SIOLD= 16384
##$SREGLST= <1H.CDCl3>
##$SSB= 0
##$STSI= 16384
##$STSR= 0
##$SW_p= 4139.07284768211
##$SYMM= 0
##$S_DEV= 0
##$TDeff= 32768
##$TDoff= 0
##$TI= <>
##$TILT= no
##$TM1= 0
##$TM2= 0
##$TOPLEV= 0
##$USERP1= <user>
##$USERP2= <user>
##$USERP3= <user>
##$USERP4= <user>
##$USERP5= <user>
##$WDW= 1
##$XDIM= 16384
##$YMAX_p= 535113428
##$YMIN_p= -1409693
$$ End of Bruker specific parameters
$$ ---------------------------------
##NTUPLES= NMR SPECTRUM
##VAR_NAME=  FREQUENCY,     SPECTRUM/REAL,   SPECTRUM/IMAG
##SYMBOL=    X,             R,               I
##VAR_TYPE=  INDEPENDENT,   DEPENDENT,       DEPENDENT
##VAR_FORM=  AFFN,          ASDF,            ASDF
##VAR_DIM=   16384,         16384,           16384
##UNITS=     HZ,            ARBITRARY UNITS, ARBITRARY UNITS
##FACTOR=    0.252644378177508, 1,           1
##FIRST=     3299.83951724647, 0,            0
##LAST=      -839.233330435636, 0,           0
##MIN=       -839.233330435636, -1409693,    0
##MAX=       3299.83951724647, 535113428,    0
$$ Real data points
##PAGE= N=1
##DATA TABLE= (X++(R..R)), XYDATA
$$ [...]
8986 -705834 -804031 -701816 -786940 -652931 -732611 -614708 -677453 -661399 -699087 -713017 -512344
8975 -512344 -405619 -743522 -686851 -668363 -702084 -662478 -659719 -723138 -794882 -869057 -821685
8964 -821685 -769288 -720279 -818113 -778307 -521014 -577886 -700110 -615715 -762117 -588125 -612314
8953 -612314 -644134 -619001 -706025 -858621 -699705 -800829 -741032 -631390 -828017 -704308
8943 -704308 -587135 -589855 -544483 -764060 -730681 -668497 -530904 -654904 -662945 -517341 -687955
8932 -687955 -708553 -694207 -703532 -714297 -827100 -826410 -630265 -766249 -609792 -680384 -720082
8921 -720082 -538707 -727759 -715499 -871393 -713931 -486285 -745831 -827145 -598503 -737789
8911 -737789 -776210 -539518 -681206 -701172 -609120 -556720 -621896 -615336 -680384 -556011 -671181
8900 -671181 -700042 -578736 -644988 -725177 -593931 -701086 -794230 -776549 -668538 -761787 -722644
8889 -722644 -727619 -569637 -774953 -673473 -488382 -555115 -868162 -720946 -470907 -559885
8879 -559885 -640277 -643106 -788783 -883246 -869926 -661767 -551071 -828153 -562002 -709684 -628526
8868 -628526 -701932 -660455 -629292 -617063 -758568 -681986 -731612 -612488 -630316 -647788 -883624
8857 -883624 -619297 -753781 -645643 -670595 -824111 -732900 -603952 -610118 -680450 -638994 -825758
8846 -825758 -782392 -563661 -702941 -654332 -712292 -750099 -455482 -635153 -851439 -837065 -709605
8835 -709605 -570682 -696179 -495354 -775657 -844202 -678855 -586188 -740426 -574651 -762176
8825 -762176 -785434 -681726 -539145 -585876 -769427 -685275 -772373 -636069 -640629 -867493 -763750
8814 -763750 -768841 -699661 -687366 -864790 -579913 -674817 -591049 -587206 -673830 -521981 -830119
8803 -830119 -737926 -718216 -764968 -674302 -656307 -712185 -637106 -474720 -776237 -465054 -680720
8792 -680720 -787024 -713449 -813678 -632596 -933454 -777634 -467319 -693481 -750056 -955396
8782 -955396 -745177 -822046 -485249 -932243 -504119 -685780 -730000 -655024 -782918 -805167
8772 -805167 -873105 -658451 -599664 -730193 -791763 -581218 -713500 -672172 -924567 -876549 -757228
8761 -757228 -772680 -805528 -693599 -682798 -546455 -596670 -784990 -806397 -689042 -788504 -722551
8750 -722551 -762340 -764029 -713069 -626884 -549424 -791577 -666744 -701655 -717880 -853572 -566864
8739 -566864 -737220 -629229 -526014 -582868 -898109 -733299 -604084 -488363 -674665 -867119
8729 -867119 -770338 -623953 -775809 -759781 -847343 -711305 -867784 -665299 -588613 -608411 -730730
8718 -730730 -544510 -728996 -635255 -577147 -685076 -774736 -687350 -659053 -634732 -714843 -784330
8707 -784330 -818791 -755298 -839866 -768718 -927867 -765123 -711007 -682761 -730123 -672635 -880144
8696 -880144 -675121 -864173 -742097 -760976 -700655 -763134 -441350 -562280 -625515 -679400 -680116
8685 -680116 -798971 -769723 -422708 -452055 -763067 -769825 -805504 -620673 -703500 -757070 -726537
8674 -726537 -677314 -709885 -623935 -841966 -653210 -721372 -657741 -723896 -810510 -614718 -671196
8663 -671196 -661706 -729471 -768076 -899481 -686937 -604265 -709675 -711702 -912498 -764662 -532994
8652 -532994 -674680 -862043 -627991 -732683 -618838 -633734 -644140 -724923 -778148 -787716 -910347
8641 -910347 -671123 -794948 -620402 -701484 -766325 -734192 -599056 -733658 -924605 -697933
8631 -697933 -690246 -797650 -665890 -672150 -577884 -775220 -625214 -609793 -604278 -760385 -763874
8620 -763874 -626403 -810391 -676009 -763093 -647568 -752735 -518304 -740258 -866949 -652285
8610 -652285 -556075 -675664 -444386 -677010 -632276 -618572 -904105 -728543 -810413 -569696
8600 -569696 -801278 -799242 -826281 -862008 -623524 -654065 -597575 -831729 -788655 -820601 -794433
8589 -794433 -647962 -585314 -627722 -758462 -654911 -854212 -656564 -752242 -726174 -558625
8579 -558625 -674312 -670574 -651583 -651005 -742329 -645312 -874514 -689202 -617097 -702529 -629717 -633163
8567 -633163 -648220 -885412 -735745 -907067 -817433 -712466 -564071 -790567 -675640 -733217
8557 -733217 -655714 -687864 -634562 -687956 -689242 -712737 -723175 -734138 -600984 -770015 -862456
8546 -862456 -569340 -720068 -621046 -759213 -775822 -744341 -495999 -679084 -633892 -655795 -335642
8535 -335642 -255439 -814550 -423115 -793528 -707131 -666580 -847202 -807567 -631156 -652654 -783896
8524 -783896 -708884 -687139 -677006 -729305 -730282 -668121 -702440 -739513 -733680 -778989 -909566 -662334
8512 -662334 -760064 -824976 -775633 -747689 -812893 -784532 -776151 -744731 -756324 -713223 -842460 -757633
8500 -757633 -792087 -776951 -824306 -623032 -627386 -664050 -610024 -690189 -738560 -677213 -843575
8489 -843575 -961716 -632067 -809349 -641499 -608795 -768994 -634449 -539416 -708630 -962854
8479 -962854 -597472 -636583 -691533 -676395 -761113 -615352 -672163 -528851 -649491 -667059 -676302
8468 -676302 -594601 -836575 -690602 -727730 -714234 -714104 -862949 -695444 -730566 -864294 -671560
8457 -671560 -660251 -719852 -611654 -911089 -604281 -654398 -651181 -737871 -690171 -666712 -622679
8446 -622679 -699109 -759687 -807413 -619745 -825073 -666097 -795242 -678373 -788930 -824238
8436 -824238 -728701 -906174 -839852 -896328 -784334 -646985 -654694 -719183 -771608 -713301 -647127
8425 -647127 -707478 -799816 -719888 -890258 -833128 -552590 -839260 -621757 -732577 -764517 -677066
8414 -677066 -686333 -771301 -829021 -757958 -666474 -594674 -680857 -932989 -899241 -924876 -851408 -783281
8402 -783281 -688381 -533780 -845595 -721640 -684782 -777143 -652895 -488547 -672711 -569511
8392 -569511 -775416 -887239 -724347 -771281 -606583 -786223 -671741 -824690 -653430 -744603
8382 -744603 -690961 -707189 -725529 -607574 -657790 -590733 -625803 -648900 -661404 -730060 -823500
8371 -823500 -602429 -743877 -704325 -783844 -640734 -582905 -519200 -790971 -559716 -659924
8361 -659924 -626724 -662346 -859771 -665677 -710733 -695823 -673518 -843748 -782346 -690017 -586816
8350 -586816 -598893 -703003 -680663 -747911 -946329 -783126 -899318 -640081 -841096 -753841
8340 -753841 -742134 -646951 -584934 -594301 -674707 -742015 -765532 -767998 -545734 -756356 -730766 -800077
8328 -800077 -590795 -672153 -659557 -609174 -829610 -542883 -656300 -779794 -653289 -884054
8318 -884054 -546315 -757336 -576557 -607043 -672956 -972216 -729618 -689133 -744724 -669943 -743168
8307 -743168 -707818 -770143 -793113 -718656 -709139 -798058 -730825 -680976 -887321 -677829 -669881 -537712
8295 -537712 -829937 -765317 -704381 -622428 -555700 -704406 -684978 -817252 -666502 -713886 -523987
8284 -523987 -738958 -652556 -708460 -559506 -655024 -971828 -647382 -847049 -684451 -778992
8274 -778992 -660284 -710914 -769364 -587904 -600776 -817767 -657133 -750357 -760018 -645055 -819726
8263 -819726 -819230 -663472 -577770 -650848 -678132 -718436 -733586 -759918 -676489 -745244 -724372 -722062
8251 -722062 -660043 -546011 -743568 -608473 -751501 -932681 -890910 -799956 -507333 -498408 -843919
8240 -843919 -796662 -744336 -546289 -661426 -810060 -439396 -577225 -577582 -699247 -752612 -757638
8229 -757638 -707671 -867702 -797716 -799243 -876818 -584343 -732872 -670900 -727955 -798717 -852674
8218 -852674 -720993 -642417 -707634 -731202 -786949 -896978 -633074 -615320 -775708 -793204 -665163
8207 -665163 -541232 -659902 -699096 -717749 -604764 -524115 -467220 -769166 -665484 -708550 -432561
8196 -432561 -601396 -583320 -569025 -156415 1198706 -1192067 -619691 -1138679 -901038 -660459
8186 -660459 -747263 -873434 -708153 -882855 -826674 -783566 -960814 -918813 -719031 -865093
8176 -865093 -772492 -676133 -841205 -596141 -642859 -641479 -537667 -583525 -963021 -606943 -812104
8165 -812104 -732779 -846338 -395574 -695607 -779530 -732173 -743604 -780575 -577297 -815265 -778934
8154 -778934 -597363 -801900 -711191 -711085 -565887 -812770 -921486 -566117 -705892 -644983 -741907
8143 -741907 -636017 -604028 -679781 -769920 -732558 -863452 -780439 -671882 -524574 -833527 -919019
8132 -919019 -864095 -802988 -911318 -698278 -919184 -807305 -581860 -655623 -710779 -698152 -712090
8121 -712090 -677190 -750537 -876221 -754851 -696608 -793189 -665886 -645569 -740220 -910624 -693118
8110 -693118 -783624 -530478 -620841 -683688 -826617 -794343 -719144 -704747 -728026 -523940 -708606
8099 -708606 -675916 -753198 -817716 -772522 -843984 -722952 -738832 -781954 -760705 -802192 -967763
8088 -967763 -842461 -686529 -698319 -793380 -896826 -671466 -690298 -626797 -591010 -734510 -656874
8077 -656874 -767340 -708079 -684749 -618719 -639677 -712555 -911852 -624078 -707166 -635586 -497711
8066 -497711 -825369 -693646 -704311 -519152 -624942 -659137 -726542 -823172 -718593 -746402 -804414
8055 -804414 -783718 -532167 -757976 -470098 -605185 -631008 -882436 -750226 -650875 -916780
8045 -916780 -775417 -939451 -455442 -641854 -790344 -399116 -709680 -835950 -649503 -727650
8035 -727650 -595253 -765529 -891129 -601650 -707481 -693765 -738320 -810673 -753506 -712120 -664349
8024 -664349 -694945 -643656 -755015 -473386 -646184 -664682 -781766 -759433 -669199 -643037 -763441
8013 -763441 -705712 -626860 -571684 -562735 -496799 -664612 -836527 -699181 -772427 -800707 -610558
8002 -610558 -691966 -757723 -659554 -662281 -767108 -838551 -658270 -882466 -736288 -784489 -801536
7991 -801536 -739011 -697349 -715531 -604338 -783459 -835391 -804875 -540307 -798906 -696237 -965123
7980 -965123 -644952 -805967 -673033 -529236 -712007 -448896 -669018 -650397 -874304 -704505
7970 -704505 -746994 -458995 -681620 -634064 -669165 -565790 -638380 -695322 -687462 -665806 -801102
7959 -801102 -912976 -575296 -786958 -682629 -803019 -777991 -663787 -678041 -586515 -669611
7949 -669611 -618700 -721175 -815457 -635941 -626967 -755407 -729959 -554520 -932027 -598237 -694557
7938 -694557 -690604 -680216 -662196 -754076 -620837 -864537 -1027882 -872328 -755727 -686899 -680815
7927 -680815 -680826 -861589 -615174 -666565 -714990 -714634 -799599 -778971 -793529 -746697 -665120 -547038
7915 -547038 -626189 -741384 -797049 -801984 -809110 -702769 -673479 -739543 -517100 -747526 -680640
7904 -680640 -640032 -853582 -592178 -757975 -644831 -622733 -687083 -654712 -778874 -722031 -799153
7893 -799153 -719041 -729914 -729394 -618938 -581541 -631040 -528933 -946016 -770935 -912011 -875921
7882 -875921 -737174 -533694 -625071 -665504 -731691 -590681 -674202 -616704 -638015 -855927 -756973
7871 -756973 -783606 -605603 -615927 -767329 -566737 -706793 -623221 -534589 -578253 -706099 -717882
7860 -717882 -873291 -674011 -692933 -710756 -669021 -757876 -694678 -635260 -580232 326840 -1297233
7849 -1297233 -1409693 -650056 -573819 -713106 -509867 -745293 -765298 -630254 -780352 -703198
7839 -703198 -668042 -737337 -558550 -598665 -700145 -722712 -636787 -691064 -618022 -699525 -664641
7828 -664641 -483560 -734691 -906664 -893675 -717000 -806573 -719986 -588268 -560903 -553887 -582680
7817 -582680 -696167 -617529 -824728 -831395 -734405 -730577 -547255 -716006 -660471 -895136 -633317
7806 -633317 -735328 -626935 -778241 -552774 -518956 -757705 -595184 -541171 -635565 -734815
7796 -734815 -669532 -540298 -586495 -592073 -657932 -616184 -834166 -708400 -663755 -634222 -729731
7785 -729731 -820005 -764318 -612237 -667506 -665712 -684732 -674698 -778120 -814357 -618658 -742602
7774 -742602 -703416 -660534 -761720 -770391 -537866 -655472 -714342 -604254 -776569 -837202 -695944
7763 -695944 -814571 -693062 -790023 -666572 -630425 -609727 -597983 -595285 -596132 -775324 -681578
7752 -681578 -844329 -518791 -838330 -710558 -724135 -626955 -596048 -709116 -676503 -803736
7742 -803736 -641474 -597864 -673559 -598548 -627998 -730803 -807029 -594618 -707919 -741569 -802307
7731 -802307 -636064 -614799 -779801 -859168 -793852 -558439 -792808 -729852 -691565 -657939 -610081
7720 -610081 -739327 -568886 -755315 -636067 -597915 -532339 -650512 -574756 -797482 -857957
7710 -857957 -487851 -482333 -863428 -752331 -737059 -672550 -696061 -708418 -626413 -596413 -619096
7699 -619096 -717502 -681008 -754527 -687167 -817405 -684457 -773616 -854242 -833730 -567663 -743099
7688 -743099 -748033 -801993 -863112 -713367 -679114 -742498 -704064 -718241 -624001 -746581 -585980
7677 -585980 -810778 -706017 -761944 -740453 -863614 -732977 -682435 -630211 -840125 -802521 -877940
7666 -877940 -783207 -634382 -647218 -767139 -775617 -772218 -649247 -815539 -675514 -656775 -810656
7655 -810656 -835287 -725659 -733739 -860942 -653309 -917576 -631817 -942835 -756812 -637066
7645 -637066 -687525 -724028 -830517 -581634 -737094 -665821 -717783 -770325 -527444 -707367 -728146
7634 -728146 -728064 -626676 -736209 -685513 -927231 -786285 -661130 -825408 -836343 -647330 -864155
7623 -864155 -857342 -741117 -612295 -673459 -704457 -645489 -637702 -656547 -714954 -778342 -795016 -617410
7611 -617410 -686393 -806376 -691902 -793184 -740558 -592655 -715356 -700537 -609059 -689604 -877456
7600 -877456 -753780 -788308 -852997 -677402 -678304 -775127 -448152 -651800 -658161 -698554 -629207
7589 -629207 -801703 -733205 -629946 -712770 -732110 -620135 -575565 -553247 -388262 -738169 -677175
7578 -677175 -506853 -593415 -457366 -610960 -554504 -476264 -637206 -807997 -644581 -688036
7568 -688036 -562471 -586026 -460422 -562055 -878240 -770264 -575709 -858805 -674314 -820343
7558 -820343 -644769 -794920 -760685 -710948 -757603 -578341 -814257 -623677 -845533 -537373
7548 -537373 -501633 -560903 -911127 -691901 -812188 -699655 -623480 -790681 -628205 -565208
7538 -565208 -600010 -605951 -743896 -764722 -748793 -691610 -574060 -583348 -786282 -499681 -633655
7527 -633655 -617965 -722096 -683051 -536576 -824983 -657045 -545112 -633795 -583075 -560178 -565748
7516 -565748 -708803 -713145 -711387 -894137 -688859 -604031 -555018 -638412 -695562 -721998 -643976
7505 -643976 -610982 -701740 -665996 -645497 -586725 -606283 -717534 -730335 -928780 -758973 -492170
7494 -492170 -800908 -721182 -793597 -763034 -602356 -478911 -607424 -608293 -674533 -825284 -665516
7483 -665516 -640874 -693434 -910988 -782052 -666736 -777470 -808248 -738818 -666221 -820555 -640441
7472 -640441 -706789 -743463 -720553 -799803 -657457 -779817 -578130 -531818 -655482 -539289 -555784
7461 -555784 -696859 -722111 -747983 -756622 -684815 -651826 -630397 -668621 -715125 -759901 -666665 -647363
7449 -647363 -637834 -851318 -819394 -711199 -846406 -597118 -602779 -648179 -709871 -612245 -706833
7438 -706833 -664737 -678918 -618461 -795384 -761634 -725202 -701990 -663134 -816727 -667216 -956323
7427 -956323 -690560 -690245 -670745 -779932 -873815 -691532 -854019 -608527 -631108 -500125 -771218
7416 -771218 -685127 -615946 -686765 -757279 -538365 -872315 -621122 -626163 -524712 -662803 -682153
7405 -682153 -717142 -456156 -652399 -647548 -554595 -602619 -493563 -596929 -799609 -531256 -746902
7394 -746902 -733849 -704127 -553435 -453537 -792932 -666170 -685653 -699967 -543028 -537437 -675217
7383 -675217 -463736 -687564 -885768 -657012 -700752 -658347 -616222 -777083 -549948 -537255
7373 -537255 -579798 -406762 -606739 -422440 -660551 -553899 -608798 -639173 -576632 -640829 -712560
7362 -712560 -616542 -655450 -656831 -613993 -717633 -500373 -590472 -786927 -531833 -665616 -479832
7351 -479832 -513146 -449454 -804358 -538259 -628297 -683661 -626009 -669578 -578699 -819545 -840410
7340 -840410 -748627 -387886 -660593 -550536 -445718 -564207 -648649 -393773 -637814 -731897
7330 -731897 -725023 -608222 -479055 -535753 -488174 -583798 -415915 -671616 -509324 -720379 -682866
7319 -682866 -590924 -586024 -699919 -511146 -399327 -602002 -688417 -511495 -555435 -452921 -564212
7308 -564212 -472788 -604891 -572711 -629637 -569129 -606862 -596386 -459397 -666437 -665540 -683650
7297 -683650 -518235 -360831 -417407 -648392 -554317 -631611 -610157 -562464 -484696 -536490 -328084
7286 -328084 -373098 -341926 -506180 -438729 -401674 -518944 -580447 -611188 -507679 -510542 -459246
7275 -459246 -488186 -320301 -589282 -542043 -462121 -590270 -484685 -497005 -489360 -202362 -558646
7264 -558646 -344599 -498519 -456365 -508701 -460870 -329356 -328115 -276537 -448870 -294967 -545921
7253 -545921 -418656 -363297 -493257 -223083 -374417 -299341 -342212 -435850 -422599 -443479 -340637
7242 -340637 -355723 -424636 -307575 -272414 -339429 -566338 -403378 -195840 -369448 -327408 -185447
7231 -185447 -220450 -246007 -155622 -379320 -431853 -290251 -90128 -4675 -383838 -422682 -271547
7220 -271547 -260738 -140878 -147758 45937 -153296 -266155 -110556 -294854 -150965 -223125
7210 -223125 -146690 -153862 -127321 -177993 -7827 138410 -80625 170788 -130828 -86765 -12713
7199 -12713 69411 17245 74047 374999 57527 255257 167388 229125 417895 341509 405316
7188 405316 722484 684031 757042 993378 1245112 1214597 1520188 1518171 1837548 2038145 2439594
7177 2439594 2857320 3395505 3759508 4343027 5220681 5999870 6994036 8360561 9790829
7168 9790829 12489315 16122742 19405226 20810067 22966677 25196726 26128449 22579589
7160 22579589 18073407 15163628 13238264 11624491 10475534 9604259 8378491 7602409
7152 7602409 7077032 5985012 5495327 4843011 4454222 4022780 3494057 3220473 2946339
7143 2946339 2654720 2458845 2305164 2076730 1925427 1724735 1566950 1406853 1540451 1261560
7133 1261560 1191197 1256799 1023749 1239242 728005 1034064 1048020 905620 730672 619130
7123 619130 583250 717366 541212 633912 491765 412950 329822 324652 184657 268681 193687
7112 193687 15468 127921 76883 -61303 133611 174227 -167352 129228 101661 -46326
7102 -46326 -33117 14367 -129343 -87437 -65737 -77753 74276 -149070 -45266 -135796 -215314
7091 -215314 -189262 -108296 -135815 -124408 -74752 -55807 -176449 -67005 -242552 -223121 -252901
7080 -252901 -376994 -306055 -240210 -210696 -273254 -496670 -225984 -192431 -303951 -50908 -344097
7069 -344097 -258554 -202006 -382259 -444478 -331279 -317201 -272272 -407076 -171012 -323129 -245789
7058 -245789 -508795 -458805 -454564 -481719 -302347 -341743 -366428 -441024 -519005 -256710 -490704
7047 -490704 -287594 -286886 -376583 -568079 -283274 -272299 -340440 -421027 -272545 -544737 -305977
7036 -305977 -451110 -467800 -496967 -447095 -468367 -558336 -569864 -477237 -334862 -208267 -403345
7025 -403345 -479523 -515659 -520503 -493161 -386865 -456405 -424767 -505272 -507366 -431571 -642520 -630579
7013 -630579 -434283 -494966 -470701 -535084 -383022 -473575 -412420 -545976 -501471 -572183 -459526
7002 -459526 -462558 -676126 -510078 -526145 -610733 -607357 -534805 -550830 -361334 -533300 -683439
6991 -683439 -432052 -468668 -516094 -572269 -505989 -622261 -704205 -614778 -710915 -715111 -603472
6980 -603472 -591242 -625105 -555476 -513465 -606547 -535961 -563047 -623690 -633356 -562469 -560388 -443231
6968 -443231 -500374 -632320 -740359 -568087 -541363 -478008 -876454 -573536 -523380 -578255 -626878
6957 -626878 -635851 -561741 -488274 -472113 -566174 -453184 -744927 -763677 -553530 -664383 -694483
6946 -694483 -570196 -585187 -525287 -586190 -457300 -583342 -562561 -548707 -544192 -692036 -495052
6935 -495052 -586210 -554571 -612794 -530383 -717294 -617319 -595323 -799243 -631639 -558989 -649971
6924 -649971 -578805 -653010 -598358 -502075 -554417 -738613 -725188 -589775 -620375 -607280 -624765
6913 -624765 -786055 -753596 -475960 -639665 -659355 -534773 -605012 -779409 -668445 -592426
6903 -592426 -732109 -614463 -658403 -546023 -419929 -872303 -606780 -643548 -519089 -641112
6893 -641112 -535606 -576600 -608017 -632646 -540900 -524871 -527870 -749649 -533562 -627066 -773074
6882 -773074 -645005 -673346 -619578 -710309 -784954 -575862 -470880 -623576 -573796 -553386 -596249
6871 -596249 -545634 -777187 -809179 -626645 -541288 -677396 -511743 -601077 -707403 -578783
6861 -578783 -603030 -729872 -685193 -740783 -773389 -725560 -691873 -598637 -434926 -877441 -658326
6850 -658326 -671816 -739526 -581756 -667169 -643531 -805222 -569065 -687246 -826433 -781380 -816604
6839 -816604 -807991 -751373 -675916 -756578 -607328 -556620 -572802 -643221 -531683 -744515 -590176
6828 -590176 -592075 -645759 -653614 -867100 -653196 -745410 -552415 -759136 -395449 -587199 -703800
6817 -703800 -524793 -653264 -699114 -604591 -739871 -646654 -699225 -701794 -705096 -658830 -619768
6806 -619768 -587003 -600662 -695688 -765024 -676340 -803808 -639592 -713414 -598379 -765620 -764699
6795 -764699 -817899 -514583 -499223 -612630 -622064 -841216 -536278 -784147 -785616 -634707 -682095
6784 -682095 -693100 -778967 -756407 -533531 -711734 -699949 -664208 -575688 -572704 -802991 -561618
6773 -561618 -584638 -650041 -685329 -728703 -502438 -655784 -621739 -544178 -676688 -690168 -758061
6762 -758061 -648058 -658132 -690824 -677074 -551645 -537248 -730594 -592634 -768118 -647929
6752 -647929 -511897 -735091 -535333 -622563 -519420 -515135 -431133 -523013 -633628 -616381 -492419
6741 -492419 -712425 -701369 -622775 -656500 -565704 -631054 -666974 -607748 -728507 -766816 -820791
6730 -820791 -576385 -783081 -660341 -773431 -798736 -527642 -653784 -705157 -687863 -746148
6720 -746148 -655919 -631244 -693957 -532976 -681265 -812292 -682403 -728754 -707470 -769792 -749448
6709 -749448 -851428 -708027 -541412 -692749 -594440 -636446 -535024 -824413 -811907 -597038
6699 -597038 -584669 -663535 -647108 -654462 -679884 -776620 -687393 -607137 -616315 -810761 -620851 -679956
6687 -679956 -638927 -640813 -667093 -692024 -651796 -789892 -699790 -691998 -708159 -707659 -935380 -751363
6675 -751363 -775734 -621339 -549103 -658507 -821808 -651324 -702341 -598284 -658879 -660266 -708488
6664 -708488 -697683 -781670 -895792 -755158 -910056 -776092 -801180 -888308 -661849 -666453 -979456
6653 -979456 -583228 -689246 -649915 -681048 -651272 -529586 -602841 -827255 -610821 -596159 -665887
6642 -665887 -776256 -886314 -720624 -554307 -634034 -730174 -772935 -763202 -726898 -650319 -706971
6631 -706971 -638948 -564399 -733846 -636841 -754188 -739781 -659127 -837492 -662138 -568792 -588856
6620 -588856 -770074 -643611 -591060 -682144 -603273 -839021 -656053 -741254 -883759 -758357
6610 -758357 -685010 -944133 -711425 -705484 -604008 -677982 -704375 -784449 -779983 -797534 -811741
6599 -811741 -718183 -863923 -689035 -737000 -585570 -698582 -666454 -636229 -695448 -651598 -555323
6588 -555323 -690034 -809300 -736375 -631070 -738241 -667528 -571085 -619693 -513016 -688391
6578 -688391 -890182 -740841 -657805 -688066 -672184 -693947 -720929 -776978 -709451 -883910 -732047
6567 -732047 -607190 -741070 -756828 -705230 -659440 -678937 -521230 -875161 -701940 -796630 -737454
6556 -737454 -825193 -945304 -671959 -703408 -686163 -860224 -711401 -619229 -838628 -557753
6546 -557753 -623508 -567232 -629456 -860306 -615801 -654015 -604139 -813243 -745237 -817751 -632042
6535 -632042 -789110 -898821 -680276 -705428 -668659 -775236 -569457 -730130 -749869 -629991
6525 -629991 -835329 -649560 -718195 -646066 -689145 -734972 -649899 -712275 -987738 -720562 -739919
6514 -739919 -702761 -516924 -784167 -844711 -572859 -710291 -752143 -511108 -737715 -683789
6504 -683789 -838841 -804797 -915726 -533057 -658461 -753708 -700911 -694390 -783243 -641221 -777786
6493 -777786 -675004 -656395 -705033 -690295 -676477 -579876 -652278 -686540 -865287 -689769 -743173
6482 -743173 -767005 -649009 -764557 -737629 -730120 -711033 -798642 -716362 -612663 -554090 -738374
6471 -738374 -710710 -530455 -639609 -598260 -710936 -555373 -806413 -667214 -711451 -635967
6461 -635967 -728853 -571194 -652601 -749073 -733746 -711858 -762272 -779072 -590422 -711084 -626868
6450 -626868 -645798 -539296 -759772 -528269 -570492 -765033 -720291 -648540 -625820 -546276 -750080
6439 -750080 -458846 -676417 -542306 -644355 -555078 -450709 -461274 -632369 -692681 -383905
6429 -383905 -816878 -746709 -540711 -598606 -699069 -638018 -645393 -520443 -745274 -689077 -725776
6418 -725776 -756503 -781038 -492029 -589634 -686187 -566634 -559045 -621219 -574812 -528827 -830642
6407 -830642 -537440 -694690 -767647 -654962 -628673 -525124 -606287 -720340 -570804 -671343
6397 -671343 -667431 -795584 -767724 -769127 -659598 -654938 -662031 -677959 -808322 -810658 -563794 -720642
6385 -720642 -577978 -789256 -609798 -784445 -741841 -567384 -486746 -888837 -575024 -605947
6375 -605947 -726888 -530767 -678903 -549831 -689360 -826262 -874242 -758909 -629004 -620098
6365 -620098 -662822 -749499 -715066 -959880 -797299 -772599 -827960 -839015 -911349 -830289 -767654
6354 -767654 -660528 -614565 -792592 -646501 -523674 -782475 -626106 -614175 -828188 -833756
6344 -833756 -782497 -757605 -779099 -905063 -751776 -850320 -640333 -716653 -954263 -638589 -843924
6333 -843924 -609049 -851333 -709598 -813977 -621200 -736657 -890091 -803290 -634793 -1040891
6323 -1040891 -714839 -823515 -806397 -650782 -668188 -520473 -722798 -670603 -631336 -546314
6313 -546314 -515990 -621348 -654336 -675998 -587566 -592356 -633161 -554257 -817815 -564288 -808723
6302 -808723 -581033 -652441 -584352 -658800 -819028 -746642 -725342 -743344 -652926 -685576 -774227
6291 -774227 -588150 -614936 -821543 -764290 -668247 -632003 -782142 -863813 -705796 -626623 -602840
6280 -602840 -555562 -810725 -648452 -664810 -647076 -420574 -778101 -673565 -623573 -598581 -754709
6269 -754709 -696290 -506410 -739683 -728815 -596234 -774021 -638242 -704848 -584352 -827117
6259 -827117 -770506 -647895 -566038 -806406 -536922 -736239 -589764 -691876 -690042 -864661
6249 -864661 -787994 -804903 -734636 -821138 -716676 -796739 -839287 -646025 -640460 -613320 -986436
6238 -986436 -677660 -666363 -849569 -777434 -540692 -496108 -842182 -679298 -648796 -654017 -657566
6227 -657566 -655082 -595902 -510501 -749129 -906549 -823513 -707008 -723058 -653226 -655040 -604880
6216 -604880 -727766 -693568 -823351 -738937 -860205 -594074 -849711 -504240 -646954 -681009
6206 -681009 -744890 -602559 -845076 -743853 -698593 -867236 -597756 -718475 -856823 -762778
6196 -762778 -805587 -779138 -698174 -838129 -704836 -799799 -691892 -461411 -556233 -705258 -1010106
6185 -1010106 -729210 -885179 -676743 -791648 -821587 -901599 -833139 -924712 -765346 -722324
6175 -722324 -725765 -836756 -875658 -832472 -699184 -707988 -672174 -793203 -874644 -676705 -529964
6164 -529964 -831300 -599481 -826113 -700779 -819847 -605349 -825752 -889931 -840354 -699335
6154 -699335 -669298 -772484 -701624 -760773 -943795 -698706 -774610 -829367 -601086 -693209 -759518
6143 -759518 -744313 -686028 -726435 -719675 -707813 -601861 -643656 -764184 -556706 -663679 -718067
6132 -718067 -622153 -811234 -668946 -785046 -653931 -608762 -855472 -949334 -717960 -756082
6122 -756082 -714307 -651394 -731411 -737775 -747257 -577056 -742496 -662456 -707928 -675762 -616628 -677562
6110 -677562 -753385 -787538 -671328 -684635 -892779 -840519 -697932 -557654 -668591 -850601
6100 -850601 -710156 -625813 -668362 -705308 -739015 -792357 -697526 -671669 -804784 -637996 -752216
6089 -752216 -755620 -717239 -655759 -836731 -619479 -842680 -973287 -650540 -568180 -847446 -802041
6078 -802041 -722724 -778717 -652514 -625287 -832599 -872079 -627519 -781696 -835750 -593846 -566937
6067 -566937 -479898 -862315 -490791 -589897 -719991 -638322 -757383 -743996 -729540 -520154 -813210
6056 -813210 -670714 -680840 -877515 -615988 -647471 -734786 -807681 -773557 -568705 -659745 -767609
6045 -767609 -732755 -672862 -858990 -681059 -697856 -654786 -833843 -798629 -745241 -860936 -927256
6034 -927256 -744110 -620124 -815311 -809500 -872917 -712038 -776673 -908104 -688561 -750530 -677876
6023 -677876 -773464 -773236 -583917 -824384 -833283 -802387 -750805 -1000010 -769906 -765860 -639793
6012 -639793 -507396 -784655 -726616 -746152 -628830 -687714 -781024 -834723 -692226 -724910 -816663
6001 -816663 -741253 -592436 -733547 -773998 -847505 -799665 -572949 -660643 -915437 -685103 -778972
5990 -778972 -690534 -630605 -668663 -610463 -717552 -678309 -596200 -772787 -687728 -724416 -811111
5979 -811111 -640197 -821835 -607962 -747434 -907453 -709249 -787233 -593503 -530445 -711614
5969 -711614 -792361 -756204 -576757 -700135 -894324 -755452 -758804 -769014 -668865 -631153 -836584
5958 -836584 -607466 -698104 -702337 -770443 -767516 -819266 -644723 -625137 -723497 -733299 -759536 -707605
5946 -707605 -854265 -717387 -799660 -582080 -754440 -771484 -900082 -886525 -586000 -853646
5936 -853646 -825309 -850891 -712666 -944995 -684431 -668543 -808168 -661599 -760486 -706792 -543578
5925 -543578 -791549 -765309 -1095391 -656485 -759185 -746223 -696214 -807678 -802714 -674425 -816572
5914 -816572 -832359 -794435 -811365 -791200 -787869 -881391 -905285 -818637 -791878 -737784 -830787 -567025
5902 -567025 -558538 -752296 -790078 -599098 -791268 -785682 -817069 -898530 -830629 -814136 -655287
5891 -655287 -786212 -853393 -837440 -618297 -684416 -681934 -702522 -879954 -658223 -504872 -632223
5880 -632223 -697529 -865711 -887598 -714758 -630759 -902358 -677836 -687925 -819912 -784004 -678819
5869 -678819 -810650 -693783 -803542 -790751 -807317 -875665 -799925 -865536 -896070 -852653 -954301
5858 -954301 -714286 -792517 -837798 -859561 -662484 -696405 -712604 -818296 -570861 -598672 -517051
5847 -517051 -781965 -598471 -693651 -653851 -849953 -701021 -683752 -762127 -860397 -634440 -735861
5836 -735861 -841242 -696134 -767877 -802445 -813237 -744050 -1035751 -757438 -648308 -806370
5826 -806370 -624180 -927534 -566159 -684816 -618938 -801378 -800712 -744786 -681934 -766650 -535092
5815 -535092 -615296 -486925 -572901 -790305 -826704 -891514 -835995 -633794 -670184 -703903 -698675
5804 -698675 -689806 -790982 -739940 -734814 -813985 -824224 -685278 -669701 -691549 -629414 -810803
5793 -810803 -689524 -653409 -682835 -722600 -827121 -854514 -588682 -832387 -731061 -1020617
5783 -1020617 -800973 -684471 -553644 -740630 -851138 -736264 -818321 -885902 -646931 -766610
5773 -766610 -742606 -767295 -689913 -652420 -642326 -941986 -886451 -712556 -714236 -887932 -537380
5762 -537380 -800116 -728192 -820484 -675793 -779410 -775916 -829406 -831871 -722905 -609371 -556734
5751 -556734 -668260 -693745 -619301 -710908 -608911 -533958 -498289 -590014 -825381 -743265 -784357
5740 -784357 -626867 -598929 -742742 -608833 -737298 -858560 -784723 -726177 -700250 -748166 -591695
5729 -591695 -853777 -842300 -708410 -740416 -710934 -788818 -834280 -709492 -792772 -706076 -849723
5718 -849723 -724071 -650791 -613249 -566840 -736227 -785215 -813703 -754639 -635627 -779052 -887306
5707 -887306 -749781 -591656 -833712 -705110 -754927 -795932 -691886 -799649 -714910 -664062
5697 -664062 -604727 -770243 -518142 -945564 -979303 -772503 -804564 -789839 -678516 -675941 -768560
5686 -768560 -692210 -747069 -581658 -791208 -704068 -909677 -889851 -588197 -663034 -691620 -822659
5675 -822659 -649032 -799336 -819712 -871150 -846380 -866392 -860308 -925672 -707028 -771598 -658628
5664 -658628 -725895 -717387 -717105 -757082 -890714 -764818 -583813 -827810 -808199 -695575 -688933
5653 -688933 -695722 -683717 -630950 -886633 -650666 -746302 -519940 -636407 -685648 -798138 -822013
5642 -822013 -752109 -692060 -706653 -633028 -643687 -595659 -694002 -689767 -524446 -586197 -665701 -697804
5630 -697804 -701608 -756823 -627132 -697746 -638634 -644963 -876787 -569857 -814518 -752300 -678421
5619 -678421 -587341 -693678 -795347 -687013 -860698 -772012 -718106 -770235 -646122 -654551 -797706
5608 -797706 -664227 -655524 -665329 -600244 -554334 -745736 -787375 -639708 -624334 -541361 -614653
5597 -614653 -734420 -647953 -701465 -675833 -757805 -566497 -600900 -720219 -617215 -757276 -797303
5586 -797303 -632249 -645624 -783431 -853031 -686697 -651259 -782870 -685857 -716369 -653155 -617734
5575 -617734 -643734 -437009 -704972 -619157 -577422 -593493 -635514 -718596 -894178 -799966 -636691
5564 -636691 -583240 -722773 -865008 -905775 -806586 -849308 -839787 -610810 -746524 -746557 -671940 -734011
5552 -734011 -643444 -804001 -719399 -768903 -837336 -580383 -633217 -827124 -704384 -802330 -726751
5541 -726751 -754041 -751688 -710330 -703181 -954234 -744989 -623080 -663630 -692760 -833622 -724417
5530 -724417 -845112 -884012 -837531 -710445 -635075 -877965 -823489 -739652 -736414 -847818 -630284
5519 -630284 -799914 -652473 -783935 -887110 -913199 -814854 -590065 -714001 -910177 -739688
5509 -739688 -659131 -859520 -735595 -811119 -745898 -835319 -709592 -760889 -865375 -772748 -640115
5498 -640115 -630178 -742722 -786994 -799221 -670135 -691965 -703314 -802148 -764603 -505195 -638777
5487 -638777 -768751 -711400 -773493 -556897 -555887 -557506 -736151 -707532 -764929 -865000 -740580
5476 -740580 -771703 -731770 -661723 -836409 -650924 -621447 -1039994 -717927 -678333 -747528 -643084
5465 -643084 -817594 -681769 -656916 -671137 -977548 -806317 -607789 -626578 -927707 -710742
5455 -710742 -770626 -650743 -826586 -757006 -593020 -691770 -802326 -713960 -779360 -618513 -699922
5444 -699922 -643716 -645528 -770028 -849535 -563125 -584094 -816556 -791212 -803629 -601353 -722270
5433 -722270 -696551 -759211 -641379 -616678 -747603 -750191 -863166 -760010 -741077 -742424 -770597
5422 -770597 -760246 -625452 -620493 -747515 -867985 -755632 -543161 -824819 -619267 -491435
5412 -491435 -763924 -515444 -576016 -499578 -544454 -664453 -718384 -789262 -741526 -667632 -1029375
5401 -1029375 -829322 -876362 -657271 -721464 -740146 -737968 -844977 -873805 -726620 -941975 -728959
5390 -728959 -795522 -819593 -715385 -822918 -825587 -638071 -601034 -681708 -1043112 -687407 -707655
5379 -707655 -910476 -876491 -559541 -715103 -692767 -736320 -903517 -708503 -699092 -874535 -736542
5368 -736542 -744261 -887052 -750802 -814699 -747614 -870057 -881605 -822224 -827813 -962374 -823724
5357 -823724 -871424 -958578 -916746 -630640 -686006 -884687 -790720 -722013 -681620 -795645 -834401
5346 -834401 -735447 -793152 -698980 -695433 -999246 -795797 -806859 -882030 -758799 -785522 -830854
5335 -830854 -818425 -595240 -815985 -857964 -723723 -803980 -759645 -716396 -824137 -911459 -717775
5324 -717775 -512478 -569125 -757614 -754574 -771867 -762058 -718716 -663187 -767240 -748094 -863990
5313 -863990 -768635 -723099 -792793 -808070 -672546 -834582 -739228 -706009 -892071 -875014 -691260
5302 -691260 -713124 -809226 -787935 -718042 -846504 -766035 -984745 -754008 -873836 -932916 -928904
5291 -928904 -889691 -824610 -885560 -809981 -836918 -929352 -846054 -854064 -974158 -829009 -924750
5280 -924750 -747284 -970545 -844732 -620695 -829188 -653055 -661512 -887027 -611949 -648986
5270 -648986 -633804 -635629 -667767 -584849 -700694 -746528 -775477 -665434 -830357 -736916 -848355
5259 -848355 -726215 -886700 -832866 -811512 -841851 -808173 -727044 -840742 -799747 -559804 -748474
5248 -748474 -811514 -773135 -624510 -899458 -690359 -867145 -625339 -787788 -642602 -764644
5238 -764644 -747595 -799479 -713108 -722731 -845087 -871780 -800409 -582661 -733505 -664162 -705811
5227 -705811 -647482 -741755 -861536 -929879 -833096 -915396 -842622 -915614 -820177 -755497 -840166
5216 -840166 -780976 -657792 -758463 -816753 -785207 -907249 -978006 -773185 -678829 -873142 -832375
5205 -832375 -860244 -664888 -777812 -765977 -625012 -815684 -810062 -726133 -736263 -924353 -507567
5194 -507567 -850713 -780996 -814768 -942099 -830562 -760683 -825944 -748186 -847542 -738791 -692912
5183 -692912 -682583 -931994 -505100 -794587 -713057 -905313 -882651 -828959 -867381 -779084 -680477
5172 -680477 -844125 -863067 -858192 -726386 -858735 -758696 -1036318 -925884 -703911 -778204
5162 -778204 -728223 -877566 -808588 -731996 -652410 -761211 -825597 -659137 -769188 -777952 -616837
5151 -616837 -693462 -628822 -747537 -547336 -603799 -900818 -887388 -794524 -610235 -904922 -864717
5140 -864717 -785260 -727724 -644837 -631532 -801340 -916512 -693230 -757710 -711867 -772882 -867073
5129 -867073 -845323 -692573 -763400 -754266 -805999 -567903 -836466 -581137 -950618 -693928 -860590
5118 -860590 -677159 -635740 -657694 -802196 -825173 -642443 -822250 -756734 -819185 -868035 -877155
5107 -877155 -673842 -874083 -671585 -576432 -577754 -601551 -587373 -1002243 -888563 -747722 -706155
5096 -706155 -842563 -556883 -635844 -651437 -628251 -762761 -674332 -903791 -807967 -596550 -689483
5085 -689483 -743089 -586346 -812763 -864309 -800124 -759269 -721613 -927170 -708652 -788328 -834960
5074 -834960 -811108 -684844 -940200 -858794 -865283 -684126 -681194 -607280 -701033 -719211 -869093
5063 -869093 -632920 -520354 -523667 -655991 -656271 -735193 -736374 -902766 -920681 -736458 -629712
5052 -629712 -701533 -689523 -749621 -801428 -527480 -727128 -499293 -735798 -713948 -784685 -698821
5041 -698821 -1029903 -954620 -665322 -765300 -776296 -625574 -766646 -569555 -701101 -733493
5031 -733493 -688769 -579935 -596016 -572254 -781355 -576849 -374069 -612881 -408813 -438583
5021 -438583 -364205 -690443 -345246 -381292 -584748 -423066 -572817 -294168 -655411 -672838
5011 -672838 -483912 -618199 -436639 -453131 -632978 -560558 -532983 -699996 -504305 -521162
5001 -521162 -476829 -405285 -685237 -653738 -409159 -689288 -417257 -588245 -350586 -629737
4991 -629737 -373790 -299537 -332803 -465856 -356640 -394736 -619901 -459967 -587522 -755436
4981 -755436 -680061 -533885 -505397 -616891 -758993 -689882 -666621 -578145 -756229 -547962 -546176
4970 -546176 -571601 -658381 -709642 -661879 -583449 -396388 -693317 -637135 -769969 -554249 -670239
4959 -670239 -811019 -592643 -752325 -530714 -705552 -556936 -722008 -639119 -492046 -594707
4949 -594707 -557815 -720096 -745863 -664151 -673702 -664004 -696815 -702680 -705393 -823451 -679614 -707915
4937 -707915 -811417 -760126 -719702 -822509 -623973 -490940 -619533 -571461 -853275 -769517
4927 -769517 -738895 -691801 -723585 -706577 -549823 -775551 -592016 -795586 -605897 -595399 -660503
4916 -660503 -694427 -779477 -654754 -539976 -782188 -503262 -511276 -636642 -762245 -681537 -680890
4905 -680890 -572134 -756574 -653420 -795887 -683296 -761949 -714490 -793543 -593906 -562727
4895 -562727 -611161 -663722 -702529 -568966 -515123 -526069 -576613 -777454 -525780 -594181 -643541
4884 -643541 -600326 -748922 -724964 -553722 -568879 -456579 -602477 -629582 -584960 -668610 -698989
4873 -698989 -547120 -633510 -593792 -704427 -566494 -561857 -825772 -783282 -777349 -754041 -648287
4862 -648287 -835736 -557072 -643770 -737504 -540953 -684253 -394675 -620019 -668540 -334698
4852 -334698 -580817 -548850 -526520 -511405 -563530 -513734 -579915 -418421 -558593 -512971 -583516
4841 -583516 -520788 -542559 -491539 -623731 -326617 -636163 -560456 -468132 -174244 -520937 -638645
4830 -638645 -482258 -372955 -306610 -382636 -381166 -471282 -292049 -333726 -196388 -354470 -224478
4819 -224478 -205714 -353449 -381034 -221521 -210842 -305183 -152007 -205593 -71694 -179056 -104208
4808 -104208 -46233 60884 104074 59467 34844 246594 225485 43661 70075 171459 238816
4797 238816 146043 349741 233377 297019 387681 417090 528941 348623 439091 532763 474864
4786 474864 618732 600345 636315 954806 751613 832028 996740 1009635 993324 957923 1089958
4775 1089958 993847 1185293 1291807 977247 974056 1021270 874613 1157030 978450 1016299
4765 1016299 1083649 1107457 1007187 842697 652134 803592 893386 623962 573382 779949
4755 779949 641076 652970 817957 628920 689172 601862 590822 601486 486794 683720 549973
4744 549973 404716 505457 440067 367490 262951 176272 201253 57758 18691 225659 4927
4733 4927 -231494 107563 140208 31978 -7729 -296167 -99467 -123313 -59190 -235055 -65710
4722 -65710 34676 -31035 -11676 -13807 -10758 23546 39932 -164525 -203728 -113910 -168541 -398404
4710 -398404 -398314 -334482 -436627 -449146 -310747 -326630 -353927 -571355 -235214 -299025 -394144
4699 -394144 -519955 -370521 -618517 -530396 -476712 -406447 -525063 -476093 -369867 -499900
4689 -499900 -419562 -357195 -364025 -362705 -478743 -442709 -488298 -397662 -379311 -612784 -398146
4678 -398146 -475198 -570093 -502356 -467074 -504117 -676713 -717926 -607735 -639697 -479116 -609601
4667 -609601 -461272 -570313 -548717 -611928 -536564 -526180 -428170 -505233 -638077 -649546 -471977
4656 -471977 -554839 -712248 -660052 -533076 -578054 -653950 -648307 -556973 -575891 -523508 -511305
4645 -511305 -489406 -662526 -545011 -421543 -660325 -520744 -763108 -422352 -650307 -643702
4635 -643702 -638414 -635138 -589356 -532747 -589357 -625401 -647434 -729765 -708449 -655648 -744936 -827753
4623 -827753 -818920 -525770 -755390 -611439 -591646 -671924 -781233 -634375 -698595 -637120 -513420
4612 -513420 -696498 -762827 -666200 -655662 -868899 -756761 -548409 -766153 -644529 -592990
4602 -592990 -759973 -774057 -664243 -807549 -768196 -675886 -717118 -653862 -751869 -805495 -715600
4591 -715600 -554819 -756678 -607963 -579061 -621447 -718175 -674991 -852841 -725876 -849997
4581 -849997 -783206 -731746 -643300 -605515 -826488 -729735 -643283 -748792 -731785 -647946 -931774
4570 -931774 -722915 -792179 -741154 -745146 -686332 -630676 -790505 -783523 -684467 -721827 -659750 -635021
4558 -635021 -658669 -611060 -756327 -767695 -696835 -764723 -690331 -832032 -798048 -800164 -774990
4547 -774990 -897771 -761024 -910117 -780171 -821942 -846125 -766432 -705211 -686398 -695726 -1041596
4536 -1041596 -880876 -796422 -929904 -843582 -900098 -843893 -800768 -1037380 -736401 -847443
4526 -847443 -958313 -1034815 -1010549 -844825 -842215 -920266 -712461 -803785 -742094 -793977 -897645
4515 -897645 -713292 -997424 -937181 -601332 -647318 -643258 -742546 -603672 -934085 -730252 -659569
4504 -659569 -838104 -839566 -827436 -821979 -941327 -729903 -697436 -948924 -880943 -700811 -890094
4493 -890094 -792114 -965305 -815282 -907487 -710932 -813689 -712168 -784682 -793521 -884294 -829396
4482 -829396 -759634 -901801 -666298 -851880 -757410 -715328 -696470 -955677 -797406 -772605 -855709
4471 -855709 -751338 -621836 -730424 -771630 -671201 -623804 -498068 -658026 -820710 -664085
4461 -664085 -662162 -459596 -661065 -745883 -523316 -772338 -659554 -796898 -590686 -581596 -621213
4450 -621213 -885655 -520207 -800819 -854410 -863098 -801855 -650437 -794823 -731784 -787129 -656068
4439 -656068 -643533 -943111 -895218 -834660 -769941 -816161 -1016682 -684218 -915401 -825665 -817278
4428 -817278 -755150 -790291 -763794 -791759 -727160 -659000 -643331 -799309 -743469 -759851 -816934
4417 -816934 -772980 -795087 -748627 -847421 -755363 -1038757 -789516 -828676 -908200 -657420 -726473
4406 -726473 -837909 -906282 -709982 -764790 -878398 -895080 -890604 -850353 -756491 -777653 -846935
4395 -846935 -816450 -857870 -908804 -766958 -817547 -708906 -666491 -636673 -824780 -844938 -863108
4384 -863108 -903462 -798797 -698148 -851871 -773586 -713620 -733455 -984906 -755077 -948471
4374 -948471 -856840 -766714 -723987 -716831 -566141 -724636 -843379 -780992 -842513 -777007 -858496
4363 -858496 -781306 -688448 -665606 -744954 -723241 -765260 -704790 -832432 -739401 -678163 -832207
4352 -832207 -819097 -585258 -799463 -698212 -699107 -811257 -922727 -731516 -657409 -959225 -805277
4341 -805277 -683514 -879829 -590989 -756864 -859307 -961976 -762469 -685511 -705594 -751873
4331 -751873 -763251 -822461 -677653 -885818 -777632 -655927 -903787 -654435 -709657 -762791
4321 -762791 -648646 -922404 -662148 -751273 -651154 -773254 -699157 -802973 -812918 -868813 -687537
4310 -687537 -813858 -644140 -743605 -660996 -624614 -611205 -710988 -713385 -566253 -771305 -702013
4299 -702013 -900822 -822736 -706459 -732249 -569572 -685183 -720471 -705529 -724676 -736589 -627879
4288 -627879 -683229 -808400 -642627 -809715 -540273 -624290 -664653 -689153 -839658 -789839 -529527
4277 -529527 -639673 -663788 -687072 -778397 -641172 -697794 -866284 -684874 -674731 -768955 -714634
4266 -714634 -809204 -717670 -594271 -661954 -713271 -613714 -716852 -700858 -511900 -479781 -731363
4255 -731363 -604512 -812040 -788784 -639255 -356601 -709228 -703544 -553150 -577499 -529989 -726815
4244 -726815 -540463 -634165 -628934 -715993 -661431 -710466 -680566 -564127 -707313 -718828 -615818
4233 -615818 -662407 -772135 -669603 -797392 -696003 -668224 -666441 -719323 -667656 -749960 -515110
4222 -515110 -555210 -670852 -602403 -803652 -852202 -680923 -702647 -652977 -621682 -905021 -918725
4211 -918725 -511966 -516588 -566762 -771589 -659287 -466018 -951795 -511381 -581689 -682480
4201 -682480 -731617 -588813 -547893 -688334 -677157 -632978 -758892 -935639 -764619 -649542
4191 -649542 -755935 -831700 -439515 -830376 -540323 -626037 -552822 -775426 -636909 -505086
4181 -505086 -683600 -694981 -669383 -605918 -790775 -782120 -752690 -667338 -763485 -888948 -572359
4170 -572359 -799422 -509679 -601266 -644665 -602403 -641577 -549344 -731917 -787370 -499020 -680191
4159 -680191 -671782 -812406 -721971 -673777 -796237 -775970 -714162 -750635 -769769 -777026 -619700
4148 -619700 -793551 -621927 -777890 -680838 -785318 -544292 -475613 -671001 -585118 -653708
4138 -653708 -730889 -722906 -598571 -625235 -808770 -770872 -638138 -874613 -788489 -638087 -877302
4127 -877302 -885202 -752407 -600614 -767538 -676670 -802239 -746336 -927739 -799041 -781719 -801554
4116 -801554 -764839 -753521 -600132 -550323 -835610 -853561 -778031 -762050 -830997 -654081 -728406
4105 -728406 -846470 -757070 -731756 -865091 -644011 -669852 -867723 -678559 -752513 -727195 -606390
4094 -606390 -766808 -882428 -731728 -797601 -595257 -649293 -808803 -592430 -640900 -599338
4084 -599338 -745154 -655864 -576254 -644062 -677229 -528344 -673978 -578688 -686338 -879005 -671583
4073 -671583 -540120 -597379 -585537 -673612 -850342 -647870 -631049 -509956 -818190 -453487
4063 -453487 -574800 -438658 -506662 -426695 -420078 -261011 -229649 -381051 -308008 -230944 -44285
4052 -44285 -38133 3427 104817 404175 149882 388243 396457 759974 703674 767031 861277
4041 861277 842305 976713 667046 819987 705358 731894 551695 723917 453092 520374
4031 520374 581261 588829 759502 690475 639378 853464 800716 821703 1075528 1189891 1111993
4020 1111993 1397552 1543073 1687326 1807719 1955422 2058809 2248147 2344870 2434020 2257695
4010 2257695 2398646 2301215 2011567 1915604 1866513 1637662 1612819 1489989 1567665 1429019
4000 1429019 1312313 1294270 1051049 1045160 941158 1172783 1121122 1042476 1181199 1320435
3990 1320435 1266797 1411991 1523017 1767750 1674694 1935237 1825228 1928689 2013873 2157422
3980 2157422 1955205 1841276 1711372 1725856 1893732 1572704 1561606 1589511 1395730 1245658
3970 1245658 1031981 1202271 1185255 931142 968035 1250667 1022784 1124973 1446257 1042860
3960 1042860 1018575 1137724 1203061 1328969 1316228 1473875 1512606 1396908 1405434 1596190 1395491
3949 1395491 1544541 1570985 1596046 1620134 1748428 1808652 1908790 2078657 1902229 1943733
3939 1943733 2080854 1957005 2173935 2342431 2300050 2428372 2271211 2573555 2581080 2663698
3929 2663698 2813592 2598637 2750442 2960148 2839979 2916634 3092499 3007982 3125520 3169081
3919 3169081 3224465 3368967 3266420 3292050 3473483 3582332 3312353 3394697 3386473 3403609 3649389
3908 3649389 3684472 3662462 3668607 3696657 3610328 3752544 3701994 3873517 4027025 4128106 4014883
3897 4014883 4020922 4005775 4103566 4082440 4215696 4020176 4295424 4142555 4312931 4240236 4257302
3886 4257302 4228957 4240443 4284992 4555821 4368694 4460557 4350159 4641242 4545944 4845848
3876 4845848 4989302 5049102 5121732 5025022 5123042 5142649 5183682 5388113 5357816 5624390 5602120
3865 5602120 5583500 5609255 5890445 5722054 5842856 6089893 6362153 6257663 6360128 6466735
3855 6466735 6647113 6906975 6980268 6962057 7242130 7477559 7722907 7750610 7923687 8329755
3845 8329755 8223514 8535651 8723808 8810729 9017542 9340536 9493472 9690513 10038188 10239530
3835 10239530 10448174 10749987 11106671 11365592 11785842 12099067 12440415 12908679 13387481
3826 13387481 13627921 14382471 14875072 15296959 15982338 16660392 17309825 18080587 18701902
3817 18701902 19698161 20722872 21732604 22923483 24132634 25325117 26878188 28261853
3809 28261853 29853931 31788866 33934123 36456450 38882021 41701767 45317898 49170754
3801 49170754 53556023 58674215 64710351 71638704 79584343 89274853 99972262 112713400
3793 112713400 126396525 141640921 158266438 175470729 193215068 210050139 226284543
3786 226284543 240673284 252231328 260124488 264027134 264678429 262387030 257574240 250495853
3778 250495853 242252791 233962242 225745586 218574896 212239408 206947083 203237142 201650765
3770 201650765 202180899 205356608 211431282 220170034 232043674 247437400 266530180 288941598
3762 288941598 314927526 343872691 375546965 408838689 441852551 472297138 498953907
3755 498953907 519623851 532313839 535113428 529020665 515011788 495161120 470890210
3748 470890210 444341159 417345511 391051599 365921559 342340169 320781931 301840608
3741 301840608 285449384 272111487 261580887 253983896 249387233 247358388 248308963 252010020
3733 252010020 258329647 268001245 279930303 294385840 310241008 326149923 341193719
3726 341193719 354670318 364783037 369802955 368998737 363204305 352939700 338725674 321161819
3718 321161819 302074665 282711975 263875907 245933623 229138608 213697344 199663792
3711 199663792 187374469 176766271 167818022 160018206 153724902 148722956 144659556 142079552
3703 142079552 140330752 139561652 139908580 140994750 142912204 145581408 148735566 152817743
3695 152817743 156697750 161634628 166290524 170886072 175651234 179855549 183945735 187829557
3687 187829557 191403692 194339507 197815718 200937453 204220101 207708504 211476879 215279449
3679 215279449 219755038 224815939 230441685 236543557 243052071 249403506 255658893 261886046
3671 261886046 267722829 272571310 276232527 278809491 279905433 279901177 278482519 275117744
3663 275117744 270656575 265537380 259235172 252191814 244860887 237767535 230626425 223575940
3655 223575940 217021792 211365823 205714813 201488837 197403985 194204815 191307837 188841980
3647 188841980 186443440 184092962 181530685 178700007 175398017 171065866 166603612 161418404
3639 161418404 155490342 149237612 142471372 135684297 129015667 122470281 116064671 109995177
3631 109995177 104413282 99390602 94482788 89783950 85659067 81971536 78532350 75530286
3623 75530286 72262637 69998549 67277468 65074321 63141597 61593745 60290026 59004984
3615 59004984 57842379 57115790 56338968 55800288 55564920 55316367 55441549 55636112 56066809
3606 56066809 56650810 57362896 58428613 59448213 60954630 62615859 64705076 67021714
3598 67021714 69671213 72721396 76077649 80073116 84579809 89316118 94367206 100147689
3590 100147689 105737128 111603101 117298209 122732450 127843157 132283585 136329797 140074734
3582 140074734 143320352 146011006 148528689 151543549 154164420 156866936 160096815 164067550
3574 164067550 168565296 173432582 179319930 185881119 192830266 200489995 208680020 217101441
3566 217101441 225693217 233965430 242070392 249423216 255597017 260760616 264038774 266385716
3558 266385716 266918651 265557676 263018926 259472625 255128953 250073717 244915153 239308692
3550 239308692 234167118 229204782 224639632 220418811 216682786 213156120 209871565 206792963
3542 206792963 203397071 200046877 196128800 191694064 186733441 181540079 175529762 168917954
3534 168917954 162035308 154901238 147606252 140306936 133122397 125983984 119100288 112675553
3526 112675553 106747946 101180666 95654573 90885745 86384626 82379169 78389085 74968076
3518 74968076 71901744 68995199 66548055 64030770 61829351 59348288 57503312 55891184
3510 55891184 53926624 52389887 50922347 49198978 47859747 46358402 45183397 43859439
3502 43859439 42920236 41743820 40668407 39699064 38727374 37855505 37285888 36345027 35531490
3493 35531490 34957377 34078432 33554556 32611979 31873560 31120794 30433819 29814015 29090319
3484 29090319 28266876 27728667 27122311 26348422 26060629 25410189 24933193 24463563 23880621
3475 23880621 23665277 23152554 22730092 22536983 22195807 22015798 21559580 21365878 21226856
3466 21226856 21041406 20619509 20663026 20320909 20016586 19931978 19674399 19190142 18935391 18753571
3456 18753571 18329694 17921026 17715546 17491700 16960734 16853114 16586199 16261305 16041454
3447 16041454 15856369 15582596 15348476 15110196 14838739 14815476 14499856 14382517 14155760 14031447
3437 14031447 13787057 13829336 13577914 13526974 13183992 13132070 12991494 12627163 12768908 12495387
3427 12495387 12326699 12168490 11966621 11928969 11655209 11891483 11732307 11784055 11628605 11485812
3417 11485812 11328334 11378104 11049624 10918320 11002420 11028025 10758438 10709966 10447513 10521098
3407 10521098 10522379 10305331 10020941 9934067 9801806 9747580 9562592 9587586 9422311 9280733
3397 9280733 9174506 9193371 9069318 8922846 8815778 8726983 8698851 8442140 8406187 8436900
3387 8436900 8357302 8127148 8290155 7966290 7782621 7850049 7794086 7740621 7790019 7698402 7740207
3376 7740207 7709432 7503253 7558349 7615333 7524196 7449432 7289723 7400146 7094367 6788629
3366 6788629 6992278 6914578 6840343 6699080 6655551 6840140 6511765 6578323 6390898 6586318
3356 6586318 6403393 6403277 6365637 6395013 6325845 6190349 6457185 6469877 6352584 6466117 6664835
3345 6664835 6598986 6857546 6937296 6983116 7020566 6887078 7162033 6963535 6899734 7016210
3335 7016210 6969100 6946272 7002483 7041547 6979432 6915464 7001546 6998935 7219466 7377707 7132953
3324 7132953 7313249 7162430 7381133 7372160 7665956 7683258 7864674 7896878 8187006 8317368
3314 8317368 8509645 8530932 8487571 8395244 8594279 8452730 8464985 8543470 8193659 8178392 8064367
3303 8064367 8020590 7935826 7639882 7472430 7412382 7349666 7251451 6957663 7090490 6893193
3293 6893193 6986335 6749237 6735224 6579392 6667683 6650744 6554787 6766387 6661233 6596255 6357236
3282 6357236 6331791 6238676 6137392 5995172 5717735 5711815 5590908 5437456 5369974 5473115
3272 5473115 5180644 4828974 4906991 4913785 4605164 4624125 4674291 4561275 4476766 4492097 4392363
3261 4392363 4384772 4338744 4134619 4245390 4365453 4195926 4204873 4078452 4132745 4135077 4192347
3250 4192347 4114151 3953798 4084655 4068735 4016904 3955370 3864716 3845648 4017029 4056802 4069346
3239 4069346 3940181 4016496 4090305 3988837 4024031 4002511 4165955 4083479 4139024 4086612 4213855
3228 4213855 4121752 4223642 3958739 4216378 4228900 4184083 3963515 4054689 4138754 4221037 4122775
3217 4122775 4225481 4215447 4050569 4191440 3958617 4141524 4411697 4247316 4299830 4627578
3207 4627578 4616197 4448293 4662211 4742563 4734251 4746967 4913987 4925026 4828102 4898655 4887182
3196 4887182 4849509 4751503 5025466 4918630 5160051 5155193 5263442 5185085 5408552 5444156 5480330
3185 5480330 5681869 5513565 5630203 5829707 6023495 6068665 6244381 6458895 6531620 6960591
3175 6960591 6942563 7117279 7416766 7589556 7788646 8062144 8299467 8565487 8956001 9339976
3165 9339976 9763973 10396774 10576180 11198275 12037863 12902374 13890915 14763995 16085054
3156 16085054 17258221 18999525 20655096 22777261 25092281 28149533 31823519 36062807
3148 36062807 40786639 45816918 50603627 55131607 58378671 59707663 59427156 57483295
3140 57483295 54153212 50916029 48610539 46939682 46186196 45657736 45587821 45688797 45959552
3131 45959552 46663184 47549249 48824426 50553717 52837432 56121995 60089828 65320070
3123 65320070 71905677 79569149 89317264 100159504 112036260 125192438 139481951 153381116
3115 153381116 163698649 169579378 172690769 173354766 169574927 159675192 146621366 134661591
3107 134661591 125669626 118927261 113434588 108748219 105024963 102254885 99561658 97437607
3099 97437607 96067276 95928148 97040221 99454478 103020994 108445382 115032519 124184327
3091 124184327 134714575 146670400 161079326 178038471 194888690 209044341 220598962
3084 220598962 229677692 235146519 233443426 223420820 208745456 191885189 174851054
3077 174851054 160205641 148046073 138382748 130228572 122867687 116631496 111422581 107029010
3069 107029010 103268489 100341058 98341148 97296450 97092050 97530036 98998871 101884798
3061 101884798 106540474 113259220 121996071 131740743 141761181 151741700 159917755 164087587
3053 164087587 163631377 159052994 150142310 138502723 126321855 114948023 105740619 97943484
3045 97943484 91390679 85315507 80160410 75311054 71040573 67554870 64303525 61562612
3037 61562612 59465081 57512972 56004843 55049812 54279179 53891083 54235063 54901316 56093546
3028 56093546 57068028 58326852 59713936 61093502 61275551 60500777 58557950 55759060 51916214
3019 51916214 47668644 44263537 41728449 38982336 37033914 34919899 32947221 31397547
3011 31397547 29707346 28357545 26937839 25669330 24855932 23870114 22910389 22341604 21663037
3002 21663037 21147181 20649117 19926034 19638584 19105544 18692024 18212934 18016214 17767318
2993 17767318 17349598 16858107 16763252 16525114 16235471 16077715 15858327 15476078 15291567 15091545
2983 15091545 14921536 14681014 14605188 14254755 14144653 14254353 13886279 13804295 13790888 13425290
2973 13425290 13665630 13182439 13366524 13380393 13489211 13037205 13290190 12930538 13036122 12983641
2963 12983641 12741099 12783919 12687977 12798706 12563891 12653075 12496968 12606800 12487239 12506592
2953 12506592 12433319 12466420 12590313 12527942 12551260 12775951 12725231 12916886 12701493 12872490
2943 12872490 12791442 13112522 13075163 13205487 13265787 13390097 13630906 13736727 13848822 13993524
2933 13993524 14209605 14425195 14664055 14846496 14944297 15489617 15856084 16142816 16713024 17080549
2923 17080549 17983662 18469915 19301099 19820638 20946671 21983966 22955162 24283693 25260873
2914 25260873 26872871 28180724 29648326 31040845 32201906 33670545 35432368 37051307
2906 37051307 38850226 40581182 42746117 44865700 46611120 48101605 49571065 51488745
2898 51488745 53279242 55390737 57581900 59609054 61506212 63203524 64845247 66666417
2890 66666417 68690194 70901126 73639903 76938196 80912245 85599580 90537994 96290393
2882 96290393 102607608 109530509 117118197 125400868 134302448 143799648 154272246 165319655
2874 165319655 176863019 188300932 199753744 210090572 219311950 227185791 234822913
2867 234822913 242497273 250195984 258483080 268142756 280127486 294893514 312070395 328988396
2859 328988396 344926842 360655697 375585900 386151872 389764252 389523138 391535305 398020328
2851 398020328 408838633 422481952 437923825 453092946 467630338 480176611 488850217
2844 488850217 492756152 491814426 487763253 480438946 470054737 456803273 443166320 431899987
2836 431899987 423368602 418448999 415064924 411215847 407060738 403446010 397188429 384615551
2828 384615551 365699644 346522161 330016001 317005484 306733540 298242786 290011492
2821 290011492 282266933 274655741 266983277 258497466 249217290 239724225 229391094 218426944
2813 218426944 207106478 195840565 185534925 175709661 166358460 157820376 149438395 141732595
2805 141732595 134352374 127584066 121102505 115786378 110922661 106684358 102780693 99660227
2797 99660227 96442851 93782983 91509552 88961537 86804044 84522679 81902595 79664360
2789 79664360 77008558 74730622 72461793 70185431 68073333 65833407 63461481 60830226
2781 60830226 58494024 56332823 54151589 52520977 51018109 49359691 47901710 46334027
2773 46334027 44690903 43175762 41742219 39914500 38598891 37446658 36376447 35002169
2765 35002169 34113826 33224911 32138306 31286299 30641917 30025770 29057206 28469770 27692343
2756 27692343 26904377 26255911 25796103 25290081 24757442 24104229 23636443 23290052 22764802
2747 22764802 22463541 22057160 21452943 20995958 20783619 20557640 20059190 19575594 19325098
2738 19325098 18975764 18712725 18476654 18196018 17804811 17462963 17058877 16887152 16668603
2729 16668603 16249273 16293877 15740787 15630433 15339232 15266611 14910806 14619027 14295682 14001720
2719 14001720 13649520 13775211 13356697 13285261 13202758 12769335 12597899 12513404 12251739 12194429
2709 12194429 11919694 11768955 11624002 11455351 11431657 11183961 11132863 10950147 10726973 10570393
2699 10570393 10592528 10342009 10106411 10085732 9785211 9753691 9639269 9524545 9430443 9309702
2689 9309702 9168385 9121891 8875656 9031582 8589779 8575970 8533536 8382677 8324111 8199863
2679 8199863 8218168 8214105 7976079 7871904 7830023 7606971 7650302 7588097 7682322 7300978 7283913
2668 7283913 7168371 7201449 7342732 7146141 6997964 7103315 7010202 6953508 6837606 6959837
2658 6959837 6887498 6714991 6716520 6637716 6578852 6494338 6475188 6257323 6589725 6287709 6239177
2647 6239177 6261065 6415868 6101306 6033939 6176219 6142099 5985756 6215991 5897965 5972286
2637 5972286 5904136 5921877 5813146 5758109 5767901 5721030 5797124 5880642 5882891 5744213 5874671
2626 5874671 5833164 5901688 6036196 6037110 5862580 5858121 5757118 5984134 5870944 5673912 5646574
2615 5646574 5869462 5648320 5520705 5835191 5666158 5759647 5676471 5508447 5631068 5750017
2605 5750017 5693100 5928082 5736763 5807998 5903409 5889161 5933505 5905463 5894155 6046039 5653284
2594 5653284 5622020 5508444 5652315 5472946 5613999 5503110 5332737 5425651 5282473 5180721
2584 5180721 5101198 5342416 5259275 5021948 5357859 5095914 5164353 5282653 5261802 5229767
2574 5229767 4995575 5008986 4864951 4904550 5014335 4585528 4774758 4695525 4529642 4571507
2564 4571507 4424701 4411908 4411812 4190155 4390649 4215479 4238799 4200163 4162297 4222894 4162953
2553 4162953 4301654 4131051 4034039 4086008 3939303 4008660 3851050 3865652 3797339 3643660
2543 3643660 3738476 3492992 3598549 3596687 3549365 3483933 3458334 3418962 3405694 3164363 3324426
2532 3324426 3259539 3316541 3418529 3417550 3425510 3396522 3260986 3284580 3105038 3193034 3111077
2521 3111077 3175449 3150697 3023465 2963321 2791073 2749679 2818851 2804425 2892687 2988035 2817669
2510 2817669 2825870 2853821 2732552 2899734 2733959 2993066 2898462 2887816 2751149 2776459 2587622
2499 2587622 2869192 2801058 2773492 2625831 2731094 2647785 2824320 2855690 3011176 2679763
2489 2679763 2930483 2915850 2925130 2959300 2962220 3043051 2965204 3076752 3280919 3139680 3130701
2478 3130701 3238017 3074795 2956304 3197943 3122210 3246906 3031891 3075234 2945004 2973485
2468 2973485 3005437 3195101 3194823 3123278 3259247 3279825 3534630 3351749 3547055 3595057 3682628
2457 3682628 3659462 3698071 3738799 3921847 3725519 3996380 3803871 3931861 3726048 3797156
2447 3797156 3711106 3937587 3936943 4098736 3901808 4008058 3952365 4077034 4306918 4352667 4300999
2436 4300999 4524815 4809940 4728444 5060347 5320925 5144942 5375107 5480915 5300092 5322753
2426 5322753 5040659 4942599 4971566 5139754 5064774 4996821 5135405 5052137 4829246 4949422
2416 4949422 5150820 5078877 5319295 5218723 5266195 5418848 5620002 5598262 5746954 6016396
2406 6016396 6081763 6225946 6475197 6673500 6751219 7004423 7167616 7354586 7749775 8068840
2396 8068840 8367272 8858567 9342903 10029079 10740339 11247303 12019189 12936257 13678113 14680207
2386 14680207 15419359 15861039 16470040 16587244 16446474 16139588 15202915 14117699 13275778
2377 13275778 12316246 11547662 10918577 10563214 9677122 9165741 8557846 8357468 7846507
2368 7846507 7202146 6884763 6765636 6516323 6244026 6072123 5885799 5639898 5470936 5440813
2358 5440813 5302034 5132682 4857542 4774727 4785680 4734862 4306986 4464452 4206978 4328006
2348 4328006 3895919 4065043 3963779 3745778 3742122 3620156 3534541 3421612 3397181 3497860
2338 3497860 3267411 3239186 3115384 3283694 3252939 3062310 3116618 2885216 3116219 2923510
2328 2923510 2827852 2879243 2844474 2580261 2608004 2560279 2612487 2782825 2651949 2555942 2548846
2317 2548846 2448718 2733486 2494993 2355348 2232745 2422538 2414760 2570511 2270873 2421359
2307 2421359 2304698 2253355 2178686 1936069 2382451 2377686 2025393 2092797 2215751 1989978
2297 1989978 2235972 1878144 2011189 2088403 1932163 1984258 1985859 1932070 1969464 1921272 2160905
2286 2160905 2253166 2003680 1758095 1933650 1854299 1984964 1899288 1892118 1730517 1690278 1775513
2275 1775513 1979007 1793006 1881195 1841509 1902240 1801144 1696454 1809786 1729882 1727579 1729858
2264 1729858 1605102 1432817 1710786 1700977 1678107 1584043 1748940 1792613 1589638 1449068
2254 1449068 1644367 1493623 1651984 1534871 1512875 1355964 1412949 1432345 1400819 1510454
2244 1510454 1487736 1644497 1555888 1317846 1275862 1293970 1452418 1453533 1368959 1412790 1278395
2233 1278395 1404815 1361453 1192879 1494945 1522958 1552360 1353822 1514071 1352007 1176658
2223 1176658 1285867 1247832 1212656 1510806 1332866 1305976 1228787 1258049 1403827 1312901 1392471
2212 1392471 1204453 1220122 1371770 1252123 1355007 1400331 1106717 1309699 1355585 1210696
2202 1210696 1265282 1282278 1424752 1462180 1324949 1356152 1177159 1148921 1157519 1172366 1276607
2191 1276607 1397048 1155700 1046897 1309851 1140680 993442 1166941 1187082 1153227 1242271
2181 1242271 1250229 1401040 1128480 1286973 1201974 1329796 1384494 1321709 1171535 1378613
2171 1378613 1369981 1184642 1132486 1422895 1172189 1279984 1311221 1160035 1204025 1313171
2161 1313171 1405754 1318840 1163526 1302913 1323886 1313860 1447039 1328813 1403142 1424219 1389643
2150 1389643 1402235 1373046 1349470 1403107 1414411 1259187 1379235 1317966 1389266 1333976 1419845
2139 1419845 1401457 1519130 1300793 1266877 1299981 1338554 1384683 1430267 1664084 1376114 1452354
2128 1452354 1526796 1513989 1632748 1558910 1473854 1752697 1665981 1710982 1912254 1835733 1816742
2117 1816742 1651487 2085771 2055675 2105304 2243196 2234494 2093979 2190563 2137182 2195043 2419545
2106 2419545 2222820 2356169 2133302 2230724 2221892 2467152 2519128 2271993 2575460 2266072
2096 2266072 2582382 2818526 2934394 2899753 3137509 3078640 3101988 3284790 3353378 3484566
2086 3484566 3347658 3125776 3035203 3048617 2927768 3003326 2899027 2943449 2767473 2908495
2076 2908495 2830106 2843175 2790875 2920142 3187140 2992811 3132995 3180449 3077989 3130020
2066 3130020 3203065 3223607 3339167 3287349 3197378 3154977 3052072 3156835 3168458 2890850 2797762
2055 2797762 2877974 2863581 2779164 2515191 2453904 2584269 2641285 2357457 2514807 2450867 2425467
2044 2425467 2331492 2267193 2294509 2249581 2360132 2210217 2196145 2011948 2041522 1887219 1756752
2033 1756752 1621215 1481968 1685198 1754581 1633153 1553470 1657390 1656625 1482057 1555338 1417564
2022 1417564 1191233 1269093 1180809 1312453 1194033 1279296 1227729 1162818 1175817 939694 1058900
2011 1058900 1068310 999947 1225274 1133001 1123718 983543 976970 1026445 798500 1035608 1058362
2000 1058362 807273 1014291 783636 838963 1072143 956038 874239 854232 731708 868684
1990 868684 747191 856498 869172 966722 678879 718187 759741 678686 738010 798519 826520
1979 826520 744710 527998 712518 650589 488025 490828 681721 373521 538370 699729
1969 699729 566493 571954 486831 577457 572881 470196 518745 699943 593145 672292 741513
1958 741513 459925 571705 735819 410629 463164 545334 634095 550615 650951 652282 629906
1947 629906 587162 739722 677675 654025 667981 542846 558934 497778 700377 545685 580380
1936 580380 417275 445552 588666 556475 436425 551295 444083 376462 397263 482593 347340
1925 347340 370330 496630 463580 460063 351995 306301 499535 295882 578578 434852 404286
1914 404286 288537 199517 354100 392451 183757 389182 446224 321253 351098 415286 379397
1903 379397 417806 526871 368604 313759 355951 269017 384003 235202 375812 418883 27494
1892 27494 375301 249148 267186 477956 345456 270115 42737 211168 122291 298725
1882 298725 347990 347784 72394 440295 138789 311551 362061 255605 22313 291317 281908
1871 281908 286443 126112 243744 394491 196649 174366 261537 269132 350830 190772 271350
1860 271350 449979 295920 309007 223435 206932 162908 221520 216819 121743 236911 298107
1849 298107 214749 81235 337082 328451 169502 247222 63788 153442 70187 139011 144316
1838 144316 84268 95314 107618 349024 117153 210325 163369 262299 124766 122315 268182
1827 268182 403188 128399 221768 294016 34647 68922 56764 315226 308589 365675 160733
1816 160733 251424 320232 226406 280478 104685 157693 130472 96543 77758 26696 271395
1805 271395 75541 282371 343594 186115 296067 258997 -19707 293233 261776 242179
1795 242179 186149 235732 130334 141184 349346 141767 194257 264761 66787 139164 85210
1784 85210 2755 240388 226707 299275 242010 267040 127148 247168 212674 279163 205565
1773 205565 219202 258267 44743 279564 127712 52676 172476 109264 66865 -113117 55036
1762 55036 60869 55490 319359 37685 255596 181357 43597 204373 19607 48883 25166
1751 25166 36945 92983 71294 141556 314556 148837 108233 291664 66115 71443 37469
1740 37469 23497 48520 209598 57378 -29564 66423 156585 79848 -208335 -94235 5914
1729 5914 185354 10630 164429 143153 177100 139774 144457 155685 320186 184828 -47210
1718 -47210 211416 13519 83719 133785 -68529 141162 32338 163957 182749 -74099
1708 -74099 -100598 187493 21837 -38793 52816 -24125 165241 97018 -17845 66087 -119603
1697 -119603 141461 187793 -22503 143546 32336 17043 -36995 131487 -22052 -78433
1687 -78433 12276 99059 36999 -21970 38722 36670 105440 189088 108838 118931 133925 -100974
1675 -100974 33533 -180515 159718 90683 -186043 -25290 335207 87812 256608 69370
1665 69370 164754 85309 103069 110278 -38936 58336 18552 130500 34913 -195180 156539
1654 156539 -53766 -23858 292266 117415 25017 212874 201388 -48659 98956 270341
1644 270341 77185 -38936 8079 255950 -55269 38606 -1305 35504 15645 25879 104734
1633 104734 39448 38685 -131758 57732 60329 84089 -100413 -53113 140883 146159 -17136
1622 -17136 87389 127731 55399 154739 -1303 161799 83069 271357 22665 -2722 36984
1611 36984 202016 56549 -58643 -51797 41759 96214 125101 66189 294734 -1809 30821
1600 30821 -59731 21885 6444 -161319 63404 57210 167565 74425 97635 65536 177678
1589 177678 118811 54543 104685 292400 -84670 197727 74888 -75543 -20652 -87505 147688
1578 147688 22014 24857 136190 14448 -57176 -94371 25808 7261 -79430 114377 114663
1567 114663 -116454 222434 -40919 53725 60333 174830 -45840 -13358 81170 -16216 -29458
1556 -29458 166157 135699 167506 72462 260477 -24541 -825 -43504 -107723 85557 101008
1545 101008 -13473 83968 67329 -7885 -16270 65910 60780 48593 -41573 94545 47729 -44780
1533 -44780 253735 -103220 -166551 -36507 24453 48332 39859 82631 -67069 114337 209925
1522 209925 76701 20220 66819 190953 -116015 23771 -52829 33508 72523 140837 87703
1511 87703 286644 -37693 40424 76570 162603 99855 195865 -58910 211574 93579 -137657
1500 -137657 -16375 60229 49142 -68599 -64477 74074 -19709 -53509 -25531 290504 52535
1489 52535 22470 63867 -17909 164638 54894 20775 60434 -14446 -90153 -253370 -50502
1478 -50502 135452 -4318 -301274 98263 159272 73138 -73653 79818 126577 139954 113495
1467 113495 172405 108695 72544 382686 202634 44099 198725 314811 405401 456440 702127
1456 702127 732187 604888 673008 743811 753533 679768 685761 718949 377074 526974 406647
1445 406647 323153 246995 294292 276217 166787 30141 188399 203867 294820 -14985 215084
1434 215084 121371 216206 136428 79101 94505 -50235 55457 103105 63201 98888 242428
1423 242428 93750 109100 165468 97203 -27141 44206 78749 -3785 52514 -137954 124999
1412 124999 26190 16372 58807 30867 165161 -73605 -33772 -41705 63499 -72539 -124809
1401 -124809 44811 75808 -84889 -198545 -72262 -59347 17721 -141105 27985 -227084
1391 -227084 -131520 71070 -3942 144299 -60534 147354 -38186 -134309 -22504 -556
1381 -556 -41913 -47709 -160734 -162149 -61872 -95666 48142 110988 21540 161330 -58326 82855
1369 82855 -21612 159720 120622 59187 -104183 21608 73611 -122216 68770 -105758
1359 -105758 58100 10757 -32206 -41619 -53137 56751 38235 -187128 -205957 -139608 -61038
1348 -61038 -119566 -286856 -131686 -144781 -54088 -19618 140820 -138014 522 -56441 -72751
1337 -72751 -81794 -86816 30387 98804 -89584 -38470 62070 -90911 -184250 -17767 -122274
1326 -122274 -2928 -6048 -32908 -180119 -213499 -87396 142814 84814 -67534 53725 -149114
1315 -149114 698 -139707 -124148 53000 -91230 -55736 100186 -182896 72882 -110767
1305 -110767 3371 -83140 -81251 -235736 -67508 -45163 13835 -18273 175839 -84364 -50164
1294 -50164 -78088 -79753 -119482 -95082 -124092 12184 118299 58362 -111912 158793 -205437
1283 -205437 61529 -17497 -254587 -159464 -176770 -243551 -51194 -53753 -124290 -83798 37339
1272 37339 -127888 -110187 -90748 -99511 -48023 -115985 -83825 -180361 97053 -153553 -143274
1261 -143274 4443 -108852 -72092 -77255 -136023 45768 -156555 107971 -68640 -20458 65391
1250 65391 198752 42037 -143509 -182999 -154579 109952 170969 -107951 -9410 -36434 -151488
1239 -151488 -141291 -99070 -127750 -199022 -303 -129605 -245003 91783 -121185 75796
1229 75796 -25984 -180248 -183780 -262265 -113369 -110037 -279403 -159820 -197578 -72110 1139
1218 1139 -266185 -215629 -36637 -50666 -29871 109009 21185 71959 -120630 -238818 -64866
1207 -64866 -30798 -67626 -255032 -107769 -251454 -251314 -14778 43752 -63103 17151 -144931
1196 -144931 -198859 -78838 -140411 -10157 -38014 6764 9368 33028 10201 -35981 -107483
1185 -107483 144485 -31861 -56743 75936 -13960 2544 8077 -107605 -124198 -35869 56566
1174 56566 4250 12548 -51851 -8955 90015 -116272 36413 -130501 -20807 -284276 -27306
1163 -27306 -96672 -149420 -73886 4419 -150482 -152809 6229 -84876 -233790 -177532 -20480
1152 -20480 6654 -176138 -59731 -38015 -102272 -143913 -46177 130189 11630 -216415 -33554
1141 -33554 -14019 81730 4470 13734 74137 29702 -55304 -80260 -8427 -83121 29154 -70603
1129 -70603 15573 -98043 18442 -76011 -18938 -39682 -73320 48449 -36473 -6024 -228390
1118 -228390 62153 -21428 -260994 -623 -73816 -144310 -160407 -175049 -76148 -96805 -176002
1107 -176002 -128039 -378693 -1188 -176589 -98938 29746 -199143 -189645 -143031 -123191 -70340
1096 -70340 -165100 -105325 -55145 -105681 -134091 -107439 -78116 133860 35313 -186275 58066
1085 58066 -168505 -201272 -182625 -32307 -176742 -269301 -208996 -48023 -130156 -57283 -162944
1074 -162944 -52384 -102935 -173535 -237196 -145397 -1112 -126743 -39483 -241977 -158108 -90197
1063 -90197 8872 32977 -168055 -140140 -172494 -319471 -144021 -79255 -110056 -192297 -105312
1052 -105312 1801 -242537 -67279 -62184 -196352 -60611 -122154 -32236 -190118 -249701 -130236
1041 -130236 -123111 -256923 -134530 -191146 -57469 -205074 -153692 1693 -105122 -274464
1031 -274464 -105405 -156585 -278585 -136801 -34031 -27765 -79967 -64659 -205820 -335980 -66043
1020 -66043 -111034 -229824 -161321 61846 -78596 -237944 -53465 41813 22308 -9943 -45440
1009 -45440 -201570 -95280 -121404 2900 -29652 -195223 -103615 -135427 -70366 -121537 -53663
998 -53663 -14031 -246657 -57740 -167210 -67430 -187658 -235920 -196201 -194570 -69862 -263546
987 -263546 -251283 -111376 -123972 25272 -75638 -225491 -135735 -56806 -224534 -121072 -103150
976 -103150 -57557 -53244 -197507 -47952 48009 -129925 -91085 -81001 -165276 -139121 -122331
965 -122331 -56749 -129770 -141049 -254114 -205271 16058 -70118 -61272 -113537 -136487 -216912 -259810
953 -259810 -89694 -128832 -83712 -72946 -42528 -196054 -182548 -170850 -136742 -183460 -199602
942 -199602 -135822 -251358 67696 -70308 -59076 -197550 -50881 -194777 -172258 -153920 -85563
931 -85563 -107060 22090 -141994 -289454 -280063 -228742 34282 -46286 -83977 -43468 -62431
920 -62431 -130993 -21119 -20660 -99461 -86905 40312 -196929 57897 -114989 -144079 -315714
909 -315714 -80135 -75219 -35651 -177012 -232396 5953 -59482 -31247 146643 -105881 -79649
898 -79649 -36325 -244825 -130616 -317821 -80767 -208867 -216495 41611 -224773 -3853 -196793
887 -196793 -59411 -256698 -138632 -262629 -118812 -69457 -299722 -162519 -190659 -133982
877 -133982 -48991 -167631 -123880 -232920 -292276 -180623 -65368 -51652 -241700 -58009 -162979
866 -162979 -87932 -178413 -379555 -140904 -100070 -294186 -85985 -34680 -245710 -198393 -93135
855 -93135 -78482 -214224 -52594 -64697 -204788 57661 -116120 -122646 -115015 -177094 -22773
844 -22773 -236973 93695 -117871 -221791 -212093 -151383 -90775 34122 -63918 -117855 -164166
833 -164166 -87249 -33651 -68786 -52507 -64074 -184652 -252923 -14270 -283158 81871 -225745
822 -225745 -227288 -72996 -294515 -45181 -201324 -223137 -123922 -176274 -20028 -105833 -177575
811 -177575 -93662 -348138 -86178 -180815 -182081 176169 -225734 -215898 -152 -267791 162805
800 162805 -139705 -221787 -276662 33237 -210209 -132693 -54729 -231000 22538 2462 16287
789 16287 -188757 -82452 -202199 -194477 -21621 -126720 19789 -127866 -232100 -258804 -141778
778 -141778 -106305 -214268 76716 -123725 -128778 -198267 -130713 -118762 -175076 -48824 -400523
767 -400523 -50064 -27049 -199291 -308815 -254647 -294911 -245472 47238 -183008 -100215 -300379
756 -300379 -267144 -14158 -150918 -109005 -45669 -183345 18094 -269738 -154621 -41457
746 -41457 -39272 -199722 141209 25396 -111434 -113927 -130383 -99064 -227680 -244649 -88559
735 -88559 6209 -300731 -217768 -330675 -284887 -243445 -42133 -280632 -91346 -140839 -483337
724 -483337 -205796 -50270 -184825 -272061 -255947 -158406 -111327 -150185 -142746 -191988 -109884
713 -109884 -15048 -105431 -224900 -189191 -51236 -178538 -55947 -149794 -171311 -226484 -267438
702 -267438 -193614 -76757 -313704 -104191 -176482 -351573 -70215 21384 -257168 -211424 -87352
691 -87352 -148303 10165 -172910 -303051 40286 -196258 -319166 -217239 -86377 -366007
681 -366007 -292822 -329539 -54681 -63452 -20919 -256939 -155940 -278859 -48815 -343382 -346277
670 -346277 -191515 -46624 -43811 -167273 -365025 -193100 -119211 -144326 -136189 -178317 -194282
659 -194282 -71289 -239874 22844 -192154 -200034 -164138 -65466 -116190 -223259 -107637 -221245
648 -221245 -271868 -126069 -133484 -138414 -131069 -285633 -197816 -74513 -128807 -209020 -219003 -173984
636 -173984 -15874 -186484 -122816 -162791 -156161 -129363 -246832 -139877 -237445 -284531 -278374
625 -278374 -118648 -369679 53037 -192961 -314240 -369881 -255319 -234639 -123726 -355238
615 -355238 -85941 -145012 -260732 -237851 -175178 -107761 -339247 -72216 -283426 -222571 -85281
604 -85281 -228083 -165805 -133509 -179396 -364786 -51454 -163797 -297886 -126678 -108056 -73656
593 -73656 4384 -221604 -55883 -233421 -245799 -311739 -191293 -55146 -155339 -185977 -215649
582 -215649 -229298 -190323 -247772 -290549 -197449 -276723 -161403 -216228 -188803 -239928 -120284
571 -120284 -252610 -133519 -85679 2989 -158549 -263201 -378189 -190425 -102126 -148544 -200135
560 -200135 -295085 -275753 -150288 -173292 -51580 -147015 -111475 -189259 -203747 -27337 -214070
549 -214070 -239997 -356203 -165225 -335811 -254663 -356337 -145860 -340972 -205749 -231281
539 -231281 -163080 -368355 -130204 -95222 -260778 -148014 -277109 -90088 -272969 -330461
529 -330461 -184209 -313012 -107548 -269984 -116546 -296158 -186933 -199086 -133616 -7959
519 -7959 -217315 -136582 -287691 -225460 -113907 -74697 -209455 -261095 -358236 -148853 -115663
508 -115663 -43348 -210425 -52860 -158767 -256845 -230354 -75738 -128924 -325448 -98389 -26132
497 -26132 -228315 -198854 -292932 -280570 -319514 -310899 -154664 -309009 -159998 -305035 -282560
486 -282560 -243595 -312576 -322641 -381877 -410563 -189237 -183511 101737 -75723 33473 -22985
475 -22985 -199361 -97083 -254433 -11603 -305403 -263823 -222152 -320887 -249301 -278913 -44859
464 -44859 -104177 -311724 -202870 -80595 -218101 14760 -196052 -182694 -233522 -295278 -168687
453 -168687 -325224 -185791 -186763 -400975 -264016 -138006 -110350 -208153 -165256 -171476 -293018
442 -293018 -244040 -85961 -233620 -363028 -137493 -261821 -182079 -240609 -287228 -363907 -50992
431 -50992 -289697 -346011 -37614 -252019 -238360 -120875 -304033 -173411 -366525 -112304
421 -112304 -97742 -352572 -289139 -315448 -175286 -198166 -230047 -363992 -140688 -164233 -94779
410 -94779 -434002 -195168 -204196 -291862 -168156 -195312 -311048 -226050 73549 -133469 -254976
399 -254976 -238718 -167591 -251913 -221659 -159720 -137012 -203513 -166228 -140847 -100929 -273595 -198994
387 -198994 -305241 -216600 -12274 -139352 -35381 -143083 1738 -218439 -215926 -131575 -226977
376 -226977 -113333 -140292 -325075 3032 -203921 -220739 -262549 -131380 -350548 -41427
366 -41427 -329496 -256343 -105958 -118888 -251675 -268052 -121011 -192287 -289965 -157420 -84233
355 -84233 -145579 -112009 -126344 -70700 -134457 -141901 -317641 -10607 -133791 -240546 -264362
344 -264362 -331774 -223685 -264446 -161108 -204445 -320548 -264238 105724 -317526 -210322 -308948
333 -308948 -239309 -303849 -229553 -150982 -373947 -155451 -144856 -161854 -338212 -344550 -93051
322 -93051 -324788 -235534 -340006 -381778 -209753 -178805 -238572 -352598 -272542 -226130 -231375
311 -231375 -25212 -288697 -53539 -207070 -156014 -213545 -371198 -253522 -65076 -99037
301 -99037 -133722 -161790 -416993 -153358 -127161 -240039 -139244 -568493 -264489 -151727 -147802
290 -147802 -130520 -290102 -175005 -140434 -373296 -205020 -308569 -381904 -170489 -339104
280 -339104 -188122 -424151 -234878 -428813 -219941 -44723 -199698 -309902 -226357 -300019
270 -300019 -256335 -24162 -179161 -269429 -147310 -420135 -269070 -193228 -312832 -205273
260 -205273 -277441 -337911 -492388 -171625 -265655 -263971 -196918 -254133 -334215 -87578 -315005
249 -315005 -388439 -98897 -347046 -98043 -189414 -278899 -336489 -149266 -206093 -148735 1311
238 1311 -279937 -175906 -233764 -2436 -75388 -380177 -340881 -295647 -242770 -371474 -442809
227 -442809 -244332 -261957 -63772 -305164 -289137 -234530 -233910 -255553 -225733 -217498 -152946 -172682
215 -172682 -309580 -304654 -260559 -155656 -363789 -173757 -205608 -288164 -261211 -200805 -134173
204 -134173 -221051 -225637 -257556 -294215 -288405 -233648 -334840 -328843 -170339 -333029 -106617 -390860
192 -390860 -203663 -303139 -239343 -134115 -249298 -222451 -60695 -190307 -67175 -338529
182 -338529 -162467 -145879 -287486 -298330 -297075 -330557 -258441 -347211 -428863 -207021 -315845
171 -315845 -293880 -285714 -162789 -200605 -269348 -487989 -345777 -256053 -261821 -216950 -317073
160 -317073 -303468 -203628 -386549 -302535 -281651 -195926 -251053 -323137 -310832 -297567 -348864 -299431
148 -299431 -200612 -365564 -209541 -299193 -350701 -339182 -231065 -280578 -298057 -358323 -235116
137 -235116 -261849 -295611 -416272 -260945 -241064 -351254 -379585 -450262 -342959 -316261 -308238
126 -308238 -312150 -223673 -346836 -335062 -391182 -216426 -413117 -389071 -357247 -457524 -400203
115 -400203 -351396 -219603 -233846 -338974 -475872 -526675 -253878 -222279 -431047 -351684 -367401
104 -367401 -593882 -372660 -436767 -442052 -219425 -381256 -330793 -501328 -344464 -272146 -385403
93 -385403 -354751 -318382 -494488 -295081 -457395 -398452 -434135 -585130 -419373 -367426 -536396
82 -536396 -446734 -396707 -406098 -291859 -406051 -594771 -392100 -433260 -406199 -343497 -487583
71 -487583 -489384 -531306 -462618 -543279 -541366 -402631 -466699 -434014 -422836 -457505 -493381 -363615
59 -363615 -405867 -357234 -431922 -444222 -429480 -501528 -447217 -297879 -448801 -377325 -538459
48 -538459 -364210 -437825 -529712 -475736 -366343 -506940 -502743 -403246 -465793 -529773 -539087 -505940
36 -505940 -450540 -455617 -464661 -505049 -443479 -527778 -636717 -510691 -484205 -523642 -523344 -542415
24 -542415 -461485 -508772 -652579 -433033 -546022 -575458 -492641 -582498 -559863 -655273 -638104
13 -638104 -462903 -626017 -489664 -665565 -536811 -692487 -569735 -530910 -508700 -590367 -629364
2 -629364 -620466 -429229
0 -429229
$$ Imaginary data points
##PAGE= N=2
##DATA TABLE= (X++(I..I)), XYDATA
16383 -3940346 -3903344 -3897368 -3768562 -3815046 -3761698 -3690332 -3577566 -3664883 -3478496 -3554674 -3579110
16372 -3579110 -3486393 -3423841 -3440451 -3223381 -3186924 -3186771 -3271700 -3318706 -3024733 -3103158 -3113915
16361 -3113915 -2917290 -2956141 -2781163 -2778114 -2783927 -2789686 -2683996 -2730641 -2578312 -2601996 -2565982
16350 -2565982 -2468995 -2444903 -2530954 -2389240 -2439663 -2264160 -2351522 -2066501 -2157821 -2036087
16340 -2036087 -2041126 -2001862 -2020675 -1938061 -1883443 -1951897 -1900272 -1650346 -1952126 -1809511 -1623874
16329 -1623874 -1688282 -1520728 -1510808 -1593327 -1437935 -1508198 -1350415 -1285185 -1285720 -1461651 -1263448
16318 -1263448 -1272286 -1133798 -1180341 -1147657 -1075673 -1067693 -1061016 -1011598 -824799 -794018 -754539
16307 -754539 -697864 -856849 -720697 -753564 -574036 -581702 -719885 -567990 -635322 -425507
16297 -425507 -422028 -480276 -470312 -432645 -243684 -340712 -313473 -127074 -189249 -190766 -102539 -102876
16285 -102876 93842 42905 40371 111016 59133 86005 157367 -37580 114882 359999 38339
16274 38339 212972 426925 452364 235103 381219 396884 272386 557576 403752 623878
16264 623878 585624 636423 716996 672670 583256 658532 693051 716548 720808 639913 1005730
16253 1005730 772011 925042 978350 952496 912072 892078 1038026 1084723 1235552 1120809
16243 1120809 1152887 1110482 1193012 1038269 1112267 1347522 1317643 1208407 1295431 1264382 1284247
16232 1284247 1317078 1394310 1273014 1361378 1542678 1447944 1560312 1395118 1422872 1564940
16222 1564940 1523561 1614101 1759459 1363949 1644829 1783029 1617704 1826372 1825736 1772676
16212 1772676 1806410 1859976 1840065 1816881 1841152 1824398 1910679 1656604 1927073 1925160 1831093
16201 1831093 1808519 1728401 1902201 1921076 1811854 1940507 1981248 2041076 1934790 2085234
16191 2085234 2133695 2014544 2193504 2092555 2070412 2150513 2275290 1932158 2199937 2048812
16181 2048812 2244606 2273077 2149861 2106711 2189907 2152066 2274364 2309752 2222158 2300420 2286303
16170 2286303 2347393 2359813 2233341 2437990 2332804 2373977 2469186 2285674 2582232 2466362
16160 2466362 2320618 2579982 2559924 2325807 2286796 2612618 2422243 2541937 2584164 2286807
16150 2286807 2669943 2532213 2609443 2523589 2543086 2485825 2523590 2578500 2612626 2600414 2528878
16139 2528878 2501924 2614351 2573074 2383250 2487582 2622278 2567443 2628575 2459029 2632373
16129 2632373 2575050 2565599 2741635 2622649 2340006 2692297 2559427 2609902 2573895 2596037
16119 2596037 2516598 2615160 2684150 2693660 2724599 2670295 2799994 2745419 2770881 2693824 2808657
16108 2808657 2726478 2767874 2750122 2806233 2667965 2595059 2801252 2741694 2819737 2772346 2695131
16097 2695131 2578368 2618433 2638973 2792704 2711402 2736339 2786557 2779328 2880962 2672440 2880488
16086 2880488 2766470 2740615 2918330 2727426 2686815 2703214 2716831 2807216 2764092 2817744 2906421
16075 2906421 2832635 2939497 2927218 2859328 2799083 2967215 2646706 2761224 2664985 2751622
16065 2751622 2764677 2896698 2943249 2828953 2849385 2949838 2816494 2767809 2850979 2767814
16055 2767814 2930731 2828025 2883194 2896761 2857424 2861464 2827203 2689877 2735306 2837059 2777787
16044 2777787 2947503 2788421 2947820 2657054 2950624 2766765 2985865 2808714 2964121
16035 2964121 2988271 2931666 2784307 2874304 2844037 3020097 2948779 2873528 2960955 2818333 2944664
16024 2944664 2815798 2806521 2938691 2900912 2924756 2960437 3002305 2843818 2825956 2915137 2892293
16013 2892293 2903363 2877814 2740113 2960596 2867555 2715502 2765866 2894403 2976634 3031073
16003 3031073 2798116 2742383 2816751 2875257 2881752 2789377 2757876 3088577 2971647 2800274 2732919
15992 2732919 2836550 2711428 2862236 2796661 2951979 2859118 2864756 2835807 3030102 2746687
15982 2746687 2886056 2783045 2865209 2795285 2807144 3033973 2770819 2993211 3094480 2873022
15972 2873022 2732432 2931222 3033624 2845482 2898995 2852683 2996137 2892732 2832318 2895708
15962 2895708 2861066 2868936 2979010 2933125 2825365 2847415 2873258 2850008 3006021 2720938 2665066
15951 2665066 2774980 2847144 2920457 2856696 2810293 2940489 2927251 3056999 2718956 2806280
15941 2806280 2843820 2766752 2943844 2927207 3016115 2934901 2918878 2926831 2928651 2949669 2851430
15930 2851430 3020550 3136926 2926298 2927377 2956054 2980990 2817952 2943669 2913329 3073943
15920 3073943 2826348 2939898 2808151 2950049 2979375 2630456 2823277 2781593 3026596 2905442
15910 2905442 2796145 2865413 2857167 2974787 2853624 2962714 2937931 2799384 2800015 2929740 2954716
15899 2954716 2838953 2844209 2734744 3023022 3026660 2978349 2957183 2780115 2904361 2979736 2996373
15888 2996373 2806035 2968806 2904230 3030180 2823971 2859864 2894408 3044932 2952013 3049203
15878 3049203 2972294 2933679 2958528 2880838 3031456 2873135 2834531 2974064 2882855 2918192 2934021
15867 2934021 2882294 2923766 2808781 2977038 2896988 3015021 2836120 2842267 2996836 2885536
15857 2885536 2973778 2789525 2827944 2889092 2818825 2961017 2885667 2990874 3062284 3050183 2955402
15846 2955402 2852909 2971603 2816834 2874086 2944590 2945211 2968814 2850279 2885234 2851886 2940286
15835 2940286 2956078 2905711 2973074 2987703 3032224 2563437 2873130 2924369 3105613 3033250 2851343
15824 2851343 2906609 2952018 2795318 2857426 3005348 2985290 2846030 2946563 2816742 2951977
15814 2951977 3002922 2795417 3065337 2904244 2977657 2910410 2743187 2758433 3059009 2883085
15804 2883085 2958920 2837250 2911229 2809622 2766016 2916062 2844577 2893124 2878583 2964154 3042007
15793 3042007 3024215 3055886 3023939 3013762 3019496 2920416 2898488 3043140 3016448 2996027 2990222
15782 2990222 2825206 2854627 2661660 2898562 3012262 2975991 3067842 2982455 3143058 2946376
15772 2946376 2953942 2804004 3107763 2862104 2880584 2891493 2904191 2931464 2883458 3006347 2825646
15761 2825646 2909245 3097940 3250654 2908353 2800734 2873138 2869298 2937637 2937934 3038343 3002232
15750 3002232 2965216 2988882 3072156 2887379 2872308 3107567 3069524 3081045 3114196 2936570 3014695
15739 3014695 3093676 2790015 3013372 2967562 2912728 2845630 2951898 2876844 2879583 2918765 2849531
15728 2849531 2937130 2833353 2918983 3200315 2889692 2837149 2906061 2914485 2980507 3100105 2998267
15717 2998267 2968677 2921625 3106610 2961590 2962694 3033691 2920786 2899304 2974376 2738089 2994997
15706 2994997 3008214 3150788 2968521 2768321 2879844 2904913 2707054 2932594 2910551 2914569
15696 2914569 3055429 2864191 2878744 2788477 2933126 2930385 3123156 3128502 2797918 3016421
15686 3016421 3102158 2974559 2951553 2907078 3035585 2969751 3017845 2807747 3026750 3109455
15676 3109455 3094712 3032634 3066815 3005208 3059614 2800528 3152408 2883182 2795257 2853770 2729650
15665 2729650 3125740 2934977 2894233 3051083 3106116 3017843 3071710 3034707 2921780 2968044
15655 2968044 3058078 2835327 2955689 2996443 3079286 3244700 2903019 2913789 2770851 2994241
15645 2994241 2946619 2778834 2922028 2871060 3080939 2686914 3009284 2764911 2701555 3064538
15635 3064538 2987574 2856363 2858494 2942472 2872531 2976876 2841507 2938185 3144527 2768583
15625 2768583 3107382 2923623 2870633 3067139 3094905 2988734 2891464 2995040 3023139 2887666
15615 2887666 3013573 3000735 2914235 2905311 2941218 3068584 3012906 2979168 2711648 3073654 3066125
15604 3066125 2908635 2982702 2984264 3027604 2885439 2789327 2852121 2982829 3142261 2904262
15594 2904262 2924836 2969338 2890354 2921163 2911794 2955974 2823655 2906004 3090100 3085519 2949037
15583 2949037 2836275 2821077 2991589 3050063 2894149 3160561 2928719 3185389 2906666 2937773
15573 2937773 2937024 2987929 3059921 3203291 2801004 3107338 2994152 2966548 3080841 2965174
15563 2965174 3115273 3140353 3022605 2984276 2984946 3106358 2952919 2875505 3023119 3101212 3173756
15552 3173756 3003335 2922215 2881858 3113807 3008715 2942963 2846698 3137071 3034692 3043225
15542 3043225 3166575 2917673 2944735 3002322 2877642 3061677 3068646 3078821 2809308 2877399
15532 2877399 2916547 3010496 3038101 3090593 3046307 3189629 3106611 2964274 3008164 2927031 3147709
15521 3147709 3040481 2968801 2855586 3001380 2984738 2770818 2934848 3029476 3112869 3091663
15511 3091663 2978767 3117510 2982630 3105401 3011380 2962868 3070737 2954301 3143542 2884076
15501 2884076 2828755 2814019 2898282 3140382 3123762 2886610 2959370 2956319 2958201 2982627 3015452
15490 3015452 2977141 2945080 2997277 2943605 3064414 2947126 3003200 2996004 3029784 3119901 3112783
15479 3112783 2935040 2909666 2886507 3090401 2876771 2883808 2889959 2996960 2960854 3147252 2849475
15468 2849475 3026594 2966168 3016802 2989039 2904638 3050903 3124604 2919908 3047364 2972041
15458 2972041 3077501 2954106 2894828 3090680 3088775 2949907 2924152 2930523 3026391 3112080 2953148
15447 2953148 3075931 2970700 3024583 2883577 3047634 2862579 2960328 2917887 3096365 2990992
15437 2990992 3041030 3128456 3217478 2927848 3252040 2962119 3079856 2976871 3029181 2825748
15427 2825748 3050944 2924299 3066321 2925703 3059893 3133865 2992189 2885797 3120815 3071729
15417 3071729 3096298 2914468 2945649 2874083 3061542 3130495 3032223 2851348 2962780 2786763
15407 2786763 2967987 2959464 3007145 2952168 3058115 3113389 3181493 3116001 3145313 2972650 2910425
15396 2910425 3011758 3018357 2959953 3062139 3009251 2986694 2944242 3036800 2956185 3132333 3013903
15385 3013903 3007886 3027384 2944955 3050166 3254000 3040915 3076732 3036686 3112607 3019018 3001603
15374 3001603 2802631 2916895 3054543 3043056 3111257 3137835 3045593 2807293 2889961 2999558
15364 2999558 3005840 3183153 2923463 3135484 3233606 3009759 3036572 3083153 3186029 2820358
15354 2820358 2859919 3000468 3120373 3096950 3216947 2988845 3144777 3153354 2930345 3047241
15344 3047241 3047982 2740345 3175871 3085515 2751937 3215828 2965373 2962456 2978109 3060525 3082423
15333 3082423 2950447 3007182 3157136 3162345 2910790 3101454 3081758 2981628 2972054 3108898
15323 3108898 2960826 3059842 3202847 3050566 2951116 3155628 2859026 3113006 3005030 2993670
15313 2993670 3149201 3014174 2981372 2966212 3224079 2915436 3013485 3232259 3077120 2849224
15303 2849224 3005952 2935543 2883474 3002146 2941915 2884937 2719061 3124166 3085797 2871914
15293 2871914 3057753 3050002 3104286 3061465 3114699 3152762 3079544 2955298 3019650 3080329 3155304
15282 3155304 3057814 2980149 3025565 3039647 3133767 2973449 3149906 3006713 2819784 3137659
15272 3137659 3000851 2982674 2929122 2974125 3057885 3336903 3123485 3110146 3101166 2975200 3201683
15261 3201683 3077730 3074648 2952267 3242721 3001412 3012701 3280476 3035924 2940848 3201710
15251 3201710 2832609 3203041 3065517 3144885 3153848 3124249 3140357 3125610 3046286 3034546 3090067
15240 3090067 2992170 3186061 2907297 3155870 3129990 3227206 3138267 3010159 3013849 3068930 3090857
15229 3090857 2994086 3052627 3102420 3045095 2961680 2918669 3174254 2957916 3196014 3125377 3090107
15218 3090107 3073200 3070814 2960211 3051267 3042856 3060819 2801063 3130301 3152677 3167739 2977443
15207 2977443 3012563 3076009 3054242 3117512 3099359 3038884 3224786 2982869 3138345 3091690 2974166
15196 2974166 3017618 3146107 3068201 3173460 2934334 2973316 2926534 3155512 3212782 3067336
$$ [...]
##END NTUPLES=NMR SPECTRUM
##END=
